*** Darwin 10x14 ***
Turn = 0.
  01234567890123
0 ...h.......t..
1 .......h......
2 ..f........h..
3 ..r...........
4 h.t..f.h....hr
5 f.......f.....
6 .f....t.......
7 r.f.h......t..
8 .f..f.........
9 r..t..........

Turn = 5.
  01234567890123
0 ......hh...th.
1 .......h......
2 ..f...........
3 .......r......
4 hrr..f...r....
5 f.......f.....
6 .f....t....t..
7 ...rr......t..
8 .f..r.........
9 ..tt..........

*** Darwin 4x17 ***
Turn = 0.
  01234567890123456
0 .................
1 .................
2 .................
3 h................

Turn = 5.
  01234567890123456
0 h................
1 .................
2 .................
3 .................

Turn = 10.
  01234567890123456
0 h................
1 .................
2 .................
3 .................

Turn = 15.
  01234567890123456
0 h................
1 .................
2 .................
3 .................

*** Darwin 4x12 ***
Turn = 0.
  012345678901
0 ...f...hrf.t
1 ftf..ff..trt
2 .h..h.......
3 ....f...t...

Turn = 4.
  012345678901
0 ...f....ht.t
1 ttt..ff..t.t
2 .....h.hr...
3 ....f....r.r

Turn = 8.
  012345678901
0 ...f....rt.t
1 ttt..ff.rtrt
2 .......h....
3 ....f..r...r

*** Darwin 15x18 ***
Turn = 0.
  012345678901234567
0 r..hh.f...f.......
1 ........t......h..
2 .....f......r.....
3 .hhh.f.......h....
4 ...h..f...........
5 ..........h.......
6 ....hr...rfh......
7 r........r....h...
8 ..f....hr..r....rt
9 .....r......t.....
0 .t....r..rt.......
1 .h........rr......
2 ......ff.....r..h.
3 ........r.......h.
4 .h..f.t..t....rt..

Turn = 5.
  012345678901234567
0 ..h..hf...f...rh..
1 ........t.........
2 .....f............
3 r...hf..........r.
4 ......f...........
5 r..h..........h...
6 h....r..rr.r......
7 ..........rh....h.
8 .hf.......h..h...t
9 .........r..t.....
0 .t........r.r.....
1 .....r......r.....
2 r.....ff.........r
3 .h.......r.h......
4 .h..frt.r.rrr..t..

Turn = 10.
  012345678901234567
0 ..h..hf...f....r..
1 ........t..r.....r
2 .....rr...r.......
3 ...rr.........r.h.
4 ......f...........
5 .........r.......h
6 r..rr.............
7 r.....r...........
8 ..f............hrr
9 .t..........tt....
0 rt.h.......rr....r
1 ...........r.....r
2 .....r.f..........
3 .h.r.r.r..r.......
4 rh..f.rr..r....t..

Turn = 15.
  012345678901234567
0 ..rr.r..rr..rr..h.
1 ...r....t...r.....
2 ...........r......
3 .......r..........
4 ......f..........r
5 r..........r....rr
6 ...........r.....r
7 .rr...............
8 ..f.r.........r...
9 .t....r......rr...
0 tt............r..r
1 ...r...........rr.
2 rr.....f..........
3 rr..r.......r.rr..
4 rrr.rr........r...

*** Darwin 12x21 ***
Turn = 0.
  012345678901234567890
0 th......ft...f....tt.
1 .h.hf..r....rhf.f...r
2 ..tr.rrfth..f..rfft..
3 ..f..t.ff............
4 .rrhh.r...f.t...f...r
5 .fr.fh.f..f..fh...hhh
6 t..r..r.tf.t....rt...
7 h...rh.........th.h..
8 t..rr...f...r...rh...
9 ....r.fr..ft.ftf.h.t.
0 .tf..tr.r.t..h...h.hf
1 ...f...t..htr..t.....

Turn = 5.
  012345678901234567890
0 tt..rr.r.r...rr...tt.
1 ttt.f..rtrh...f.f....
2 ..t....tt...f...rtt..
3 ..t..t.tt.......r....
4 ..t.......f.r.....hr.
5 r...r.hf.tt.rf.hht..r
6 rr..r...tt.t....ht...
7 ttrr...........t.t...
8 t..r.r..f........t.tr
9 ..r..r...ttr.tttt..t.
0 .tr.rr...ttr.h.tt...f
1 ...rr.ttttt....t.....

Turn = 10.
  012345678901234567890
0 ttttrrr...rr.....rrr.
1 ttt..r.tt...rrf.f....
2 .rt....tt...r....r.r.
3 r.t..t.tt...........r
4 ..t.......t.....rt...
5 r...r.hf.tt....ttt...
6 tt..r...tt..r...tt...
7 ttt.......r....t.t..r
8 t.t.....fr..r....t.t.
9 ....r....tt..tttt..tt
0 .rrr..r..tt..t.tt...r
1 ..r.rrttttt....t....r

Turn = 15.
  012345678901234567890
0 tttt....r.......r....
1 rrt.rr.r.r....r.r....
2 rrt...rtt......rr..r.
3 r.t.r..tt.r......r..r
4 ..t.rr....r...rr.t...
5 ......hf.ttr...ttt..r
6 tt...r..tt.....ttt...
7 tttt.r.........t.t..r
8 tttr.r...r.......t.tt
9 ..t....rr.t..tttt..tt
0 ........ttt..t.tt...t
1 .r....tttttr...t....t

*** Darwin 7x15 ***
Turn = 0.
  012345678901234
0 ....h..r.......
1 ..ff....t...hth
2 r...h.f........
3 h..............
4 ......r........
5 ...tt.t....f...
6 ......h..tf....

Turn = 4.
  012345678901234
0 ..........r....
1 ..ff....t....tt
2 .....r.........
3 ....h..r.......
4 ....t..........
5 r..tt.t....fh..
6 h.....t..tt....

Turn = 8.
  012345678901234
0 ..............r
1 ..ff....t....tt
2 .r.............
3 ....t......r...
4 ....t..........
5 r..tt.t....f...
6 r.....t..tt.h..

Turn = 12.
  012345678901234
0 r.............t
1 ..ff....t....tt
2 ...............
3 ....t.........r
4 ....t..........
5 ..ttt.t....f...
6 .r....t..tt.h..

Turn = 16.
  012345678901234
0 r.............t
1 ..ff....t....r.
2 .............rr
3 ....t..........
4 ....t..........
5 ..ttt.t....f...
6 .....rt..tt.h..

*** Darwin 6x6 ***
Turn = 0.
  012345
0 tr...t
1 .r....
2 ...rt.
3 .r..r.
4 rf....
5 ...trh

Turn = 4.
  012345
0 tt..tt
1 ....r.
2 r.....
3 rr....
4 ..rt.r
5 ...tt.

Turn = 8.
  012345
0 rt..rr
1 tt...r
2 .....r
3 ......
4 r..t..
5 ..ttt.

Turn = 12.
  012345
0 rrr...
1 tt...r
2 .....r
3 ......
4 ...tr.
5 r.ttt.

*** Darwin 9x9 ***
Turn = 0.
  012345678
0 .fh......
1 ....frt.f
2 ...r.....
3 f.tfh.h.t
4 r.r..h...
5 .rhth....
6 rtrt...t.
7 h.t.frrrf
8 .......f.

Turn = 3.
  012345678
0 .fhr...r.
1 ....f..rf
2 .........
3 f.tt...tt
4 rrr.th...
5 ..rtt.r..
6 .trt..rr.
7 .rr.f...f
8 r....r.f.

Turn = 6.
  012345678
0 .rr....rr
1 r.rrf....
2 r.r...r.t
3 ...t...tt
4 ..r.tt.t.
5 .r.tt....
6 r.ttt....
7 r..t....f
8 ..r.r.rr.

Turn = 9.
  012345678
0 rr...r...
1 rrrr...rr
2 ....r...r
3 .r.r...tt
4 r..ttt.t.
5 ..t.t.r..
6 ..ttr..r.
7 ...tr.r.f
8 r..t.....

Turn = 12.
  012345678
0 rrrr...r.
1 ......r.r
2 rr......t
3 .r..r..tt
4 ..tr.rrt.
5 ..tr.rr.r
6 ..ttt...r
7 ...tt...f
8 ..rr.....

Turn = 15.
  012345678
0 rr.....rr
1 r.r...r.r
2 ..rr..r.r
3 ..tr...tr
4 ..t.r.rt.
5 ..tt..rr.
6 ..rtt.r..
7 ..rtt...f
8 .....r...

*** Darwin 1x14 ***
Turn = 0.
  01234567890123
0 ......h......t

Turn = 4.
  01234567890123
0 ......h......t

Turn = 8.
  01234567890123
0 ......h......t

Turn = 12.
  01234567890123
0 ......h......t

Turn = 16.
  01234567890123
0 ......h......t

Turn = 20.
  01234567890123
0 ......h......t

*** Darwin 4x3 ***
Turn = 0.
  012
0 .fh
1 ...
2 ...
3 .r.

Turn = 5.
  012
0 .f.
1 ...
2 ...
3 r.h

*** Darwin 14x8 ***
Turn = 0.
  01234567
0 ...t....
1 ..f....t
2 .f..fr..
3 ......r.
4 ........
5 ...f....
6 ...f....
7 ........
8 ......h.
9 t...tr..
0 .t......
1 .r.....t
2 ....ht..
3 ...tfr..

Turn = 5.
  01234567
0 ...t...r
1 ..f....t
2 rr......
3 ...r....
4 .....r..
5 ...f....
6 ...f....
7 ........
8 .......h
9 t...t...
0 t.......
1 t...r..t
2 h...r...
3 ....r.r.

Turn = 10.
  01234567
0 rr.t.r.t
1 ..f....t
2 ........
3 ........
4 .....r..
5 .....r..
6 r.......
7 ....r...
8 .......h
9 tr......
0 t.......
1 t.....rt
2 tt.....t
3 ........

Turn = 15.
  01234567
0 .rr....t
1 ..f....t
2 ....r...
3 ...r....
4 .......r
5 r.......
6 ......r.
7 .......r
8 t......h
9 tt......
0 t.......
1 t......t
2 tt.....t
3 ........

*** Darwin 5x20 ***
Turn = 0.
  01234567890123456789
0 hth..thtrh..h...rtth
1 .rhf..fh....ftrt.t.h
2 ...rf.rf.r.tf.rthfrh
3 ht.....r..r.......t.
4 rtr..r....r.....tth.

Turn = 4.
  01234567890123456789
0 htrr.tttttt.r...htth
1 .tt.r.rr....tttt.tt.
2 ....frt.r..tt..t.ttt
3 tt........rr......t.
4 tt..r.r.r.....r.ttt.

*** Darwin 13x9 ***
Turn = 0.
  012345678
0 ....f..t.
1 tt.f..tf.
2 ......hh.
3 h........
4 ...f.tf..
5 .........
6 ........h
7 ....f..h.
8 ..rtr..r.
9 .........
0 ....f...h
1 .h.......
2 .f.......

Turn = 5.
  012345678
0 ....f..t.
1 tt.f..tt.
2 ......tt.
3 h......r.
4 ...frtt..
5 ......r..
6 ........h
7 .........
8 ...t.r...
9 .........
0 r...f....
1 .h.......
2 .f......h

Turn = 10.
  012345678
0 ....rr.t.
1 tt.f..tt.
2 ......tt.
3 h......t.
4 ...f.tt..
5 ......t..
6 ........h
7 .........
8 ...t.....
9 .........
0 ....f....
1 rh.......
2 .f...r..h

*** Darwin 4x18 ***
Turn = 0.
  012345678901234567
0 r.frr....tr..fh..t
1 .r....rrfh.t.r..f.
2 h...t.r.trr.f....h
3 h.f..h.hh....r....

Turn = 3.
  012345678901234567
0 .rrr..r..t..rrr..t
1 .......rtt.tr...f.
2 h...t..rttt.f.....
3 hrfh..rrr.r......h

Turn = 6.
  012345678901234567
0 rr......rrrr..r.rt
1 .......rr.r.r...f.
2 h..tt..rrrr.......
3 hrrr..r.rrr.r....h

Turn = 9.
  012345678901234567
0 rrr....rrrr..r..r.
1 .......rrr.r.r.rf.
2 h..tt.rr.r.r.....r
3 rrr......rrr.....h

*** Darwin 15x6 ***
Turn = 0.
  012345
0 .t..t.
1 .r....
2 r.....
3 ......
4 ....r.
5 ....rr
6 ......
7 ......
8 ..r.h.
9 h.....
0 ...r.f
1 ......
2 t.....
3 ...f..
4 ......

Turn = 5.
  012345
0 .t..t.
1 ....t.
2 ......
3 ....h.
4 rr....
5 ...r..
6 r.....
7 ......
8 r.....
9 r....r
0 ....r.
1 ......
2 t.....
3 ...f..
4 ......

Turn = 10.
  012345
0 rr.rt.
1 ....t.
2 ....t.
3 ......
4 ......
5 ......
6 ......
7 r..r..
8 r..r..
9 ......
0 r.....
1 ......
2 t.....
3 ...f..
4 .....r

Turn = 15.
  012345
0 rr..t.
1 ....t.
2 ....t.
3 r.....
4 r.....
5 .....r
6 .....r
7 ......
8 ......
9 ......
0 ......
1 ......
2 r.....
3 r..f..
4 rr....

