*** Darwin 10x10 ***
Turn = 0.
  0123456789
0 .........t
1 ..........
2 ......t..h
3 ..........
4 ..........
5 ..t.......
6 ..........
7 ..........
8 .........f
9 .......h..

Turn = 2.
  0123456789
0 .........t
1 ..........
2 ......t...
3 ..........
4 .........h
5 ..t.......
6 ..........
7 ..........
8 .........f
9 .......h..

Turn = 4.
  0123456789
0 .........t
1 ..........
2 ......t...
3 ..........
4 ..........
5 ..t.......
6 .........h
7 ..........
8 .........f
9 .......h..

Turn = 6.
  0123456789
0 .........t
1 ..........
2 ......t...
3 ..........
4 ..........
5 ..t.......
6 ..........
7 .........h
8 .........f
9 .......h..

*** Darwin 14x17 ***
Turn = 0.
  01234567890123456
0 .................
1 .t..........t....
2 ........r........
3 .................
4 ............h.f..
5 .................
6 .............r..r
7 .................
8 ..h.....r........
9 .r...............
0 .................
1 .................
2 .................
3 .................

Turn = 5.
  01234567890123456
0 .................
1 .t..........t....
2 .................
3 ..h..............
4 .............hf..
5 ................r
6 .................
7 ........r........
8 ...r.............
9 .................
0 ................r
1 .................
2 .................
3 .r...............

Turn = 10.
  01234567890123456
0 ................r
1 .tt.........t....
2 .................
3 .................
4 .............hf..
5 .................
6 .................
7 r................
8 .................
9 .................
0 r................
1 .................
2 ........r........
3 ...............r.

*** Darwin 5x3 ***
Turn = 0.
  012
0 ..f
1 ...
2 .h.
3 ...
4 .r.

Turn = 1.
  012
0 ..f
1 ...
2 h..
3 ...
4 r..

Turn = 2.
  012
0 ..f
1 ...
2 h..
3 ...
4 r..

Turn = 3.
  012
0 ..f
1 ...
2 h..
3 r..
4 ...

Turn = 4.
  012
0 ..f
1 ...
2 r..
3 r..
4 ...

Turn = 5.
  012
0 ..f
1 ...
2 r..
3 r..
4 ...

Turn = 6.
  012
0 ..f
1 ...
2 r..
3 .r.
4 ...

*** Darwin 8x10 ***
Turn = 0.
  0123456789
0 ......h...
1 ..........
2 ...h.ht.t.
3 ff........
4 ......r...
5 ........h.
6 h.....h...
7 .h........

Turn = 1.
  0123456789
0 .......h..
1 ..........
2 .....ht.t.
3 ff.h......
4 .......rh.
5 ..........
6 h....h....
7 ..h.......

Turn = 2.
  0123456789
0 ........h.
1 ..........
2 .....ht.t.
3 ff......r.
4 ...h...r..
5 ..........
6 h...h.....
7 ...h......

Turn = 3.
  0123456789
0 .........h
1 ..........
2 .....ht.t.
3 ff......t.
4 ........r.
5 ...h......
6 h..h......
7 ....h.....

Turn = 4.
  0123456789
0 .........h
1 ..........
2 .....tt.t.
3 ff......t.
4 .........r
5 ...h......
6 h.h.......
7 .....h....

Turn = 5.
  0123456789
0 .........h
1 ..........
2 .....tt.t.
3 ff......t.
4 .........r
5 ..........
6 hh.h......
7 ......h...

Turn = 6.
  0123456789
0 .........h
1 ..........
2 .....tt.t.
3 ff......t.
4 ..........
5 .........r
6 hh........
7 ...h...h..

Turn = 7.
  0123456789
0 .........h
1 ..........
2 .....tt.t.
3 ff......t.
4 ..........
5 ..........
6 hh.......r
7 ...h....h.

Turn = 8.
  0123456789
0 .........h
1 ..........
2 .....tt.t.
3 ff......t.
4 ..........
5 ..........
6 hh........
7 ...h....hr

Turn = 9.
  0123456789
0 .........h
1 ..........
2 .....tt.t.
3 ff......t.
4 ..........
5 ..........
6 hh........
7 ...h....hr

Turn = 10.
  0123456789
0 .........h
1 ..........
2 .....tt.t.
3 ff......t.
4 ..........
5 ..........
6 hh........
7 ...h....hr

*** Darwin 5x10 ***
Turn = 0.
  0123456789
0 ........t.
1 ........ft
2 .........t
3 .h........
4 ...r....f.

Turn = 4.
  0123456789
0 .h......t.
1 ........tt
2 .........t
3 ..........
4 r.......f.

Turn = 8.
  0123456789
0 rh......t.
1 ........tt
2 .........t
3 ..........
4 ........f.

Turn = 12.
  0123456789
0 rr......t.
1 ........tt
2 .........t
3 ..........
4 ........f.

Turn = 16.
  0123456789
0 .....r..t.
1 ........tt
2 .........t
3 r.........
4 ........f.

Turn = 20.
  0123456789
0 ........rr
1 ........tt
2 .........t
3 ..........
4 ..r.....f.

*** Darwin 5x5 ***
Turn = 0.
  01234
0 ..f..
1 .....
2 .....
3 r..fh
4 ..r..

Turn = 3.
  01234
0 ..f..
1 .....
2 .....
3 ...f.
4 rr..h

Turn = 6.
  01234
0 ..f..
1 .r...
2 .....
3 r..f.
4 ....h

*** Darwin 7x5 ***
Turn = 0.
  01234
0 ....h
1 h...h
2 ..f..
3 rh...
4 ..r..
5 .....
6 ..ft.

Turn = 4.
  01234
0 rh...
1 rh...
2 ..f..
3 .....
4 .....
5 .r.r.
6 .hr..

Turn = 8.
  01234
0 rr...
1 rr.r.
2 ..f..
3 .....
4 .....
5 .....
6 rh..r

*** Darwin 4x10 ***
Turn = 0.
  0123456789
0 ...t......
1 .....t.rt.
2 .........f
3 hh..h....r

Turn = 1.
  0123456789
0 ...t...r..
1 .....t..t.
2 .h.......f
3 h...h...r.

Turn = 2.
  0123456789
0 ...t...r..
1 .h...t..t.
2 .........f
3 h...h..r..

Turn = 3.
  0123456789
0 .h.t....r.
1 .....t..t.
2 .........f
3 h...h.r...

*** Darwin 2x20 ***
Turn = 0.
  01234567890123456789
0 ......h.r..r......rt
1 ......f..fr..t.....r

Turn = 2.
  01234567890123456789
0 ........h.r........t
1 ......f.rf.r.t....rr

Turn = 4.
  01234567890123456789
0 .........rr........t
1 ......rr.rr..t..r..t

Turn = 6.
  01234567890123456789
0 ......r..rr........t
1 .....r...rr..tr....t

Turn = 8.
  01234567890123456789
0 ....r....rr........t
1 ...r....r.r..rr....t

Turn = 10.
  01234567890123456789
0 ..r.....r..r.r.....t
1 .r....r.....rr.....t

*** Darwin 4x4 ***
Turn = 0.
  0123
0 .h..
1 r..r
2 ..ft
3 ...t

Turn = 1.
  0123
0 h...
1 .rr.
2 ..ft
3 ...t

Turn = 2.
  0123
0 h...
1 .rr.
2 ..ft
3 ...t

Turn = 3.
  0123
0 h...
1 ..rr
2 .rr.
3 ...t

Turn = 4.
  0123
0 h..r
1 ..r.
2 ...r
3 .r.t

Turn = 5.
  0123
0 h..r
1 .r..
2 ...t
3 .r.t

Turn = 6.
  0123
0 h..r
1 r...
2 ...t
3 r..t

Turn = 7.
  0123
0 h..r
1 r...
2 ...t
3 r..t
