*** Darwin 8x8 ***
Turn = 0.
  01234567
0 f.......
1 ........
2 ........
3 ...hh...
4 ...hh...
5 ........
6 ........
7 .......f

Turn = 1.
  01234567
0 f.......
1 ........
2 ...h....
3 .....h..
4 ..h.....
5 ....h...
6 ........
7 .......f

Turn = 2.
  01234567
0 f.......
1 ...h....
2 ........
3 ......h.
4 .h......
5 ........
6 ....h...
7 .......f

Turn = 3.
  01234567
0 f..h....
1 ........
2 ........
3 .......h
4 h.......
5 ........
6 ........
7 ....h..f

Turn = 4.
  01234567
0 f..h....
1 ........
2 ........
3 .......h
4 h.......
5 ........
6 ........
7 ....h..f

Turn = 5.
  01234567
0 f..h....
1 ........
2 ........
3 .......h
4 h.......
5 ........
6 ........
7 ....h..f

*** Darwin 7x9 ***
Turn = 0.
  012345678
0 t........
1 .........
2 .........
3 ..h......
4 .........
5 ....r....
6 ........t

Turn = 1.
  012345678
0 t........
1 .........
2 .........
3 ...h.....
4 ....r....
5 .........
6 ........t

Turn = 2.
  012345678
0 t........
1 .........
2 .........
3 ....r....
4 ....r....
5 .........
6 ........t

Turn = 3.
  012345678
0 t........
1 .........
2 .........
3 ....rr...
4 .........
5 .........
6 ........t

Turn = 4.
  012345678
0 t........
1 .........
2 ....r....
3 ......r..
4 .........
5 .........
6 ........t

Turn = 5.
  012345678
0 t........
1 ....r....
2 .........
3 .......r.
4 .........
5 .........
6 ........t

*** Darwin 10x10 ***
Turn = 0.
  0123456789
0 thrtthrtth
1 frtthrtthr
2 tthrtthrtt
3 hrtthrtthr
4 tthrtthrtt
5 hrtthrtthr
6 tthrtthrtt
7 hrtthrtthr
8 tthrtthrtt
9 hrtthrtthr

Turn = 10.
  0123456789
0 tttttttttt
1 tttttttttt
2 tttttttttt
3 tttttttttt
4 tttttttttt
5 tttttttttt
6 tttttttttt
7 tttttttttt
8 tttttttttt
9 tttttttttt

*** Darwin 8x8 ***
Turn = 0.
  01234567
0 thrt....
1 ........
2 ........
3 ........
4 ........
5 ........
6 ........
7 ........

Turn = 5.
  01234567
0 tttt....
1 ........
2 ........
3 ........
4 ........
5 ........
6 ........
7 ........

*** Darwin 2x2 ***
Turn = 0.
  01
0 th
1 rt

Turn = 10.
  01
0 tt
1 tt

*** Darwin 8x8 ***
Turn = 0.
  01234567
0 h.......
1 .h......
2 ..h.....
3 ...t....
4 ....t...
5 .....h..
6 ......t.
7 .......t

Turn = 1.
  01234567
0 ........
1 h.h.....
2 ..h.....
3 ...t....
4 ....t...
5 ......t.
6 ......t.
7 .......t

Turn = 2.
  01234567
0 ........
1 ..hh....
2 h.......
3 ...t....
4 ....t...
5 ......t.
6 ......t.
7 .......t

Turn = 3.
  01234567
0 ..h.....
1 ....h...
2 ........
3 h..t....
4 ....t...
5 ......t.
6 ......t.
7 .......t

Turn = 4.
  01234567
0 ..h.....
1 .....h..
2 ........
3 ...t....
4 h...t...
5 ......t.
6 ......t.
7 .......t

Turn = 5.
  01234567
0 ..h.....
1 ......h.
2 ........
3 ...t....
4 ....t...
5 h.....t.
6 ......t.
7 .......t

*** Darwin 4x4 ***
Turn = 0.
  0123
0 hhhf
1 ....
2 ....
3 ....

Turn = 1.
  0123
0 .hhf
1 h...
2 ....
3 ....

Turn = 2.
  0123
0 .hhf
1 ....
2 h...
3 ....

Turn = 3.
  0123
0 .hhf
1 ....
2 ....
3 h...

Turn = 4.
  0123
0 .hhf
1 ....
2 ....
3 h...

Turn = 5.
  0123
0 .hhf
1 ....
2 ....
3 h...

*** Darwin 1x1 ***
Turn = 0.
  0
0 f

Turn = 1.
  0
0 f

Turn = 2.
  0
0 f

Turn = 3.
  0
0 f

Turn = 4.
  0
0 f

Turn = 5.
  0
0 f

*** Darwin 9x8 ***
Turn = 0.
  01234567
0 fff.....
1 ........
2 ........
3 ........
4 ........
5 ........
6 ........
7 ........
8 .......r

Turn = 10.
  01234567
0 fff.....
1 ........
2 ........
3 ........
4 ........
5 ........
6 r.......
7 ........
8 ........

Turn = 20.
  01234567
0 ..r.....
1 r.......
2 .rr.....
3 ........
4 ........
5 ........
6 ........
7 ........
8 ........

*** Darwin 9x8 ***
Turn = 0.
  01234567
0 ttt.....
1 ........
2 ........
3 ........
4 ........
5 ........
6 ........
7 ........
8 .......h

Turn = 10.
  01234567
0 ttt.....
1 ........
2 ........
3 ........
4 ........
5 ........
6 ........
7 ........
8 h.......

Turn = 20.
  01234567
0 ttt.....
1 ........
2 ........
3 ........
4 ........
5 ........
6 ........
7 ........
8 h.......

*** Darwin 6x8 ***
Turn = 0.
  01234567
0 h.......
1 ........
2 ........
3 ........
4 ........
5 .......r

Turn = 5.
  01234567
0 ........
1 ........
2 ........
3 ........
4 ........
5 h.....r.

*** Darwin 10x10 ***
Turn = 0.
  0123456789
0 f.........
1 ..........
2 ..........
3 ..........
4 ..........
5 .....r....
6 ..........
7 ..........
8 ..........
9 .........h

Turn = 5.
  0123456789
0 f....r....
1 ..........
2 ..........
3 ..........
4 ..........
5 ..........
6 ..........
7 ..........
8 ..........
9 .........h
