*** Darwin 8x8 ***
Turn = 0.
  01234567
0 rt......
1 ........
2 ........
3 ...hh...
4 ...hh...
5 ........
6 ........
7 ........

Turn = 1.
  01234567
0 rr......
1 ........
2 ...h....
3 .....h..
4 ..h.....
5 ....h...
6 ........
7 ........

Turn = 2.
  01234567
0 rr......
1 ...h....
2 ........
3 ......h.
4 .h......
5 ........
6 ....h...
7 ........

Turn = 3.
  01234567
0 r.rh....
1 ........
2 ........
3 .......h
4 h.......
5 ........
6 ........
7 ....h...

Turn = 4.
  01234567
0 .rrr....
1 ........
2 ........
3 .......h
4 h.......
5 ........
6 ........
7 ....h...

Turn = 5.
  01234567
0 .rr.r...
1 ........
2 ........
3 .......h
4 h.......
5 ........
6 ........
7 ....h...

Turn = 6.
  01234567
0 ..r..r..
1 .r......
2 ........
3 .......h
4 h.......
5 ........
6 ........
7 ....h...

Turn = 7.
  01234567
0 .r....r.
1 ........
2 .r......
3 .......h
4 h.......
5 ........
6 ........
7 ....h...

Turn = 8.
  01234567
0 r......r
1 ........
2 ........
3 .r.....h
4 h.......
5 ........
6 ........
7 ....h...

*** Darwin 14x21 ***
Turn = 0.
  012345678901234567890
0 ...................f.
1 h...........r........
2 .....................
3 .....................
4 .....................
5 .....................
6 .....................
7 h....................
8 ..................r..
9 .....................
0 .....................
1 .....................
2 ............r.....h..
3 .....................

Turn = 2.
  012345678901234567890
0 ............r......f.
1 .....................
2 .....................
3 h....................
4 .....................
5 .....................
6 .....................
7 ..h..................
8 .....................
9 .....................
0 ..................r..
1 .....................
2 ..............r.....h
3 .....................

Turn = 4.
  012345678901234567890
0 ..............r....f.
1 .....................
2 .....................
3 .....................
4 .....................
5 h....................
6 .....................
7 ....h................
8 .....................
9 .....................
0 .....................
1 .....................
2 ................r.r.h
3 .....................

*** Darwin 7x11 ***
Turn = 0.
  01234567890
0 ..hrr.h....
1 .hhf.......
2 ..h........
3 ......rf.h.
4 ..f.....rr.
5 ...........
6 ...........

Turn = 1.
  01234567890
0 ..hrr......
1 .hhf..h....
2 ...........
3 ..h....f..h
4 ..f...r....
5 ........rr.
6 ...........

Turn = 2.
  01234567890
0 ..hrr......
1 .hr........
2 ..h...h....
3 ..h....f..h
4 ..f........
5 ......r....
6 ........rr.

Turn = 3.
  01234567890
0 ..h.r......
1 .rrr.......
2 ..h........
3 ..h...hf..h
4 ..f........
5 ...........
6 ......r.rr.

Turn = 4.
  01234567890
0 ...h.r.....
1 .rr........
2 ..hr.......
3 ..h....f..h
4 ..f...h....
5 ...........
6 ......rrr..

Turn = 5.
  01234567890
0 .r..h.r....
1 ..r........
2 ..r........
3 ..rr...f..h
4 ...r.......
5 ......h....
6 .....rrr...

Turn = 6.
  01234567890
0 .r...h.r...
1 ..r........
2 ..r........
3 ...r...f..h
4 ..r.r......
5 ......h....
6 ....rrr....

*** Darwin 20x3 ***
Turn = 0.
  012
0 ...
1 fr.
2 ...
3 .r.
4 ...
5 .r.
6 hf.
7 f..
8 h..
9 .r.
0 h..
1 ...
2 ...
3 r..
4 ...
5 rr.
6 ...
7 ...
8 ...
9 ...

Turn = 4.
  012
0 r..
1 f..
2 h..
3 ...
4 ...
5 ..r
6 .r.
7 frr
8 ...
9 ..r
0 ..h
1 ...
2 ..r
3 ...
4 ...
5 ...
6 ...
7 ..r
8 r..
9 ...

*** Darwin 13x2 ***
Turn = 0.
  01
0 ..
1 f.
2 ..
3 h.
4 h.
5 r.
6 f.
7 r.
8 ..
9 ..
0 r.
1 h.
2 ..

Turn = 6.
  01
0 ..
1 f.
2 h.
3 h.
4 ..
5 ..
6 ..
7 .r
8 .r
9 .r
0 .r
1 ..
2 r.

*** Darwin 14x4 ***
Turn = 0.
  0123
0 ....
1 ....
2 h...
3 ....
4 ....
5 ....
6 ....
7 .hr.
8 ....
9 .r..
0 ....
1 h...
2 ....
3 ....

Turn = 1.
  0123
0 ....
1 ....
2 .h..
3 ....
4 ....
5 ....
6 ..r.
7 .h..
8 ....
9 ..r.
0 ....
1 ....
2 h...
3 ....

Turn = 2.
  0123
0 ....
1 ....
2 ..h.
3 ....
4 ....
5 ..r.
6 ....
7 ..h.
8 ....
9 ...r
0 ....
1 ....
2 ....
3 h...

*** Darwin 12x13 ***
Turn = 0.
  0123456789012
0 .............
1 .......r.....
2 .......f.....
3 .............
4 .............
5 .............
6 ..f..h.......
7 r.....h......
8 ........f....
9 .............
0 .r...........
1 .............

Turn = 1.
  0123456789012
0 .............
1 .......r.....
2 .............
3 .......r.....
4 .............
5 .....h.......
6 ..f...h......
7 .r...........
8 ........f....
9 .............
0 ..r..........
1 .............

Turn = 2.
  0123456789012
0 .............
1 .............
2 .......r.....
3 .............
4 .....h.r.....
5 ......h......
6 ..f..........
7 ..r..........
8 ........f....
9 .............
0 ...r.........
1 .............

Turn = 3.
  0123456789012
0 .............
1 .............
2 .............
3 .....h.r.....
4 ......h......
5 .......r.....
6 ..f..........
7 ...r.........
8 ........f....
9 .............
0 ....r........
1 .............

Turn = 4.
  0123456789012
0 .............
1 .............
2 .....h.......
3 ......h......
4 .......r.....
5 .............
6 ..f....r.....
7 ....r........
8 ........f....
9 .............
0 .....r.......
1 .............

Turn = 5.
  0123456789012
0 .............
1 .....h.......
2 ......h......
3 .............
4 .............
5 .......r.....
6 ..f..........
7 .....r.r.....
8 ........f....
9 .............
0 ......r......
1 .............

Turn = 6.
  0123456789012
0 .....h.......
1 ......h......
2 .............
3 .............
4 .............
5 .............
6 ..f....r.....
7 ......r......
8 .......rf....
9 .............
0 .......r.....
1 .............

Turn = 7.
  0123456789012
0 .....hh......
1 .............
2 .............
3 .............
4 .............
5 .............
6 ..f..........
7 ......rr.....
8 ........f....
9 .......r.....
0 ........r....
1 .............

*** Darwin 20x21 ***
Turn = 0.
  012345678901234567890
0 ............f........
1 .....................
2 .....................
3 .....................
4 .....................
5 .....................
6 .....................
7 ......r..............
8 .....................
9 .....................
0 .....................
1 .....................
2 ......r..............
3 .....................
4 .....................
5 .....................
6 .....................
7 .....................
8 .....................
9 .....................

Turn = 5.
  012345678901234567890
0 ............f........
1 .....................
2 .....................
3 .....................
4 .....................
5 .....................
6 .....................
7 ......r....r.........
8 .....................
9 .....................
0 .....................
1 .....................
2 .....................
3 .....................
4 .....................
5 .....................
6 .....................
7 .....................
8 .....................
9 .....................

*** Darwin 21x21 ***
Turn = 0.
  012345678901234567890
0 ........f............
1 ..................f..
2 .....................
3 ..............f......
4 .....................
5 .....................
6 .....................
7 .......h.r...........
8 .....................
9 .....................
0 .f...........r.......
1 f....................
2 .....................
3 .....................
4 .....................
5 ..............f......
6 .....................
7 .h..............f....
8 ..............r......
9 ....f.....h..........
0 .....................

Turn = 2.
  012345678901234567890
0 ........f............
1 ..................f..
2 .....................
3 ..............f......
4 .....................
5 .........r...........
6 .....................
7 .....................
8 .............r.......
9 .......h.............
0 .f...................
1 f....................
2 .....................
3 .....................
4 .....................
5 ..............f......
6 .....................
7 ...h......h.....f....
8 .....................
9 ....f................
0 ..............r......

Turn = 4.
  012345678901234567890
0 ........f............
1 ..................f..
2 .....................
3 .........r....f......
4 .....................
5 .....................
6 .............r.......
7 .....................
8 .....................
9 .....................
0 .f...................
1 f......h.............
2 .....................
3 .....................
4 .....................
5 ..........h...f......
6 .....................
7 .....h..........f....
8 .....................
9 ....f................
0 .............r.......

*** Darwin 14x19 ***
Turn = 0.
  0123456789012345678
0 ...................
1 ...................
2 ....h...........r..
3 ...f...............
4 ........f..........
5 ...................
6 ....r.......r......
7 ...................
8 h..................
9 ...................
0 ............h......
1 ...................
2 ...................
3 ...................

Turn = 1.
  0123456789012345678
0 ...................
1 ...................
2 .................r.
3 ...fh..............
4 ........f..........
5 ...................
6 .....r.............
7 ............r......
8 ...................
9 h..................
0 .............h.....
1 ...................
2 ...................
3 ...................

Turn = 2.
  0123456789012345678
0 ...................
1 ...................
2 ..................r
3 ...f...............
4 ....h...f..........
5 ...................
6 ......r............
7 ...................
8 ............r......
9 ...................
0 h.............h....
1 ...................
2 ...................
3 ...................

Turn = 3.
  0123456789012345678
0 ...................
1 ...................
2 ..................r
3 ...f...............
4 ........f..........
5 ....h..............
6 .......r...........
7 ...................
8 ...................
9 ............r......
0 ...............h...
1 h..................
2 ...................
3 ...................

Turn = 4.
  0123456789012345678
0 ...................
1 ...................
2 ...................
3 ...f..............r
4 ........f..........
5 ...................
6 ....h...r..........
7 ...................
8 ...................
9 ...................
0 ............r...h..
1 ...................
2 h..................
3 ...................

Turn = 5.
  0123456789012345678
0 ...................
1 ...................
2 ...................
3 ...f...............
4 ........f.........r
5 ...................
6 .........r.........
7 ....h..............
8 ...................
9 ...................
0 .................h.
1 ............r......
2 ...................
3 h..................

Turn = 6.
  0123456789012345678
0 ...................
1 ...................
2 ...................
3 ...f...............
4 ........f..........
5 ..................r
6 ..........r........
7 ...................
8 ....h..............
9 ...................
0 ..................h
1 ...................
2 ............r......
3 h..................

Turn = 7.
  0123456789012345678
0 ...................
1 ...................
2 ...................
3 ...f...............
4 ........f..........
5 ...................
6 ...........r......r
7 ...................
8 ...................
9 ....h..............
0 ..................h
1 ...................
2 ...................
3 h...........r......
