*** Darwin 9x1 ***
Turn = 0.
  0
0 .
1 .
2 .
3 r
4 .
5 .
6 .
7 .
8 h

Turn = 2.
  0
0 .
1 .
2 .
3 .
4 .
5 r
6 .
7 .
8 h

Turn = 4.
  0
0 .
1 .
2 .
3 .
4 .
5 .
6 .
7 r
8 h

*** Darwin 6x6 ***
Turn = 0.
  012345
0 f.t...
1 ......
2 ..h...
3 ..t...
4 ......
5 r.....

Turn = 5.
  012345
0 r.t...
1 r.t...
2 ......
3 ..t...
4 ......
5 ......

Turn = 10.
  012345
0 r...r.
1 .tt...
2 ......
3 ..t...
4 ......
5 ......

Turn = 15.
  012345
0 r.....
1 .tt...
2 ......
3 ..t..r
4 ......
5 ......

*** Darwin 14x14 ***
Turn = 0.
  01234567890123
0 ...t..........
1 .....f.h......
2 .........t...t
3 ......ft......
4 ...........f..
5 ............t.
6 f.............
7 .........h....
8 ....t...tr..th
9 .r...........r
0 ...r..........
1 .......f.....f
2 .t...t....tf..
3 ..............

Turn = 12.
  01234567890123
0 ...t..........
1 .....f.......t
2 .........t...t
3 ......tt......
4 ...........f..
5 ............t.
6 f.............
7 .............t
8 ....t...t...tt
9 ............tt
0 ..............
1 .......f.....f
2 .t...t....tt..
3 .t...........r

*** Darwin 7x12 ***
Turn = 0.
  012345678901
0 ............
1 .r.h.......r
2 ....h.t.....
3 .........h..
4 h.....tf....
5 f...........
6 ......t.....

Turn = 1.
  012345678901
0 ...h........
1 r..........r
2 ...h..t.....
3 ........h...
4 .h....tt....
5 f...........
6 ......t.....

Turn = 2.
  012345678901
0 ...h........
1 r...........
2 ..h...t....r
3 .......h....
4 ..h...tt....
5 f...........
6 ......t.....

Turn = 3.
  012345678901
0 ...h........
1 ............
2 rh....t.....
3 ......t....r
4 ...h..tt....
5 f...........
6 ......t.....

Turn = 4.
  012345678901
0 ...h........
1 ............
2 h.....t.....
3 r.....t.....
4 ....h.tt...r
5 f...........
6 ......t.....

Turn = 5.
  012345678901
0 ...h........
1 ............
2 h.....t.....
3 ......t.....
4 r....ttt....
5 f..........r
6 ......t.....

Turn = 6.
  012345678901
0 ...h........
1 ............
2 h.....t.....
3 ......t.....
4 r....ttt....
5 r...........
6 ......t....r

Turn = 7.
  012345678901
0 ...h........
1 ............
2 h.....t.....
3 ......t.....
4 r....ttt....
5 .r..........
6 ......t....r

*** Darwin 4x15 ***
Turn = 0.
  012345678901234
0 h.........f....
1 ....f....h.....
2 ...f...........
3 .....ff......t.

Turn = 2.
  012345678901234
0 ..........f....
1 ....f..........
2 h..f...........
3 .....ff..h...t.

Turn = 4.
  012345678901234
0 ..........f....
1 ....f..........
2 ...f...........
3 h....ff..h...t.

Turn = 6.
  012345678901234
0 ..........f....
1 ....f..........
2 ...f...........
3 h....ff..h...t.

Turn = 8.
  012345678901234
0 ..........f....
1 ....f..........
2 ...f...........
3 h....ff..h...t.

Turn = 10.
  012345678901234
0 ..........f....
1 ....f..........
2 ...f...........
3 h....ff..h...t.

Turn = 12.
  012345678901234
0 ..........f....
1 ....f..........
2 ...f...........
3 h....ff..h...t.

Turn = 14.
  012345678901234
0 ..........f....
1 ....f..........
2 ...f...........
3 h....ff..h...t.

Turn = 16.
  012345678901234
0 ..........f....
1 ....f..........
2 ...f...........
3 h....ff..h...t.

Turn = 18.
  012345678901234
0 ..........f....
1 ....f..........
2 ...f...........
3 h....ff..h...t.

Turn = 20.
  012345678901234
0 ..........f....
1 ....f..........
2 ...f...........
3 h....ff..h...t.

*** Darwin 10x7 ***
Turn = 0.
  0123456
0 .f.....
1 .t.....
2 .......
3 ..r....
4 f......
5 .......
6 ...f.r.
7 .....f.
8 f......
9 ......r

Turn = 2.
  0123456
0 .t.....
1 .t.....
2 .......
3 ....r..
4 f......
5 .......
6 ...f.r.
7 ......r
8 f......
9 ....r..

Turn = 4.
  0123456
0 .t.....
1 .t.....
2 .......
3 ......r
4 f......
5 .......
6 ...f..r
7 .......
8 f.....r
9 ..r....

Turn = 6.
  0123456
0 .t.....
1 .t.....
2 .......
3 .......
4 f.....r
5 .......
6 ...f...
7 .......
8 f.....r
9 r.....r

*** Darwin 9x6 ***
Turn = 0.
  012345
0 ...f..
1 ..f...
2 .....r
3 ......
4 ......
5 ..r...
6 ..tt..
7 .f....
8 ......

Turn = 1.
  012345
0 ...f..
1 ..f...
2 .....r
3 ......
4 ......
5 ..r...
6 .r.t..
7 .f....
8 ......

Turn = 2.
  012345
0 ...f..
1 ..f...
2 ......
3 .....r
4 ......
5 ......
6 r.rt..
7 .f....
8 ......

Turn = 3.
  012345
0 ...f..
1 ..f...
2 ......
3 ......
4 .....r
5 ......
6 r..t..
7 .fr...
8 ......

Turn = 4.
  012345
0 ...f..
1 ..f...
2 ......
3 ......
4 ......
5 .....r
6 ...t..
7 rf....
8 ..r...

Turn = 5.
  012345
0 ...f..
1 ..f...
2 ......
3 ......
4 ......
5 ......
6 ...t.r
7 .f....
8 r.r...

Turn = 6.
  012345
0 ...f..
1 ..f...
2 ......
3 ......
4 ......
5 ......
6 ...t..
7 .f...r
8 rr....

Turn = 7.
  012345
0 ...f..
1 ..f...
2 ......
3 ......
4 ......
5 ......
6 ...t..
7 .f....
8 rr...r

Turn = 8.
  012345
0 ...f..
1 ..f...
2 ......
3 ......
4 ......
5 ......
6 ...t..
7 rr....
8 .r...r

Turn = 9.
  012345
0 ...f..
1 ..f...
2 ......
3 ......
4 ......
5 ......
6 r..t..
7 rr....
8 .....r

Turn = 10.
  012345
0 ...f..
1 ..f...
2 ......
3 ......
4 ......
5 r.....
6 .r.t..
7 r....r
8 ......

Turn = 11.
  012345
0 ...f..
1 ..f...
2 ......
3 ......
4 r.....
5 .r....
6 r..t.r
7 ......
8 ......

*** Darwin 15x4 ***
Turn = 0.
  0123
0 ....
1 ...t
2 ....
3 ....
4 ...h
5 ....
6 ....
7 ....
8 .r..
9 ....
0 ....
1 t.f.
2 h..t
3 .r..
4 ....

Turn = 9.
  0123
0 ....
1 ...t
2 ....
3 ....
4 h...
5 ....
6 ....
7 ....
8 ....
9 ....
0 ....
1 rtt.
2 r..t
3 r...
4 ....

Turn = 18.
  0123
0 ....
1 ...t
2 ....
3 r...
4 ....
5 r...
6 r...
7 ....
8 ....
9 ....
0 ....
1 .tt.
2 ...t
3 ....
4 ...r

*** Darwin 5x14 ***
Turn = 0.
  01234567890123
0 .........r....
1 ............r.
2 ..t....t......
3 ...r....r...h.
4 ...f..h.......

Turn = 5.
  01234567890123
0 ....r.h....rh.
1 ...........r..
2 ..t....t......
3 ..............
4 ...f.r........

Turn = 10.
  01234567890123
0 .....rr.....h.
1 ..............
2 ..t.rr.t......
3 ..............
4 ...r......r...

Turn = 15.
  01234567890123
0 rr..........h.
1 ..t.r.........
2 ..t....t......
3 ..............
4 ......rr......

*** Darwin 9x9 ***
Turn = 0.
  012345678
0 .........
1 ...hrf.f.
2 .........
3 f.......r
4 ...t..h..
5 .t.......
6 .........
7 .........
8 h.t......

Turn = 6.
  012345678
0 ......r..
1 ...r.f.f.
2 .........
3 f........
4 ...t.....
5 .t.......
6 .........
7 .........
8 .tt...h.r

*** Darwin 8x11 ***
Turn = 0.
  01234567890
0 .h.....tr..
1 t...h......
2 ..f........
3 ...........
4 .r...t.....
5 f..........
6 .r...t.....
7 ..f........

Turn = 16.
  01234567890
0 ...r.rtt...
1 rr.........
2 ..rr.......
3 .r.........
4 ...........
5 ...........
6 .r.........
7 r.....r....

*** Darwin 2x10 ***
Turn = 0.
  0123456789
0 ..t...h...
1 r.........

Turn = 9.
  0123456789
0 ..t......h
1 .........r

*** Darwin 5x3 ***
Turn = 0.
  012
0 ...
1 .hr
2 ...
3 ...
4 ...

Turn = 3.
  012
0 ...
1 ..h
2 ...
3 ...
4 ..r

*** Darwin 15x2 ***
Turn = 0.
  01
0 ..
1 ..
2 t.
3 h.
4 f.
5 ..
6 ..
7 ..
8 ..
9 ..
0 .r
1 ..
2 ..
3 ..
4 ..

Turn = 11.
  01
0 ..
1 ..
2 t.
3 t.
4 t.
5 ..
6 ..
7 ..
8 ..
9 ..
0 ..
1 ..
2 r.
3 ..
4 ..
