{
  "project_info": {
    "project_number": "973279463567",
    "firebase_url": "https://masterclassapp-f1f19.firebaseio.com",
    "project_id": "masterclassapp-f1f19",
    "storage_bucket": "masterclassapp-f1f19.appspot.com"
  },
  "client": [
    {
      "client_info": {
        "mobilesdk_app_id": "1:973279463567:android:7ae72aa2c2f9811f",
        "android_client_info": {
          "package_name": "com.test.elenabedulina.masterclassapp"
        }
      },
      "oauth_client": [
        {
          "client_id": "973279463567-c5lb74inhsmnqm99b48ouh7u7h62i7im.apps.googleusercontent.com",
          "client_type": 3
        }
      ],
      "api_key": [
        {
          "current_key": "AIzaSyANj_r8TySUigydg9rPkIlLoiEpILaydL8"
        }
      ],
      "services": {
        "analytics_service": {
          "status": 1
        },
        "appinvite_service": {
          "status": 1,
          "other_platform_oauth_client": []
        },
        "ads_service": {
          "status": 2
        }
      }
    }
  ],
  "configuration_version": "1"
}