%YAML 1.1
%TAG !u! tag:unity3d.com,2011:
--- !u!30 &1
GraphicsSettings:
  m_ObjectHideFlags: 0
  serializedVersion: 13
  m_Deferred:
    m_Mode: 1
    m_Shader: {fileID: 69, guid: 0000000000000000f000000000000000, type: 0}
  m_DeferredReflections:
    m_Mode: 1
    m_Shader: {fileID: 74, guid: 0000000000000000f000000000000000, type: 0}
  m_ScreenSpaceShadows:
    m_Mode: 1
    m_Shader: {fileID: 64, guid: 0000000000000000f000000000000000, type: 0}
  m_LegacyDeferred:
    m_Mode: 1
    m_Shader: {fileID: 63, guid: 0000000000000000f000000000000000, type: 0}
  m_DepthNormals:
    m_Mode: 1
    m_Shader: {fileID: 62, guid: 0000000000000000f000000000000000, type: 0}
  m_MotionVectors:
    m_Mode: 1
    m_Shader: {fileID: 75, guid: 0000000000000000f000000000000000, type: 0}
  m_LightHalo:
    m_Mode: 1
    m_Shader: {fileID: 105, guid: 0000000000000000f000000000000000, type: 0}
  m_LensFlare:
    m_Mode: 1
    m_Shader: {fileID: 102, guid: 0000000000000000f000000000000000, type: 0}
  m_VideoShadersIncludeMode: 2
  m_AlwaysIncludedShaders:
  - {fileID: 7, guid: 0000000000000000f000000000000000, type: 0}
  - {fileID: 15104, guid: 0000000000000000f000000000000000, type: 0}
  - {fileID: 15105, guid: 0000000000000000f000000000000000, type: 0}
  - {fileID: 15106, guid: 0000000000000000f000000000000000, type: 0}
  - {fileID: 10753, guid: 0000000000000000f000000000000000, type: 0}
  - {fileID: 10770, guid: 0000000000000000f000000000000000, type: 0}
  - {fileID: 4800000, guid: 91dc9288320516f4193c37dcef2ad252, type: 3}
  - {fileID: 4800000, guid: 97fa50d0d790674419d2b555568d5d31, type: 3}
  - {fileID: 4800000, guid: 2c71f2f08f7eca3488e511c8b3e36912, type: 3}
  - {fileID: 4800000, guid: 963484209d11fd7f110076aa44295342, type: 3}
  - {fileID: 4800000, guid: b1ae6b3851e35fa4ba8825a866fb81ad, type: 3}
  - {fileID: 4800000, guid: 4fac230d594b48f4da4a52b2dbaf49b2, type: 3}
  - {fileID: 4800000, guid: 8a082b7610f1c28438dbcba40d81ac41, type: 3}
  - {fileID: 4800000, guid: d7e51e13d606e3749ba7883a0104db99, type: 3}
  - {fileID: 4800000, guid: 77ad4328105c67e468fdb468ca1bf54d, type: 3}
  - {fileID: 4800000, guid: 43c47d66e06a6a1439d6acf36f15463f, type: 3}
  - {fileID: 4800000, guid: 17a2bca3ccb59c74fb9d55f197dd4eac, type: 3}
  - {fileID: 46, guid: 0000000000000000f000000000000000, type: 0}
  m_PreloadedShaders:
  - {fileID: 20000000, guid: b607d96c29d8c204ca1ff8915217efbc, type: 2}
  m_SpritesDefaultMaterial: {fileID: 10754, guid: 0000000000000000f000000000000000, type: 0}
  m_CustomRenderPipeline: {fileID: 11400000, guid: 07683906275f2544d9b3f58ad2c96b5a, type: 2}
  m_TransparencySortMode: 0
  m_TransparencySortAxis: {x: 0, y: 0, z: 1}
  m_DefaultRenderingPath: 1
  m_DefaultMobileRenderingPath: 1
  m_TierSettings: []
  m_LightmapStripping: 0
  m_FogStripping: 0
  m_InstancingStripping: 0
  m_LightmapKeepPlain: 1
  m_LightmapKeepDirCombined: 1
  m_LightmapKeepDynamicPlain: 1
  m_LightmapKeepDynamicDirCombined: 1
  m_LightmapKeepShadowMask: 1
  m_LightmapKeepSubtractive: 1
  m_FogKeepLinear: 1
  m_FogKeepExp: 1
  m_FogKeepExp2: 1
  m_AlbedoSwatchInfos: []
  m_LightsUseLinearIntensity: 0
  m_LightsUseColorTemperature: 0
  m_DefaultRenderingLayerMask: 1
  m_LogWhenShaderIsCompiled: 1
