{
    "m_Name": "Settings",
    "m_Path": "ProjectSettings/Packages/com.unity.polybrush/Settings.json",
    "m_Dictionary": {
        "m_DictionaryValues": [
            {
                "type": "System.Boolean, mscorlib, Version=4.0.0.0, Culture=neutral, PublicKeyToken=b77a5c561934e089",
                "key": "Editor.FloatingWindow",
                "value": "{\"m_Value\":false}"
            },
            {
                "type": "System.Boolean, mscorlib, Version=4.0.0.0, Culture=neutral, PublicKeyToken=b77a5c561934e089",
                "key": "Scattering.UsePivotForPlacement",
                "value": "{\"m_Value\":false}"
            },
            {
                "type": "System.Boolean, mscorlib, Version=4.0.0.0, Culture=neutral, PublicKeyToken=b77a5c561934e089",
                "key": "Scattering.ParentObjectsWithSurface",
                "value": "{\"m_Value\":true}"
            },
            {
                "type": "System.Boolean, mscorlib, Version=4.0.0.0, Culture=neutral, PublicKeyToken=b77a5c561934e089",
                "key": "Scattering.AvoidOverlappingObjects",
                "value": "{\"m_Value\":false}"
            },
            {
                "type": "System.Boolean, mscorlib, Version=4.0.0.0, Culture=neutral, PublicKeyToken=b77a5c561934e089",
                "key": "Brush.IgnoreUnselected",
                "value": "{\"m_Value\":true}"
            },
            {
                "type": "System.Boolean, mscorlib, Version=4.0.0.0, Culture=neutral, PublicKeyToken=b77a5c561934e089",
                "key": "SmoothBrush.IgnoreOpenEdges",
                "value": "{\"m_Value\":true}"
            },
            {
                "type": "System.Boolean, mscorlib, Version=4.0.0.0, Culture=neutral, PublicKeyToken=b77a5c561934e089",
                "key": "Mesh.RebuildColliders",
                "value": "{\"m_Value\":true}"
            },
            {
                "type": "UnityEngine.Polybrush.BrushMirror, Unity.Polybrush, Version=0.0.0.0, Culture=neutral, PublicKeyToken=null",
                "key": "Brush.MirrorAxis",
                "value": "{\"m_Value\":0}"
            },
            {
                "type": "UnityEngine.Polybrush.MirrorCoordinateSpace, Unity.Polybrush, Version=0.0.0.0, Culture=neutral, PublicKeyToken=null",
                "key": "Brush.MirrorSpace",
                "value": "{\"m_Value\":0}"
            },
            {
                "type": "UnityEditor.Polybrush.PrefabLoadout, Unity.Polybrush.Editor, Version=0.0.0.0, Culture=neutral, PublicKeyToken=null",
                "key": "ScatteringEditor.userLoadout",
                "value": "{\"m_Value\":{\"infos\":[]}}"
            },
            {
                "type": "System.Int32, mscorlib, Version=4.0.0.0, Culture=neutral, PublicKeyToken=b77a5c561934e089",
                "key": "ScatteringEditor.PreviewThumSize",
                "value": "{\"m_Value\":60}"
            },
            {
                "type": "UnityEngine.Polybrush.PolyDirection, Unity.Polybrush, Version=0.0.0.0, Culture=neutral, PublicKeyToken=null",
                "key": "Brush.Direction",
                "value": "{\"m_Value\":1}"
            }
        ]
    }
}