// Jest Snapshot v1, https://goo.gl/fbAQLP

exports[`Form-Select renders correctly 1`] = `
"<div class=\\"form-select\\" type=\\"text\\"><select name=\\"select\\" required=\\"required\\" class=\\"form-select__field\\">
    <option value=\\"\\" disabled=\\"disabled\\"></option>
    <option value=\\"Field value A\\">Field value A</option>
    <option value=\\"Field value B\\">Field value B</option>
    <option value=\\"Field value C\\">Field value C</option>
  </select> <label class=\\"form-select__label\\">Field</label></div>"
`;
