<svg width="18" height="24" viewBox="0 0 18 24" fill="none" xmlns="http://www.w3.org/2000/svg">
<path d="M13.6851 22.6689L15.8614 21.4132C16.1539 21.2441 16.4063 21.0137 16.6013 20.7377C16.7963 20.4618 16.9292 20.147 16.991 19.8148C17.0528 19.4827 17.042 19.1411 16.9593 18.8135C16.8766 18.4859 16.7239 18.1801 16.5119 17.9171L14.6723 15.6384C14.4424 15.3545 14.1494 15.1281 13.8167 14.9772C13.484 14.8263 13.1208 14.755 12.7557 14.7689C12.0055 14.7993 10.8882 14.8452 10.2004 14.8639C10.0131 14.8725 9.82955 14.8101 9.68642 14.689C8.97233 14.0583 8.35559 13.3253 7.85624 12.5139C7.75099 12.3378 7.5807 12.2102 7.38215 12.1586C7.1836 12.107 6.97273 12.1356 6.79506 12.2381C6.6174 12.3407 6.48721 12.509 6.4326 12.7068C6.378 12.9045 6.40336 13.1158 6.50321 13.295C7.08468 14.2539 7.80911 15.1184 8.65147 15.8587C9.09337 16.2458 9.66688 16.4486 10.2539 16.4255C10.9356 16.4075 12.0625 16.3611 12.8191 16.3301C12.9405 16.3253 13.0613 16.3489 13.172 16.399C13.2827 16.4491 13.3801 16.5243 13.4566 16.6186L15.2965 18.8983C15.3669 18.9858 15.4175 19.0876 15.4449 19.1965C15.4723 19.3054 15.4758 19.419 15.4552 19.5294C15.4346 19.6399 15.3903 19.7445 15.3255 19.8363C15.2606 19.928 15.1767 20.0046 15.0795 20.0609L14.4384 20.431L12.5074 18.2896C12.4395 18.2109 12.3565 18.1466 12.2633 18.1004C12.1701 18.0542 12.0687 18.027 11.9649 18.0206C11.8611 18.0141 11.7571 18.0284 11.6589 18.0627C11.5607 18.0969 11.4703 18.1504 11.3931 18.2201C11.3159 18.2897 11.2533 18.3741 11.2091 18.4682C11.1649 18.5623 11.1399 18.6643 11.1357 18.7682C11.1314 18.8721 11.1479 18.9758 11.1842 19.0733C11.2206 19.1707 11.276 19.2599 11.3472 19.3356L13.0543 21.2288L12.9053 21.3147C12.6692 21.4408 12.4099 21.5176 12.1431 21.5404C11.8764 21.5631 11.6078 21.5314 11.3537 21.4471C10.0267 21.0834 7.8181 19.5409 4.83327 14.2566C1.70692 8.7221 0.926648 4.7857 2.74759 3.72475L4.924 2.46909C5.02122 2.41308 5.12941 2.37877 5.24114 2.3685C5.35287 2.35823 5.46549 2.37226 5.57129 2.40961C5.67709 2.44696 5.77356 2.50676 5.85408 2.5849C5.93459 2.66305 5.99725 2.75768 6.03776 2.86231L7.09182 5.59488C7.13564 5.70811 7.15225 5.83004 7.14032 5.95086C7.12838 6.07169 7.08824 6.18802 7.02312 6.29049L6.1946 7.5998L5.49209 5.66365C5.42134 5.46879 5.27607 5.31002 5.08825 5.22227C4.90044 5.13452 4.68545 5.12497 4.4906 5.19573C4.29574 5.26648 4.13697 5.41175 4.04922 5.59956C3.96147 5.78738 3.95192 6.00236 4.02267 6.19722L5.26831 9.62962C5.33911 9.82434 5.48435 9.98297 5.6721 10.0706C5.85985 10.1582 6.07472 10.1677 6.26945 10.0969C6.42947 10.0353 6.56409 9.92165 6.65162 9.77421L6.66281 9.78133L8.34316 7.12576C8.53799 6.81695 8.65807 6.46696 8.69387 6.10359C8.72966 5.74023 8.68018 5.37352 8.54935 5.03264L7.49542 2.29955C7.37364 1.98432 7.18504 1.6992 6.94258 1.4638C6.70011 1.22839 6.40955 1.04829 6.09086 0.935878C5.77216 0.823462 5.43291 0.781399 5.09641 0.812581C4.75991 0.843761 4.43416 0.947447 4.14155 1.11651L1.96416 2.3728C1.56994 2.59974 1.22596 2.90445 0.953131 3.26843C0.680303 3.63241 0.484319 4.04805 0.377083 4.49011C-0.133943 6.39729 0.416552 9.61495 3.47258 15.0253C6.08133 19.6435 8.59387 22.3111 10.9405 22.9541C11.3934 23.0951 11.8703 23.1424 12.3421 23.0934C12.8139 23.0444 13.2708 22.8999 13.6851 22.6689Z" fill="#8D8D8D"/>
</svg>
