{
    "/js/app.js": "/js/app.js",
    "/css/app.css": "/css/app.css",
    "/js/accordion.js": "/js/accordion.js",
    "/js/jquery.js": "/js/jquery.js",
    "/js/masonry.pkgd.min.js": "/js/masonry.pkgd.min.js",
    "/js/plugins.js": "/js/plugins.js",
    "/js/scripts.js": "/js/scripts.js",
    "/js/tabs.js": "/js/tabs.js",
    "/js/toggle.js": "/js/toggle.js",
    "/js/validate.js": "/js/validate.js",
    "/css/easy-responsive-shortcodes.css": "/css/easy-responsive-shortcodes.css",
    "/css/font-awesome.min.css": "/css/font-awesome.min.css",
    "/css/style.css": "/css/style.css",
    "/css/woocommerce-layout.css": "/css/woocommerce-layout.css",
    "/css/woocommerce-smallscreen.css": "/css/woocommerce-smallscreen.css",
    "/css/woocommerce.css": "/css/woocommerce.css",
    "/fonts/behance.eot": "/fonts/behance.eot",
    "/fonts/behance.svg": "/fonts/behance.svg",
    "/fonts/behance.ttf": "/fonts/behance.ttf",
    "/fonts/behance.woff": "/fonts/behance.woff",
    "/fonts/fontawesome-webfont.eot": "/fonts/fontawesome-webfont.eot",
    "/fonts/fontawesome-webfont.svg": "/fonts/fontawesome-webfont.svg",
    "/fonts/fontawesome-webfont.ttf": "/fonts/fontawesome-webfont.ttf",
    "/fonts/fontawesome-webfont.woff": "/fonts/fontawesome-webfont.woff",
    "/fonts/fontawesome-webfont.woff2": "/fonts/fontawesome-webfont.woff2",
    "/fonts/FontAwesome.otf": "/fonts/FontAwesome.otf",
    "/fonts/genericons-regular-webfont.eot": "/fonts/genericons-regular-webfont.eot",
    "/fonts/genericons-regular-webfont.svg": "/fonts/genericons-regular-webfont.svg",
    "/fonts/genericons-regular-webfont.ttf": "/fonts/genericons-regular-webfont.ttf",
    "/fonts/genericons-regular-webfont.woff": "/fonts/genericons-regular-webfont.woff"
}
