    1  sudo docker --version
    2  poweroff
    3  sudo gedit
    4  clear
    5  sudo docker --version
    6  ping www.google.com
    7  clear
    8  exit
    9  git status
   10  git add README.md
   11  git commit
   12  git commit -M  'teste de commit'
   13  git push
   14  clear
   15  git status
   16  git add .
   17  git commit -M  'teste de commit'
   18  git commit 'teste de commit'
   19  git commit -m 'teste de commit'
   20  git push
   21  clear
   22  git clone https://github.com/SergioDiniz/iesp-aula-31-05--01-06-SOLID.git
   23  clear
   24  docker images
   25  sudo su
   26  cd bonavides-generator/
   27  code .
   28  cd bonavides-generator/
   29  git remote add origin https://github.com/wellesson/bonavides-generetor.git
   30  git status
   31  git add .
   32  gis status
   33  git commit -m 'comit inicial
   34  git commit -m 'comit inicial'
   35  git status
   36  git commit -m "comit inicial"
   37  git push
   38  git push -u origin master
   39  git status
   40  git add .
   41  git commit -m "comit 2"
   42  git push -u origin master
   43  wellesson15.cz@gmail.com
   44  git push -u origin master
   45  git add .
   46  git commit -m "comit 32"
   47  git push
   48  ionic generate
   49  cd bonavides-generator/
   50  ionic serve --lab
   51  cd app-particular/
   52  ionic g
   53  cd app-particular/
   54  ionic g
   55  code .
   56  cd app-particular/
   57  cod .
   58  code .
   59  ionic g
   60  ionic serve --lab
   61  ionic g
   62  mkdir app-particular
   63  cd app-particular/
   64  ionic g
   65  cd ..
   66  ionic g
   67  cd app-particular/
   68  ionic start
   69  ionic serve --lab
   70  ionic init
   71  ionic serve
   72  cd app-particular/
   73  ionic serve --lab
   74  ionic serve --lab
   75  git remote add origin 
   76  git status
   77  git add .
   78  git status
   79  git commit -m "comit 2º app"
   80  git status
   81  git remote add origin https://github.com/wellesson/app-particular.git
   82  cd ..
   83  git remote add origin https://github.com/wellesson/app-particular.git
   84  cd ..
   85  cd aplicativo-particular/
   86  git remote add origin https://github.com/wellesson/app-particular.git
   87  git remote add origin https://github.com/wellesson/aplicativo-particular.git
   88  /home
   89  /
   90  9
   91  ls -a
   92  /clear
   93  cd/home
   94  /ls
   95  /ls -a
   96  ls -a
   97  cd /home
   98  cd /
   99  ls
  100  cd home/
  101  ls
  102  cd lab10usuario32/
  103  ls
  104  cd Downloads
  105  cd ..
  106  ls
  107  cd Downloads
  108  cd ..
  109  ls
  110  cd ..
  111  cd/ 
  112  cd /
  113  ls
  114  cd home/
  115  cd lab10usuario32/
  116  cd downloads
  117  cd Downloads
  118  ls
  119  /clear ]
  120  cd ..
  121  /clear
  122  clear
  123  history
  124  clear
  125  cd /
  126  cd home/
  127  ls
  128  cd lab10usuario32/
  129  ls
  130  clear
  131  ls
  132  ls -l
  133  ls clear
  134  clear
  135  ls
  136  cd Documentos
  137  ls
  138  mkdir pasta_linux
  139  ls
  140  cd pasta_linux
  141  mkdir pasta da pasta linux teste
  142  mkdir pasta_linux_teste
  143  /ls
  144  cd ..
  145  ls
  146  mkdir pasta_linux2
  147  ls
  148  cd pasta_linux
  149  mkdir eu gosto de café
  150  mkdir eu_gosto
  151  cd ..
  152  mkdir eu\gosto
  153  ls
  154  touch testetxt.txt
  155  ls
  156  touch teste2 txt
  157  ls
  158  cp teste2 pasta_linux2
  159  ls
  160  cd pasta_linux2
  161  ls
  162  cd ..
  163  ls
  164  cp eugosto pasta_linux2
  165  ls
  166  cp -eugosto pasta_linux2
  167  ls
  168  cd eugosto
  169  ls
  170  cd ..
  171  cd teste2
  172  ls
  173  more teste2
  174  more /home/lab10usuario32/documentos/teste2
  175  more /home/lab10usuario32/Documentos/teste2
  176  ls
  177  rm teste2
  178  ls
  179  rm eugosto
  180  ls
  181  rm testetxt.txt
  182  ls
  183  rm txt
  184  ls
  185  cd eugosto
  186  ls
  187  rm eugosto
  188  dc ..
  189  cd ..
  190  ls
  191  mv eugosto pasta_linux2
  192  ls
  193  cd pasta_linux2
  194  ls
  195  cd ..
  196  ls
  197  mv pasta_linux pasta_linux2
  198  cd pasta_linux2
  199  ls
  200  mv teste2 cd ..
  201  ls
  202  rm -r eugosto
  203  ls
  204  mv pasta_linux /Documentos
  205  mv -r pasta_linux /Documentos
  206  mv pasta_linux /home/lab10usuario32/Documentos
  207  ls
  208  cd ..
  209  ls
  210  cd
  211  ls
  212  cd Documentos
  213  cd pasta_linux
  214  ls
  215  rm -r café
  216  ls
  217  rs da
  218  ls
  219  rm da
  220  ls
  221  mkdir removivel
  222  ls
  223  rmdir removivel
  224  ls
  225  cd
  226  ls -l
  227  mkdir teste
  228  chmod 700 teste
  229  ls -l
  230  mkdir testegrupo
  231  ls
  232  chmod 070 testegrupo
  233  ls -l
  234  cd
  235  mkdir teste.txt
  236  ls
  237  chmod 070 teste.txt
  238  ls -l
  239  cd
  240  ls
  241  cd ~
  242  ls
  243  sudo apt-get update
  244  sudo apt -geat update
  245  cd
  246  sudo apt -get update
  247  sudo apt-get update
  248  apt-get install vlc
  249  cd
  250  sudo apt-get install vlc
  251  cd
  252  l
  253  ls
  254  l
  255  vlc
  256  sudo apt-get update && sudo apt-get install python 3.7.4 -y
  257  exit
  258  sudo apt install w3m
  259  w3m
  260  ls
  261  cd Downloads
  262  ls
  263  tar -xvz w3m-0.5.3.tar.gz
  264  tar -xvf w3m-0.5.3.tar.gz
  265  ls
  266  sudo apt-get install lynx
  267  lynx https://www.google.com
  268  lynks https://www.google.com
  269  lynx https://www.google.com
  270  docker
  271  docker info
  272  docker --V
  273  docker --version
  274  sudo apt update
  275  docker 
  276  docker run
  277  docker info
  278  sudo su
  279  docker container rm -f $(docker container ls -q)
  280  sudo docker container rm -f $(docker container ls -q)
  281  sudo su
  282  git clone git@gitlab.com:Logstay/treinamentoindradevops.git
  283  git clone https://gitlab.com/Logstay/treinamentoindradevops.git
  284  https://gitlab.com/Logstay/treinamentoindradevops0001.git
  285  git clone git@gitlab.com:Logstay/treinamentodevopsindramens.git
  286  ls
  287  cd treinamentoindradeops
  288  cd treinamentoindradevops
  289  ls
  290  ls -la
  291  git status
  292  git config
  293  git config username
  294  ls
  295  ls -la
  296  nodejs --version
  297  sudo npm -i -g docusaurus-init@1.11.1
  298  ls
  299  ls -la
  300  sudo npm install -g docusaurus-init@1.11.1
  301  docusaurus-init
  302  ls
  303  chmod help
  304  chmod --helmp
  305  chmod --help
  306  npm start
  307  cd website/
  308  npm start
  309  git init
  310  git status
  311  git add .
  312  git commit -m "primeiro comite nmp na pasta cd website"
  313  git push -u origin master
  314  git push
  315  git push master
  316  git push -u origin master
  317  git commit --help
  318  git push -u origin master
  319  git config --global user.name "Kaique Moreira de Lima"
  320  git config --global user.email "kaiquepng@gmail.com"
  321  git push -u origin master
  322  git push -u origin --all
  323  git push origin master
  324  ls
  325  cd
  326  cd treinamentoindradevops
  327  git init
  328  git push origin master
  329  git init
  330  git add .
  331  git status
  332  git commit -m "firt commit"
  333  git push origin master
  334  cd treinamentoindradevops
  335  git init
  336  git add .
  337  git init
  338  git commit -m "firt commit"
  339  git push origin master
  340  git remote add origin https://github.com/Logstay/treinamentoindradevops.git
  341  git clone
  342  git clone https://github.com/Logstay/treinamentoindradevops.git
  343  cd ..
  344  git clone https://github.com/Logstay/treinamentoindradevops.git
  345  ls
  346  cd treinamentoindradevops
  347  cd ..
  348  ls
  349  git clone https://github.com/Logstay/treinamentoindradevops.git
  350  ls
  351  cd treinamentoindradevops
  352  docusaurus-init
  353  cd website/
  354  npm start
  355  git init
  356  git add ,
  357  git add .
  358  git status
  359  git commit -m "first commit"
  360  git push -u origin master
  361  git remote add origin https://github.com/Logstay/treinamentoindradevops.git
  362  git push -u origin master
  363  git remote add origin git@gitlab.com:Logstay/treinamentoindradevops.git
  364  git init
  365  git remote add origin git@gitlab.com:Logstay/treinamentoindradevops.git
  366  npm start
  367  git config --global user.name "logstay"
  368  git config --global user.email "kaiquepng@gmail.com"
  369  git clone git@gitlab.com:Logstay/treinamentoindradevops.git
  370  ls
  371  git clone git@gitlab.com:Logstay/treinamentoindradevops.git
  372  ls
  373  https://gitlab.com/Logstay/treinamentoindradevops.git
  374  ls
  375  cd treinamentoindradevops
  376  https://gitlab.com/Logstay/treinamentoindradevops.git
  377  git clone https://gitlab.com/Logstay/treinamentoindradevops.git
  378  ls
  379  cd treinamentoindradevops
  380  docusaurus-init
  381  cd website/
  382  npm start
  383  cd ..
  384  git init
  385  git add .
  386  git commit -m "first commit"
  387  git push -u origin master
  388  cd website/
  389  npm start
  390  service docker restart
  391  sudo su
  392  cd ..
  393  nmp build
  394  npm build
  395  ls
  396  cd website/
  397  npm build
  398  npm run build
  399  npm update
  400  npm run update
  401  npm run build
  402  sudo su
  403  ls
  404  cd build
  405  ls
  406  git clone https://github.com/higoalexandreb/docker.git
  407  cd docker
  408  git init
  409  git add ,
  410  git add .
  411  git commit -m "first commit"
  412  git push -u origin master
  413  cd ..
  414  cd treinamentoindradevops
  415  ls
  416  git init
  417  git add .
  418  git commmit -m "add jenkinsfile"
  419  git commmit -m "add jenkinsfile menas"
  420  git push -u origin master
  421  git push -u origin master --force
  422  git push -u origin master -f
  423  git commit -am "add jenkins file"
  424  git push -u origin master
  425  cd website/
  426  npm start
  427  history
  428  history > arquivs.txt
