%YAML 1.1
%TAG !u! tag:unity3d.com,2011:
--- !u!114 &2492856028049657324
MonoBehaviour:
  m_ObjectHideFlags: 0
  m_CorrespondingSourceObject: {fileID: 0}
  m_PrefabInstance: {fileID: 0}
  m_PrefabAsset: {fileID: 0}
  m_GameObject: {fileID: 8987954712656238285}
  m_Enabled: 1
  m_EditorHideFlags: 0
  m_Script: {fileID: 11500000, guid: 12aa1a079b194bfb9198a9154631404d, type: 3}
  m_Name: 
  m_EditorClassIdentifier: 
--- !u!1001 &8987954712656334953
PrefabInstance:
  m_ObjectHideFlags: 0
  serializedVersion: 2
  m_Modification:
    m_TransformParent: {fileID: 0}
    m_Modifications:
    - target: {fileID: 100004, guid: 7867af58a6ec48846ae807eb4022fbaa, type: 3}
      propertyPath: m_Name
      value: DeathParticles
      objectReference: {fileID: 0}
    - target: {fileID: 400004, guid: 7867af58a6ec48846ae807eb4022fbaa, type: 3}
      propertyPath: m_RootOrder
      value: 0
      objectReference: {fileID: 0}
    - target: {fileID: 400004, guid: 7867af58a6ec48846ae807eb4022fbaa, type: 3}
      propertyPath: m_LocalPosition.x
      value: -4.45
      objectReference: {fileID: 0}
    - target: {fileID: 400004, guid: 7867af58a6ec48846ae807eb4022fbaa, type: 3}
      propertyPath: m_LocalPosition.y
      value: 3.6
      objectReference: {fileID: 0}
    - target: {fileID: 400004, guid: 7867af58a6ec48846ae807eb4022fbaa, type: 3}
      propertyPath: m_LocalPosition.z
      value: 4.49
      objectReference: {fileID: 0}
    - target: {fileID: 400004, guid: 7867af58a6ec48846ae807eb4022fbaa, type: 3}
      propertyPath: m_LocalRotation.w
      value: 0.70710677
      objectReference: {fileID: 0}
    - target: {fileID: 400004, guid: 7867af58a6ec48846ae807eb4022fbaa, type: 3}
      propertyPath: m_LocalRotation.x
      value: 0.7071069
      objectReference: {fileID: 0}
    - target: {fileID: 400004, guid: 7867af58a6ec48846ae807eb4022fbaa, type: 3}
      propertyPath: m_LocalRotation.y
      value: 0
      objectReference: {fileID: 0}
    - target: {fileID: 400004, guid: 7867af58a6ec48846ae807eb4022fbaa, type: 3}
      propertyPath: m_LocalRotation.z
      value: 0
      objectReference: {fileID: 0}
    - target: {fileID: 400004, guid: 7867af58a6ec48846ae807eb4022fbaa, type: 3}
      propertyPath: m_LocalEulerAnglesHint.x
      value: 0
      objectReference: {fileID: 0}
    - target: {fileID: 400004, guid: 7867af58a6ec48846ae807eb4022fbaa, type: 3}
      propertyPath: m_LocalEulerAnglesHint.y
      value: 0
      objectReference: {fileID: 0}
    - target: {fileID: 400004, guid: 7867af58a6ec48846ae807eb4022fbaa, type: 3}
      propertyPath: m_LocalEulerAnglesHint.z
      value: 0
      objectReference: {fileID: 0}
    - target: {fileID: 19800000, guid: 7867af58a6ec48846ae807eb4022fbaa, type: 3}
      propertyPath: playOnAwake
      value: 0
      objectReference: {fileID: 0}
    - target: {fileID: 19800002, guid: 7867af58a6ec48846ae807eb4022fbaa, type: 3}
      propertyPath: playOnAwake
      value: 0
      objectReference: {fileID: 0}
    - target: {fileID: 19800004, guid: 7867af58a6ec48846ae807eb4022fbaa, type: 3}
      propertyPath: playOnAwake
      value: 0
      objectReference: {fileID: 0}
    - target: {fileID: 19800006, guid: 7867af58a6ec48846ae807eb4022fbaa, type: 3}
      propertyPath: playOnAwake
      value: 0
      objectReference: {fileID: 0}
    - target: {fileID: 19900000, guid: 7867af58a6ec48846ae807eb4022fbaa, type: 3}
      propertyPath: m_Materials.Array.size
      value: 1
      objectReference: {fileID: 0}
    - target: {fileID: 19900002, guid: 7867af58a6ec48846ae807eb4022fbaa, type: 3}
      propertyPath: m_Materials.Array.size
      value: 1
      objectReference: {fileID: 0}
    - target: {fileID: 19900004, guid: 7867af58a6ec48846ae807eb4022fbaa, type: 3}
      propertyPath: m_Materials.Array.size
      value: 1
      objectReference: {fileID: 0}
    - target: {fileID: 19900006, guid: 7867af58a6ec48846ae807eb4022fbaa, type: 3}
      propertyPath: m_Materials.Array.size
      value: 1
      objectReference: {fileID: 0}
    m_RemovedComponents:
    - {fileID: 11400004, guid: 7867af58a6ec48846ae807eb4022fbaa, type: 3}
  m_SourcePrefab: {fileID: 100100000, guid: 7867af58a6ec48846ae807eb4022fbaa, type: 3}
--- !u!1 &8987954712656238285 stripped
GameObject:
  m_CorrespondingSourceObject: {fileID: 100004, guid: 7867af58a6ec48846ae807eb4022fbaa, type: 3}
  m_PrefabInstance: {fileID: 8987954712656334953}
  m_PrefabAsset: {fileID: 0}
