Division,WeightClassKg,Place,Name,Team,BodyweightKg,Best3SquatKg,Best3BenchKg,Best3DeadliftKg,TotalKg,Equipment,Event,Sex,BirthDate
Boys,59.87,1,Paul Herrera,Floresville,59.15,145.15,86.18,170.1,401.43,Single-ply,SBD,M,
Boys,59.87,2,Juan Higgins,Universal City Randolph,57.11,142.88,86.18,170.1,399.16,Single-ply,SBD,M,
Boys,59.87,3,Migeul Elizarraras,Floresville,59.65,104.33,74.84,158.76,337.93,Single-ply,SBD,M,
Boys,59.87,4,Cameron Johns,Floresville,59.6,108.86,86.18,124.74,319.78,Single-ply,SBD,M,
Boys,67.13,1,Gavin LaFleur,Floresville,65.14,183.7,106.59,163.29,453.59,Single-ply,SBD,M,
Boys,67.13,2,Jayson Figueroa,San Antonio East Central,67.13,170.1,92.99,149.69,412.77,Single-ply,SBD,M,
Boys,67.13,3,Matthew Villarreal,San Antonio East Central,63.19,127.01,77.11,158.76,362.87,Single-ply,SBD,M,
Boys,74.84,1,Zac Nelson,Floresville,73.71,188.24,129.27,197.31,514.83,Single-ply,SBD,M,
Boys,74.84,2,Micheal Aguliar,San Antonio East Central,68.13,192.78,113.4,199.58,505.76,Single-ply,SBD,M,
Boys,74.84,3,Trevon Moore,Universal City Randolph,73.71,217.72,117.93,163.29,498.95,Single-ply,SBD,M,
Boys,74.84,4,Christian Luensmann,San Antonio East Central,70.85,183.7,106.59,179.17,469.47,Single-ply,SBD,M,
Boys,74.84,5,Mark Janowsky,Castroville Medina Valley,73.44,138.35,61.23,181.44,381.02,Single-ply,SBD,M,
Boys,74.84,6,Parker Cabra,Universal City Randolph,68.4,142.88,81.65,154.22,378.75,Single-ply,SBD,M,
Boys,74.84,7,Landrum Wells,Universal City Randolph,72.71,127.01,90.72,129.27,347,Single-ply,SBD,M,
Boys,74.84,8,Antonio Robles,Floresville,74.8,102.06,79.38,136.08,317.51,Single-ply,SBD,M,
Boys,74.84,DQ,Christopher Rodriguez,San Antonio Southside,67.31,,,,,Single-ply,SBD,M,
Boys,82.1,1,Eduardo Garcia-Ocampo,San Antonio East Central,80.01,199.58,127.01,195.04,521.63,Single-ply,SBD,M,
Boys,82.1,2,Banks Lezerrick,Universal City Randolph,77.29,183.7,102.06,195.04,480.81,Single-ply,SBD,M,
Boys,82.1,3,Kalvin Solis,San Antonio East Central,76.88,176.9,86.18,190.51,453.59,Single-ply,SBD,M,
Boys,82.1,4,Carson Morris,Universal City Randolph,78.56,174.63,97.52,179.17,451.32,Single-ply,SBD,M,
Boys,82.1,5,Daniel Arellano,Floresville,81.06,149.69,102.06,183.7,435.45,Single-ply,SBD,M,
Boys,89.81,1,Micah Young,San Antonio Southside,89.13,240.4,136.08,244.94,621.42,Single-ply,SBD,M,
Boys,89.81,2,Tristian Real,San Antonio East Central,88.54,217.72,140.61,195.04,553.38,Single-ply,SBD,M,
Boys,89.81,3,Kenneth Arroyos,Castroville Medina Valley,88.13,199.58,117.93,210.92,528.44,Single-ply,SBD,M,
Boys,99.79,1,Seth Bullard,Castroville Medina Valley,98.02,260.82,161.03,226.8,648.64,Single-ply,SBD,M,
Boys,99.79,2,Marshall Clark,San Antonio East Central,97.34,233.6,147.42,210.92,591.94,Single-ply,SBD,M,
Boys,99.79,3,Brandon Glaspie,Universal City Randolph,99.43,219.99,127.01,199.58,546.58,Single-ply,SBD,M,
Boys,99.79,4,Jason Coronado,Floresville,95.53,204.12,104.33,233.6,542.04,Single-ply,SBD,M,
Boys,99.79,5,Mauricio Delgado,San Antonio East Central,97.48,188.24,81.65,197.31,467.2,Single-ply,SBD,M,
Boys,99.79,DQ,Josh Munoz,Castroville Medina Valley,99.43,,,,,Single-ply,SBD,M,
Boys,109.77,1,Ethan Wanat,Castroville Medina Valley,99.84,156.49,111.13,170.1,437.72,Single-ply,SBD,M,
Boys,109.77,2,Isaiah Mena,Castroville Medina Valley,107.91,124.74,74.84,124.74,324.32,Single-ply,SBD,M,
Boys,109.77,DQ,Jared Relkin,Universal City Randolph,100.92,181.44,117.93,,,Single-ply,SBD,M,
Boys,124.74,1,Aidan Marin,San Antonio East Central,118.25,238.14,108.86,206.38,553.38,Single-ply,SBD,M,
Boys,124.74,2,Micheal Pinones,San Antonio East Central,122.11,235.87,145.15,172.37,553.38,Single-ply,SBD,M,
Boys,124.74,3,Matt Polasek,Floresville,119.66,229.06,122.47,195.04,546.58,Single-ply,SBD,M,
