Place,Name,State,WeightClassKg,BodyweightKg,Age,Squat1Kg,Squat2Kg,Squat3Kg,Best3SquatKg,Bench1Kg,Bench2Kg,Bench3Kg,Best3BenchKg,Deadlift1Kg,Deadlift2Kg,Deadlift3Kg,Best3DeadliftKg,Deadlift4Kg,TotalKg,Event,Equipment,Sex,Division,BirthDate
1,Kellie Chong,ON,60,58.3,22,127.5,135.0,142.5,142.5,62.5,67.5,70.0,70.0,157.5,165,172.5,172.5,175,385,SBD,Raw,F,Juniors 20-23,
1,Kiley Morrissey,ON,67.5,66.9,22,117.5,125.0,132.5,132.5,75,80.0,85.5,85.5,127.5,137.5,147.5,147.5,,365.5,SBD,Raw,F,Juniors 20-23,
1,Sarah Mcloughlin,ON,82.5,75.3,22,110.0,115.0,120,120,45,52.5,-62.5,52.5,125,142.5,150,150,,322.5,SBD,Raw,F,Juniors 20-23,
2,Brooke Myatt,ON,82.5,76.1,22,102.5,-110.0,-117.5,102.5,55,62.5,67.5,67.5,110,120,130,130,,300,SBD,Raw,F,Juniors 20-23,
1,Grace Nakatsu,ON,52,48.7,63,-85.0,85.0,-90,85.0,40,45.0,-47.5,45.0,105,110,115,115,,245,SBD,Raw,F,Open,
1,Emily Nesbitt,ON,56,55.2,25,-117.5,117.5,122.5,122.5,62.5,-67.5,-67.5,62.5,125,135,-140,135,,320,SBD,Raw,F,Open,
2,Linda Mejia,ON,56,54.3,34,90.0,95.0,100,100,50,55.0,-62.5,55.0,122.5,125,137.5,137.5,,292.5,SBD,Raw,F,Open,
1,Randi Colwell,ON,67.5,62.1,29,75.0,80,87.5,87.5,42.5,45.0,47.5,47.5,120,130,-137.5,130,,265,SBD,Raw,F,Open,
1,Valéry Switzer,ON,82.5,79.8,28,100.0,120.0,137.5,137.5,60,-67.5,70.0,70.0,135,142.5,150,150,,357.5,SBD,Raw,F,Open,
2,Steph Spencer,ON,82.5,80.9,46,-80.0,82.5,85,85,35,42.5,47.5,47.5,-95,112.5,115,115,,247.5,SBD,Raw,F,Open,
1,Grace Nakatsu,ON,52,48.7,63,-85.0,85.0,-90,85.0,40,45.0,-47.5,45.0,105,110,115,115,,245,SBD,Raw,F,Masters 60-64,
1,Melissa Cohoe,ON,67.5,66.2,40,90,95.0,-97.5,95.0,60,62.5,-65.0,62.5,117.5,122.5,127.5,127.5,,285,SBD,Raw,F,Masters 40-44,
1,Michelle Derouin,ON,75,70.1,40,135.0,145.0,-150,145.0,60,65.0,-70.0,65.0,155,162.5,170,170,,380,SBD,Raw,F,Masters 40-44,
1,Steph Spencer,ON,82.5,80.9,46,-80.0,82.5,85,85,35,42.5,47.5,47.5,-95,112.5,115,115,,247.5,SBD,Raw,F,Masters 45-49,
1,Brandon Wojick,ON,75,73.8,19,152.5,160.0,170.0,170.0,112.5,117.5,-127.5,117.5,180,192.5,200,200,,487.5,SBD,Raw,M,Juniors 18-19,
1,Nicolas Perdicaris,ON,75,74.6,20,202.5,207.5,212.5,212.5,142.5,-147.5,147.5,147.5,265,275.0,282.5,282.5,,642.5,SBD,Raw,M,Juniors 20-23,
1,Anders Kalvenes,ON,82.5,79.3,19,-165.0,-165.0,165.0,165.0,90,97.5,-102.5,97.5,195,215.0,-230,215.0,,477.5,SBD,Raw,M,Juniors 18-19,
1,Jordan Courtney,ON,82.5,79.5,23,155,167.5,177.5,177.5,105,115,125.0,125.0,-212.5,225.0,237.5,237.5,,540,SBD,Raw,M,Juniors 20-23,
1,Brandon Thompson,ON,100,95.8,23,217.5,232.5,245.0,245.0,132.5,-142.5,150,150,240,262.5,-267.5,262.5,,657.5,SBD,Raw,M,Juniors 20-23,
2,Brady Sager,ON,100,97.2,21,182.5,190.0,205.0,205.0,122.5,135,-137.5,135,215,230.0,245,245,,585,SBD,Raw,M,Juniors 20-23,
1,Connor Hume,ON,110,106.3,16,167.5,185,195,195,107.5,115,120,120,212.5,230,240,240,,555,SBD,Raw,M,Juniors 16-17,
1,Jake Mitchell,ON,140+,140.1,23,210.0,225,240,240,182.5,-190,-195,182.5,200,220,-240,220,,642.5,SBD,Raw,M,Juniors 20-23,
1,Nicolas Perdicaris,ON,75,74.6,20,202.5,207.5,212.5,212.5,142.5,-147.5,147.5,147.5,265,275.0,282.5,282.5,,642.5,SBD,Raw,M,Open,
2,Richard Domino,ON,75,71.8,26,185.0,200.0,207.5,207.5,120,127.5,-135,127.5,195,210.0,222.5,222.5,,557.5,SBD,Raw,M,Open,
1,Skye Doctor,ON,82.5,82.2,25,162.5,-172.5,-172.5,162.5,122.5,132.5,-142.5,132.5,200,212.5,217.5,217.5,,512.5,SBD,Raw,M,Open,
1,Adam Katz,ON,90,84.8,22,215,230.0,240.0,240.0,130,140,145,145,276,291,-302.5,291,,676,SBD,Raw,M,Open,
2,Guillaume Couture,QC,90,88.2,30,172.5,185.0,195.0,195.0,122.5,127.5,-135,127.5,207.5,212.5,225,225,,547.5,SBD,Raw,M,Open,
1,Michael Collins,ON,100,94.4,25,210.0,-225,225,225,105,115,-125,115,260,272.5,275,275,,615,SBD,Raw,M,Open,
2,Mike Chambers,ON,100,97,41,205.0,210,220,220,-155,155,-162.5,155,215,222.5,235,235,,610,SBD,Raw,M,Open,
3,Benjamin Clifford,ON,100,97.0,24,167.5,177.5,185,185,127.5,135,-140,135,235,260.5,-273,260.5,,580.5,SBD,Raw,M,Open,
1,Brad Fulton,ON,110,109.1,27,250.0,265,275,275,155.5,162.5,170,170,300,315,325,325,,770,SBD,Raw,M,Open,
2,Granville Mayers,ON,110,108.9,47,210.0,230,240,240,177.5,187.5,,187.5,290,312.5,320,320,,747.5,SBD,Raw,M,Open,
3,Harry Tibbs,ON,110,101.0,26,242.5,250,260,260,137.5,142.5,-150,142.5,265,-275,275,275,,677.5,SBD,Raw,M,Open,
1,Alex Parsons,ON,125,119.5,25,225.0,237.5,250,250,187.5,197.5,-205,197.5,290,305,-330,305,,752.5,SBD,Raw,M,Open,
2,Eugenio Conte,ON,125,122.7,39,215.0,235,247.5,247.5,-145,145,155,155,292.5,305,327.5,327.5,,730,SBD,Raw,M,Open,
3,Ty Harrison,ON,125,110.4,26,232.5,240,250,250,132.5,-137.5,,132.5,277.5,285,302.5,302.5,,685,SBD,Raw,M,Open,
1,Eugenio Conte,ON,125,122.7,39,215.0,235,247.5,247.5,-145,145,155,155,292.5,305,327.5,327.5,,730,SBD,Raw,M,Submasters 35-39,
1,Mike Chambers,ON,100,97,41,205.0,210,220,220,-155,155,-162.5,155,215,222.5,235,235,,610,SBD,Raw,M,Masters 40-44,
1,Sean Finn,ON,100,95.5,55,167.5,-177.5,177.5,177.5,125,-130,-130,125,205,217.5,227.5,227.5,,530,SBD,Raw,M,Masters 55-59,
1,Granville Mayers,ON,110,108.9,47,210.0,230,240,240,177.5,187.5,,187.5,290,312.5,320,320,,747.5,SBD,Raw,M,Masters 45-49,
1,Elizabeth Small,ON,67.5,67.3,28,142.5,150.0,-160,150.0,70,-72.5,-72.5,70,150,162.5,165,165,,385,SBD,Wraps,F,Open,
2,Stefanie Bender,ON,67.5,64.5,31,120.0,127.5,-135,127.5,65,70.0,72.5,72.5,162.5,-170,-170,162.5,,362.5,SBD,Wraps,F,Open,
1,Billy Carbonneau,ON,75,72.4,31,150,165.0,175.0,175.0,107.5,115,-122.5,115,170,185.0,190.0,190.0,,480,SBD,Wraps,M,Open,
1,Kaiden Bushey,ON,140,136.7,30,295.0,312.5,325.5,325.5,200,210,215,215,295,312.5,322.5,322.5,,863,SBD,Wraps,M,Open,
1,David Maxwell,ON,110,108.6,35,205.0,215,-223,215,-137.5,-140,140,140,220,235,250.5,250.5,,605.5,SBD,Wraps,M,Submasters 35-39,
1,Linda Mejia,ON,56,54.3,34,,,,,50,55.0,-62.5,55.0,,,,,,55,B,Raw,F,Open,
1,Melissa Cohoe,ON,67.5,66.2,40,,,,,60,62.5,-65.0,62.5,,,,,,62.5,B,Raw,F,Masters 40-44,
1,Hasan Daoud,ON,100,97.9,27,,,,,145,160,-170,160,,,,,,160,B,Raw,M,Open,
1,Mario Lunardo,ON,140+,161.4,29,,,,,230,240,-257.5,240,,,,,,240,B,Single-ply,M,Open,
1,Robert Eberhardt,ON,140+,140.2,59,,,,,55,62.5,-70,62.5,,,,,,62.5,B,Single-ply,M,Masters 55-59,
1,Linda Mejia,ON,56,54.3,34,,,,,,,,,122.5,125,137.5,137.5,,137.5,D,Raw,F,Open,
1,Robert Eberhardt,ON,140+,140.2,59,,,,,,,,,52.5,-80,-80,52.5,,52.5,D,Single-ply,M,Open,
