Division,WeightClassKg,Place,Name,Team,BodyweightKg,Best3SquatKg,Best3BenchKg,Best3DeadliftKg,TotalKg,Equipment,Event,Sex
Boys,51.71,1,Isaac Santillan,Clifton,51.26,142.88,79.38,154.22,376.48,Single-ply,SBD,M
Boys,51.71,2,Joe-Angel Carpenter,Troy,50.53,122.47,63.5,136.08,322.05,Single-ply,SBD,M
Boys,51.71,3,Layton Noey,Normangee,51.62,108.86,65.77,133.81,308.44,Single-ply,SBD,M
Boys,51.71,4,Zachary Callaway,Whitney,51.71,102.06,61.23,124.74,288.03,Single-ply,SBD,M
Boys,51.71,5,Stephen Mathison,Whitney,48.9,113.4,63.5,106.59,283.5,Single-ply,SBD,M
Boys,51.71,6,Colby Williamson,Troy,46.63,83.91,45.36,86.18,215.46,Single-ply,SBD,M
Boys,55.79,1,Fausto Rodriguez,West,54.61,176.9,97.52,181.44,455.86,Single-ply,SBD,M
Boys,55.79,2,Trevor Koestens,Troy,55.34,165.56,99.79,163.29,428.64,Single-ply,SBD,M
Boys,55.79,3,Diego Rivera,Mexia,52.98,174.63,92.99,158.76,426.38,Single-ply,SBD,M
Boys,55.79,4,Alec Bailey,Mexia,55.25,140.61,77.11,147.42,365.14,Single-ply,SBD,M
Boys,55.79,5,Albert Perales,Waco Connally,52.16,111.13,77.11,120.2,308.44,Single-ply,SBD,M
Boys,55.79,DQ,Robbie Brewer,Clifton,54.43,147.42,83.91,,,Single-ply,SBD,M
Boys,59.87,1,Philip Sharp,Robinson,56.15,176.9,97.52,188.24,462.66,Single-ply,SBD,M
Boys,59.87,2,Davin Carboni,Hillsboro,59.51,170.1,106.59,165.56,442.25,Single-ply,SBD,M
Boys,59.87,3,Alex Reynoso,West,59.33,156.49,92.99,174.63,424.11,Single-ply,SBD,M
Boys,59.87,4,Justin O'Neal,Clifton,58.79,156.49,88.45,165.56,410.5,Single-ply,SBD,M
Boys,59.87,5,Emiliano Mar,Clifton,58.97,138.35,86.18,167.83,392.36,Single-ply,SBD,M
Boys,59.87,6,Osvaldo Antunez,Hillsboro,59.24,147.42,92.99,147.42,387.82,Single-ply,SBD,M
Boys,59.87,7,Greg Norman,Grandview,59.33,149.69,77.11,154.22,381.02,Single-ply,SBD,M
Boys,59.87,8,Lucas Zepeda,Red Oak Life,56.15,136.08,61.23,138.35,335.66,Single-ply,SBD,M
Boys,59.87,9,Alex Rodriguez #9,Fairfield,56.25,136.08,68.04,124.74,328.85,Single-ply,SBD,M
Boys,59.87,10,Adam Montemayor,Lorena,56.61,120.2,79.38,127.01,326.59,Single-ply,SBD,M
Boys,59.87,11,Holden Rogers,Clifton,59.6,124.74,72.57,124.74,322.05,Single-ply,SBD,M
Boys,59.87,12,Joe Guerra,Robinson,55.97,120.2,61.23,136.08,317.51,Single-ply,SBD,M
Boys,59.87,13,Jake Durbin,Lorena,57.06,99.79,63.5,113.4,276.69,Single-ply,SBD,M
Boys,59.87,DQ,Rodrigo Hernandez,Hillsboro,59.69,,,,,Single-ply,SBD,M
Boys,59.87,DQ,Zaahid Abdullah,Red Oak Life,58.06,138.35,77.11,,,Single-ply,SBD,M
Boys,67.13,1,Brandon Simpson #3,Hubbard,62.78,174.63,108.86,174.63,458.13,Single-ply,SBD,M
Boys,67.13,2,Samuel Shorts,Whitney,65.41,188.24,95.25,165.56,449.06,Single-ply,SBD,M
Boys,67.13,3,Sergio Gonzalez,Troy,66.41,170.1,88.45,183.7,442.25,Single-ply,SBD,M
Boys,67.13,4,Bobby Hanson,Axtell,63.59,161.03,108.86,165.56,435.45,Single-ply,SBD,M
Boys,67.13,5,Austin Sauceda,Axtell,66.04,156.49,97.52,176.9,430.91,Single-ply,SBD,M
Boys,67.13,6,Ulises Ramirez-Rangel,Fairfield,63.59,167.83,77.11,142.88,387.82,Single-ply,SBD,M
Boys,67.13,7,Luke Brookshire,Crawford,65.59,142.88,65.77,154.22,362.87,Single-ply,SBD,M
Boys,67.13,8,Josh Watson,Robinson,63.14,124.74,95.25,115.67,335.66,Single-ply,SBD,M
Boys,67.13,9,Gavin Isham,Bosqueville,66.5,124.74,74.84,136.08,335.66,Single-ply,SBD,M
Boys,67.13,10,Javier Trejo,Hillsboro,61.78,122.47,74.84,136.08,333.39,Single-ply,SBD,M
Boys,67.13,11,Stephen McNaught,Meridian,60.6,106.59,65.77,131.54,303.91,Single-ply,SBD,M
Boys,67.13,DQ,Jose Rodriguez #4,Fairfield,66.59,147.42,83.91,,,Single-ply,SBD,M
Boys,67.13,DQ,David Serebia,Mexia,66.41,,,,,Single-ply,SBD,M
Boys,67.13,DQ,Chris Calloway,Red Oak Life,61.42,122.47,,,,Single-ply,SBD,M
Boys,67.13,DQ,Elijah Lucero,Red Oak Life,65.41,,,,,Single-ply,SBD,M
Boys,74.84,1,Adolfo Rodriguez,West,72.94,226.8,147.42,188.24,562.45,Single-ply,SBD,M
Boys,74.84,2,Darius Dorsey,Mexia,73.66,195.04,129.27,195.04,519.36,Single-ply,SBD,M
Boys,74.84,3,Nathan Gerik,West,69.58,183.7,104.33,176.9,464.93,Single-ply,SBD,M
Boys,74.84,4,Jashawn Hatcher,Fairfield,72.76,179.17,92.99,192.78,464.93,Single-ply,SBD,M
Boys,74.84,5,Zant Tatum,Jewett Leon,74.66,185.97,90.72,181.44,458.13,Single-ply,SBD,M
Boys,74.84,6,Dalton Baker,West,71.85,176.9,102.06,174.63,453.59,Single-ply,SBD,M
Boys,74.84,7,Mariano Perez,West,73.66,172.37,108.86,158.76,439.98,Single-ply,SBD,M
Boys,74.84,8,Garrett Randolph,Troy,70.58,154.22,102.06,167.83,424.11,Single-ply,SBD,M
Boys,74.84,9,Dustin Richter,Bosqueville,73.66,161.03,72.57,161.03,394.63,Single-ply,SBD,M
Boys,74.84,10,Jonathan Weatherman,Crawford,71.12,131.54,88.45,149.69,369.68,Single-ply,SBD,M
Boys,74.84,11,Josh Granger,Robinson,71.3,147.42,81.65,122.47,351.53,Single-ply,SBD,M
Boys,74.84,12,Ty Bachtel,Fairfield,69.31,117.93,74.84,136.08,328.85,Single-ply,SBD,M
Boys,74.84,13,Colton Thomas,Grandview,70.58,104.33,79.38,136.08,319.78,Single-ply,SBD,M
Boys,74.84,14,Ian Smith,Bosqueville,69.94,124.74,61.23,124.74,310.71,Single-ply,SBD,M
Boys,74.84,15,Jossie Palacios,Mexia,74.84,188.24,45.36,61.23,294.84,Single-ply,SBD,M
Boys,74.84,DQ,Armando Casteneda,Hillsboro,67.77,,,,,Single-ply,SBD,M
Boys,82.1,1,Devyn Hebbe,Axtell,75.21,278.96,115.67,233.6,628.23,Single-ply,SBD,M
Boys,82.1,2,Aaron Ratliff,Normangee,80.47,208.65,133.81,217.72,560.19,Single-ply,SBD,M
Boys,82.1,3,Drew Roberts,Bosqueville,81.74,215.46,140.61,204.12,560.19,Single-ply,SBD,M
Boys,82.1,4,Michael Rodriguez #7,Axtell,78.83,215.46,97.52,224.53,537.51,Single-ply,SBD,M
Boys,82.1,5,Desmond Harris,Waco Connally,79.11,204.12,122.47,197.31,523.9,Single-ply,SBD,M
Boys,82.1,6,Alex Hankhouse,Bosqueville,81.74,199.58,111.13,181.44,492.15,Single-ply,SBD,M
Boys,82.1,7,Anthony Rodriguez,Lorena,77.29,170.1,97.52,192.78,460.4,Single-ply,SBD,M
Boys,82.1,8,Marc Gutierrez,Clifton,76.2,183.7,104.33,165.56,453.59,Single-ply,SBD,M
Boys,82.1,9,Rolando Ramirez,Hillsboro,81.19,158.76,104.33,161.03,424.11,Single-ply,SBD,M
Boys,82.1,10,Shane Carroll,Red Oak Life,79.47,149.69,90.72,174.63,415.04,Single-ply,SBD,M
Boys,82.1,11,Tanner Mitchell,Crawford,80.65,163.29,92.99,158.76,415.04,Single-ply,SBD,M
Boys,82.1,12,Bodee Humphreys,Clifton,78.29,172.37,88.45,151.95,412.77,Single-ply,SBD,M
Boys,82.1,13,Ryan Austin,Lorena,78.38,149.69,97.52,149.69,396.89,Single-ply,SBD,M
Boys,82.1,14,António Sotero,Hillsboro,81.1,154.22,92.99,149.69,396.89,Single-ply,SBD,M
Boys,82.1,15,Brendon Stockton,Whitney,81.37,156.49,92.99,147.42,396.89,Single-ply,SBD,M
Boys,82.1,16,Cooper Wagenschein,Robinson,78.2,163.29,83.91,136.08,383.29,Single-ply,SBD,M
Boys,82.1,17,Colby Fedor,Grandview,78.29,149.69,88.45,145.15,383.29,Single-ply,SBD,M
Boys,82.1,18,Colton Wilson,Bosqueville,75.75,142.88,68.04,170.1,381.02,Single-ply,SBD,M
Boys,82.1,19,Tharron Pearl,Mexia,75.3,151.95,79.38,142.88,374.21,Single-ply,SBD,M
Boys,82.1,20,Cade Bennett,Grandview,80.2,117.93,83.91,127.01,328.85,Single-ply,SBD,M
Boys,82.1,21,Trey Mays,Holland,78.02,115.67,65.77,145.15,326.59,Single-ply,SBD,M
Boys,82.1,DQ,Stephen Evans #5,Holland,81.01,,,,,Single-ply,SBD,M
Boys,82.1,DQ,Darius Oliver,Mexia,76.75,185.97,99.79,,,Single-ply,SBD,M
Boys,82.1,DQ,Lance Sembera,West,80.83,176.9,102.06,,,Single-ply,SBD,M
Boys,89.81,1,Mason Oliver,Clifton,88.27,226.8,111.13,240.4,578.33,Single-ply,SBD,M
Boys,89.81,2,Logan Blake,Red Oak Life,88.9,226.8,136.08,185.97,548.85,Single-ply,SBD,M
Boys,89.81,3,Eric Rosson,Grandview,87.45,226.8,120.2,197.31,544.31,Single-ply,SBD,M
Boys,89.81,4,Rahi Patel,Mexia,88.36,204.12,117.93,197.31,519.36,Single-ply,SBD,M
Boys,89.81,5,Hunter Isham,Lorena,85.09,181.44,108.86,210.92,501.22,Single-ply,SBD,M
Boys,89.81,6,Hunter Hartberg,Lorena,84.91,197.31,124.74,176.9,498.95,Single-ply,SBD,M
Boys,89.81,7,Ben Roberson,Robinson,83.1,204.12,108.86,181.44,494.42,Single-ply,SBD,M
Boys,89.81,8,Wyatt Faulkenberry,Lorena,88.36,192.78,113.4,181.44,487.61,Single-ply,SBD,M
Boys,89.81,9,David Ramirez,Red Oak Life,88.45,192.78,106.59,183.7,483.08,Single-ply,SBD,M
Boys,89.81,10,Lance Bracco,Crawford,84.91,158.76,108.86,181.44,449.06,Single-ply,SBD,M
Boys,89.81,11,Morgan Marshall #1,Crawford,86.09,181.44,102.06,151.95,435.45,Single-ply,SBD,M
Boys,89.81,12,Weston Hugo,Holland,85.64,145.15,102.06,170.1,417.3,Single-ply,SBD,M
Boys,89.81,13,Ryan Lloyd,Clifton,85.91,165.56,111.13,140.61,417.3,Single-ply,SBD,M
Boys,89.81,14,Caydon Ramsey,Mexia,86.18,151.95,86.18,147.42,385.55,Single-ply,SBD,M
Boys,89.81,15,James Harrison,Crawford,84.28,120.2,90.72,142.88,353.8,Single-ply,SBD,M
Boys,89.81,DQ,Bryson Steglich,Holland,84.01,161.03,,,,Single-ply,SBD,M
Boys,89.81,DQ,Timothy Thomas,Whitney,85.09,206.38,113.4,,,Single-ply,SBD,M
Boys,89.81,DQ,Ryan Hilty,Whitney,88.54,174.63,,,,Single-ply,SBD,M
Boys,89.81,DQ,Matt Sparks,West,88.09,181.44,99.79,,,Single-ply,SBD,M
Boys,89.81,DQ,Richard Zamora,Waco Connally,82.37,,,,,Single-ply,SBD,M
Boys,99.79,1,Jason Marroquin,Axtell,99.61,244.94,136.08,260.82,641.83,Single-ply,SBD,M
Boys,99.79,2,Eric Marton,Axtell,98.61,256.28,129.27,240.4,625.96,Single-ply,SBD,M
Boys,99.79,3,Daniel Fraire,West,96.8,272.16,142.88,179.17,594.21,Single-ply,SBD,M
Boys,99.79,4,Franco Landeros,Crawford,99.06,226.8,129.27,217.72,573.79,Single-ply,SBD,M
Boys,99.79,5,Alex Falcon,Troy,95.89,226.8,133.81,210.92,571.53,Single-ply,SBD,M
Boys,99.79,6,Ismael Rocha,Holland,97.16,229.06,108.86,229.06,566.99,Single-ply,SBD,M
Boys,99.79,7,Bryce Latson,Grandview,97.25,226.8,124.74,195.04,546.58,Single-ply,SBD,M
Boys,99.79,8,Quenden Darby,Red Oak Life,97.61,213.19,106.59,201.85,521.63,Single-ply,SBD,M
Boys,99.79,9,Travis Pilgrim,Robinson,97.61,210.92,104.33,190.51,505.76,Single-ply,SBD,M
Boys,99.79,10,Cameron Fimbres,Waco Connally,97.52,201.85,104.33,190.51,496.68,Single-ply,SBD,M
Boys,99.79,11,Justin Wardlow,Whitney,90.54,183.7,106.59,163.29,453.59,Single-ply,SBD,M
Boys,99.79,12,Tanner Sparks,West,96.8,172.37,102.06,174.63,449.06,Single-ply,SBD,M
Boys,99.79,13,Jose Hernandez #6,Holland,99.06,176.9,90.72,181.44,449.06,Single-ply,SBD,M
Boys,99.79,14,Luis Reyes,Mexia,91.72,199.58,86.18,158.76,444.52,Single-ply,SBD,M
Boys,99.79,15,Gabriel Egula,Red Oak Life,98.34,206.38,90.72,142.88,439.98,Single-ply,SBD,M
Boys,99.79,16,Robin Hewitt,Normangee,93.71,151.95,72.57,176.9,401.43,Single-ply,SBD,M
Boys,99.79,DQ,Jacob Gomez,Fairfield,95.98,,,,,Single-ply,SBD,M
Boys,99.79,DQ,Jorge Lince,Hillsboro,98.52,122.47,,,,Single-ply,SBD,M
Boys,99.79,DQ,Aniken Deluna,Hillsboro,91.35,149.69,,,,Single-ply,SBD,M
Boys,99.79,DQ,Matt Moneyham,Fairfield,97.7,201.85,,,,Single-ply,SBD,M
Boys,109.77,1,Steven Frausto,Waco Connally,102.69,242.67,133.81,206.38,582.87,Single-ply,SBD,M
Boys,109.77,2,Jacob Byrd,Lorena,106.59,238.14,117.93,188.24,544.31,Single-ply,SBD,M
Boys,109.77,3,Will Worrell,Crawford,100.33,213.19,113.4,208.65,535.24,Single-ply,SBD,M
Boys,109.77,4,Mike Cervantes,Lorena,106.59,204.12,113.4,217.72,535.24,Single-ply,SBD,M
Boys,109.77,5,Elijah Cummings,Whitney,107.5,204.12,124.74,192.78,521.63,Single-ply,SBD,M
Boys,109.77,6,Shelby Wilder,Red Oak Life,109.77,181.44,106.59,176.9,464.93,Single-ply,SBD,M
Boys,109.77,7,Marcus DeLeon,Waco Connally,106.32,183.7,111.13,142.88,437.72,Single-ply,SBD,M
Boys,109.77,8,Dustin Stewart,Crawford,108.77,172.37,95.25,156.49,424.11,Single-ply,SBD,M
Boys,109.77,9,Trace Snyder,Robinson,106.5,136.08,65.77,154.22,356.07,Single-ply,SBD,M
Boys,109.77,DQ,Anthony Banda,Normangee,104.24,174.63,,,,Single-ply,SBD,M
Boys,109.77,DQ,Ethan Campbell,Grandview,103.24,,,,,Single-ply,SBD,M
Boys,109.77,DQ,Payton Price #1,Grandview,105.6,181.44,117.93,,,Single-ply,SBD,M
Boys,124.74,1,Isaias Hernandez,Hillsboro,124.47,272.16,147.42,260.82,680.39,Single-ply,SBD,M
Boys,124.74,2,Robert Gober,Waco Connally,122.2,260.82,142.88,217.72,621.42,Single-ply,SBD,M
Boys,124.74,3,Brayan Villa,Grandview,113.67,226.8,163.29,215.46,605.55,Single-ply,SBD,M
Boys,124.74,4,Jeremy Wood,Fairfield,112.58,265.35,161.03,170.1,596.47,Single-ply,SBD,M
Boys,124.74,5,Jeran Gallimore,Robinson,114.76,249.48,140.61,195.04,585.13,Single-ply,SBD,M
Boys,124.74,6,Joe Fallwell,Whitney,123.65,197.31,136.08,210.92,544.31,Single-ply,SBD,M
Boys,124.74,7,Joseph Lucas,Lorena,123.2,213.19,102.06,197.31,512.56,Single-ply,SBD,M
Boys,124.74+,1,Connor Barnett,Robinson,143.43,272.16,165.56,226.8,664.51,Single-ply,SBD,M
Boys,124.74+,2,Trederek Anglin,Mexia,148.96,238.14,142.88,213.19,594.21,Single-ply,SBD,M
Boys,124.74+,3,Seth Kohlscheen,Crawford,125.01,238.14,104.33,188.24,530.7,Single-ply,SBD,M
Boys,124.74+,4,Jacob Villa,Robinson,132.18,229.06,131.54,167.83,528.44,Single-ply,SBD,M
Boys,124.74+,5,Juan Rodriguez,Clifton,138.8,192.78,108.86,181.44,483.08,Single-ply,SBD,M
Boys,124.74+,6,Colton Deal,Red Oak Life,150.32,165.56,106.59,183.7,455.86,Single-ply,SBD,M
Boys,124.74+,7,Chase Lankford,Waco Connally,146.06,185.97,83.91,147.42,417.3,Single-ply,SBD,M
Boys,,NS,Tyler Flowers,Bosqueville,,,,,,Single-ply,SBD,M
Boys,,NS,Lucas Steinkamp,Crawford,,,,,,Single-ply,SBD,M
Boys,,NS,AJ Polk,Fairfield,,,,,,Single-ply,SBD,M
Boys,,NS,Jax Donahoo,Fairfield,,,,,,Single-ply,SBD,M
Boys,,NS,Cole Beddingfield,Fairfield,,,,,,Single-ply,SBD,M
Boys,,NS,Stephen Stagg,Hubbard,,,,,,Single-ply,SBD,M
Boys,,NS,Kolby Pederson,Hubbard,,,,,,Single-ply,SBD,M
Boys,,NS,Christian Howell,Hubbard,,,,,,Single-ply,SBD,M
Boys,,NS,Nolan Groseclose,Holland,,,,,,Single-ply,SBD,M
Boys,,NS,Juan Becerra,Holland,,,,,,Single-ply,SBD,M
