Division,WeightClassKg,Place,Name,Team,BodyweightKg,Best3SquatKg,Best3BenchKg,Best3DeadliftKg,TotalKg,Equipment,Event,Sex,BirthDate
Boys,55.79,1,David Price,College Station A&M Cons,54.57,97.52,56.7,102.06,256.28,Single-ply,SBD,M,
Boys,59.87,1,Emanuel Bravo,College Station A&M Cons,58.24,113.4,97.52,117.93,328.85,Single-ply,SBD,M,
Boys,59.87,2,Paden Cashion,College Station,59.42,122.47,74.84,122.47,319.78,Single-ply,SBD,M,
Boys,59.87,3,Anthony Coleman,Robinson,58.97,92.99,68.04,102.06,263.08,Single-ply,SBD,M,
Boys,59.87,DQ,Reagan Brown,College Station A&M Cons,58.47,117.93,,136.08,,Single-ply,SBD,M,
Boys,67.13,1,Jonathan Hernandez,Robinson,64.86,140.61,90.72,161.03,392.36,Single-ply,SBD,M,
Boys,67.13,2,Colby Wolcott,College Station A&M Cons,66.36,136.08,70.31,131.54,337.93,Single-ply,SBD,M,
Boys,67.13,3,Roger Aliff,Robinson,65.77,129.27,72.57,113.4,315.25,Single-ply,SBD,M,
Boys,67.13,4,Reggie DeAnda,Robinson,62.14,113.4,63.5,115.67,292.57,Single-ply,SBD,M,
Boys,67.13,DQ,Gavin Martinez,College Station A&M Cons,65.27,,,120.2,,Single-ply,SBD,M,
Boys,74.84,1,Tanner Lightsey,College Station A&M Cons,74.43,190.51,97.52,179.17,467.2,Single-ply,SBD,M,
Boys,74.84,2,Matthew Martinez,College Station A&M Cons,74.16,145.15,111.13,167.83,424.11,Single-ply,SBD,M,
Boys,74.84,3,Raymond Finch,Robinson,68.04,131.54,81.65,204.12,417.3,Single-ply,SBD,M,
Boys,74.84,4,Elliot Dabney,College Station,73.62,158.76,88.45,156.49,403.7,Single-ply,SBD,M,
Boys,74.84,5,Cason Garner,College Station A&M Cons,70.85,133.81,83.91,154.22,371.95,Single-ply,SBD,M,
Boys,74.84,6,Brevan Willis,College Station,69.94,129.27,90.72,140.61,360.61,Single-ply,SBD,M,
Boys,74.84,7,Samuel Miles,College Station A&M Cons,68.99,129.27,72.57,129.27,331.12,Single-ply,SBD,M,
Boys,74.84,8,Jamarion Evans,Robinson,69.85,120.2,74.84,120.2,315.25,Single-ply,SBD,M,
Boys,74.84,9,Connor Reilly,College Station A&M Cons,67.22,106.59,77.11,117.93,301.64,Single-ply,SBD,M,
Boys,74.84,10,Mason Poage,College Station A&M Cons,69.76,86.18,70.31,108.86,265.35,Single-ply,SBD,M,
Boys,82.1,1,Brock Slaydon,College Station A&M Cons,81.83,226.8,127.01,217.72,571.53,Single-ply,SBD,M,
Boys,82.1,2,Ashton Jaspersn,College Station A&M Cons,77.38,167.83,90.72,174.63,433.18,Single-ply,SBD,M,
Boys,82.1,3,James Deegear,College Station,82.1,158.76,102.06,158.76,419.57,Single-ply,SBD,M,
Boys,82.1,4,Darius Turner,College Station A&M Cons,79.61,163.29,90.72,156.49,410.5,Single-ply,SBD,M,
Boys,82.1,5,Paxson Berkey,College Station A&M Cons,81.92,156.49,81.65,147.42,385.55,Single-ply,SBD,M,
Boys,82.1,6,Tanner McCulloch,College Station A&M Cons,81.87,136.08,74.84,127.01,337.93,Single-ply,SBD,M,
Boys,82.1,7,Jake Kriel,College Station A&M Cons,76.61,117.93,72.57,117.93,308.44,Single-ply,SBD,M,
Boys,89.81,1,Tristan White,College Station A&M Cons,84.78,190.51,117.93,181.44,489.88,Single-ply,SBD,M,
Boys,89.81,2,Dylan Olivares,Robinson,84.82,170.1,108.86,167.83,446.79,Single-ply,SBD,M,
Boys,89.81,3,Nathan Sanchez #4,College Station A&M Cons,83.78,136.08,81.65,149.69,367.41,Single-ply,SBD,M,
Boys,89.81,4,Jacob Koeneman,College Station A&M Cons,86.73,117.93,68.04,122.47,308.44,Single-ply,SBD,M,
Boys,99.79,1,Luke Miles,College Station,99.7,265.35,154.22,272.16,691.73,Single-ply,SBD,M,
Boys,99.79,2,Tyndall McNamara,College Station A&M Cons,97.2,208.65,131.54,238.14,578.33,Single-ply,SBD,M,
Boys,99.79,3,Jaxon Edwards,College Station,96.07,215.46,108.86,192.78,517.1,Single-ply,SBD,M,
Boys,99.79,4,Jeremy Lerma,College Station,93.17,201.85,113.4,181.44,496.68,Single-ply,SBD,M,
Boys,99.79,5,Lyndon Williams,College Station A&M Cons,95.53,181.44,124.74,174.63,480.81,Single-ply,SBD,M,
Boys,99.79,6,John Martinez,College Station,97.43,192.78,113.4,170.1,476.27,Single-ply,SBD,M,
Boys,99.79,7,Kaiser Qiu,College Station A&M Cons,99.29,181.44,104.33,154.22,439.98,Single-ply,SBD,M,
Boys,99.79,8,Cody Clough,College Station A&M Cons,98.79,161.03,102.06,161.03,424.11,Single-ply,SBD,M,
Boys,99.79,9,Tyrese Hargrove,College Station A&M Cons,99.16,142.88,86.18,136.08,365.14,Single-ply,SBD,M,
Boys,99.79,10,James Morgan,College Station A&M Cons,93.03,131.54,86.18,136.08,353.8,Single-ply,SBD,M,
Boys,99.79,11,Christopher Cyrus,College Station A&M Cons,98.97,117.93,68.04,115.67,301.64,Single-ply,SBD,M,
Boys,109.77,1,Eduardo Chavez,Robinson,104.78,206.38,127.01,238.14,571.53,Single-ply,SBD,M,
Boys,109.77,2,Klayton Sheffield,College Station A&M Cons,107.86,213.19,136.08,208.65,557.92,Single-ply,SBD,M,
Boys,109.77,3,Christian Watters,College Station A&M Cons,102.47,190.51,117.93,213.19,521.63,Single-ply,SBD,M,
Boys,109.77,4,Daniel Walker,Robinson,102.06,192.78,120.2,204.12,517.1,Single-ply,SBD,M,
Boys,109.77,5,Hudson House,College Station A&M Cons,106.96,188.24,92.99,190.51,471.74,Single-ply,SBD,M,
Boys,109.77,6,Jordan Lynch,College Station A&M Cons,105.32,147.42,88.45,174.63,410.5,Single-ply,SBD,M,
Boys,109.77,7,Dustin Cheyne,Robinson,105.23,124.74,68.04,115.67,308.44,Single-ply,SBD,M,
Boys,124.74,1,Joey Lightfoot,College Station A&M Cons,123.51,238.14,136.08,215.46,589.67,Single-ply,SBD,M,
Boys,124.74,2,Kyle Greer,College Station A&M Cons,109.81,235.87,124.74,204.12,564.72,Single-ply,SBD,M,
Boys,124.74,3,JaKai Bams,College Station A&M Cons,115.44,185.97,108.86,190.51,485.34,Single-ply,SBD,M,
Boys,124.74,4,Carlos Escobedo,Robinson,121.11,181.44,104.33,158.76,444.52,Single-ply,SBD,M,
Boys,139.71,1,Timothy Chandler,College Station A&M Cons,129.55,185.97,111.13,158.76,455.86,Single-ply,SBD,M,
Boys,139.71,2,Jace Plant,College Station,129.77,181.44,97.52,147.42,426.38,Single-ply,SBD,M,
Boys,139.71,3,Garrett Heron,College Station A&M Cons,130.86,113.4,77.11,127.01,317.51,Single-ply,SBD,M,
