Division,WeightClassKg,Place,Name,Team,BodyweightKg,Best3SquatKg,Best3BenchKg,Best3DeadliftKg,TotalKg,Equipment,Event,Sex
Boys,51.71,1,Ethan Stack,Scurry-Rosser,51.35,129.27,86.18,147.42,362.87,Single-ply,SBD,M
Boys,51.71,2,Junior Chavez,Waxahachie,50.17,99.79,65.77,127.01,292.57,Single-ply,SBD,M
Boys,51.71,3,Jose Gonzalez #2,Hillsboro,49.26,106.59,61.23,113.4,281.23,Single-ply,SBD,M
Boys,51.71,4,Chris Charles,Ennis,48.72,90.72,56.7,106.59,254.01,Single-ply,SBD,M
Boys,51.71,5,Collin Stephens,Buffalo,49.8,92.99,52.16,106.59,251.74,Single-ply,SBD,M
Boys,51.71,6,Kace Cotton,Waxahachie,48.81,81.65,45.36,113.4,240.4,Single-ply,SBD,M
Boys,51.71,7,Jason Botkin,Corsicana,48.17,77.11,43.09,102.06,222.26,Single-ply,SBD,M
Boys,51.71,DQ,Aaron Matche,Fairfield,51.71,,,,,Single-ply,SBD,M
Boys,51.71,DQ,Gavin Niediche,Fairfield,51.71,,,,,Single-ply,SBD,M
Boys,51.71,DQ,Noah Vasquez,Palmer,51.44,133.81,,,,Single-ply,SBD,M
Boys,55.79,1,Tony Delacruz,Waxahachie,54.61,117.93,68.04,140.61,326.59,Single-ply,SBD,M
Boys,55.79,2,Chad Collup,Scurry-Rosser,54.79,113.4,58.97,131.54,303.91,Single-ply,SBD,M
Boys,55.79,DQ,Jose Esquivel,Corsicana,55.79,,,,,Single-ply,SBD,M
Boys,55.79,DQ,Larion Craven,Hubbard,55.79,,,,,Single-ply,SBD,M
Boys,55.79,DQ,Angel Sosa,Rice,55.61,147.42,68.04,,,Single-ply,SBD,M
Boys,55.79,DQ,Juan Chavez,Palmer,55.79,,,,,Single-ply,SBD,M
Boys,59.87,1,Fausto Rodriguez,West,58.42,190.51,108.86,188.24,487.61,Single-ply,SBD,M
Boys,59.87,2,Juan Hernandez #4,Palmer,59.87,174.63,97.52,179.17,451.32,Single-ply,SBD,M
Boys,59.87,3,Sean Busby,Teague,59.87,181.44,86.18,165.56,433.18,Single-ply,SBD,M
Boys,59.87,4,Rodrigo Hernandez,Hillsboro,59.06,147.42,90.72,172.37,410.5,Single-ply,SBD,M
Boys,59.87,5,Seth Shipp,Rice,57.24,165.56,92.99,147.42,405.97,Single-ply,SBD,M
Boys,59.87,6,Tristan Castillo,Eustace,58.79,156.49,92.99,156.49,405.97,Single-ply,SBD,M
Boys,59.87,7,Tyson Ramirez,Palmer,59.51,151.95,74.84,172.37,399.16,Single-ply,SBD,M
Boys,59.87,8,Jose Reyes,Ennis,58.97,136.08,95.25,147.42,378.75,Single-ply,SBD,M
Boys,59.87,9,Jesus Reyes,Ennis,57.15,131.54,88.45,142.88,362.87,Single-ply,SBD,M
Boys,59.87,10,Corbin Donoho,Corsicana Mildred,58.69,136.08,81.65,145.15,362.87,Single-ply,SBD,M
Boys,59.87,11,Michael Wong,Eustace,59.06,129.27,70.31,142.88,342.46,Single-ply,SBD,M
Boys,59.87,12,Deandre Brown,Corsicana,57.97,129.27,77.11,129.27,335.66,Single-ply,SBD,M
Boys,59.87,13,Jaydon Clemens,Italy,56.88,106.59,90.72,115.67,312.98,Single-ply,SBD,M
Boys,59.87,14,Harris Sherrod,Jewett Leon,58.15,124.74,61.23,124.74,310.71,Single-ply,SBD,M
Boys,59.87,15,Jonathan Lopez,Hillsboro,57.79,117.93,49.9,111.13,278.96,Single-ply,SBD,M
Boys,59.87,16,Colton Reid,Hubbard,58.24,92.99,61.23,120.2,274.42,Single-ply,SBD,M
Boys,59.87,DQ,John Rangel,Ennis,59.87,,,,,Single-ply,SBD,M
Boys,59.87,DQ,Alex Rodriquez,Fairfield,59.87,,,,,Single-ply,SBD,M
Boys,67.13,1,Alex Reynoso,West,62.96,170.1,99.79,190.51,460.4,Single-ply,SBD,M
Boys,67.13,2,Nick Henderson,Waxahachie,63.78,176.9,92.99,190.51,460.4,Single-ply,SBD,M
Boys,67.13,3,DeMarcus McQurter,Hubbard,65.86,174.63,90.72,185.97,451.32,Single-ply,SBD,M
Boys,67.13,4,Ulices Guerrero,Buffalo,67.13,170.1,99.79,174.63,444.52,Single-ply,SBD,M
Boys,67.13,5,Darius Jones #1,Dallas Life Oak Cliff,62.41,158.76,88.45,181.44,428.64,Single-ply,SBD,M
Boys,67.13,6,Chris Soria,Buffalo,63.14,147.42,99.79,147.42,394.63,Single-ply,SBD,M
Boys,67.13,7,Diego Gutierrez,Scurry-Rosser,61.78,149.69,90.72,145.15,385.55,Single-ply,SBD,M
Boys,67.13,8,Jose Silva,Palmer,65.05,133.81,83.91,165.56,383.29,Single-ply,SBD,M
Boys,67.13,9,Micah Thompson,Teague,63.5,154.22,77.11,149.69,381.02,Single-ply,SBD,M
Boys,67.13,10,Zack Horner,Corsicana Mildred,65.5,133.81,81.65,149.69,365.14,Single-ply,SBD,M
Boys,67.13,11,Javier Trejo,Hillsboro,62.14,124.74,68.04,154.22,347,Single-ply,SBD,M
Boys,67.13,12,Trey Atkeisson,Corsicana Mildred,63.59,115.67,74.84,122.47,312.98,Single-ply,SBD,M
Boys,67.13,13,David Lopez,West,66,120.2,65.77,117.93,303.91,Single-ply,SBD,M
Boys,67.13,14,Mason Vick,Jewett Leon,62.87,99.79,79.38,117.93,297.1,Single-ply,SBD,M
Boys,67.13,15,Cameron Berryhill,Jewett Leon,60.33,111.13,58.97,115.67,285.76,Single-ply,SBD,M
Boys,67.13,16,Juan Perez #10,Rice,64.86,167.83,,,167.83,Single-ply,S,M
Boys,67.13,17,Joshua Hughes,Eustace,66.95,142.88,,,142.88,Single-ply,S,M
Boys,67.13,18,Jason Oliver,Hubbard,65.41,115.67,,,115.67,Single-ply,S,M
Boys,67.13,DQ,Osvaldo Atunez,Hillsboro,67.13,,,,,Single-ply,SBD,M
Boys,67.13,DQ,Tim Cordon,Fairfield,67.13,,,,,Single-ply,SBD,M
Boys,67.13,DQ,Manuel Villegas,Blooming Grove,66.59,,,,,Single-ply,SBD,M
Boys,74.84,1,Nathan Gerik,West,74.21,199.58,124.74,201.85,526.17,Single-ply,SBD,M
Boys,74.84,2,Cam Morris,Waxahachie,73.12,181.44,104.33,219.99,505.76,Single-ply,SBD,M
Boys,74.84,3,Jarred Leal,Palmer,71.49,174.63,124.74,185.97,485.34,Single-ply,SBD,M
Boys,74.84,4,Kolby Pederson,Hubbard,74.84,181.44,115.67,181.44,478.54,Single-ply,SBD,M
Boys,74.84,5,Azaya Patrick,Teague,74.12,176.9,97.52,190.51,464.93,Single-ply,SBD,M
Boys,74.84,6,Fallon Little,Corsicana Mildred,72.21,154.22,99.79,190.51,444.52,Single-ply,SBD,M
Boys,74.84,7,John Vaughn,Buffalo,73.12,154.22,92.99,147.42,394.63,Single-ply,SBD,M
Boys,74.84,8,Callghan Sherrod,Jewett Leon,71.94,138.35,74.84,174.63,387.82,Single-ply,SBD,M
Boys,74.84,9,Anthony Ray,Ennis,71.21,131.54,92.99,133.81,358.34,Single-ply,SBD,M
Boys,74.84,10,Mark Zagala,Palmer,71.49,122.47,79.38,149.69,351.53,Single-ply,SBD,M
Boys,74.84,11,Jeremy Flake,Jewett Leon,71.12,117.93,86.18,145.15,349.27,Single-ply,SBD,M
Boys,74.84,12,David Thomas #8,Fairfield,74.84,129.27,83.91,131.54,344.73,Single-ply,SBD,M
Boys,74.84,13,Trent Barnes,Scurry-Rosser,69.58,117.93,81.65,142.88,342.46,Single-ply,SBD,M
Boys,74.84,14,Derek Smith,Scurry-Rosser,74.03,122.47,68.04,142.88,333.39,Single-ply,SBD,M
Boys,74.84,15,Marcus Terry,Dallas Life Oak Cliff,72.21,120.2,72.57,136.08,328.85,Single-ply,SBD,M
Boys,74.84,16,Trevor Farris,Teague,73.21,142.88,72.57,113.4,328.85,Single-ply,SBD,M
Boys,74.84,17,Humberto Mancilla,Hillsboro,70.4,102.06,79.38,145.15,326.59,Single-ply,SBD,M
Boys,74.84,DQ,Ulises Ramirez,Fairfield,74.84,,,,,Single-ply,SBD,M
Boys,74.84,DQ,Demarcus Brackens,Hubbard,74.84,,,,,Single-ply,SBD,M
Boys,74.84,DQ,Justin Ewing,Corsicana Mildred,74.84,,,,,Single-ply,SBD,M
Boys,74.84,DQ,Truman Garza,Buffalo,68.31,170.1,79.38,,,Single-ply,SBD,M
Boys,74.84,DQ,Michael McCarter,Blooming Grove,70.76,,,,,Single-ply,SBD,M
Boys,74.84,DQ,Zane Anderson,Fairfield,69.4,174.63,88.45,,,Single-ply,SBD,M
Boys,74.84,DQ,Jason Williams #4,Dallas Life Oak Cliff,74.39,,,,,Single-ply,SBD,M
Boys,74.84,DQ,Terry Richardson,Eustace,74.12,,,,,Single-ply,SBD,M
Boys,74.84,DQ,Cameron Aldridge,Jewett Leon,74.84,117.93,,,,Single-ply,SBD,M
Boys,82.1,1,Hector Dominguez,Buffalo,81.37,249.48,127.01,226.8,603.28,Single-ply,SBD,M
Boys,82.1,2,JaShaughn Hatcher,Fairfield,80.2,231.33,117.93,235.87,585.13,Single-ply,SBD,M
Boys,82.1,3,Dalton Baker,West,76.11,192.78,111.13,190.51,494.42,Single-ply,SBD,M
Boys,82.1,4,Trevor King,Buffalo,79.47,190.51,115.67,181.44,487.61,Single-ply,SBD,M
Boys,82.1,5,Eric Johnson,Waxahachie,78.02,170.1,111.13,195.04,476.27,Single-ply,SBD,M
Boys,82.1,6,Rustin Goff,Blooming Grove,79.2,176.9,97.52,199.58,474,Single-ply,SBD,M
Boys,82.1,7,Samuel Cervantes,Buffalo,75.39,165.56,97.52,204.12,467.2,Single-ply,SBD,M
Boys,82.1,8,Mariano Perez,West,76.11,181.44,104.33,167.83,453.59,Single-ply,SBD,M
Boys,82.1,9,Jonathan Aranda,Rice,79.65,174.63,113.4,165.56,453.59,Single-ply,SBD,M
Boys,82.1,10,Clayton Wilson #2,West,78.2,174.63,90.72,170.1,435.45,Single-ply,SBD,M
Boys,82.1,11,Drew Acosta,Scurry-Rosser,81.74,167.83,97.52,156.49,421.84,Single-ply,SBD,M
Boys,82.1,12,Xavier Robertson,Eustace,78.02,142.88,102.06,174.63,419.57,Single-ply,SBD,M
Boys,82.1,13,Alex Dupree,Eustace,80.38,163.29,90.72,156.49,410.5,Single-ply,SBD,M
Boys,82.1,14,Wyatt Poole,Fairfield,75.66,136.08,81.65,147.42,365.14,Single-ply,SBD,M
Boys,82.1,15,Christopher Acevedo,Dallas Life Oak Cliff,75.02,120.2,83.91,129.27,333.39,Single-ply,SBD,M
Boys,89.81,1,Victor Quevedo,Eustace,87.63,219.99,133.81,215.46,569.26,Single-ply,SBD,M
Boys,89.81,2,Nathan Vick,Teague,84.37,201.85,154.22,204.12,560.19,Single-ply,SBD,M
Boys,89.81,3,Brian Black,Palmer,89.18,215.46,142.88,201.85,560.19,Single-ply,SBD,M
Boys,89.81,4,Dylan Myers,Rice,83.64,206.38,142.88,190.51,539.77,Single-ply,SBD,M
Boys,89.81,5,Matt Rolen,Waxahachie,86.18,195.04,133.81,199.58,528.44,Single-ply,SBD,M
Boys,89.81,6,Aaron Harralson,West,88.18,195.04,142.88,190.51,528.44,Single-ply,SBD,M
Boys,89.81,7,Ingnacio Carmona,Hillsboro,86.27,206.38,120.2,195.04,521.63,Single-ply,SBD,M
Boys,89.81,8,Kyle Kelly,Scurry-Rosser,85.09,124.74,79.38,165.56,369.68,Single-ply,SBD,M
Boys,89.81,9,Anakin Sullivan,Hubbard,83.91,129.27,86.18,131.54,347,Single-ply,SBD,M
Boys,89.81,10,Jarred Maler,West,85.28,140.61,72.57,120.2,333.39,Single-ply,SBD,M
Boys,89.81,11,Connor Luke,Scurry-Rosser,83.55,115.67,74.84,133.81,324.32,Single-ply,SBD,M
Boys,89.81,DQ,Henry Martinez,Palmer,89.81,,,,,Single-ply,SBD,M
Boys,89.81,DQ,Stephen Stagg,Hubbard,89.81,,,,,Single-ply,SBD,M
Boys,89.81,DQ,Jaden Kistler,Corsicana Mildred,89.81,,,,,Single-ply,SBD,M
Boys,89.81,DQ,Matt Christian,Palmer,83.55,,,,,Single-ply,SBD,M
Boys,89.81,DQ,Rolando Ramirez,Hillsboro,85.73,188.24,122.47,,,Single-ply,SBD,M
Boys,99.79,1,Caleb High,Waxahachie,95.16,254.01,165.56,249.48,669.05,Single-ply,SBD,M
Boys,99.79,2,Nick Stewart,Waxahachie,97.79,247.21,167.83,249.48,664.51,Single-ply,SBD,M
Boys,99.79,3,Caleb Johnson,Corsicana,96.71,210.92,129.27,238.14,578.33,Single-ply,SBD,M
Boys,99.79,4,Daniel Fraire,West,98.43,249.48,158.76,167.83,576.06,Single-ply,SBD,M
Boys,99.79,5,Melvin Martin,Corsicana,97.89,190.51,117.93,219.99,528.44,Single-ply,SBD,M
Boys,99.79,6,Chris Flores,Hillsboro,90.72,208.65,124.74,183.7,517.1,Single-ply,SBD,M
Boys,99.79,7,Justin Horn #1,Corsicana Mildred,95.62,204.12,122.47,190.51,517.1,Single-ply,SBD,M
Boys,99.79,8,Zane Rider,Ennis,93.62,195.04,106.59,192.78,494.42,Single-ply,SBD,M
Boys,99.79,9,Tristan Williams,Corsicana,93.44,176.9,115.67,192.78,485.34,Single-ply,SBD,M
Boys,99.79,10,Rudy Segura,Palmer,97.25,190.51,108.86,185.97,485.34,Single-ply,SBD,M
Boys,99.79,11,Nick Barrios,West,90.26,195.04,106.59,174.63,476.27,Single-ply,SBD,M
Boys,99.79,12,Saul Diaz,Rice,97.16,179.17,111.13,185.97,476.27,Single-ply,SBD,M
Boys,99.79,13,River Drohn,Eustace,91.53,165.56,106.59,165.56,437.72,Single-ply,SBD,M
Boys,99.79,14,Nick Ucci,Jewett Leon,96.25,163.29,83.91,167.83,415.04,Single-ply,SBD,M
Boys,99.79,15,LaDarius Price,Fairfield,92.9,154.22,68.04,136.08,358.34,Single-ply,SBD,M
Boys,99.79,DQ,Charles Overman,Hubbard,99.79,,,,,Single-ply,SBD,M
Boys,99.79,DQ,Zion Barnes,Hubbard,90.99,,,,,Single-ply,SBD,M
Boys,99.79,DQ,John Montano,Buffalo,92.8,145.15,,,,Single-ply,SBD,M
Boys,99.79,DQ,Daniel Briones,Rice,97.89,215.46,142.88,,,Single-ply,SBD,M
Boys,99.79,DQ,Francisco Gomez,Eustace,94.35,,,,,Single-ply,SBD,M
Boys,109.77,1,Marcus Williams #2,Teague,107.32,263.08,156.49,260.82,680.39,Single-ply,SBD,M
Boys,109.77,2,Anthony Perez,Waxahachie,107.68,240.4,190.51,249.48,680.39,Single-ply,SBD,M
Boys,109.77,3,Ramiro Reyes,Hillsboro,104.78,238.14,124.74,226.8,589.67,Single-ply,SBD,M
Boys,109.77,4,Seth White,Corsicana,104.96,229.06,120.2,185.97,535.24,Single-ply,SBD,M
Boys,109.77,5,Bear Williams,Corsicana Mildred,103.78,215.46,115.67,147.42,478.54,Single-ply,SBD,M
Boys,109.77,6,Clint Ewing,Corsicana Mildred,109.5,176.9,97.52,140.61,415.04,Single-ply,SBD,M
Boys,109.77,7,Ray Reimim,Corsicana Mildred,106.32,154.22,72.57,136.08,362.87,Single-ply,SBD,M
Boys,109.77,DQ,Richard Worthington,Scurry-Rosser,109.77,,,,,Single-ply,SBD,M
Boys,124.74,1,Aaron Pfleeger,Fairfield,114.85,283.5,142.88,238.14,664.51,Single-ply,SBD,M
Boys,124.74,2,DeAunte Thomas,Corsicana,114.76,251.74,138.35,210.92,601.01,Single-ply,SBD,M
Boys,124.74,3,Dillon Jurcik,Ennis,120.93,210.92,111.13,201.85,523.9,Single-ply,SBD,M
Boys,124.74,4,Manny Ramirez,Ennis,120.47,213.19,129.27,179.17,521.63,Single-ply,SBD,M
Boys,124.74,5,Timmy Collums,Corsicana Mildred,117.48,215.46,147.42,147.42,510.29,Single-ply,SBD,M
Boys,124.74,6,Christ Palmer,Scurry-Rosser,118.93,204.12,120.2,185.97,510.29,Single-ply,SBD,M
Boys,124.74,7,Andres Ulloa-Cedillo,Rice,121.02,192.78,120.2,183.7,496.68,Single-ply,SBD,M
Boys,124.74,8,Chris Adams,Ennis,119.39,197.31,115.67,181.44,494.42,Single-ply,SBD,M
Boys,124.74,9,Bryce Stavinoha,Scurry-Rosser,123.56,183.7,129.27,179.17,492.15,Single-ply,SBD,M
Boys,124.74,10,Caleb Hernandez,Palmer,119.2,158.76,113.4,158.76,430.91,Single-ply,SBD,M
Boys,124.74,11,Govani Martinez,Dallas Life Oak Cliff,116.66,170.1,72.57,181.44,424.11,Single-ply,SBD,M
Boys,124.74+,1,Devin Collins,Ennis,145.24,276.69,145.15,263.08,684.92,Single-ply,SBD,M
Boys,124.74+,2,Larry Davis,Corsicana,159.94,258.55,179.17,242.67,680.39,Single-ply,SBD,M
Boys,124.74+,3,Isais Hernandez,Hillsboro,133.17,272.16,154.22,242.67,669.05,Single-ply,SBD,M
Boys,124.74+,4,Jesus Garcia #7,Buffalo,124.92,238.14,165.56,242.67,646.37,Single-ply,SBD,M
Boys,124.74+,5,Micheal Marshall,Eustace,136.44,256.28,151.95,238.14,646.37,Single-ply,SBD,M
Boys,124.74+,6,Dalton Hatcher,Scurry-Rosser,173.27,267.62,174.63,204.12,646.37,Single-ply,SBD,M
Boys,124.74+,7,Deontae Martin,Corsicana,138.35,260.82,149.69,222.26,632.76,Single-ply,SBD,M
Boys,124.74+,8,Caleb Carlile,Waxahachie,141.25,224.53,140.61,208.65,573.79,Single-ply,SBD,M
Boys,124.74+,9,Jesus Nunez,Corsicana,139.07,222.26,129.27,199.58,551.11,Single-ply,SBD,M
Boys,124.74+,10,Hiram Lawrence,Dallas Life Oak Cliff,140.52,158.76,113.4,192.78,464.93,Single-ply,SBD,M
Boys,124.74+,DQ,Marcus Staggs,Eustace,127.01,,,,,Single-ply,SBD,M
Boys,124.74+,DQ,LaMonte Hawley,Dallas Life Oak Cliff,125.92,,,,,Single-ply,SBD,M
