Name,WeightClassKg,Best3BenchKg,TotalKg,Event,Equipment,Sex,Division,AgeRange,Place,Bench4Kg
Mathew Maloney,82.5,107.05,107.05,B,Single-ply,M,Teen,13-19,1,
Adam James,125,227.25,227.25,B,Single-ply,M,Open,0-999,1,
Jason Neuhard,125,209.56,209.56,B,Single-ply,M,Open,0-999,2,
Scott Nail,140,204.57,204.57,B,Single-ply,M,Master,40-44,1,
Brian Porter,140,182.34,182.34,B,Single-ply,M,Master,40-44,2,
JW Potts,140,,,B,Single-ply,M,Master,45-49,DQ,
Zach Nail,52,34.93,34.93,B,Raw,M,Teen,13-19,1,
Tim Nail,67.5,49.9,49.9,B,Raw,M,Teen,13-19,1,
Roger Saunders,110,174.63,174.63,B,Raw,M,Submaster,33-39,1,
