Place,Name,BodyweightKg,Squat1Kg,Squat2Kg,Squat3Kg,Squat4Kg,Best3SquatKg,Bench1Kg,Bench2Kg,Bench3Kg,Bench4Kg,Best3BenchKg,Deadlift1Kg,Deadlift2Kg,Deadlift3Kg,Deadlift4Kg,Best3DeadliftKg,TotalKg,WeightClassKg,Sex,CyrillicName,BirthDate,Event,Equipment,Division
2,Varvara Bessel,31.4,37.5,42.5,45,,45,25,27.5,-30,,27.5,45,50,55,,55,127.5,44,F,Бессель,2013-11-05,SBD,Wraps,Youth
1,Xenia Bessel,43.8,47.5,55,60,,60,32.5,35,37.5,,37.5,60,70,-75,,70,167.5,44,F,Бессель,2012-02-22,SBD,Wraps,Youth
1,Andelina Silach,48.4,80,85,90,,90,40,45,-47.5,,45,90,100,110,,110,245,52,F,Силач,1997-11-20,SBD,Wraps,Open
1,Maxim Nikul,52.6,55,62.5,67.5,,67.5,40,45,-50,,45,70,75,80,,80,192.5,56,M,Никул,2008-09-20,SBD,Wraps,Open
1,Julia Litvinenko,53,100,107.5,115,,115,45,50,52.5,,52.5,135,145,-155,,145,312.5,56,F,Наталья Сорока,2001-11-15,SBD,Wraps,Open
1,Deyan Fitkevich,59,115,130,135,,135,75,82.5,85,,85,145,160,165,,165,385,60,M,Деян Фіткевич,2005-07-18,SBD,Wraps,Open
1,Ksenia Sholina,59.2,115,122.5,-130,,122.5,60,65,-70,,65,120,130,142.5,,142.5,330,60,F,Шолина,1999-08-10,SBD,Wraps,Juniors 20-23
1,Victoria Plakhuta,57.4,110,120,130,,130,45,50,-52.5,,50,100,110,-115,,110,290,60,F,Плахута,1994-08-16,SBD,Wraps,Open
1,Ekaterina Bessel,73.2,140,150,-160,,150,77.5,85,-87.5,,85,135,140,145,,145,380,75,F,Бессель,1991-07-18,SBD,Wraps,Open
1,Irina Kairova,71.8,-100,105,115,,115,70,75,80,,80,110,115,120,,120,315,75,F,Ірина Каірова,1982-12-10,SBD,Wraps,Submasters 35-39
3,Anton Okolets,74.8,220,235,245,,245,125,132.5,140,,140,185,195,205,,205,590,75,M,Антон Околець,2003-10-31,SBD,Wraps,Open
1,Alexey Zakhozhiy,71.6,80,90,105,,105,80,90,-92.5,,90,150,165,175,,175,370,75,M,Захожий,1998-11-22,SBD,Wraps,Juniors 20-23
2,Andrey Sozontov,79,140,145,150,,150,95,100,-105,,100,142.5,150,160,,160,410,82.5,M,Андрей Созонтов,1985-11-21,SBD,Wraps,Open
1,Dmitry Dudnik,77,-150,150,,,150,105,-110,-110,,105,182.5,195,205,,205,460,82.5,M,Дудник,1994-12-15,SBD,Wraps,Open
5,Vitaly Grigorovich,89.9,180,190,200,,200,125,132.5,137.5,,137.5,200,210,-220,,210,547.5,90,M,Григорович,1989-09-10,SBD,Wraps,Open
6,Korobov Maxim,86.4,180,190,195,,195,117.5,122.5,-127.5,,122.5,122.5,200,210,,210,527.5,90,M,Коробов,1992-07-21,SBD,Wraps,Open
1,Ruslana Moldovanova,108.6,140,150,160,,160,70,75,80,,80,170,180,185,,185,425,90+,F,Руслана Молдованова,1986-07-27,SBD,Wraps,Open
4,Alexander Molodov,99.6,205,225,230,,230,-120,125,-132.5,,125,225,245,-250,,245,600,100,M,Молодов,1972-02-22,SBD,Wraps,Open
5,Igor Romasenko,97.4,170,177.5,185,,185,-100,100,-105,,100,210,220,230,,230,515,100,M,Ігор Ромасенко,1963-02-26,SBD,Wraps,Open
6,Yuri Shirinsky,91.4,152.5,165,-170,,165,115,120,-125,,120,165,180,-185,,180,465,100,M,Ширинский,1977-08-15,SBD,Wraps,Open
2,Sergey Bessel,106.6,242.5,260,,,260,180,190,-200,,190,260,275,285,,285,735,110,M,Бессель,1984-12-27,SBD,Wraps,Open
4,Bratov Dmitry,108.6,182.5,205,225,,225,150,160,165,,165,210,222.5,230,,230,620,110,M,Дмитрий Братов,1995-07-10,SBD,Wraps,Open
3,Daniel Udovik,112.8,200,210,220,,220,132.5,142.5,-147.5,,142.5,210,220,-230,,220,582.5,125,M,Даниил Удовик,1992-01-25,SBD,Wraps,Open
1,Alina Gerasimova,47.9,,,,,,40,45,47.5,,47.5,,,,,,47.5,48,F,Алина Герасимова,2008-08-03,B,Raw,Open
1,Natalia Klimchuk,58.4,,,,,,62.5,67.5,-70,,67.5,,,,,,67.5,60,F,Наталья Климчук,1984-09-25,B,Raw,Open
1,Valentin Pushkov,57.8,,,,,,80,85,-90,,85,,,,,,85,60,M,Валентин Пушков,2004-12-27,B,Raw,Teen 16-17
1,Bogdan Obshansky,65.2,,,,,,100,112.5,-130,,112.5,,,,,,112.5,67.5,M,Богдан Обшанский,2000-01-13,B,Raw,Open
1,Bogdan Pischits,72.4,,,,,,130,-137.5,-137.5,,130,,,,,,130,75,M,Богдан Піщиць,2004-02-24,B,Raw,Teen
1,Igor Guzhansky,70.6,,,,,,100,115,120,,120,,,,,,120,75,M,Игорь Гужанский,2004-08-21,B,Raw,Teen 16-17
1,Bogdan Polotnyanko,74.6,,,,,,100,105,-107.5,,105,,,,,,105,75,M,Богдан Полотнянко,2001-08-06,B,Raw,Juniors 20-23
2,Dmitry Mishchenko,74.9,,,,,,120,125,130,,130,,,,,,130,75,M,Дмитрий Мищенко,1992-07-13,B,Raw,Open
1,Artem Molchanov,73,,,,,,-130,130,137.5,,137.5,,,,,,137.5,75,M,Артем Молчанов,1987-10-14,B,Raw,Open
1,Vladislav Yarony,77.2,,,,,,-100,110,-125,,110,,,,,,110,82.5,M,Владислав Яроный,2004-12-02,B,Raw,Teen
4,Maxim Sukhanov,80.4,,,,,,122.5,127.5,130,,130,,,,,,130,82.5,M,Максим Суханов,1993-11-15,B,Raw,Open
3,Alexander Sharvey,81.4,,,,,,142.5,147,150,,150,,,,,,150,82.5,M,Александр Шарвей,1986-02-03,B,Raw,Open
2,Alexander Deev,85.2,,,,,,130,-135,135,,135,,,,,,135,90,M,Александр Деев,1992-04-15,B,Raw,Open
4,Nikita Bogdan,96.2,,,,,,150,-157.5,157.5,,157.5,,,,,,157.5,100,M,Никита Богдан,2004-10-08,B,Raw,Open
1,Constantine Rembach,64,,,,,,,,,,,125,145,152.5,,152.5,152.5,67.5,M,Константин Рембач,2005-07-18,D,Raw,Teen 16-17
1,Vladislav Yarony,77.2,,,,,,,,,,,165,190,-210,,190,190,82.5,M,Владислав Яроный,2004-12-02,D,Raw,Teen 16-17
1,Anastasia Bogopolskaya,78.2,,,,,,,,,,,60,70,-90,,70,70,82.5,F,Анастасия Богопольская,2004-08-28,D,Raw,Teen
1,Sergey Shevchenko,89.6,,,,,,,,,,,172.5,177.5,-182.5,,177.5,177.5,90,M,Сергей Шевченко,1973-08-29,D,Raw,Masters
2,Yaroslav Goncharuk,89.9,,,,,,135,150,-170,,150,235,245,255,,255,405,90,M,Ярослав Гончарук,1999-04-18,BD,Raw,Open
2,Igor Franko,122,,,,,,160,170,180,,180,255,,,,255,435,125,M,Ігор Франко,1989-06-09,BD,Raw,Open
1,Vladislav Glushchenko,122,,,,,,,,,,,160,180,200,,200,200,125,M,Владислав Глущенко,2005-02-05,D,Raw,Teen 16-17
1,Aleksandr Tarasov,130.2,310,325,340,350,340,235,245,252.5,-257.5,252.5,345,360,-372.5,-372.5,360,952.5,140,M,Александр Тарасов,1991-10-27,SBD,Wraps,Open
1,Maxim Potemkin,113.6,325,345,360,370,360,230,242.5,252.5,260,252.5,370,,-400,-400,370,982.5,125,M,Максим Потьомкін,1993-08-30,SBD,Wraps,Open
2,Aleksey Ponomarenko,124.6,300,320,340,355,340,180,190,200,,200,325,340,350,-360,350,890,125,M,Алексей Пономаренко,1992-03-27,SBD,Wraps,Open
2,Maxim Samoylenko,99.2,300,320,332.5,,332.5,190,200,-205,,200,320,-340,-340,,320,852.5,100,M,Максим Самойленко,1998-03-11,SBD,Wraps,Open
1,Igor Klyaooz,109.9,260,280,,,280,170,190,-200,,190,270,290,-310,,290,760,110,M,Игорь Кляуз,1987-06-15,SBD,Wraps,Open
3,Sergey Seleznev,106.4,250,265,280,-300,280,165,172.5,,,172.5,225,235,-240,-240,235,687.5,110,M,Сергей Селезнев,1996-04-13,SBD,Wraps,Open
1,Alexander Shevchenko,96,330,350,370,400,370,180,-190,190,,190,330,350,-360,-360,350,910,100,M,Александр Шевченко,1990-12-23,SBD,Wraps,Open
1,Ivan Chervony,97.4,220,235,247.5,-260,247.5,90,110,-122.5,122.5,110,225,245,-255,-255,245,602.5,100,M,Иван Червоный,2003-01-19,SBD,Wraps,Teen 18-19
3,Alexander Sychev,99.9,-200,215,230,235,230,160,167.5,-175,-175,167.5,210,225,-230,,225,622.5,100,M,Александр Сычев,1996-09-11,SBD,Wraps,Open
1,Oleksii Melnyk,89.9,320,340,355,367.5,355,190,200,207.5,-212.5,207.5,315,-335,-335,,315,877.5,90,M,Олексій Мельник,1990-04-26,SBD,Wraps,Open
2,Arkady Shaloha,87.2,310,330,350,,350,160,167.2,172.5,,172.5,290,-300,,,290,812.5,90,M,Аркадий Шалоха,1983-02-28,SBD,Wraps,Open
3,Evgeniy Borisenko #1,89.6,225,240,-250,,240,130,140,145,,145,240,250,260,270,260,645,90,M,Євгеній Борисенко,1997-02-26,SBD,Wraps,Open
4,Daniel Talash,88.4,185,195,200,,200,120,125,130,,130,200,220,230,,230,560,90,M,Даниил Талаш,2004-10-24,SBD,Wraps,Open
1,Alexander Kucher,74.8,290,305,312.5,-325,312.5,177.5,185,190,,190,250,,-300,,250,752.5,75,M,Александр Кучер,1980-08-24,SBD,Wraps,Open
2,Alexander Gushtyk,74.6,290,305,315,,315,-145,150,-155,-155,150,-220,220,232.5,-245,232.5,697.5,75,M,Александр Гуштык,1998-12-30,SBD,Wraps,Open
1,Kondakov Viktor,128.2,,,,,,230,240,250,255,250,,,,,,250,140,M,Виктор Кондаков,1996-07-11,B,Raw,Open
1,Valery Koev,101.8,,,,,,165,172.5,-180,180,172.5,260,267.5,272.5,,272.5,445,110,M,Валерий Коев,1987-01-30,BD,Raw,Open
3,Sergey Protsenko,96.4,,,,,,180,190,200,-205,200,,,,,,200,100,M,Сергей Проценко,1987-03-29,B,Raw,Open
1,Alexander Onishchenko,99.4,,,,,,230,240,-250,250,240,,,,,,240,100,M,Александр Онищенко,1980-05-28,B,Raw,Open
2,Sergey Didovik,99.8,,,,,,200,210,-215,-215,210,,,,,,210,100,M,Сергей Дидовик,1978-01-20,B,Raw,Open
1,Vladimir Gutsul,87.4,,,,,,175,190,-195,,190,245,265,,,265,455,90,M,Владимир Гуцул,1978-03-16,BD,Raw,Open
1,Ernest Gromov,89.8,,,,,,212.5,222.5,-232.5,-232.5,222.5,,,,,,222.5,90,M,Ернест Громов,1994-05-17,B,Raw,Open
1,Anton Shipilov,82,,,,,,190,200,205,210,205,,,,,,205,82.5,M,Антон Шипилов,1986-09-19,B,Raw,Open
2,Constantine Secker,81.4,,,,,,180,-190,190,-201,190,,,,,,190,82.5,M,Костянтин Секкер,2003-06-15,B,Raw,Open
1,Aleksandr Tarasov,130.2,,,,,,,,,,,345,360,-372.5,-372.5,360,360,140,M,Александр Тарасов,1991-10-27,D,Raw,Open
1,Maxim Potemkin,113.6,,,,,,,,,,,370,,-400,-400,370,370,125,M,Максим Потьомкін,1993-08-30,D,Raw,Open
2,Aleksey Ponomarenko,124.6,,,,,,,,,,,325,340,350,-360,350,350,125,M,Алексей Пономаренко,1992-03-27,D,Raw,Open
1,Nikita Eirushevich,124.2,,,,,,202.5,-215,-215,-215,202.5,290,-310,-310,-330,290,492.5,125,M,Никита Ейрушевич,1989-06-30,BD,Raw,Open
1,Stepan Savchuk,91.4,,,,,,,,,,,270,-280,280,-290,280,280,100,M,Степан Савчук,1996-04-18,D,Raw,Open
