Place,Tested,Equipment,WeightClassKg,Name,CyrillicName,Sex,Country,BirthDate,Division,BodyweightKg,Squat1Kg,Squat2Kg,Squat3Kg,Squat4Kg,Best3SquatKg,Bench1Kg,Bench2Kg,Bench3Kg,Bench4Kg,Best3BenchKg,Deadlift1Kg,Deadlift2Kg,Deadlift3Kg,Deadlift4Kg,Best3DeadliftKg,TotalKg,Event
1,Yes,Wraps,52,Olga Petrichenko,Ольга Петриченко,F,Russia,1985-12-21,Amateur Open,51.1,100,110,-117.5,,110,,,,,,,,,,,110,S
1,Yes,Wraps,82.5,Grigoriy Yudin,Григорий Юдин,M,Russia,1985-06-06,Amateur Open,79.9,185,195,205,,205,,,,,,,,,,,205,S
1,Yes,Wraps,100,Sergey Nosachyov,Сергей Носачёв,M,Russia,1987-10-19,Amateur Open,90.55,120,145,-155,,145,,,,,,,,,,,145,S
2,Yes,Wraps,100,Vladislav Trautveyn,Владислав Траутвейн,M,Russia,1985-06-03,Amateur Open,92,125,142.5,-145,,142.5,,,,,,,,,,,142.5,S
1,Yes,Raw,52,Margarita Galaktionova,Маргарита Галактионова,F,Russia,1991-03-01,Amateur Open,52,,,,,,,,,,,145,152.5,155,,155,155,D
2,Yes,Raw,52,Olga Petrichenko,Ольга Петриченко,F,Russia,1985-12-21,Amateur Open,51.1,,,,,,,,,,,-120,120,130,,130,130,D
3,Yes,Raw,52,Seda Minosyan,Седа Миносян,F,Russia,1980-10-15,Amateur Open,50,,,,,,,,,,,100,-110,-110,,100,100,D
1,Yes,Raw,56,Anna Kosheleva,Анна Кошелева,F,Russia,1964-09-30,Amateur Masters 50-54,54.35,,,,,,,,,,,70,75,85,,85,85,D
1,Yes,Raw,56,Anna Vishnyak,Анна Вишняк,F,Russia,1984-12-12,Amateur Open,54.85,,,,,,,,,,,145,155,-165,,155,155,D
1,Yes,Raw,60,Nadezhda Krylova,Надежда Крылова,F,Russia,1982-11-24,Amateur Open,59.1,,,,,,,,,,,80,85,90,,90,90,D
1,Yes,Raw,67.5,Irina Gamova,Ирина Гамова,F,Russia,1974-10-16,Amateur Masters 40-44,62.9,,,,,,,,,,,62.5,67.5,72.5,,72.5,72.5,D
1,Yes,Raw,67.5,Elena Pecherskaya,Елена Печерская,F,Russia,1991-02-08,Amateur Open,66.6,,,,,,,,,,,-145,152.5,-160,,152.5,152.5,D
2,Yes,Raw,67.5,Evgeniya Karakash,Евгения Каракаш,F,Russia,1979-11-03,Amateur Open,66.4,,,,,,,,,,,140,150,-157.5,,150,150,D
3,Yes,Raw,67.5,Nadezhda Golovina,Надежда Головина,F,Russia,1990-10-05,Amateur Open,63.4,,,,,,,,,,,95,110,120,,120,120,D
1,Yes,Raw,82.5,Alla Kovalskaya,Алла Ковальская,F,Russia,1975-01-01,Amateur Masters 40-44,75.15,,,,,,,,,,,80,90,95,,95,95,D
1,Yes,Raw,60,Dmitriy Basantsov,Дмитрий Басанцов,M,Russia,1997-08-11,Amateur Juniors 20-23,59.45,,,,,,,,,,,160,167.5,-175,,167.5,167.5,D
1,Yes,Raw,60,Ayrat Khayrullin,Айрат Хайруллин,M,Russia,1964-01-24,Amateur Masters 50-54,60,,,,,,,,,,,130,140,145,,145,145,D
1,Yes,Raw,60,Artur Gushchin,Артур Гущин,M,Russia,2004-02-26,Amateur Teen 14-15,57.9,,,,,,,,,,,115,-120,120,,120,120,D
1,Yes,Raw,67.5,Denis Papenko,Денис Папенко,M,Russia,1997-04-07,Amateur Juniors 20-23,66.4,,,,,,,,,,,220,225,-230,,225,225,D
1,Yes,Raw,67.5,Murat Tlinov,Мурат Тлинов,M,Russia,1966-08-01,Amateur Masters 50-54,64.8,,,,,,,,,,,125,130,140,,140,140,D
1,Yes,Raw,67.5,Boris Shavrin,Борис Шаврин,M,Russia,1951-03-12,Amateur Masters 65-69,66.4,,,,,,,,,,,162.5,172.5,-182.5,,172.5,172.5,D
1,Yes,Raw,67.5,Vladimir Afonin,Владимир Афонин,M,Russia,1945-06-09,Amateur Masters 70-74,66.95,,,,,,,,,,,152.5,160,165,,165,165,D
1,Yes,Raw,67.5,Boris Shavrin,Борис Шаврин,M,Russia,1951-03-12,Amateur Open,66.4,,,,,,,,,,,162.5,172.5,-182.5,,172.5,172.5,D
1,Yes,Raw,67.5,Artyom Abashev,Артём Абашев,M,Russia,1999-01-22,Amateur Teen 18-19,64,,,,,,,,,,,167.5,175,-192.5,,175,175,D
1,Yes,Raw,75,Grigoriy Rafaylidi,Григорий Рафайлиди,M,Russia,1979-11-25,Amateur Open,73.9,,,,,,,,,,,205,215,-235,,215,215,D
2,Yes,Raw,75,Stepan Kozlov,Степан Козлов,M,Russia,1992-08-17,Amateur Open,72.05,,,,,,,,,,,190,205,-215,,205,205,D
DQ,Yes,Raw,75,Elkhan Orudzhaev,Эльхан Оруджаев,M,Azerbaijan,2001-12-03,Amateur Teen 16-17,69.55,,,,,,,,,,,,,,,,,D
1,Yes,Raw,82.5,Roman Khachatryan,Роман Хачатрян,M,Russia,1988-10-26,Amateur Open,78.9,,,,,,,,,,,180,190,200,,200,200,D
1,Yes,Raw,90,Aleksandr Grushinskiy,Александр Грушинский,M,Russia,1975-02-06,Amateur Masters 40-44,85.6,,,,,,,,,,,225,,,,225,225,D
1,Yes,Raw,90,Denis Zubov,Денис Зубов,M,Russia,1987-04-02,Amateur Open,89.15,,,,,,,,,,,240,257.5,-270,,257.5,257.5,D
DQ,Yes,Raw,90,Andrey Lopatko,Андрей Лопатко,M,Russia,1993-09-11,Amateur Open,89,,,,,,,,,,,-210,-210,,,,,D
1,Yes,Raw,100,Nikolay Korshunov,Николай Коршунов,M,Russia,1995-03-07,Amateur Juniors 20-23,99.25,,,,,,,,,,,215,235,-245,,235,235,D
1,Yes,Raw,100,Vadim Anishchenko,Вадим Анищенко,M,Russia,1971-03-29,Amateur Masters 45-49,97.55,,,,,,,,,,,200,215,230,,230,230,D
1,Yes,Raw,100,Vyacheslav Nikolaev,Вячеслав Николаев,M,Russia,1956-07-10,Amateur Masters 60-64,99.9,,,,,,,,,,,230,-250,-250,,230,230,D
1,Yes,Raw,100,Pavel Ivanilov,Павел Иванилов,M,Russia,1988-04-07,Amateur Open,97.25,,,,,,,,,,,245,-257.5,-257.5,,245,245,D
2,Yes,Raw,100,Eduard Danelyan,Эдуард Данелян,M,Russia,1990-04-04,Amateur Open,93.5,,,,,,,,,,,190,205,-235,,205,205,D
3,Yes,Raw,100,Vladislav Trautveyn,Владислав Траутвейн,M,Russia,1985-06-03,Amateur Open,92,,,,,,,,,,,165,175,180,,180,180,D
1,Yes,Raw,110,Anatoliy Belyakov,Анатолий Беляков,M,Russia,1996-10-19,Amateur Juniors 20-23,105.45,,,,,,,,,,,190,-210,210,,210,210,D
1,Yes,Raw,110,Georgiy Gnezdilo,Георгий Гнездило,M,Russia,1977-08-18,Amateur Masters 40-44,103.65,,,,,,,,,,,210,225,-232.5,,225,225,D
1,Yes,Raw,110,Andrey Maksimenko,Андрей Максименко,M,Russia,1972-10-03,Amateur Masters 45-49,103,,,,,,,,,,,185,190,-195,,190,190,D
1,Yes,Raw,110,Gennadiy Shedo,Геннадий Шедо,M,Russia,1979-04-12,Amateur Open,105.25,,,,,,,,,,,200,220,235,,235,235,D
1,Yes,Raw,125,Rodion Shishkin,Родион Шишкин,M,Russia,1985-10-03,Amateur Open,116.8,,,,,,,,,,,200,-210,210,,210,210,D
1,Yes,Wraps,44,Aleksandra Surodeeva,Александра Суродеева,F,Russia,2003-04-01,Amateur Teen 14-15,43.9,50,-55,55,,55,35,40,-42.5,,40,50,55,-60,,55,150,SBD
1,Yes,Wraps,48,Rozaliya Boyko,Розалия Бойко,F,Russia,1987-04-07,Amateur Open,46.65,80,85,87.5,,87.5,50,52.5,55,,55,85,90,-92.5,,90,232.5,SBD
1,Yes,Wraps,52,Olga Petrichenko,Ольга Петриченко,F,Russia,1985-12-21,Amateur Open,51.1,100,110,-117.5,,110,-55,60,-65,,60,-120,120,130,,130,300,SBD
2,Yes,Wraps,52,Olga Golovataya,Ольга Головатая,F,Russia,1989-08-09,Amateur Open,52,60,65,70,,70,77.5,80,82.5,,82.5,115,120,-125,,120,272.5,SBD
1,Yes,Wraps,56,Anna Vishnyak,Анна Вишняк,F,Russia,1984-12-12,Amateur Open,54.85,120,-127.5,-130,,120,82.5,87.5,-92.5,,87.5,145,155,-165,,155,362.5,SBD
2,Yes,Wraps,56,Elena Yudina,Елена Юдина,F,Russia,1985-05-03,Amateur Open,53.95,70,75,-80,,75,45,47.5,-50,,47.5,75,80,-82.5,,80,202.5,SBD
1,Yes,Wraps,60,Mariya Eliseeva,Мария Елисеева,F,Russia,1994-06-05,Amateur Open,59.4,95,-97.5,97.5,,97.5,45,50,-52.5,,50,95,100,105,,105,252.5,SBD
1,Yes,Wraps,75,Natalya Krakhmaleva,Наталья Крахмалева,F,Russia,1976-09-06,Amateur Open,72.9,80,95,-105,,95,55,60,-62.5,,60,120,130,135,,135,290,SBD
1,Yes,Wraps,82.5,Elena Rudenko,Елена Руденко,F,Russia,1970-05-19,Amateur Masters 45-49,77.3,115,117.5,120,,120,62.5,65,67.5,,67.5,147.5,150,152.5,,152.5,340,SBD
1,Yes,Wraps,44,Artyom Anishchenko,Артём Анищенко,M,Russia,2007-11-27,Amateur Teen 13,44,35,40,45,,45,25,30,-32.5,,30,55,-60,65,,65,140,SBD
1,Yes,Wraps,56,Aleksey Lupandin,Алексей Лупандин,M,Russia,2003-11-13,Amateur Teen 14-15,54.9,120,-125,-125,,120,60,65,-70,,65,135,145,150,152.5,150,335,SBD
1,Yes,Wraps,56,Aleksandr Mikheev,Александр Михеев,M,Russia,2001-02-19,Amateur Teen 16-17,55.8,125,130,135,,135,90,95,97.5,,97.5,160,175,185,,185,417.5,SBD
1,Yes,Wraps,60,Dmitriy Basantsov,Дмитрий Басанцов,M,Russia,1997-08-11,Amateur Juniors 20-23,59.45,115,120,125,,125,65,75,-80,,75,160,167.5,-175,,167.5,367.5,SBD
1,Yes,Wraps,67.5,Denis Papenko,Денис Папенко,M,Russia,1997-04-07,Amateur Juniors 20-23,66.4,155,160,165,,165,115,120,-125,,120,220,225,-230,,225,510,SBD
1,Yes,Wraps,67.5,Murat Tlinov,Мурат Тлинов,M,Russia,1966-08-01,Amateur Masters 50-54,64.8,85,-95,95,,95,75,80,-85,,80,125,130,140,,140,315,SBD
1,Yes,Wraps,67.5,Vladimir Afonin,Владимир Афонин,M,Russia,1945-06-09,Amateur Masters 70-74,66.95,105,115,-117.5,,115,85,90,-92.5,,90,152.5,160,165,,165,370,SBD
1,Yes,Wraps,75,Said Lordkipanidze,Саид Лордкипанидзе,M,Abkhazia,1995-03-28,Amateur Juniors 20-23,72.7,180,200,210,,210,105,115,-120,,115,180,200,220,,220,545,SBD
1,Yes,Wraps,75,Valeriy Frenklakh,Валерий Френклах,M,Israel,1943-02-17,Amateur Masters 75-79,70.15,80,90,-100,,90,50,52.5,-57.5,,52.5,100,110,-125,,110,252.5,SBD
1,Yes,Wraps,75,Igor Chernyaev #2,Игорь Черняев,M,Russia,1984-04-05,Amateur Open,73.6,170,177.5,-182.5,,177.5,-130,130,-135,,130,210,220,-230,,220,527.5,SBD
2,Yes,Wraps,75,Grigoriy Rafaylidi,Григорий Рафайлиди,M,Russia,1979-11-25,Amateur Open,73.9,140,-160,-160,,140,110,125,130,,130,205,215,-235,,215,485,SBD
DQ,Yes,Wraps,75,Ioann Stupichkin,Иоанн Ступичкин,M,Russia,2000-01-03,Amateur Teen 18-19,69.25,110,-125,125,,125,-90,-90,-90,,,-160,,,,,,SBD
1,Yes,Wraps,82.5,Eduard Titulenko,Эдуард Титуленко,M,Russia,1996-07-10,Amateur Juniors 20-23,81.15,210,220,-230,,220,165,172.5,175,,175,245,255,262.5,,262.5,657.5,SBD
1,Yes,Wraps,82.5,Grigoriy Yudin,Григорий Юдин,M,Russia,1985-06-06,Amateur Open,79.9,185,195,205,,205,130,140,147.5,,147.5,170,-180,185,,185,537.5,SBD
2,Yes,Wraps,82.5,Aleksandr Yurev,Александр Юрьев,M,Russia,1981-10-11,Amateur Open,80.95,-165,165,-175,,165,105,115,120,,120,175,190,200,,200,485,SBD
1,Yes,Wraps,82.5,Alper Babal,Альпер Бабал,M,Abkhazia,1999-07-28,Amateur Teen 18-19,80.15,150,160,170,,170,110,120,,,120,160,170,180,,180,470,SBD
1,Yes,Wraps,90,Aleksey Krasnov,Алексей Краснов,M,Russia,1959-11-15,Amateur Masters 55-59,87.2,210,215,,,215,125,130,,,130,200,210,220,,220,565,SBD
1,Yes,Wraps,90,Aleksey Bulbas,Алексей Бульбас,M,Russia,1980-12-14,Amateur Open,86.5,190,200,205,,205,130,140,145,,145,200,210,220,,220,570,SBD
2,Yes,Wraps,90,Egor Okhotin,Егор Охотин,M,Russia,1990-10-08,Amateur Open,89.05,160,-180,180,,180,120,140,-150,,140,180,210,-220,,210,530,SBD
1,Yes,Wraps,100,Valeriy Mikheev,Валерий Михеев,M,Russia,1965-04-27,Amateur Masters 50-54,98.2,210,230,-240,,230,-170,170,-180,,170,210,235,-250,,235,635,SBD
1,Yes,Wraps,100,Aleksandr Ivanov,Александр Иванов,M,Russia,1989-08-21,Amateur Open,98.05,220,235,245,,245,160,170,175,,175,250,270,292.5,,292.5,712.5,SBD
2,Yes,Wraps,100,Stepan Sagirov,Степан Сагіров,M,Russia,1992-11-19,Amateur Open,98.9,230,240,250,,250,170,180,190,,190,230,250,272.5,,272.5,712.5,SBD
3,Yes,Wraps,100,Valeriy Mikheev,Валерий Михеев,M,Russia,1965-04-27,Amateur Open,98.2,210,230,-240,,230,-170,170,-180,,170,210,235,-250,,235,635,SBD
4,Yes,Wraps,100,Vladislav Trautveyn,Владислав Траутвейн,M,Russia,1985-06-03,Amateur Open,92,125,142.5,-145,,142.5,85,95,100,,100,165,175,180,,180,422.5,SBD
1,Yes,Wraps,110,Kirill Petrikin,Кирилл Петрикин,M,Russia,1995-06-13,Amateur Juniors 20-23,104.95,170,185,190,,190,160,-170,172.5,,172.5,210,230,250,,250,612.5,SBD
1,Yes,Wraps,110,Evgeniy Byzov,Евгений Бызов,M,Russia,1970-10-06,Amateur Masters 45-49,108.3,150,165,180,,180,100,110,117.5,,117.5,155,170,180,,180,477.5,SBD
1,Yes,Wraps,125,Yuriy Abregov,Юрий Абрегов,M,Russia,1964-10-21,Amateur Masters 50-54,117.9,-180,180,190,,190,130,140,150,,150,180,200,210,,210,550,SBD
1,Yes,Wraps,125,Artyom Matveychuk,Артём Матвейчук,M,Russia,1996-02-22,Amateur Open,120.75,220,230,240,,240,190,-202.5,202.5,,202.5,230,250,270,,270,712.5,SBD
2,Yes,Wraps,125,Rodion Shishkin,Родион Шишкин,M,Russia,1985-10-03,Amateur Open,116.8,160,170,180,,180,105,110,115,,115,200,-210,210,,210,505,SBD
1,Yes,Wraps,125,Artyom Fatykhov,Артём Фатыхов,M,Russia,2001-04-07,Amateur Teen 16-17,123.15,100,130,140,,140,85,90,92.5,,92.5,150,170,-185,,170,402.5,SBD
1,No,Wraps,67.5,Evgeniy Osipov,Евгений Осипов,M,Russia,1977-05-23,Pro Masters 40-44,67.45,115,125,,,125,,,,,,,,,,,125,S
1,No,Wraps,82.5,Aleksandr Malina,Александр Малина,M,Russia,1971-06-04,Pro Masters 45-49,81,130,140,155,,155,,,,,,,,,,,155,S
1,No,Raw,67.5,Elena Pecherskaya,Елена Печерская,F,Russia,1991-02-08,Pro Open,66.6,,,,,,,,,,,140,-160,-160,,140,140,D
1,No,Raw,67.5,Larisa Gvozdeva,Лариса Гвоздева,F,Russia,1965-06-25,Pro Masters 50-54,62,,,,,,,,,,,140,150,,,150,150,D
1,No,Raw,67.5,Evgeniy Osipov,Евгений Осипов,M,Russia,1977-05-23,Pro Masters 40-44,67.45,,,,,,,,,,,155,-170,,,155,155,D
1,No,Raw,75,Elkhan Orudzhev,Эльхан Оруджев,M,Azerbaijan,2001-12-03,Pro Teen 16-17,69.55,,,,,,,,,,,185,195,202.5,,202.5,202.5,D
1,No,Raw,82.5,Aleksandr Malina,Александр Малина,M,Russia,1971-06-04,Pro Masters 45-49,81,,,,,,,,,,,185,200,-210,,200,200,D
1,No,Raw,82.5,Roman Ahmadov,Роман Ахмадов,M,Azerbaijan,1985-02-03,Pro Open,79,,,,,,,,,,,160,170,-185,,170,170,D
1,No,Raw,90,Vyacheslav Skrynnikov,Вячеслав Скрынников,M,Russia,1996-06-02,Pro Juniors 20-23,83,,,,,,,,,,,170,180,190,,190,190,D
1,No,Raw,100,Oleg Sokolov,Олег Соколов,M,Russia,1972-08-14,Pro Masters 45-49,99.4,,,,,,,,,,,200,215,220,,220,220,D
1,No,Raw,100,Aleksandr Medvedev,Александр Медведев,M,Russia,1967-01-19,Pro Masters 50-54,94.3,,,,,,,,,,,220,230,245,,245,245,D
2,No,Raw,100,Vyacheslav Gorbunov #1,В'ячеслав Горбунов,M,Russia,1967-12-20,Pro Masters 50-54,99,,,,,,,,,,,220,240,-247.5,,240,240,D
1,No,Raw,100,Pavel Bessonov,Павел Бессонов,M,Russia,1988-08-24,Pro Open,98.85,,,,,,,,,,,260,280,-282.5,,280,280,D
2,No,Raw,100,Elshan Agaev,Эльшан Агаев,M,Azerbaijan,1983-07-18,Pro Open,94.55,,,,,,,,,,,260,-280,,,260,260,D
1,No,Raw,110,Aleksandr Tsygankov,Александр Цыганков,M,Russia,1965-07-05,Pro Masters 50-54,110,,,,,,,,,,,275,-317.5,,,275,275,D
1,No,Raw,110,Evgeniy Akhmedov,Евгений Ахмедов,M,Russia,1980-12-20,Pro Open,103,,,,,,,,,,,285,315,325,,325,325,D
1,No,Raw,125,Anatoliy Talovasov,Анатолий Таловасов,M,Russia,1960-12-01,Pro Masters 55-59,112.75,,,,,,,,,,,230,240,,,240,240,D
1,No,Raw,125,Sergey Daragan,Сергей Дараган,M,Russia,1978-11-12,Pro Open,119,,,,,,,,,,,-380,380,400,,400,400,D
1,No,Wraps,56,Lyana Zatonskaya,Ляна Затонская,F,Russia,1995-11-06,Pro Juniors 20-23,55.75,90,95,-100,,95,45,50,-55,,50,110,125,,,125,270,SBD
1,No,Wraps,67.5,Svetlana Leonidova,Светлана Леонидова,F,Russia,1999-10-20,Pro Teen 18-19,67.2,60,65,67.5,,67.5,42.5,-45,-45,,42.5,70,80,-85,,80,190,SBD
1,No,Wraps,75,Elena Konyushenko,Елена Конюшенко,F,Russia,1985-03-11,Pro Open,67.65,110,115,-120,,115,80,85,-87.5,,85,140,150,-160,,150,350,SBD
1,No,Wraps,75,Vladislava Myslovskaya,Владислава Мысловская,F,Russia,2001-01-07,Pro Teen 16-17,71.75,190,200,-210,,200,100,105,-110,,105,190,200,-207.5,,200,505,SBD
1,No,Wraps,67.5,Evgeniy Osipov,Евгений Осипов,M,Russia,1977-05-23,Pro Masters 40-44,67.45,115,125,,,125,100,107.5,,,107.5,155,-170,,,155,387.5,SBD
1,No,Wraps,67.5,Evgeniy Osipov,Евгений Осипов,M,Russia,1977-05-23,Pro Open,67.45,115,125,,,125,100,107.5,,,107.5,155,-170,,,155,387.5,SBD
1,No,Wraps,82.5,Vladimir Goryunov,Владимир Горюнов,M,Russia,1953-02-02,Pro Masters 65-69,81.45,145,155,160,,160,135,145,,,145,200,210,,,210,515,SBD
1,No,Wraps,82.5,Pavel Fedosov,Павел Федосов,M,Russia,1991-08-12,Pro Open,78.55,170,180,-190,,180,140,150,-155,,150,210,227.5,-235,,227.5,557.5,SBD
1,No,Wraps,90,Vyacheslav Skrynnikov,Вячеслав Скрынников,M,Russia,1996-06-02,Pro Juniors 20-23,83,160,170,-177.5,,170,110,120,-125,,120,170,180,190,,190,480,SBD
1,No,Wraps,90,Sergey Khodunov,Сергей Ходунов,M,Russia,1968-10-23,Pro Masters 45-49,86.3,165,180,,,180,160,170,,,170,185,200,215,,215,565,SBD
1,No,Wraps,100,Pavel Bessonov,Павел Бессонов,M,Russia,1988-08-24,Pro Open,98.85,220,230,,,230,150,155,-160,,155,260,280,-282.5,,280,665,SBD
1,No,Wraps,110,Aleksandr Baskarev,Александр Баскарев,M,Russia,1981-04-04,Pro Open,108.15,275,292.5,305,,305,185,195,-205,,195,300,-320,-320,,300,800,SBD
1,No,Wraps,110,Artyom Taranov,Артём Таранов,M,Russia,1998-11-25,Pro Teen 18-19,102.45,125,135,145,,145,90,95,100,,100,160,175,185,,185,430,SBD
1,No,Wraps,140,Maksim Pogas,Максим Погас,M,Russia,1985-03-10,Pro Open,125.2,285,300,310,,310,225,-237.5,-237.5,,225,300,335,-350,,335,870,SBD
1,Yes,Raw,56,Lidiya Voronova,Лидия Воронова,F,Russia,1989-10-23,Amateur Open,55.6,,,,,,,,,,,110,120,-125,,120,120,D
1,Yes,Raw,125,Aleksey Barilko,Алексей Барилко,M,Russia,1979-09-06,Amateur Open,119.65,,,,,,,,,,,225,240,-250,,240,240,D
1,Yes,Unlimited,100,Dmitriy Boytsevskiy,Дмитрий Бойцевский,M,Russia,2003-06-16,Amateur Teen 14-15,90.85,150,-152.5,-162.5,,150,150,160,170,,170,150,170,180,,180,500,SBD
DQ,Yes,Unlimited,100,Maksim Bykov,Максим Быков,M,Abkhazia,1977-06-20,Amateur Masters 40-44,91.5,-210,-220,-220,,,-170,,,,,-220,,,,,,SBD
1,Yes,Unlimited,100,Vasiliy Zhilyakov,Василий Жиляков,M,Russia,1985-02-16,Amateur Open,99.8,190,205,-220,,205,230,240,250.5,,250.5,215,-230,,,215,670.5,SBD
1,Yes,Single-ply,52,Margarita Galaktionova,Маргарита Галактионова,F,Russia,1991-03-01,Amateur Open,52,,,,,,,,,,,150,160,165,-170,165,165,D
1,Yes,Single-ply,67.5,Elena Pecherskaya,Елена Печерская,F,Russia,1991-02-08,Amateur Open,66.6,,,,,,,,,,,150,-160,-160,,150,150,D
1,Yes,Single-ply,56,Yuliya Nikiforova,Юлия Никифорова,F,Russia,1997-09-23,Amateur Juniors 20-23,56,110,120,130,,130,60,-70,-70,,60,110,120,130,,130,320,SBD
1,Yes,Single-ply,82.5,Nikolay Tya,Николай Тя,M,Russia,2001-11-08,Amateur Teen 16-17,81.35,190,205,215,,215,95,105,115,,115,190,210,-222.5,,210,540,SBD
1,Yes,Multi-ply,67.5,Samvel Gabrielyan,Самвел Габриэлян,M,Russia,1989-05-04,Amateur Open,67.15,,,,,,,,,,,185,-202.5,-202.5,,185,185,D
1,No,Raw,125,Vladimir Poletaev,Владимир Полетаев,M,Russia,1972-10-19,Pro Masters 45-49,113.15,,,,,,,,,,,230,260,-280,,260,260,D
1,No,Unlimited,75,Marina Morozova,Марина Морозова,F,Russia,1978-10-09,Pro Open,74.85,-200,205,220,,220,140,155,165,,165,-195,195,-207.5,,195,580,SBD
1,No,Unlimited,90,Aleksey Krylovskiy,Алексей Крыловский,M,Russia,1986-01-01,Pro Open,89.95,200,-210,210,,210,190,200,-205,,200,210,220,-230,,220,630,SBD
1,No,Unlimited,100,Adir Barazani,Адир Баразани,M,Israel,1993-09-06,Pro Open,93.35,240,-250,-250,,240,-230,230,240,,240,240,-255,255,,255,735,SBD
1,No,Unlimited,110,Roman Makarov,Роман Макаров,M,Russia,1980-03-08,Pro Open,109.9,225,235,247.5,,247.5,-255,255,262.5,,262.5,230,245,,,245,755,SBD
1,No,Single-ply,100,Elshan Agaev,Эльшан Агаев,M,Azerbaijan,1983-07-18,Pro Open,94.55,250,265,-280,,265,,,,,,,,,,,265,S
1,No,Single-ply,100,Andrey Sizov,Андрей Сизов,M,Russia,1968-01-29,Pro Masters 50-54,97.9,,,,,,,,,,,280,300,312.5,,312.5,312.5,D
1,No,Single-ply,100,Elshan Agaev,Эльшан Агаев,M,Azerbaijan,1983-07-18,Pro Open,94.55,,,,,,,,,,,240,255,265,,265,265,D
1,No,Single-ply,75,Ivan Smorodin,Иван Смородин,M,Russia,1994-09-25,Pro Juniors 20-23,73.2,170,175,185,,185,155,165,-170,,165,200,-210,-210,,200,550,SBD
1,No,Multi-ply,100,Eldar Mammadov,Эльдар Маммадов,M,Azerbaijan,1978-08-14,Pro Open,100,310,330,-350,,330,250,-260,260,,260,260,280,-300,,280,870,SBD
1,No,Multi-ply,125,Mikhail Mikao,Михаил Микао,M,Russia,1985-07-29,Pro Open,124.15,390,405,,,405,300,-310,310,,310,260,270,-285,,270,985,SBD
1,Yes,Raw,52,Olga Golovataya,Ольга Головатая,F,Russia,1989-08-09,Amateur Open,52,,,,,,77.5,80,82.5,,82.5,,,,,,82.5,B
2,Yes,Raw,52,Olga Petrichenko,Ольга Петриченко,F,Russia,1985-12-21,Amateur Open,51.1,,,,,,-55,60,-65,,60,,,,,,60,B
3,Yes,Raw,52,Yuliya Melkonyants,Юлия Мелконянц,F,Russia,1990-03-17,Amateur Open,51.95,,,,,,52.5,55,-60,,55,,,,,,55,B
1,Yes,Raw,56,Irina Zharyonova,Ирина Жарёнова,F,Russia,1984-01-29,Amateur Open,55.9,,,,,,50,55,60,,60,,,,,,60,B
2,Yes,Raw,56,Elena Yudina,Елена Юдина,F,Russia,1985-05-03,Amateur Open,53.95,,,,,,45,47.5,-50,,47.5,,,,,,47.5,B
1,Yes,Raw,56,Vitaliya Spilnaya,Виталия Спильная,F,Russia,2004-02-13,Amateur Teen 14-15,53.85,,,,,,40,45,47.5,50,47.5,,,,,,47.5,B
1,Yes,Raw,67.5,Svetlana Shikhanova,Светлана Шиханова,F,Russia,1975-10-22,Amateur Masters 40-44,65.55,,,,,,50,52.5,-55,,52.5,,,,,,52.5,B
1,Yes,Raw,67.5,Darya Kovalenko,Дарья Коваленко,F,Russia,2002-09-13,Amateur Open,61.65,,,,,,85,90,-95,,90,,,,,,90,B
1,Yes,Raw,44,Pyotr Storozhenko,Пётр Стороженко,M,Abkhazia,2008-04-30,Amateur Teen 13,33.95,,,,,,27.5,-30,-30,,27.5,,,,,,27.5,B
1,Yes,Raw,60,David Pimurzin,Давид Пимурзин,M,Russia,2004-02-09,Amateur Teen 14-15,59.35,,,,,,60,-65,-65,,60,,,,,,60,B
1,Yes,Raw,67.5,Roman Krivtsev,Роман Кривцев,M,Russia,1978-04-10,Amateur Masters 40-44,66.8,,,,,,140,142.5,145,,145,,,,,,145,B
1,Yes,Raw,67.5,Vladimir Afonin,Владимир Афонин,M,Russia,1945-06-09,Amateur Masters 70-74,67.05,,,,,,85,90,-92.5,,90,,,,,,90,B
1,Yes,Raw,67.5,Yuriy Brodskiy,Юрий Бродский,M,Israel,1938-02-08,Amateur Masters 80+,66.9,,,,,,85,-87.5,87.5,,87.5,,,,,,87.5,B
1,Yes,Raw,67.5,Roman Krivtsev,Роман Кривцев,M,Russia,1978-04-10,Amateur Open,66.8,,,,,,140,142.5,145,,145,,,,,,145,B
2,Yes,Raw,67.5,Stanislav Kim,Станислав Ким,M,Russia,1991-12-06,Amateur Open,67.45,,,,,,105,-110,110,,110,,,,,,110,B
1,Yes,Raw,67.5,Aleksandr Khodunov,Александр Ходунов,M,Russia,2004-07-23,Amateur Teen 13,67.2,,,,,,70,75,80,,80,,,,,,80,B
1,Yes,Raw,67.5,Bogdan Pirogov,Богдан Пирогов,M,Russia,2002-02-18,Amateur Teen 16-17,66.35,,,,,,75,80,-85,,80,,,,,,80,B
1,Yes,Raw,75,Vladimir Vrinchan,Владимир Вринчан,M,Russia,1954-11-14,Amateur Masters 60-64,74.2,,,,,,100,107.5,110,,110,,,,,,110,B
1,Yes,Raw,75,Leonid Dvorkin,Леонид Дворкин,M,Russia,1941-01-23,Amateur Masters 75-79,74.7,,,,,,100,105.5,,,105.5,,,,,,105.5,B
1,Yes,Raw,75,Ramin Rzayev,Рамин Рзаев,M,Azerbaijan,1980-07-24,Amateur Open,74.2,,,,,,170,180,,,180,,,,,,180,B
2,Yes,Raw,75,Sergey Grigoryants,Сергей Григорьянц,M,Russia,1983-07-08,Amateur Open,74.5,,,,,,145,150,-155,,150,,,,,,150,B
3,Yes,Raw,75,Batraz Gagiev,Батраз Гагиев,M,Russia,1993-11-30,Amateur Open,74.05,,,,,,125,137.5,142.5,,142.5,,,,,,142.5,B
4,Yes,Raw,75,Artur Minasyan,Артур Минасян,M,Russia,1988-02-09,Amateur Open,72.5,,,,,,130,137.5,140,,140,,,,,,140,B
5,Yes,Raw,75,Grigoriy Rafaylidi,Григорий Рафайлиди,M,Russia,1979-11-25,Amateur Open,73.9,,,,,,110,125,130,,130,,,,,,130,B
6,Yes,Raw,75,Vladimir Martirosyan,Владимир Мартиросян,M,Russia,1987-05-14,Amateur Open,74.25,,,,,,125,-137.5,-137.5,,125,,,,,,125,B
1,Yes,Raw,75,Kirill Torosyan,Кирилл Торосьян,M,Russia,2002-04-14,Amateur Teen 16-17,68.35,,,,,,70,80,85,,85,,,,,,85,B
1,Yes,Raw,82.5,Georgiy Mikheev,Георгий Михеев,M,Russia,1996-01-12,Amateur Juniors 20-23,81.15,,,,,,150,160,165,,165,,,,,,165,B
1,Yes,Raw,82.5,Yuriy Gilman,Юрий Гильман,M,Russia,1951-10-09,Amateur Masters 65-69,80.7,,,,,,82.5,-87.5,87.5,,87.5,,,,,,87.5,B
1,Yes,Raw,82.5,Boris Morozov,Борис Морозов,M,Russia,1987-04-10,Amateur Open,82.3,,,,,,187.5,-192.5,-192.5,,187.5,,,,,,187.5,B
2,Yes,Raw,82.5,Dmitriy Pyzhov,Дмитрий Пыжов,M,Russia,1982-08-01,Amateur Open,82.05,,,,,,170,180,-190,,180,,,,,,180,B
3,Yes,Raw,82.5,Nikolay Storozhenko,Николай Стороженко,M,Abkhazia,1979-08-21,Amateur Open,81.9,,,,,,-150,150,-155,,150,,,,,,150,B
4,Yes,Raw,82.5,Andrey Shcherbak,Андрей Щербак,M,Russia,1987-08-07,Amateur Open,81.45,,,,,,130,140,-147.5,,140,,,,,,140,B
5,Yes,Raw,82.5,Vyacheslav Knutarev,Вячеслав Кнутарев,M,Russia,1978-10-05,Amateur Open,81.85,,,,,,130,135,-140,,135,,,,,,135,B
1,Yes,Raw,90,Aleksandr Safonov,Александр Сафонов,M,Russia,1976-02-18,Amateur Masters 40-44,89.05,,,,,,130,140,155,,155,,,,,,155,B
2,Yes,Raw,90,Sergey Gamov,Сергей Гамов,M,Russia,1974-12-22,Amateur Masters 40-44,89.5,,,,,,155,-162.5,-162.5,,155,,,,,,155,B
3,Yes,Raw,90,Maksim Tulikov,Максим Туликов,M,Russia,1977-06-26,Amateur Masters 40-44,86.45,,,,,,125,135,142.5,,142.5,,,,,,142.5,B
1,Yes,Raw,90,Yuriy Perov,Юрий Перов,M,Russia,1973-01-04,Amateur Masters 45-49,87.5,,,,,,160,165,170,,170,,,,,,170,B
1,Yes,Raw,90,Sergey Luzin,Сергей Лузин,M,Russia,1954-04-30,Amateur Masters 60-64,88.65,,,,,,110,120,-130,,120,,,,,,120,B
1,Yes,Raw,90,Andrey Shifanov,Андрей Шифанов,M,Russia,1982-12-09,Amateur Open,89.45,,,,,,175,185,195,,195,,,,,,195,B
2,Yes,Raw,90,Sergey Klimenko,Сергей Клименко,M,Russia,1989-09-01,Amateur Open,87.75,,,,,,170,180,182.5,,182.5,,,,,,182.5,B
3,Yes,Raw,90,Vasiliy Anisimov,Василий Анисимов,M,Russia,1982-12-15,Amateur Open,89.45,,,,,,175,180,-185,,180,,,,,,180,B
4,Yes,Raw,90,Fuad Mamedov,Фуад Мамедов,M,Russia,1987-02-01,Amateur Open,87.75,,,,,,150,160,-170,,160,,,,,,160,B
5,Yes,Raw,90,Anton Bitkov,Антон Битков,M,Russia,1984-05-26,Amateur Open,88.25,,,,,,150,155,160,,160,,,,,,160,B
6,Yes,Raw,90,Vladimir Senkin,Владимир Сенькин,M,Russia,1991-12-06,Amateur Open,88.75,,,,,,145,155,-160,,155,,,,,,155,B
7,Yes,Raw,90,Sergey Vasilkovskiy,Сергей Васильковский,M,Russia,1987-09-30,Amateur Open,88.25,,,,,,130,-135,135,,135,,,,,,135,B
1,Yes,Raw,100,Sergey Tsivilyov,Сергей Цивилёв,M,Russia,1976-12-23,Amateur Masters 40-44,96.35,,,,,,-145,150,-155,,150,,,,,,150,B
1,Yes,Raw,100,Aleksey Bezverbnyy,Алексей Безвербный,M,Russia,1973-03-18,Amateur Masters 45-49,95.65,,,,,,150,157.5,162.5,,162.5,,,,,,162.5,B
1,Yes,Raw,100,Valeriy Mikheev,Валерий Михеев,M,Russia,1965-04-27,Amateur Masters 50-54,97.2,,,,,,165,175,-180,,175,,,,,,175,B
1,Yes,Raw,100,Konstantin Yarinskiy,Константин Яринский,M,Russia,1948-12-17,Amateur Masters 65-69,99.25,,,,,,145,155,-160,160,155,,,,,,155,B
1,Yes,Raw,100,Stepan Sagirov,Степан Сагіров,M,Russia,1992-11-19,Amateur Open,98.9,,,,,,170,180,190,,190,,,,,,190,B
2,Yes,Raw,100,Aleksandr Kuznetsov #13,Александр Кузнецов,M,Russia,1996-11-18,Amateur Open,97.65,,,,,,165,175,185,,185,,,,,,185,B
3,Yes,Raw,100,Andrey Kirindyasov,Андрей Кириндясов,M,Russia,1988-03-20,Amateur Open,94.4,,,,,,160,175,182.5,,182.5,,,,,,182.5,B
4,Yes,Raw,100,Sergey Troshkin,Сергей Трошкин,M,Russia,1980-07-05,Amateur Open,93.55,,,,,,155,162.5,-167.5,,162.5,,,,,,162.5,B
5,Yes,Raw,100,Andrey Sudin,Андрей Судьин,M,Russia,1989-09-02,Amateur Open,97.55,,,,,,150,155,-162.5,,155,,,,,,155,B
6,Yes,Raw,100,Kirill Pirogov,Кирилл Пирогов,M,Russia,1979-06-27,Amateur Open,99.85,,,,,,155,-162.5,-162.5,,155,,,,,,155,B
1,Yes,Raw,100,Matvey Sidorov,Матвей Сидоров,M,Russia,2001-04-17,Amateur Teen 16-17,94.85,,,,,,145,150,155,-162.5,155,,,,,,155,B
2,Yes,Raw,100,Alen Akopyan,Ален Акопян,M,Abkhazia,2001-11-27,Amateur Teen 16-17,95.1,,,,,,90,-95,-95,,90,,,,,,90,B
1,Yes,Raw,110,Armen Agadzhanyan,Армен Агаджанян,M,Russia,1994-10-01,Amateur Juniors 20-23,108.1,,,,,,170,-180,,,170,,,,,,170,B
1,Yes,Raw,110,Georgiy Gnezdilo,Георгий Гнездило,M,Russia,1977-08-18,Amateur Masters 40-44,103.65,,,,,,165,170,172.5,,172.5,,,,,,172.5,B
2,Yes,Raw,110,Dmitriy Gladyshev,Дмитрий Гладышев,M,Russia,1974-08-02,Amateur Masters 40-44,108.85,,,,,,145,150,152.5,,152.5,,,,,,152.5,B
3,Yes,Raw,110,Yuriy Gnedenkov,Юрий Гнеденков,M,Russia,1978-01-13,Amateur Masters 40-44,103.3,,,,,,-120,120,-125,,120,,,,,,120,B
1,Yes,Raw,110,Aleksandr Loginov,Александр Логинов,M,Russia,1969-02-16,Amateur Masters 45-49,106.95,,,,,,-155,-155,155,,155,,,,,,155,B
1,Yes,Raw,110,Igor Eroshkin,Игорь Ерошкин,M,Russia,1965-12-14,Amateur Masters 50-54,105.75,,,,,,155,160,167.5,,167.5,,,,,,167.5,B
2,Yes,Raw,110,Sergey Kirichenko,Сергей Кириченко,M,Russia,1968-02-24,Amateur Masters 50-54,109.25,,,,,,157.5,162.5,-167.5,,162.5,,,,,,162.5,B
1,Yes,Raw,110,Mikhail Shigun,Михаил Шигун,M,Russia,1959-10-15,Amateur Masters 55-59,106.9,,,,,,130,140,-147.5,,140,,,,,,140,B
1,Yes,Raw,110,Aleksandr Poluektov,Александр Полуэктов,M,Russia,1957-02-03,Amateur Masters 60-64,104.05,,,,,,170,180,185,,185,,,,,,185,B
1,Yes,Raw,110,Dmitriy Voloshin,Дмитрий Волошин,M,Russia,1978-11-11,Amateur Open,109.5,,,,,,180,190,-200,,190,,,,,,190,B
2,Yes,Raw,110,Akop Mkrtchyan,Акоп Мкртчян,M,Russia,1987-03-23,Amateur Open,108.95,,,,,,-155,155,-167.5,,155,,,,,,155,B
3,Yes,Raw,110,Roman Kulakov,Роман Кулаков,M,Russia,1987-09-30,Amateur Open,109.9,,,,,,-147.5,147.5,-167.5,,147.5,,,,,,147.5,B
4,Yes,Raw,110,Evgeniy Sharaev,Евгений Шараев,M,Russia,1985-11-30,Amateur Open,108.8,,,,,,130,140,-147.5,,140,,,,,,140,B
1,Yes,Raw,125,Artyom Matveychuk,Артём Матвейчук,M,Russia,1996-02-22,Amateur Juniors 20-23,120.75,,,,,,190,-202.5,202.5,,202.5,,,,,,202.5,B
1,Yes,Raw,125,Vladimir Simonenko,Владимир Симоненко,M,Russia,1960-09-02,Amateur Masters 55-59,120,,,,,,50,100,,,100,,,,,,100,B
1,Yes,Raw,125,Artur Gulyan,Артур Гулян,M,Russia,1982-01-23,Amateur Open,116.85,,,,,,227.5,-235,235,,235,,,,,,235,B
2,Yes,Raw,125,Vitaliy Mordvinov,Виталий Мордвинов,M,Russia,1987-04-24,Amateur Open,123.5,,,,,,235,-245,-245,,235,,,,,,235,B
3,Yes,Raw,125,Igor Chernikov,Игорь Черников,M,Russia,1983-06-25,Amateur Open,122.75,,,,,,180,185,192.5,,192.5,,,,,,192.5,B
1,Yes,Raw,140,Anatoliy Panchenko #1,Анатолий Панченко,M,Russia,1973-11-07,Amateur Masters 40-44,134.45,,,,,,185,-200,-200,,185,,,,,,185,B
1,Yes,Raw,140,Kasym Ziyatdimov,Касым Зиятдимов,M,Russia,1963-07-14,Amateur Masters 50-54,136.9,,,,,,110,120,130,,130,,,,,,130,B
1,Yes,Raw,140,Dmitriy Rezaykin,Дмитрий Резайкин,M,Russia,1984-02-12,Amateur Open,132.75,,,,,,-215,215,-222.5,,215,,,,,,215,B
2,Yes,Raw,140,Mikhail Melikov,Михаил Меликов,M,Russia,1991-10-28,Amateur Open,133.4,,,,,,170,180,190,,190,,,,,,190,B
1,Yes,Raw,140+,Maksim Panov,Максим Панов,M,Russia,1981-05-30,Amateur Open,151.25,,,,,,205,212.5,215,,215,,,,,,215,B
1,No,Raw,67.5,Nina Mukhortova,Нина Мухортова,F,Russia,1966-09-16,Pro Masters 50-54,65.75,,,,,,90,-95,-95,,90,,,,,,90,B
1,No,Raw,67.5,Nina Mukhortova,Нина Мухортова,F,Russia,1966-09-16,Pro Open,65.75,,,,,,90,-95,-95,,90,,,,,,90,B
1,No,Raw,90,Elena Stadnik,Елена Стадник,F,Russia,1972-12-02,Pro Open,83.55,,,,,,-90,95,-105,,95,,,,,,95,B
1,No,Raw,52,Nikolay Zolotov,Николай Золотов,M,Russia,2000-03-05,Pro Teen 18-19,50.75,,,,,,30,35,40,,40,,,,,,40,B
1,No,Raw,56,Aleksandr Tanaev,Александр Танаев,M,Russia,2000-04-13,Pro Teen 18-19,52.1,,,,,,40,50,55,,55,,,,,,55,B
1,No,Raw,75,Sergey Zavarukhin,Сергей Заварухин,M,Russia,1973-11-03,Pro Masters 40-44,71,,,,,,90,100,110,,110,,,,,,110,B
1,No,Raw,75,Evgeniy Teplov,Евгений Теплов,M,Russia,1990-06-16,Pro Open,71.25,,,,,,100,-105,105,,105,,,,,,105,B
1,No,Raw,75,Artyom Loyko,Артём Лойко,M,Russia,2003-04-08,Pro Teen 14-15,71.75,,,,,,55,65,70,,70,,,,,,70,B
1,No,Raw,82.5,Gyunduz Ismailov,Гюндуз Исмаилов,M,Azerbaijan,1972-12-18,Pro Masters 45-49,82,,,,,,190,202.5,-210,,202.5,,,,,,202.5,B
1,No,Raw,82.5,Aleksandr Rabinovich,Александр Рабинович,M,Israel,1967-02-13,Pro Masters 50-54,79.1,,,,,,160,170,177.5,,177.5,,,,,,177.5,B
1,No,Raw,82.5,Aleksandr Papir,Александр Папир,M,Israel,1945-04-11,Pro Masters 70-74,81.7,,,,,,107.5,-110,,,107.5,,,,,,107.5,B
1,No,Raw,82.5,Gyunduz Ismailov,Гюндуз Исмаилов,M,Azerbaijan,1972-12-18,Pro Open,82,,,,,,190,202.5,-210,,202.5,,,,,,202.5,B
2,No,Raw,82.5,Stas Umarov,Стас Умаров,M,Russia,1986-09-12,Pro Open,80,,,,,,180,190,-192.5,,190,,,,,,190,B
3,No,Raw,82.5,Aleksandr Rabinovich,Александр Рабинович,M,Israel,1967-02-13,Pro Open,79.1,,,,,,160,170,177.5,,177.5,,,,,,177.5,B
1,No,Raw,90,Maksim Katunin,Максим Катунин,M,Russia,1994-10-23,Pro Juniors 20-23,83.7,,,,,,155,160,-170,,160,,,,,,160,B
1,No,Raw,90,Andrey Kryukov,Андрей Крюков,M,Russia,1969-05-08,Pro Masters 45-49,83.5,,,,,,160,165,170,,170,,,,,,170,B
1,No,Raw,90,Ivan Epanov,Іван Єпанов,M,Ukraine,1963-12-11,Pro Masters 50-54,87.2,,,,,,135,145,-160,,145,,,,,,145,B
1,No,Raw,90,Zoar Itsyk,Зоар Ицык,M,Israel,1961-07-13,Pro Masters 55-59,86,,,,,,167.5,175,-180,,175,,,,,,175,B
1,No,Raw,90,Sergey Luzin,Сергей Лузин,M,Russia,1954-04-30,Pro Masters 60-64,88.65,,,,,,110,120,125,,125,,,,,,125,B
1,No,Raw,90,Andrey Zharenov,Андрей Жаренов,M,Russia,1988-06-27,Pro Open,88.4,,,,,,210,215,217.5,,217.5,,,,,,217.5,B
2,No,Raw,90,Tigran Artyunov,Тигран Артюнов,M,Russia,1993-07-02,Pro Open,84.5,,,,,,200,210,-215,,210,,,,,,210,B
3,No,Raw,90,Vladimir Kunkaev,Владимир Кункаев,M,Russia,1982-06-11,Pro Open,87.95,,,,,,180,190,-200,,190,,,,,,190,B
4,No,Raw,90,Andrey Kryukov,Андрей Крюков,M,Russia,1969-05-08,Pro Open,83.5,,,,,,160,165,170,,170,,,,,,170,B
1,No,Raw,100,Stanislav Nagibin,Станислав Нагибин,M,Russia,1996-09-17,Pro Juniors 20-23,98.2,,,,,,185,195,200,,200,,,,,,200,B
2,No,Raw,100,Evgeniy Korotchenko,Евгений Коротченко,M,Russia,1996-04-03,Pro Juniors 20-23,97.6,,,,,,160,170,-175,,170,,,,,,170,B
1,No,Raw,100,Vladislav Morev,Владислав Морев,M,Russia,1976-04-08,Pro Masters 40-44,91.75,,,,,,160,167.5,-172.5,,167.5,,,,,,167.5,B
1,No,Raw,100,Gamlet Byazrov,Гамлет Бязров,M,Russia,1969-11-11,Pro Masters 45-49,100,,,,,,-175,175,180,,180,,,,,,180,B
1,No,Raw,100,Aslambek Abaev,Асламбек Абаев,M,Russia,1959-06-28,Pro Masters 55-59,98.9,,,,,,205,-212.5,,,205,,,,,,205,B
1,No,Raw,100,Aleksey Krivchikov,Алексей Кривчиков,M,Ukraine,1948-07-19,Pro Masters 65-69,96.1,,,,,,120,127.5,130,,130,,,,,,130,B
1,No,Raw,100,Aleksandr Zhukov,Александр Жуков,M,Russia,1983-03-13,Pro Open,100,,,,,,185,195,-202.5,,195,,,,,,195,B
2,No,Raw,100,Evgeniy Zub,Евгений Зуб,M,Russia,1987-07-03,Pro Open,99.3,,,,,,180,-192.5,-192.5,,180,,,,,,180,B
1,No,Raw,110,Sergey Polutin,Сергей Полутин,M,Russia,1975-08-17,Pro Masters 40-44,106.4,,,,,,210,220,222.5,,222.5,,,,,,222.5,B
1,No,Raw,110,Daniel Semyonov,Даниэль Семёнов,M,Russia,1992-05-27,Pro Open,103.9,,,,,,210,220,230,,230,,,,,,230,B
2,No,Raw,110,Sergey Polutin,Сергей Полутин,M,Russia,1975-08-17,Pro Open,106.4,,,,,,210,220,222.5,,222.5,,,,,,222.5,B
3,No,Raw,110,Andrey Bystryukov,Андрей Быстрюков,M,Russia,1980-07-14,Pro Open,109.15,,,,,,200,207.5,-212.5,,207.5,,,,,,207.5,B
4,No,Raw,110,Dmitriy Tyurin,Дмитрий Тюрин,M,Russia,1988-06-14,Pro Open,108.1,,,,,,185,195,200,,200,,,,,,200,B
5,No,Raw,110,Aleksandr Bakhmatov,Александр Бахматов,M,Russia,1985-01-27,Pro Open,103.15,,,,,,-170,170,185,,185,,,,,,185,B
6,No,Raw,110,Oleg Zotov,Олег Зотов,M,Russia,1985-01-18,Pro Open,104.9,,,,,,170,-175,-175,,170,,,,,,170,B
1,No,Raw,125,Bakhtiyar Abdulaev,Бахтияр Абдулаев,M,Azerbaijan,1981-07-24,Pro Open,112.3,,,,,,190,205,-215,,205,,,,,,205,B
1,No,Raw,140,Igor Dmitriev,Игорь Дмитриев,M,Russia,1973-11-18,Pro Masters 40-44,138,,,,,,230,242.5,,,242.5,,,,,,242.5,B
1,No,Raw,140,Igor Dmitriev,Игорь Дмитриев,M,Russia,1973-11-18,Pro Open,138,,,,,,230,242.5,,,242.5,,,,,,242.5,B
2,No,Raw,140,Nikolay Pyshmintsev,Николай Пышминцев,M,Russia,1981-01-04,Pro Open,131,,,,,,212.5,232.5,-250,,232.5,,,,,,232.5,B
1,No,Raw,140+,Mikhail Sidorychev,Михаил Сидорычев,M,Russia,1979-06-08,Pro Open,159,,,,,,230,-240,,,230,,,,,,230,B
1,Yes,Unlimited,52,Oksana Levenets,Оксана Левенец,F,Russia,1975-10-16,Amateur Masters 40-44,51.65,,,,,,67.5,72.5,-80,,72.5,,,,,,72.5,B
1,Yes,Unlimited,52,Olga Petrichenko,Ольга Петриченко,F,Russia,1985-12-21,Amateur Open,51.1,,,,,,85,-95,-95,,85,,,,,,85,B
2,Yes,Unlimited,52,Yuliya Volkovinskaya,Юлия Волковинская,F,Russia,1992-11-08,Amateur Open,51.8,,,,,,70,-80,82.5,,82.5,,,,,,82.5,B
3,Yes,Unlimited,52,Oksana Levenets,Оксана Левенец,F,Russia,1975-10-16,Amateur Open,51.65,,,,,,67.5,72.5,-80,,72.5,,,,,,72.5,B
1,Yes,Unlimited,67.5,Elena Pecherskaya,Елена Печерская,F,Russia,1991-02-08,Amateur Open,66.6,,,,,,80,-90,90,,90,,,,,,90,B
1,Yes,Unlimited,67.5,Darya Kovalenko,Дарья Коваленко,F,Russia,2002-09-13,Amateur Open,61.65,,,,,,-120,127.5,-135,,127.5,,,,,,127.5,B
1,Yes,Unlimited,67.5,Vladimir Blashchitsin,Владимир Блащицин,M,Russia,1985-11-13,Amateur Open,66.6,,,,,,-140,140,150,,150,,,,,,150,B
1,Yes,Unlimited,82.5,Aleksandr Papir,Александр Папир,M,Israel,1945-04-11,Amateur Masters 70-74,81.7,,,,,,140,150,-171,,150,,,,,,150,B
1,Yes,Unlimited,90,Aleksandr Safonov,Александр Сафонов,M,Russia,1976-02-18,Amateur Masters 40-44,89.05,,,,,,180,190,-210,,190,,,,,,190,B
1,Yes,Unlimited,90,Sergey Boldin,Сергей Болдин,M,Russia,1971-05-31,Amateur Masters 45-49,89.6,,,,,,175,185,200,,200,,,,,,200,B
1,Yes,Unlimited,90,Aleksey Zotov,Алексей Зотов,M,Russia,1986-07-05,Amateur Open,89.35,,,,,,-240,240,-255,,240,,,,,,240,B
2,Yes,Unlimited,90,Aleksandr Safonov,Александр Сафонов,M,Russia,1976-02-18,Amateur Open,89.05,,,,,,180,190,-210,,190,,,,,,190,B
1,Yes,Unlimited,100,Aleksandr Lyashenko,Александр Ляшенко,M,Russia,1977-01-22,Amateur Masters 40-44,97.45,,,,,,260,-275,-275,,260,,,,,,260,B
1,Yes,Unlimited,100,Aleksandr Lyashenko,Александр Ляшенко,M,Russia,1977-01-22,Amateur Open,97.45,,,,,,260,-275,-275,,260,,,,,,260,B
1,Yes,Unlimited,110,Andrey Maksimenko,Андрей Максименко,M,Russia,1972-10-03,Amateur Masters 45-49,103,,,,,,220,-230,,,220,,,,,,220,B
1,Yes,Unlimited,110,Andrey Maksimenko,Андрей Максименко,M,Russia,1972-10-03,Amateur Open,103,,,,,,220,-230,,,220,,,,,,220,B
1,Yes,Unlimited,125,Alexander Chekachkov,Александр Чекачков,M,Russia,1971-02-18,Amateur Masters 45-49,121.5,,,,,,260,280,-290,,280,,,,,,280,B
1,Yes,Unlimited,125,Vladimir Simonenko,Владимир Симоненко,M,Russia,1960-09-02,Amateur Masters 55-59,120,,,,,,160,180,200,-210,200,,,,,,200,B
1,Yes,Unlimited,125,Alexander Chekachkov,Александр Чекачков,M,Russia,1971-02-18,Amateur Open,121.5,,,,,,260,280,-290,,280,,,,,,280,B
1,Yes,Unlimited,90,Aleksandr Safonov,Александр Сафонов,M,Russia,1976-02-18,Amateur Masters 40-44,89.05,,,,,,210,225,230,,230,,,,,,230,B
1,Yes,Unlimited,90,Aleksandr Safonov,Александр Сафонов,M,Russia,1976-02-18,Amateur Open,89.05,,,,,,210,225,230,,230,,,,,,230,B
2,Yes,Unlimited,90,Artyom Lukyanov,Артём Лукьянов,M,Russia,1983-04-02,Amateur Open,88.35,,,,,,210,225,-240,,225,,,,,,225,B
1,Yes,Unlimited,100,Vyacheslav Nikolaev,Вячеслав Николаев,M,Russia,1956-07-10,Amateur Masters 60-64,97.45,,,,,,170,190,210,,210,,,,,,210,B
1,No,Unlimited,75,Marina Morozova,Марина Морозова,F,Russia,1978-10-09,Pro Open,74.85,,,,,,140,155,165,,165,,,,,,165,B
1,No,Unlimited,67.5,Roman Vorona,Роман Ворона,M,Russia,1995-06-29,Pro Open,67.35,,,,,,190,205,-225,-225,205,,,,,,205,B
2,No,Unlimited,67.5,Oleg Ivanyukov,Олег Иванюков,M,Israel,1980-08-16,Pro Open,67.35,,,,,,-175,175,-195,,175,,,,,,175,B
3,No,Unlimited,67.5,Denis Nikonov #1,Денис Ніконов,M,Russia,1992-09-21,Pro Open,62.75,,,,,,135,140,145,,145,,,,,,145,B
1,No,Unlimited,82.5,Aleksandr Rabinovich,Александр Рабинович,M,Israel,1967-02-13,Pro Masters 50-54,79.1,,,,,,215,227.5,235,,235,,,,,,235,B
1,No,Unlimited,82.5,Aleksandr Rabinovich,Александр Рабинович,M,Israel,1967-02-13,Pro Open,79.1,,,,,,215,227.5,235,,235,,,,,,235,B
1,No,Unlimited,90,Vitaliy Spilnyy,Виталий Спильный,M,Russia,1975-09-14,Pro Masters 40-44,85.3,,,,,,190,210,-222.5,,210,,,,,,210,B
1,No,Unlimited,90,Zoar Itsyk,Зоар Ицык,M,Israel,1961-07-13,Pro Masters 55-59,86,,,,,,215,226,232.5,,232.5,,,,,,232.5,B
1,No,Unlimited,100,Artyom Stasyuk,Артём Стасюк,M,Russia,1993-05-30,Pro Open,98.85,,,,,,305,-322.5,-322.5,,305,,,,,,305,B
2,No,Unlimited,100,Adir Barazani,Адир Баразани,M,Israel,1993-09-06,Pro Open,93.35,,,,,,-230,230,240,,240,,,,,,240,B
3,No,Unlimited,100,Aviad Zaga,Авиад Зага,M,Israel,1990-08-30,Pro Open,99.8,,,,,,-170,170,180,,180,,,,,,180,B
DQ,No,Unlimited,100,Aleksandr Zhukov,Александр Жуков,M,Russia,1983-03-13,Pro Open,100,,,,,,-270,-270,,,,,,,,,,B
1,No,Unlimited,110,Maksim Vlaskin,Максим Власкин,M,Russia,1987-12-11,Pro Open,108.5,,,,,,290,310,-320,,310,,,,,,310,B
2,No,Unlimited,110,Oleg Zhulinskiy,Олег Жулинский,M,Russia,1980-06-16,Pro Open,100.1,,,,,,280,-300,,,280,,,,,,280,B
3,No,Unlimited,110,Roman Makarov,Роман Макаров,M,Russia,1980-03-08,Pro Open,109.9,,,,,,-255,255,262.5,,262.5,,,,,,262.5,B
1,No,Unlimited,125,Denis Semenov,Денис Семенов,M,Russia,1974-04-27,Pro Masters 40-44,115.45,,,,,,240,250,,,250,,,,,,250,B
1,No,Unlimited,125,Zaur Jafarov,Заур Джафаров,M,Azerbaijan,1982-09-05,Pro Open,114.65,,,,,,250,260,,,260,,,,,,260,B
1,No,Unlimited,140,Famil Magaremov,Фамил Магаремов,M,Azerbaijan,1982-06-20,Pro Open,133.45,,,,,,190,200,,,200,,,,,,200,B
1,No,Unlimited,82.5,Aleksey Usmanov,Алексей Усманов,M,Russia,1973-02-27,Pro Masters 45-49,80.7,,,,,,215,-230,-230,,215,,,,,,215,B
1,No,Unlimited,90,Artem Bykhovets,Артем Быховец,M,Russia,1983-07-19,Pro Open,89.95,,,,,,295,-317.5,-333,,295,,,,,,295,B
1,No,Unlimited,110,Evgeniy Karyakin,Евгений Карякин,M,Russia,1979-01-17,Pro Open,107.8,,,,,,275,-300,-310,,275,,,,,,275,B
1,No,Unlimited,140,Nikolay Pyshmintsev,Николай Пышминцев,M,Russia,1971-01-01,Pro Open,131,,,,,,332.5,355,,,355,,,,,,355,B
2,No,Unlimited,140,Aleksandr Ballod,Александр Баллод,M,Russia,1979-08-17,Pro Open,139.3,,,,,,330,352.5,-360,,352.5,,,,,,352.5,B
1,Yes,Single-ply,60,Lenar Zaynutdinov,Ленар Зайнутдинов,M,Russia,1986-05-28,Amateur Open,59.5,,,,,,80,87.5,-92.5,,87.5,,,,,,87.5,B
1,Yes,Single-ply,82.5,Rishat Fattakhov,Ришат Фаттахов,M,Russia,1967-05-08,Amateur Masters 50-54,81.7,,,,,,-180,180,187.5,,187.5,,,,,,187.5,B
1,Yes,Multi-ply,60,Olesya Braslavets,Олеся Браславец,F,Russia,1981-02-03,Amateur Open,60,,,,,,90,95,-98,,95,,,,,,95,B
1,Yes,Multi-ply,90,Namig Dzhafarov,Намиг Джафаров,M,Azerbaijan,1976-08-27,Amateur Masters 40-44,88.6,,,,,,-200,200,-215,,200,,,,,,200,B
1,No,Single-ply,82.5,Azat Akhmetshin,Азат Ахметшин,M,Russia,1983-03-17,Pro Open,81.6,,,,,,90,100,-105,,100,,,,,,100,B
DQ,No,Single-ply,100,Teymur Nasirov,Теймур Насиров,M,Azerbaijan,1977-12-22,Pro Open,96.3,,,,,,-150,,,,,,,,,,,B
1,No,Single-ply,125,Zaur Jafarov,Заур Джафаров,M,Azerbaijan,1982-09-05,Pro Open,114.65,,,,,,240,250,272.5,,272.5,,,,,,272.5,B
1,No,Single-ply,140,Nikolay Pyshmintsev,Николай Пышминцев,M,Russia,1971-01-01,Pro Open,131,,,,,,300,320,-350,,320,,,,,,320,B
2,No,Single-ply,140,Famil Magaremov,Фамил Магаремов,M,Azerbaijan,1982-06-20,Pro Open,133.45,,,,,,190,200,-215,,200,,,,,,200,B
1,No,Multi-ply,90,Agshin İsmayilov,Агшин Исмаилов,M,Azerbaijan,1978-03-30,Pro Open,83.8,,,,,,245,260,-270,,260,,,,,,260,B
1,No,Multi-ply,100,Vagif Mammadov,Вагиф Маммедов,M,Azerbaijan,1972-10-27,Pro Masters 45-49,95.25,,,,,,-220,220,-270,,220,,,,,,220,B
1,No,Multi-ply,125,Aleksandr Manchenko,Александр Манченко,M,Russia,1978-11-05,Pro Open,122.55,,,,,,-280,280,-307.5,,280,,,,,,280,B
