%!PS-Adobe-3.0 EPSF-3.0
%%Creator: (MATLAB, The Mathworks, Inc. Version 9.5.0.944444 \(R2018b\). Operating System: Windows 10)
%%Title: C:/Users/navsas/Dropbox/compensationTest.eps
%%CreationDate: 2019-06-19T11:52:48
%%Pages: (atend)
%%BoundingBox: 0 0 625 260
%%LanguageLevel: 3
%%EndComments
%%BeginProlog
%%BeginResource: procset (Apache XML Graphics Std ProcSet) 1.2 0
%%Version: 1.2 0
%%Copyright: (Copyright 2001-2003,2010 The Apache Software Foundation. License terms: http://www.apache.org/licenses/LICENSE-2.0)
/bd{bind def}bind def
/ld{load def}bd
/GR/grestore ld
/GS/gsave ld
/RM/rmoveto ld
/C/curveto ld
/t/show ld
/L/lineto ld
/ML/setmiterlimit ld
/CT/concat ld
/f/fill ld
/N/newpath ld
/S/stroke ld
/CC/setcmykcolor ld
/A/ashow ld
/cp/closepath ld
/RC/setrgbcolor ld
/LJ/setlinejoin ld
/GC/setgray ld
/LW/setlinewidth ld
/M/moveto ld
/re {4 2 roll M
1 index 0 rlineto
0 exch rlineto
neg 0 rlineto
cp } bd
/_ctm matrix def
/_tm matrix def
/BT { _ctm currentmatrix pop matrix _tm copy pop 0 0 moveto } bd
/ET { _ctm setmatrix } bd
/iTm { _ctm setmatrix _tm concat } bd
/Tm { _tm astore pop iTm 0 0 moveto } bd
/ux 0.0 def
/uy 0.0 def
/F {
  /Tp exch def
  /Tf exch def
  Tf findfont Tp scalefont setfont
  /cf Tf def  /cs Tp def
} bd
/ULS {currentpoint /uy exch def /ux exch def} bd
/ULE {
  /Tcx currentpoint pop def
  gsave
  newpath
  cf findfont cs scalefont dup
  /FontMatrix get 0 get /Ts exch def /FontInfo get dup
  /UnderlinePosition get Ts mul /To exch def
  /UnderlineThickness get Ts mul /Tt exch def
  ux uy To add moveto  Tcx uy To add lineto
  Tt setlinewidth stroke
  grestore
} bd
/OLE {
  /Tcx currentpoint pop def
  gsave
  newpath
  cf findfont cs scalefont dup
  /FontMatrix get 0 get /Ts exch def /FontInfo get dup
  /UnderlinePosition get Ts mul /To exch def
  /UnderlineThickness get Ts mul /Tt exch def
  ux uy To add cs add moveto Tcx uy To add cs add lineto
  Tt setlinewidth stroke
  grestore
} bd
/SOE {
  /Tcx currentpoint pop def
  gsave
  newpath
  cf findfont cs scalefont dup
  /FontMatrix get 0 get /Ts exch def /FontInfo get dup
  /UnderlinePosition get Ts mul /To exch def
  /UnderlineThickness get Ts mul /Tt exch def
  ux uy To add cs 10 mul 26 idiv add moveto Tcx uy To add cs 10 mul 26 idiv add lineto
  Tt setlinewidth stroke
  grestore
} bd
/QT {
/Y22 exch store
/X22 exch store
/Y21 exch store
/X21 exch store
currentpoint
/Y21 load 2 mul add 3 div exch
/X21 load 2 mul add 3 div exch
/X21 load 2 mul /X22 load add 3 div
/Y21 load 2 mul /Y22 load add 3 div
/X22 load /Y22 load curveto
} bd
/SSPD {
dup length /d exch dict def
{
/v exch def
/k exch def
currentpagedevice k known {
/cpdv currentpagedevice k get def
v cpdv ne {
/upd false def
/nullv v type /nulltype eq def
/nullcpdv cpdv type /nulltype eq def
nullv nullcpdv or
{
/upd true def
} {
/sametype v type cpdv type eq def
sametype {
v type /arraytype eq {
/vlen v length def
/cpdvlen cpdv length def
vlen cpdvlen eq {
0 1 vlen 1 sub {
/i exch def
/obj v i get def
/cpdobj cpdv i get def
obj cpdobj ne {
/upd true def
exit
} if
} for
} {
/upd true def
} ifelse
} {
v type /dicttype eq {
v {
/dv exch def
/dk exch def
/cpddv cpdv dk get def
dv cpddv ne {
/upd true def
exit
} if
} forall
} {
/upd true def
} ifelse
} ifelse
} if
} ifelse
upd true eq {
d k v put
} if
} if
} if
} forall
d length 0 gt {
d setpagedevice
} if
} bd
/RE { % /NewFontName [NewEncodingArray] /FontName RE -
  findfont dup length dict begin
  {
    1 index /FID ne
    {def} {pop pop} ifelse
  } forall
  /Encoding exch def
  /FontName 1 index def
  currentdict definefont pop
  end
} bind def
%%EndResource
%%BeginResource: procset (Apache XML Graphics EPS ProcSet) 1.0 0
%%Version: 1.0 0
%%Copyright: (Copyright 2002-2003 The Apache Software Foundation. License terms: http://www.apache.org/licenses/LICENSE-2.0)
/BeginEPSF { %def
/b4_Inc_state save def         % Save state for cleanup
/dict_count countdictstack def % Count objects on dict stack
/op_count count 1 sub def      % Count objects on operand stack
userdict begin                 % Push userdict on dict stack
/showpage { } def              % Redefine showpage, { } = null proc
0 setgray 0 setlinecap         % Prepare graphics state
1 setlinewidth 0 setlinejoin
10 setmiterlimit [ ] 0 setdash newpath
/languagelevel where           % If level not equal to 1 then
{pop languagelevel             % set strokeadjust and
1 ne                           % overprint to their defaults.
{false setstrokeadjust false setoverprint
} if
} if
} bd
/EndEPSF { %def
count op_count sub {pop} repeat            % Clean up stacks
countdictstack dict_count sub {end} repeat
b4_Inc_state restore
} bd
%%EndResource
%FOPBeginFontDict
%%IncludeResource: font Courier-Oblique
%%IncludeResource: font Courier-BoldOblique
%%IncludeResource: font Courier-Bold
%%IncludeResource: font ZapfDingbats
%%IncludeResource: font Symbol
%%IncludeResource: font Helvetica
%%IncludeResource: font Helvetica-Oblique
%%IncludeResource: font Helvetica-Bold
%%IncludeResource: font Helvetica-BoldOblique
%%IncludeResource: font Times-Roman
%%IncludeResource: font Times-Italic
%%IncludeResource: font Times-Bold
%%IncludeResource: font Times-BoldItalic
%%IncludeResource: font Courier
%FOPEndFontDict
%%BeginResource: encoding WinAnsiEncoding
/WinAnsiEncoding [
/.notdef /.notdef /.notdef /.notdef /.notdef
/.notdef /.notdef /.notdef /.notdef /.notdef
/.notdef /.notdef /.notdef /.notdef /.notdef
/.notdef /.notdef /.notdef /.notdef /.notdef
/.notdef /.notdef /.notdef /.notdef /.notdef
/.notdef /.notdef /.notdef /.notdef /.notdef
/.notdef /.notdef /space /exclam /quotedbl
/numbersign /dollar /percent /ampersand /quotesingle
/parenleft /parenright /asterisk /plus /comma
/hyphen /period /slash /zero /one
/two /three /four /five /six
/seven /eight /nine /colon /semicolon
/less /equal /greater /question /at
/A /B /C /D /E
/F /G /H /I /J
/K /L /M /N /O
/P /Q /R /S /T
/U /V /W /X /Y
/Z /bracketleft /backslash /bracketright /asciicircum
/underscore /quoteleft /a /b /c
/d /e /f /g /h
/i /j /k /l /m
/n /o /p /q /r
/s /t /u /v /w
/x /y /z /braceleft /bar
/braceright /asciitilde /bullet /Euro /bullet
/quotesinglbase /florin /quotedblbase /ellipsis /dagger
/daggerdbl /circumflex /perthousand /Scaron /guilsinglleft
/OE /bullet /Zcaron /bullet /bullet
/quoteleft /quoteright /quotedblleft /quotedblright /bullet
/endash /emdash /asciitilde /trademark /scaron
/guilsinglright /oe /bullet /zcaron /Ydieresis
/space /exclamdown /cent /sterling /currency
/yen /brokenbar /section /dieresis /copyright
/ordfeminine /guillemotleft /logicalnot /sfthyphen /registered
/macron /degree /plusminus /twosuperior /threesuperior
/acute /mu /paragraph /middot /cedilla
/onesuperior /ordmasculine /guillemotright /onequarter /onehalf
/threequarters /questiondown /Agrave /Aacute /Acircumflex
/Atilde /Adieresis /Aring /AE /Ccedilla
/Egrave /Eacute /Ecircumflex /Edieresis /Igrave
/Iacute /Icircumflex /Idieresis /Eth /Ntilde
/Ograve /Oacute /Ocircumflex /Otilde /Odieresis
/multiply /Oslash /Ugrave /Uacute /Ucircumflex
/Udieresis /Yacute /Thorn /germandbls /agrave
/aacute /acircumflex /atilde /adieresis /aring
/ae /ccedilla /egrave /eacute /ecircumflex
/edieresis /igrave /iacute /icircumflex /idieresis
/eth /ntilde /ograve /oacute /ocircumflex
/otilde /odieresis /divide /oslash /ugrave
/uacute /ucircumflex /udieresis /yacute /thorn
/ydieresis
] def
%%EndResource
%FOPBeginFontReencode
/Courier-Oblique findfont
dup length dict begin
  {1 index /FID ne {def} {pop pop} ifelse} forall
  /Encoding WinAnsiEncoding def
  currentdict
end
/Courier-Oblique exch definefont pop
/Courier-BoldOblique findfont
dup length dict begin
  {1 index /FID ne {def} {pop pop} ifelse} forall
  /Encoding WinAnsiEncoding def
  currentdict
end
/Courier-BoldOblique exch definefont pop
/Courier-Bold findfont
dup length dict begin
  {1 index /FID ne {def} {pop pop} ifelse} forall
  /Encoding WinAnsiEncoding def
  currentdict
end
/Courier-Bold exch definefont pop
/Helvetica findfont
dup length dict begin
  {1 index /FID ne {def} {pop pop} ifelse} forall
  /Encoding WinAnsiEncoding def
  currentdict
end
/Helvetica exch definefont pop
/Helvetica-Oblique findfont
dup length dict begin
  {1 index /FID ne {def} {pop pop} ifelse} forall
  /Encoding WinAnsiEncoding def
  currentdict
end
/Helvetica-Oblique exch definefont pop
/Helvetica-Bold findfont
dup length dict begin
  {1 index /FID ne {def} {pop pop} ifelse} forall
  /Encoding WinAnsiEncoding def
  currentdict
end
/Helvetica-Bold exch definefont pop
/Helvetica-BoldOblique findfont
dup length dict begin
  {1 index /FID ne {def} {pop pop} ifelse} forall
  /Encoding WinAnsiEncoding def
  currentdict
end
/Helvetica-BoldOblique exch definefont pop
/Times-Roman findfont
dup length dict begin
  {1 index /FID ne {def} {pop pop} ifelse} forall
  /Encoding WinAnsiEncoding def
  currentdict
end
/Times-Roman exch definefont pop
/Times-Italic findfont
dup length dict begin
  {1 index /FID ne {def} {pop pop} ifelse} forall
  /Encoding WinAnsiEncoding def
  currentdict
end
/Times-Italic exch definefont pop
/Times-Bold findfont
dup length dict begin
  {1 index /FID ne {def} {pop pop} ifelse} forall
  /Encoding WinAnsiEncoding def
  currentdict
end
/Times-Bold exch definefont pop
/Times-BoldItalic findfont
dup length dict begin
  {1 index /FID ne {def} {pop pop} ifelse} forall
  /Encoding WinAnsiEncoding def
  currentdict
end
/Times-BoldItalic exch definefont pop
/Courier findfont
dup length dict begin
  {1 index /FID ne {def} {pop pop} ifelse} forall
  /Encoding WinAnsiEncoding def
  currentdict
end
/Courier exch definefont pop
%FOPEndFontReencode
%%EndProlog
%%Page: 1 1
%%PageBoundingBox: 0 0 625 260
%%BeginPageSetup
[1 0 0 -1 0 260] CT
%%EndPageSetup
GS
[0.75 0 0 0.75 0 0.5] CT
N
0 0 M
833 0 L
833 346 L
0 346 L
0 0 L
cp
clip
1 GC
N
0 0 833 346 re
f
GR
GS
[0.75 0 0 0.75 0 0.5] CT
1 GC
N
0 0 833 346 re
f
GR
GS
[0.75 0 0 0.75 0 0.5] CT
1 GC
N
108 277 M
754 277 L
754 26 L
108 26 L
cp
f
GR
GS
[0.75 0 0 0.75 0 0.5] CT
0.873 GC
1 LJ
0.667 LW
N
108 277 M
108 26 L
S
GR
GS
[0.75 0 0 0.75 0 0.5] CT
0.873 GC
1 LJ
0.667 LW
N
269.5 277 M
269.5 26 L
S
GR
GS
[0.75 0 0 0.75 0 0.5] CT
0.873 GC
1 LJ
0.667 LW
N
431 277 M
431 26 L
S
GR
GS
[0.75 0 0 0.75 0 0.5] CT
0.873 GC
1 LJ
0.667 LW
N
592.5 277 M
592.5 26 L
S
GR
GS
[0.75 0 0 0.75 0 0.5] CT
0.873 GC
1 LJ
0.667 LW
N
754 277 M
754 26 L
S
GR
GS
[0.75 0 0 0.75 0 0.5] CT
0.873 GC
1 LJ
0.667 LW
N
754 254.398 M
108 254.398 L
S
GR
GS
[0.75 0 0 0.75 0 0.5] CT
0.873 GC
1 LJ
0.667 LW
N
754 179.87 M
108 179.87 L
S
GR
GS
[0.75 0 0 0.75 0 0.5] CT
0.873 GC
1 LJ
0.667 LW
N
754 105.341 M
108 105.341 L
S
GR
GS
[0.75 0 0 0.75 0 0.5] CT
0.873 GC
1 LJ
0.667 LW
N
754 30.813 M
108 30.813 L
S
GR
GS
[0.75 0 0 0.75 0 0.5] CT
0.149 GC
2 setlinecap
1 LJ
0.667 LW
N
108 277 M
754 277 L
S
GR
GS
[0.75 0 0 0.75 0 0.5] CT
0.149 GC
2 setlinecap
1 LJ
0.667 LW
N
108 26 M
754 26 L
S
GR
GS
[0.75 0 0 0.75 0 0.5] CT
0.149 GC
2 setlinecap
1 LJ
0.667 LW
N
108 277 M
108 270.54 L
S
GR
GS
[0.75 0 0 0.75 0 0.5] CT
0.149 GC
2 setlinecap
1 LJ
0.667 LW
N
269.5 277 M
269.5 270.54 L
S
GR
GS
[0.75 0 0 0.75 0 0.5] CT
0.149 GC
2 setlinecap
1 LJ
0.667 LW
N
431 277 M
431 270.54 L
S
GR
GS
[0.75 0 0 0.75 0 0.5] CT
0.149 GC
2 setlinecap
1 LJ
0.667 LW
N
592.5 277 M
592.5 270.54 L
S
GR
GS
[0.75 0 0 0.75 0 0.5] CT
0.149 GC
2 setlinecap
1 LJ
0.667 LW
N
754 277 M
754 270.54 L
S
GR
GS
[0.75 0 0 0.75 0 0.5] CT
0.149 GC
2 setlinecap
1 LJ
0.667 LW
N
108 26 M
108 32.46 L
S
GR
GS
[0.75 0 0 0.75 0 0.5] CT
0.149 GC
2 setlinecap
1 LJ
0.667 LW
N
269.5 26 M
269.5 32.46 L
S
GR
GS
[0.75 0 0 0.75 0 0.5] CT
0.149 GC
2 setlinecap
1 LJ
0.667 LW
N
431 26 M
431 32.46 L
S
GR
GS
[0.75 0 0 0.75 0 0.5] CT
0.149 GC
2 setlinecap
1 LJ
0.667 LW
N
592.5 26 M
592.5 32.46 L
S
GR
GS
[0.75 0 0 0.75 0 0.5] CT
0.149 GC
2 setlinecap
1 LJ
0.667 LW
N
754 26 M
754 32.46 L
S
GR
GS
[0.75 0 0 0.75 81 213.85001] CT
0.149 GC
N
0 20.691 M
-2.938 20.691 -4 18.269 QT
-5.063 15.847 -5.063 12.504 QT
-5.063 10.426 -4.68 8.582 QT
-4.297 6.738 -3.164 5.457 QT
-2.031 4.176 0 4.176 QT
1.578 4.176 2.586 4.949 QT
3.594 5.722 4.125 6.949 QT
4.656 8.176 4.852 9.574 QT
5.047 10.972 5.047 12.504 QT
5.047 14.566 4.664 16.363 QT
4.281 18.16 3.164 19.426 QT
2.047 20.691 0 20.691 QT
cp
0 20.066 M
1.344 20.066 2 18.691 QT
2.656 17.316 2.805 15.652 QT
2.953 13.988 2.953 12.113 QT
2.953 10.316 2.805 8.793 QT
2.656 7.269 2 6.035 QT
1.344 4.801 0 4.801 QT
-1.359 4.801 -2.016 6.043 QT
-2.672 7.285 -2.82 8.801 QT
-2.969 10.316 -2.969 12.113 QT
-2.969 13.457 -2.906 14.636 QT
-2.844 15.816 -2.563 17.082 QT
-2.281 18.347 -1.656 19.207 QT
-1.031 20.066 0 20.066 QT
cp
f
GR
GS
[0.75 0 0 0.75 202.125 213.85001] CT
0.149 GC
N
-15.333 20.691 M
-18.271 20.691 -19.333 18.269 QT
-20.396 15.847 -20.396 12.504 QT
-20.396 10.426 -20.013 8.582 QT
-19.63 6.738 -18.497 5.457 QT
-17.365 4.176 -15.333 4.176 QT
-13.755 4.176 -12.747 4.949 QT
-11.74 5.722 -11.208 6.949 QT
-10.677 8.176 -10.482 9.574 QT
-10.287 10.972 -10.287 12.504 QT
-10.287 14.566 -10.669 16.363 QT
-11.052 18.16 -12.169 19.426 QT
-13.287 20.691 -15.333 20.691 QT
cp
-15.333 20.066 M
-13.99 20.066 -13.333 18.691 QT
-12.677 17.316 -12.529 15.652 QT
-12.38 13.988 -12.38 12.113 QT
-12.38 10.316 -12.529 8.793 QT
-12.677 7.269 -13.333 6.035 QT
-13.99 4.801 -15.333 4.801 QT
-16.693 4.801 -17.349 6.043 QT
-18.005 7.285 -18.154 8.801 QT
-18.302 10.316 -18.302 12.113 QT
-18.302 13.457 -18.24 14.636 QT
-18.177 15.816 -17.896 17.082 QT
-17.615 18.347 -16.99 19.207 QT
-16.365 20.066 -15.333 20.066 QT
cp
f
GR
GS
[0.75 0 0 0.75 202.125 213.85001] CT
0.149 GC
N
-7.318 18.832 M
-7.318 18.301 -6.919 17.91 QT
-6.521 17.519 -5.99 17.519 QT
-5.661 17.519 -5.349 17.699 QT
-5.036 17.879 -4.857 18.191 QT
-4.677 18.504 -4.677 18.832 QT
-4.677 19.363 -5.068 19.761 QT
-5.458 20.16 -5.99 20.16 QT
-6.521 20.16 -6.919 19.761 QT
-7.318 19.363 -7.318 18.832 QT
cp
f
GR
GS
[0.75 0 0 0.75 202.125 213.85001] CT
0.149 GC
N
-1.464 20.16 M
-1.464 19.519 L
-1.464 19.457 -1.417 19.379 QT
2.302 15.254 L
3.146 14.347 3.677 13.722 QT
4.208 13.097 4.724 12.293 QT
5.24 11.488 5.536 10.652 QT
5.833 9.816 5.833 8.879 QT
5.833 7.894 5.466 6.996 QT
5.099 6.097 4.38 5.558 QT
3.661 5.019 2.646 5.019 QT
1.599 5.019 0.771 5.644 QT
-0.057 6.269 -0.401 7.269 QT
-0.307 7.238 -0.151 7.238 QT
0.396 7.238 0.779 7.605 QT
1.161 7.972 1.161 8.551 QT
1.161 9.097 0.779 9.48 QT
0.396 9.863 -0.151 9.863 QT
-0.714 9.863 -1.089 9.465 QT
-1.464 9.066 -1.464 8.551 QT
-1.464 7.644 -1.128 6.855 QT
-0.792 6.066 -0.151 5.449 QT
0.49 4.832 1.294 4.504 QT
2.099 4.176 2.99 4.176 QT
4.365 4.176 5.552 4.754 QT
6.74 5.332 7.427 6.394 QT
8.115 7.457 8.115 8.879 QT
8.115 9.91 7.661 10.847 QT
7.208 11.785 6.49 12.558 QT
5.771 13.332 4.661 14.301 QT
3.552 15.269 3.193 15.597 QT
0.474 18.207 L
2.786 18.207 L
4.49 18.207 5.63 18.183 QT
6.771 18.16 6.833 18.097 QT
7.115 17.785 7.411 15.879 QT
8.115 15.879 L
7.443 20.16 L
-1.464 20.16 L
cp
f
GR
GS
[0.75 0 0 0.75 202.125 213.85001] CT
0.149 GC
N
11.427 17.426 M
11.661 18.129 12.177 18.707 QT
12.693 19.285 13.388 19.605 QT
14.083 19.926 14.833 19.926 QT
16.568 19.926 17.224 18.574 QT
17.88 17.222 17.88 15.301 QT
17.88 14.472 17.849 13.902 QT
17.818 13.332 17.693 12.816 QT
17.474 11.972 16.911 11.34 QT
16.349 10.707 15.552 10.707 QT
14.74 10.707 14.161 10.949 QT
13.583 11.191 13.216 11.519 QT
12.849 11.847 12.568 12.215 QT
12.286 12.582 12.224 12.597 QT
11.943 12.597 L
11.896 12.597 11.802 12.519 QT
11.708 12.441 11.708 12.379 QT
11.708 4.363 L
11.708 4.301 11.786 4.238 QT
11.865 4.176 11.943 4.176 QT
12.021 4.176 L
13.63 4.941 15.458 4.941 QT
17.24 4.941 18.88 4.176 QT
18.958 4.176 L
19.036 4.176 19.107 4.23 QT
19.177 4.285 19.177 4.363 QT
19.177 4.582 L
19.177 4.707 19.13 4.707 QT
18.318 5.785 17.076 6.394 QT
15.833 7.004 14.521 7.004 QT
13.552 7.004 12.552 6.738 QT
12.552 11.269 L
13.349 10.629 13.974 10.355 QT
14.599 10.082 15.568 10.082 QT
16.896 10.082 17.943 10.84 QT
18.99 11.597 19.552 12.824 QT
20.115 14.051 20.115 15.332 QT
20.115 16.769 19.404 18.004 QT
18.693 19.238 17.474 19.965 QT
16.255 20.691 14.833 20.691 QT
13.646 20.691 12.654 20.082 QT
11.661 19.472 11.099 18.441 QT
10.536 17.41 10.536 16.238 QT
10.536 15.707 10.888 15.363 QT
11.24 15.019 11.755 15.019 QT
12.286 15.019 12.646 15.371 QT
13.005 15.722 13.005 16.238 QT
13.005 16.754 12.646 17.113 QT
12.286 17.472 11.755 17.472 QT
11.677 17.472 11.576 17.457 QT
11.474 17.441 11.427 17.426 QT
cp
f
GR
GS
[0.75 0 0 0.75 323.25 213.85001] CT
0.149 GC
N
-9.333 20.691 M
-12.271 20.691 -13.333 18.269 QT
-14.396 15.847 -14.396 12.504 QT
-14.396 10.426 -14.013 8.582 QT
-13.63 6.738 -12.497 5.457 QT
-11.365 4.176 -9.333 4.176 QT
-7.755 4.176 -6.747 4.949 QT
-5.74 5.722 -5.208 6.949 QT
-4.677 8.176 -4.482 9.574 QT
-4.286 10.972 -4.286 12.504 QT
-4.286 14.566 -4.669 16.363 QT
-5.052 18.16 -6.169 19.426 QT
-7.286 20.691 -9.333 20.691 QT
cp
-9.333 20.066 M
-7.99 20.066 -7.333 18.691 QT
-6.677 17.316 -6.529 15.652 QT
-6.38 13.988 -6.38 12.113 QT
-6.38 10.316 -6.529 8.793 QT
-6.677 7.269 -7.333 6.035 QT
-7.99 4.801 -9.333 4.801 QT
-10.693 4.801 -11.349 6.043 QT
-12.005 7.285 -12.154 8.801 QT
-12.302 10.316 -12.302 12.113 QT
-12.302 13.457 -12.24 14.636 QT
-12.177 15.816 -11.896 17.082 QT
-11.615 18.347 -10.99 19.207 QT
-10.365 20.066 -9.333 20.066 QT
cp
f
GR
GS
[0.75 0 0 0.75 323.25 213.85001] CT
0.149 GC
N
-1.318 18.832 M
-1.318 18.301 -0.919 17.91 QT
-0.521 17.519 0.01 17.519 QT
0.339 17.519 0.651 17.699 QT
0.964 17.879 1.143 18.191 QT
1.323 18.504 1.323 18.832 QT
1.323 19.363 0.932 19.761 QT
0.542 20.16 0.01 20.16 QT
-0.521 20.16 -0.919 19.761 QT
-1.318 19.363 -1.318 18.832 QT
cp
f
GR
GS
[0.75 0 0 0.75 323.25 213.85001] CT
0.149 GC
N
5.427 17.426 M
5.661 18.129 6.177 18.707 QT
6.693 19.285 7.388 19.605 QT
8.083 19.926 8.833 19.926 QT
10.568 19.926 11.224 18.574 QT
11.88 17.222 11.88 15.301 QT
11.88 14.472 11.849 13.902 QT
11.818 13.332 11.693 12.816 QT
11.474 11.972 10.911 11.34 QT
10.349 10.707 9.552 10.707 QT
8.74 10.707 8.161 10.949 QT
7.583 11.191 7.216 11.519 QT
6.849 11.847 6.568 12.215 QT
6.286 12.582 6.224 12.597 QT
5.943 12.597 L
5.896 12.597 5.802 12.519 QT
5.708 12.441 5.708 12.379 QT
5.708 4.363 L
5.708 4.301 5.786 4.238 QT
5.865 4.176 5.943 4.176 QT
6.021 4.176 L
7.63 4.941 9.458 4.941 QT
11.24 4.941 12.88 4.176 QT
12.958 4.176 L
13.036 4.176 13.107 4.23 QT
13.177 4.285 13.177 4.363 QT
13.177 4.582 L
13.177 4.707 13.13 4.707 QT
12.318 5.785 11.076 6.394 QT
9.833 7.004 8.521 7.004 QT
7.552 7.004 6.552 6.738 QT
6.552 11.269 L
7.349 10.629 7.974 10.355 QT
8.599 10.082 9.568 10.082 QT
10.896 10.082 11.943 10.84 QT
12.99 11.597 13.552 12.824 QT
14.115 14.051 14.115 15.332 QT
14.115 16.769 13.404 18.004 QT
12.693 19.238 11.474 19.965 QT
10.255 20.691 8.833 20.691 QT
7.646 20.691 6.654 20.082 QT
5.661 19.472 5.099 18.441 QT
4.536 17.41 4.536 16.238 QT
4.536 15.707 4.888 15.363 QT
5.24 15.019 5.755 15.019 QT
6.286 15.019 6.646 15.371 QT
7.005 15.722 7.005 16.238 QT
7.005 16.754 6.646 17.113 QT
6.286 17.472 5.755 17.472 QT
5.677 17.472 5.576 17.457 QT
5.474 17.441 5.427 17.426 QT
cp
f
GR
GS
[0.75 0 0 0.75 444.375 213.85001] CT
0.149 GC
N
/f1704899820{-15.333 20.691 M
-18.271 20.691 -19.333 18.269 QT
-20.396 15.847 -20.396 12.504 QT
-20.396 10.426 -20.013 8.582 QT
-19.63 6.738 -18.497 5.457 QT
-17.365 4.176 -15.333 4.176 QT
-13.755 4.176 -12.747 4.949 QT
-11.74 5.722 -11.208 6.949 QT
-10.677 8.176 -10.482 9.574 QT
-10.287 10.972 -10.287 12.504 QT
-10.287 14.566 -10.669 16.363 QT
-11.052 18.16 -12.169 19.426 QT
-13.287 20.691 -15.333 20.691 QT
cp
-15.333 20.066 M
-13.99 20.066 -13.333 18.691 QT
-12.677 17.316 -12.529 15.652 QT
-12.38 13.988 -12.38 12.113 QT
-12.38 10.316 -12.529 8.793 QT
-12.677 7.269 -13.333 6.035 QT
-13.99 4.801 -15.333 4.801 QT
-16.693 4.801 -17.349 6.043 QT
-18.005 7.285 -18.154 8.801 QT
-18.302 10.316 -18.302 12.113 QT
-18.302 13.457 -18.24 14.636 QT
-18.177 15.816 -17.896 17.082 QT
-17.615 18.347 -16.99 19.207 QT
-16.365 20.066 -15.333 20.066 QT
cp}def
f1704899820
f
GR
GS
[0.75 0 0 0.75 444.375 213.85001] CT
0.149 GC
N
/f655638043{-7.318 18.832 M
-7.318 18.301 -6.919 17.91 QT
-6.521 17.519 -5.99 17.519 QT
-5.661 17.519 -5.349 17.699 QT
-5.036 17.879 -4.857 18.191 QT
-4.677 18.504 -4.677 18.832 QT
-4.677 19.363 -5.068 19.761 QT
-5.458 20.16 -5.99 20.16 QT
-6.521 20.16 -6.919 19.761 QT
-7.318 19.363 -7.318 18.832 QT
cp}def
f655638043
f
GR
GS
[0.75 0 0 0.75 444.375 213.85001] CT
0.149 GC
N
/f-368726618{1.505 19.535 M
1.505 18.207 1.74 16.926 QT
1.974 15.644 2.427 14.394 QT
2.88 13.144 3.521 11.949 QT
4.161 10.754 4.911 9.691 QT
7.115 6.644 L
4.365 6.644 L
0.099 6.644 -0.026 6.769 QT
-0.339 7.144 -0.62 8.972 QT
-1.323 8.972 L
-0.526 3.941 L
0.177 3.941 L
0.177 4.004 L
0.177 4.441 1.638 4.574 QT
3.099 4.707 4.505 4.707 QT
8.974 4.707 L
8.974 5.316 L
8.974 5.347 8.966 5.355 QT
8.958 5.363 8.943 5.394 QT
5.646 10.035 L
4.427 11.832 4.122 14.035 QT
3.818 16.238 3.818 19.535 QT
3.818 20.004 3.474 20.347 QT
3.13 20.691 2.661 20.691 QT
2.193 20.691 1.849 20.347 QT
1.505 20.004 1.505 19.535 QT
cp}def
f-368726618
f
GR
GS
[0.75 0 0 0.75 444.375 213.85001] CT
0.149 GC
N
/f-1966507566{11.427 17.426 M
11.661 18.129 12.177 18.707 QT
12.693 19.285 13.388 19.605 QT
14.083 19.926 14.833 19.926 QT
16.568 19.926 17.224 18.574 QT
17.88 17.222 17.88 15.301 QT
17.88 14.472 17.849 13.902 QT
17.818 13.332 17.693 12.816 QT
17.474 11.972 16.911 11.34 QT
16.349 10.707 15.552 10.707 QT
14.74 10.707 14.161 10.949 QT
13.583 11.191 13.216 11.519 QT
12.849 11.847 12.568 12.215 QT
12.286 12.582 12.224 12.597 QT
11.943 12.597 L
11.896 12.597 11.802 12.519 QT
11.708 12.441 11.708 12.379 QT
11.708 4.363 L
11.708 4.301 11.786 4.238 QT
11.865 4.176 11.943 4.176 QT
12.021 4.176 L
13.63 4.941 15.458 4.941 QT
17.24 4.941 18.88 4.176 QT
18.958 4.176 L
19.036 4.176 19.107 4.23 QT
19.177 4.285 19.177 4.363 QT
19.177 4.582 L
19.177 4.707 19.13 4.707 QT
18.318 5.785 17.076 6.394 QT
15.833 7.004 14.521 7.004 QT
13.552 7.004 12.552 6.738 QT
12.552 11.269 L
13.349 10.629 13.974 10.355 QT
14.599 10.082 15.568 10.082 QT
16.896 10.082 17.943 10.84 QT
18.99 11.597 19.552 12.824 QT
20.115 14.051 20.115 15.332 QT
20.115 16.769 19.404 18.004 QT
18.693 19.238 17.474 19.965 QT
16.255 20.691 14.833 20.691 QT
13.646 20.691 12.654 20.082 QT
11.661 19.472 11.099 18.441 QT
10.536 17.41 10.536 16.238 QT
10.536 15.707 10.888 15.363 QT
11.24 15.019 11.755 15.019 QT
12.286 15.019 12.646 15.371 QT
13.005 15.722 13.005 16.238 QT
13.005 16.754 12.646 17.113 QT
12.286 17.472 11.755 17.472 QT
11.677 17.472 11.576 17.457 QT
11.474 17.441 11.427 17.426 QT
cp}def
f-1966507566
f
GR
GS
[0.75 0 0 0.75 565.5 213.85001] CT
0.149 GC
N
/f1650868664{-3.766 20.16 M
-3.766 19.316 L
-0.766 19.316 -0.766 18.551 QT
-0.766 5.957 L
-2.016 6.551 -3.906 6.551 QT
-3.906 5.707 L
-0.969 5.707 0.531 4.176 QT
0.875 4.176 L
0.953 4.176 1.031 4.238 QT
1.109 4.301 1.109 4.379 QT
1.109 18.551 L
1.109 19.316 4.109 19.316 QT
4.109 20.16 L
-3.766 20.16 L
cp}def
f1650868664
f
GR
GS
[0.75 0 0 0.75 323.25023 236.45] CT
0.149 GC
N
/f7899353{-118.381 22.176 M
-118.381 21.254 L
-115.693 21.254 -115.693 20.442 QT
-115.693 6.16 L
-115.693 5.332 -118.381 5.332 QT
-118.381 4.41 L
-108.787 4.41 L
-107.021 4.41 -105.545 5.184 QT
-104.068 5.957 -103.029 7.238 QT
-101.99 8.52 -101.42 10.145 QT
-100.85 11.77 -100.85 13.473 QT
-100.85 15.113 -101.428 16.668 QT
-102.006 18.223 -103.076 19.473 QT
-104.146 20.723 -105.615 21.449 QT
-107.084 22.176 -108.787 22.176 QT
-118.381 22.176 L
cp
-113.365 20.442 M
-113.365 20.988 -113.045 21.121 QT
-112.725 21.254 -112.037 21.254 QT
-109.459 21.254 L
-108.131 21.254 -106.928 20.684 QT
-105.725 20.113 -104.943 19.082 QT
-104.115 17.988 -103.842 16.637 QT
-103.568 15.285 -103.568 13.473 QT
-103.568 11.582 -103.842 10.16 QT
-104.115 8.738 -104.943 7.613 QT
-105.725 6.504 -106.912 5.918 QT
-108.1 5.332 -109.459 5.332 QT
-112.037 5.332 L
-112.506 5.332 -112.771 5.371 QT
-113.037 5.41 -113.201 5.59 QT
-113.365 5.77 -113.365 6.16 QT
-113.365 20.442 L
cp}def
f7899353
f
GR
GS
[0.75 0 0 0.75 323.25023 236.45] CT
0.149 GC
N
/f-647613129{-92.574 22.473 M
-94.136 22.473 -95.472 21.676 QT
-96.808 20.879 -97.581 19.543 QT
-98.355 18.207 -98.355 16.645 QT
-98.355 15.442 -97.925 14.34 QT
-97.495 13.238 -96.706 12.371 QT
-95.917 11.504 -94.863 11.012 QT
-93.808 10.52 -92.574 10.52 QT
-90.98 10.52 -89.659 11.363 QT
-88.339 12.207 -87.581 13.621 QT
-86.824 15.035 -86.824 16.645 QT
-86.824 18.207 -87.597 19.543 QT
-88.37 20.879 -89.699 21.676 QT
-91.027 22.473 -92.574 22.473 QT
cp
-92.574 21.707 M
-90.495 21.707 -89.792 20.199 QT
-89.089 18.692 -89.089 16.348 QT
-89.089 15.035 -89.23 14.184 QT
-89.37 13.332 -89.839 12.629 QT
-90.136 12.192 -90.589 11.871 QT
-91.042 11.551 -91.542 11.379 QT
-92.042 11.207 -92.574 11.207 QT
-93.386 11.207 -94.113 11.574 QT
-94.839 11.942 -95.324 12.629 QT
-95.808 13.363 -95.941 14.246 QT
-96.074 15.129 -96.074 16.348 QT
-96.074 17.801 -95.824 18.965 QT
-95.574 20.129 -94.8 20.918 QT
-94.027 21.707 -92.574 21.707 QT
cp}def
f-647613129
f
GR
GS
[0.75 0 0 0.75 323.25023 236.45] CT
0.149 GC
N
/f475619469{-85.202 27.223 M
-85.202 26.317 L
-84.311 26.317 -83.741 26.16 QT
-83.17 26.004 -83.17 25.473 QT
-83.17 12.942 L
-83.17 12.238 -83.678 12.059 QT
-84.186 11.879 -85.202 11.879 QT
-85.202 10.973 L
-81.358 10.692 L
-81.358 12.301 L
-80.639 11.504 -79.694 11.098 QT
-78.749 10.692 -77.686 10.692 QT
-76.155 10.692 -74.92 11.52 QT
-73.686 12.348 -72.991 13.699 QT
-72.295 15.051 -72.295 16.567 QT
-72.295 18.145 -73.069 19.496 QT
-73.842 20.848 -75.17 21.66 QT
-76.499 22.473 -78.077 22.473 QT
-79.967 22.473 -81.28 20.926 QT
-81.28 25.473 L
-81.28 26.004 -80.702 26.16 QT
-80.124 26.317 -79.249 26.317 QT
-79.249 27.223 L
-85.202 27.223 L
cp
-81.28 19.645 M
-80.827 20.582 -80.014 21.184 QT
-79.202 21.785 -78.233 21.785 QT
-77.327 21.785 -76.639 21.301 QT
-75.952 20.817 -75.475 20.004 QT
-74.999 19.192 -74.78 18.293 QT
-74.561 17.395 -74.561 16.567 QT
-74.561 15.52 -74.936 14.309 QT
-75.311 13.098 -76.077 12.27 QT
-76.842 11.442 -77.936 11.442 QT
-78.999 11.442 -79.881 11.981 QT
-80.764 12.52 -81.28 13.442 QT
-81.28 19.645 L
cp}def
f475619469
f
GR
GS
[0.75 0 0 0.75 323.25023 236.45] CT
0.149 GC
N
/f-1663935951{-70.535 27.223 M
-70.535 26.317 L
-69.644 26.317 -69.074 26.16 QT
-68.504 26.004 -68.504 25.473 QT
-68.504 12.942 L
-68.504 12.238 -69.011 12.059 QT
-69.519 11.879 -70.535 11.879 QT
-70.535 10.973 L
-66.691 10.692 L
-66.691 12.301 L
-65.972 11.504 -65.027 11.098 QT
-64.082 10.692 -63.019 10.692 QT
-61.488 10.692 -60.254 11.52 QT
-59.019 12.348 -58.324 13.699 QT
-57.629 15.051 -57.629 16.567 QT
-57.629 18.145 -58.402 19.496 QT
-59.176 20.848 -60.504 21.66 QT
-61.832 22.473 -63.41 22.473 QT
-65.301 22.473 -66.613 20.926 QT
-66.613 25.473 L
-66.613 26.004 -66.035 26.16 QT
-65.457 26.317 -64.582 26.317 QT
-64.582 27.223 L
-70.535 27.223 L
cp
-66.613 19.645 M
-66.16 20.582 -65.347 21.184 QT
-64.535 21.785 -63.566 21.785 QT
-62.66 21.785 -61.972 21.301 QT
-61.285 20.817 -60.808 20.004 QT
-60.332 19.192 -60.113 18.293 QT
-59.894 17.395 -59.894 16.567 QT
-59.894 15.52 -60.269 14.309 QT
-60.644 13.098 -61.41 12.27 QT
-62.176 11.442 -63.269 11.442 QT
-64.332 11.442 -65.215 11.981 QT
-66.097 12.52 -66.613 13.442 QT
-66.613 19.645 L
cp}def
f-1663935951
f
GR
GS
[0.75 0 0 0.75 323.25023 236.45] CT
0.149 GC
N
/f-1265704946{-55.743 22.176 M
-55.743 21.254 L
-54.853 21.254 -54.282 21.121 QT
-53.712 20.988 -53.712 20.442 QT
-53.712 6.785 L
-53.712 6.098 -53.923 5.785 QT
-54.134 5.473 -54.524 5.402 QT
-54.915 5.332 -55.743 5.332 QT
-55.743 4.41 L
-51.884 4.129 L
-51.884 20.442 L
-51.884 20.988 -51.314 21.121 QT
-50.743 21.254 -49.868 21.254 QT
-49.868 22.176 L
-55.743 22.176 L
cp}def
f-1265704946
f
GR
GS
[0.75 0 0 0.75 323.25023 236.45] CT
0.149 GC
N
/f-1658267065{-42.738 22.473 M
-44.316 22.473 -45.644 21.637 QT
-46.972 20.801 -47.73 19.41 QT
-48.488 18.02 -48.488 16.473 QT
-48.488 14.957 -47.793 13.582 QT
-47.097 12.207 -45.863 11.363 QT
-44.629 10.52 -43.097 10.52 QT
-41.91 10.52 -41.027 10.918 QT
-40.144 11.317 -39.574 12.027 QT
-39.004 12.738 -38.707 13.707 QT
-38.41 14.676 -38.41 15.832 QT
-38.41 16.176 -38.675 16.176 QT
-46.207 16.176 L
-46.207 16.457 L
-46.207 18.613 -45.34 20.16 QT
-44.472 21.707 -42.504 21.707 QT
-41.707 21.707 -41.027 21.348 QT
-40.347 20.988 -39.847 20.356 QT
-39.347 19.723 -39.16 19.004 QT
-39.144 18.91 -39.074 18.84 QT
-39.004 18.77 -38.91 18.77 QT
-38.675 18.77 L
-38.41 18.77 -38.41 19.098 QT
-38.785 20.582 -40.004 21.527 QT
-41.222 22.473 -42.738 22.473 QT
cp
-46.191 15.52 M
-40.254 15.52 L
-40.254 14.551 -40.527 13.543 QT
-40.8 12.535 -41.433 11.871 QT
-42.066 11.207 -43.097 11.207 QT
-44.566 11.207 -45.379 12.582 QT
-46.191 13.957 -46.191 15.52 QT
cp}def
f-1658267065
f
GR
GS
[0.75 0 0 0.75 323.25023 236.45] CT
0.149 GC
N
/f-983295817{-36.802 22.176 M
-36.802 21.254 L
-35.911 21.254 -35.341 21.121 QT
-34.77 20.988 -34.77 20.442 QT
-34.77 13.332 L
-34.77 12.645 -34.981 12.332 QT
-35.192 12.02 -35.583 11.949 QT
-35.973 11.879 -36.802 11.879 QT
-36.802 10.973 L
-33.083 10.692 L
-33.083 13.223 L
-32.661 12.098 -31.887 11.395 QT
-31.114 10.692 -30.005 10.692 QT
-29.239 10.692 -28.63 11.145 QT
-28.02 11.598 -28.02 12.348 QT
-28.02 12.817 -28.356 13.168 QT
-28.692 13.52 -29.177 13.52 QT
-29.661 13.52 -30.005 13.176 QT
-30.348 12.832 -30.348 12.348 QT
-30.348 11.645 -29.848 11.363 QT
-30.005 11.363 L
-31.067 11.363 -31.731 12.121 QT
-32.395 12.879 -32.677 14.012 QT
-32.958 15.145 -32.958 16.176 QT
-32.958 20.442 L
-32.958 21.254 -30.427 21.254 QT
-30.427 22.176 L
-36.802 22.176 L
cp}def
f-983295817
f
GR
GS
[0.75 0 0 0.75 323.25023 236.45] CT
0.149 GC
N
/f2097000096{-16.88 22.551 M
-16.88 16.473 L
-16.88 16.27 -16.646 16.27 QT
-16.333 16.27 L
-16.255 16.27 -16.193 16.332 QT
-16.13 16.395 -16.13 16.473 QT
-16.13 19.02 -14.544 20.426 QT
-12.958 21.832 -10.396 21.832 QT
-9.49 21.832 -8.732 21.309 QT
-7.974 20.785 -7.552 19.942 QT
-7.13 19.098 -7.13 18.207 QT
-7.13 17.41 -7.443 16.668 QT
-7.755 15.926 -8.357 15.379 QT
-8.958 14.832 -9.693 14.66 QT
-13.083 13.832 L
-14.755 13.395 -15.818 12.012 QT
-16.88 10.629 -16.88 8.926 QT
-16.88 7.582 -16.193 6.395 QT
-15.505 5.207 -14.341 4.527 QT
-13.177 3.848 -11.833 3.848 QT
-9.224 3.848 -7.693 5.613 QT
-6.63 3.926 L
-6.552 3.848 -6.443 3.848 QT
-6.271 3.848 L
-6.193 3.848 -6.122 3.902 QT
-6.052 3.957 -6.052 4.067 QT
-6.052 10.082 L
-6.052 10.317 -6.271 10.317 QT
-6.583 10.317 L
-6.818 10.317 -6.818 10.082 QT
-6.818 9.426 -7.037 8.637 QT
-7.255 7.848 -7.654 7.129 QT
-8.052 6.41 -8.505 5.957 QT
-9.771 4.676 -11.833 4.676 QT
-12.724 4.676 -13.474 5.129 QT
-14.224 5.582 -14.669 6.356 QT
-15.115 7.129 -15.115 7.988 QT
-15.115 9.098 -14.419 10.004 QT
-13.724 10.91 -12.615 11.207 QT
-9.224 12.035 L
-8.396 12.238 -7.654 12.762 QT
-6.912 13.285 -6.412 13.988 QT
-5.912 14.692 -5.638 15.543 QT
-5.365 16.395 -5.365 17.317 QT
-5.365 18.723 -6.005 19.973 QT
-6.646 21.223 -7.826 21.988 QT
-9.005 22.754 -10.396 22.754 QT
-11.255 22.754 -12.162 22.559 QT
-13.068 22.363 -13.826 21.973 QT
-14.583 21.582 -15.208 20.957 QT
-16.302 22.676 L
-16.38 22.754 -16.49 22.754 QT
-16.646 22.754 L
-16.88 22.754 -16.88 22.551 QT
cp}def
f2097000096
f
GR
GS
[0.75 0 0 0.75 323.25023 236.45] CT
0.149 GC
N
/f-2009674526{-2.885 22.176 M
-2.885 21.254 L
-2.01 21.254 -1.432 21.121 QT
-0.854 20.988 -0.854 20.442 QT
-0.854 6.785 L
-0.854 6.098 -1.065 5.785 QT
-1.276 5.473 -1.675 5.402 QT
-2.073 5.332 -2.885 5.332 QT
-2.885 4.41 L
0.974 4.129 L
0.974 13.067 L
1.521 11.988 2.497 11.34 QT
3.474 10.692 4.646 10.692 QT
6.458 10.692 7.365 11.551 QT
8.271 12.41 8.271 14.192 QT
8.271 20.442 L
8.271 20.988 8.841 21.121 QT
9.411 21.254 10.302 21.254 QT
10.302 22.176 L
4.349 22.176 L
4.349 21.254 L
5.24 21.254 5.81 21.121 QT
6.38 20.988 6.38 20.442 QT
6.38 14.27 L
6.38 13.004 6.013 12.184 QT
5.646 11.363 4.49 11.363 QT
2.99 11.363 2.013 12.567 QT
1.036 13.77 1.036 15.301 QT
1.036 20.442 L
1.036 20.988 1.615 21.121 QT
2.193 21.254 3.068 21.254 QT
3.068 22.176 L
-2.885 22.176 L
cp}def
f-2009674526
f
GR
GS
[0.75 0 0 0.75 323.25023 236.45] CT
0.149 GC
N
/f850576898{11.797 22.176 M
11.797 21.254 L
12.688 21.254 13.258 21.121 QT
13.828 20.988 13.828 20.442 QT
13.828 13.332 L
13.828 12.332 13.445 12.106 QT
13.063 11.879 11.922 11.879 QT
11.922 10.973 L
15.656 10.692 L
15.656 20.442 L
15.656 20.988 16.156 21.121 QT
16.656 21.254 17.469 21.254 QT
17.469 22.176 L
11.797 22.176 L
cp
12.906 6.223 M
12.906 5.645 13.336 5.215 QT
13.766 4.785 14.328 4.785 QT
14.688 4.785 15.031 4.973 QT
15.375 5.16 15.57 5.504 QT
15.766 5.848 15.766 6.223 QT
15.766 6.77 15.328 7.207 QT
14.891 7.645 14.328 7.645 QT
13.766 7.645 13.336 7.207 QT
12.906 6.77 12.906 6.223 QT
cp}def
f850576898
f
GR
GS
[0.75 0 0 0.75 323.25023 236.45] CT
0.149 GC
N
/f1575932539{19.177 22.176 M
19.177 21.254 L
20.052 21.254 20.622 21.121 QT
21.193 20.988 21.193 20.442 QT
21.193 11.879 L
19.193 11.879 L
19.193 10.973 L
21.193 10.973 L
21.193 7.848 L
21.193 7.02 21.544 6.285 QT
21.896 5.551 22.482 5.012 QT
23.068 4.473 23.833 4.16 QT
24.599 3.848 25.427 3.848 QT
26.302 3.848 27.005 4.363 QT
27.708 4.879 27.708 5.754 QT
27.708 6.238 27.372 6.574 QT
27.036 6.91 26.552 6.91 QT
26.052 6.91 25.701 6.574 QT
25.349 6.238 25.349 5.754 QT
25.349 4.942 26.052 4.66 QT
25.63 4.52 25.302 4.52 QT
24.536 4.52 23.997 5.059 QT
23.458 5.598 23.193 6.371 QT
22.927 7.145 22.927 7.91 QT
22.927 10.973 L
25.927 10.973 L
25.927 11.879 L
23.021 11.879 L
23.021 20.442 L
23.021 20.973 23.779 21.113 QT
24.536 21.254 25.536 21.254 QT
25.536 22.176 L
19.177 22.176 L
cp}def
f1575932539
f
GR
GS
[0.75 0 0 0.75 323.25023 236.45] CT
0.149 GC
N
/f1349297940{29.056 19.051 M
29.056 11.879 L
26.9 11.879 L
26.9 11.207 L
28.603 11.207 29.4 9.621 QT
30.197 8.035 30.197 6.176 QT
30.947 6.176 L
30.947 10.973 L
34.619 10.973 L
34.619 11.879 L
30.947 11.879 L
30.947 19.004 L
30.947 20.082 31.306 20.895 QT
31.666 21.707 32.603 21.707 QT
33.494 21.707 33.892 20.848 QT
34.291 19.988 34.291 19.004 QT
34.291 17.473 L
35.041 17.473 L
35.041 19.051 L
35.041 19.863 34.736 20.66 QT
34.431 21.457 33.853 21.965 QT
33.275 22.473 32.431 22.473 QT
30.869 22.473 29.963 21.535 QT
29.056 20.598 29.056 19.051 QT
cp}def
f1349297940
f
GR
GS
[0.75 0 0 0.75 323.25023 236.45] CT
0.149 GC
N
/f997020404{46.264 22.176 M
46.264 21.254 L
48.951 21.254 48.951 20.442 QT
48.951 6.16 L
48.951 5.332 46.264 5.332 QT
46.264 4.41 L
60.607 4.41 L
61.326 10.363 L
60.576 10.363 L
60.404 8.738 60.1 7.785 QT
59.795 6.832 59.225 6.293 QT
58.654 5.754 57.701 5.543 QT
56.748 5.332 55.061 5.332 QT
52.686 5.332 L
52.217 5.332 51.959 5.371 QT
51.701 5.41 51.537 5.59 QT
51.373 5.77 51.373 6.16 QT
51.373 12.848 L
53.217 12.848 L
54.545 12.848 55.17 12.613 QT
55.795 12.379 56.029 11.754 QT
56.264 11.129 56.264 9.801 QT
57.014 9.801 L
57.014 16.785 L
56.264 16.785 L
56.264 15.457 56.029 14.84 QT
55.795 14.223 55.17 13.981 QT
54.545 13.738 53.217 13.738 QT
51.373 13.738 L
51.373 20.442 L
51.373 21.254 54.701 21.254 QT
54.701 22.176 L
46.264 22.176 L
cp}def
f997020404
f
GR
GS
[0.75 0 0 0.75 323.25023 236.45] CT
0.149 GC
N
/f-1521127789{61.547 19.629 M
61.547 18.082 62.766 17.106 QT
63.985 16.129 65.688 15.731 QT
67.391 15.332 68.938 15.332 QT
68.938 14.27 L
68.938 13.52 68.602 12.817 QT
68.266 12.113 67.649 11.66 QT
67.031 11.207 66.281 11.207 QT
64.547 11.207 63.656 11.988 QT
64.141 11.988 64.469 12.356 QT
64.797 12.723 64.797 13.223 QT
64.797 13.738 64.43 14.113 QT
64.063 14.488 63.547 14.488 QT
63.031 14.488 62.664 14.113 QT
62.297 13.738 62.297 13.223 QT
62.297 11.848 63.539 11.184 QT
64.781 10.52 66.281 10.52 QT
67.328 10.52 68.399 10.973 QT
69.469 11.426 70.149 12.262 QT
70.828 13.098 70.828 14.223 QT
70.828 20.067 L
70.828 20.582 71.039 21.004 QT
71.25 21.426 71.703 21.426 QT
72.141 21.426 72.352 20.996 QT
72.563 20.567 72.563 20.067 QT
72.563 18.41 L
73.328 18.41 L
73.328 20.067 L
73.328 20.645 73.024 21.176 QT
72.719 21.707 72.203 22.02 QT
71.688 22.332 71.094 22.332 QT
70.328 22.332 69.774 21.738 QT
69.219 21.145 69.156 20.332 QT
68.672 21.317 67.735 21.895 QT
66.797 22.473 65.735 22.473 QT
64.735 22.473 63.781 22.176 QT
62.828 21.879 62.188 21.254 QT
61.547 20.629 61.547 19.629 QT
cp
63.656 19.629 M
63.656 20.535 64.328 21.16 QT
65 21.785 65.906 21.785 QT
66.75 21.785 67.438 21.363 QT
68.125 20.942 68.531 20.223 QT
68.938 19.504 68.938 18.692 QT
68.938 15.988 L
67.75 15.988 66.516 16.379 QT
65.281 16.77 64.469 17.59 QT
63.656 18.41 63.656 19.629 QT
cp}def
f-1521127789
f
GR
GS
[0.75 0 0 0.75 323.25023 236.45] CT
0.149 GC
N
/f-339559459{80.169 22.473 M
78.606 22.473 77.325 21.652 QT
76.044 20.832 75.302 19.465 QT
74.56 18.098 74.56 16.567 QT
74.56 15.035 75.294 13.621 QT
76.028 12.207 77.317 11.363 QT
78.606 10.52 80.169 10.52 QT
81.7 10.52 82.95 11.113 QT
84.2 11.707 84.2 13.067 QT
84.2 13.582 83.841 13.957 QT
83.481 14.332 82.95 14.332 QT
82.435 14.332 82.075 13.957 QT
81.716 13.582 81.716 13.067 QT
81.716 12.613 82.005 12.277 QT
82.294 11.942 82.731 11.848 QT
81.825 11.285 80.2 11.285 QT
78.95 11.285 78.192 12.106 QT
77.435 12.926 77.13 14.145 QT
76.825 15.363 76.825 16.567 QT
76.825 17.817 77.2 18.996 QT
77.575 20.176 78.403 20.942 QT
79.231 21.707 80.497 21.707 QT
81.731 21.707 82.591 20.949 QT
83.45 20.192 83.763 18.973 QT
83.763 18.817 83.966 18.817 QT
84.294 18.817 L
84.372 18.817 84.435 18.887 QT
84.497 18.957 84.497 19.051 QT
84.497 19.129 L
84.091 20.66 82.927 21.567 QT
81.763 22.473 80.169 22.473 QT
cp}def
f-339559459
f
GR
GS
[0.75 0 0 0.75 323.25023 236.45] CT
0.149 GC
N
/f1024191412{88.09 19.051 M
88.09 11.879 L
85.934 11.879 L
85.934 11.207 L
87.637 11.207 88.434 9.621 QT
89.23 8.035 89.23 6.176 QT
89.98 6.176 L
89.98 10.973 L
93.652 10.973 L
93.652 11.879 L
89.98 11.879 L
89.98 19.004 L
89.98 20.082 90.34 20.895 QT
90.699 21.707 91.637 21.707 QT
92.527 21.707 92.926 20.848 QT
93.324 19.988 93.324 19.004 QT
93.324 17.473 L
94.074 17.473 L
94.074 19.051 L
94.074 19.863 93.769 20.66 QT
93.465 21.457 92.887 21.965 QT
92.309 22.473 91.465 22.473 QT
89.902 22.473 88.996 21.535 QT
88.09 20.598 88.09 19.051 QT
cp}def
f1024191412
f
GR
GS
[0.75 0 0 0.75 323.25023 236.45] CT
0.149 GC
N
/f-353464579{102.2 22.473 M
100.638 22.473 99.302 21.676 QT
97.966 20.879 97.192 19.543 QT
96.419 18.207 96.419 16.645 QT
96.419 15.442 96.849 14.34 QT
97.278 13.238 98.067 12.371 QT
98.856 11.504 99.911 11.012 QT
100.966 10.52 102.2 10.52 QT
103.794 10.52 105.114 11.363 QT
106.435 12.207 107.192 13.621 QT
107.95 15.035 107.95 16.645 QT
107.95 18.207 107.177 19.543 QT
106.403 20.879 105.075 21.676 QT
103.747 22.473 102.2 22.473 QT
cp
102.2 21.707 M
104.278 21.707 104.981 20.199 QT
105.685 18.692 105.685 16.348 QT
105.685 15.035 105.544 14.184 QT
105.403 13.332 104.935 12.629 QT
104.638 12.192 104.185 11.871 QT
103.731 11.551 103.231 11.379 QT
102.731 11.207 102.2 11.207 QT
101.388 11.207 100.661 11.574 QT
99.935 11.942 99.45 12.629 QT
98.966 13.363 98.833 14.246 QT
98.7 15.129 98.7 16.348 QT
98.7 17.801 98.95 18.965 QT
99.2 20.129 99.974 20.918 QT
100.747 21.707 102.2 21.707 QT
cp}def
f-353464579
f
GR
GS
[0.75 0 0 0.75 323.25023 236.45] CT
0.149 GC
N
/f-646874540{109.572 22.176 M
109.572 21.254 L
110.463 21.254 111.033 21.121 QT
111.603 20.988 111.603 20.442 QT
111.603 13.332 L
111.603 12.645 111.392 12.332 QT
111.181 12.02 110.791 11.949 QT
110.4 11.879 109.572 11.879 QT
109.572 10.973 L
113.291 10.692 L
113.291 13.223 L
113.713 12.098 114.486 11.395 QT
115.26 10.692 116.369 10.692 QT
117.135 10.692 117.744 11.145 QT
118.353 11.598 118.353 12.348 QT
118.353 12.817 118.017 13.168 QT
117.681 13.52 117.197 13.52 QT
116.713 13.52 116.369 13.176 QT
116.025 12.832 116.025 12.348 QT
116.025 11.645 116.525 11.363 QT
116.369 11.363 L
115.306 11.363 114.642 12.121 QT
113.978 12.879 113.697 14.012 QT
113.416 15.145 113.416 16.176 QT
113.416 20.442 L
113.416 21.254 115.947 21.254 QT
115.947 22.176 L
109.572 22.176 L
cp}def
f-646874540
f
GR
GS
[0.75 0 0 0.75 0 0.5] CT
0.149 GC
2 setlinecap
1 LJ
0.667 LW
N
108 277 M
108 26 L
S
GR
GS
[0.75 0 0 0.75 0 0.5] CT
0.149 GC
2 setlinecap
1 LJ
0.667 LW
N
754 277 M
754 26 L
S
GR
GS
[0.75 0 0 0.75 0 0.5] CT
0.149 GC
2 setlinecap
1 LJ
0.667 LW
N
108 254.398 M
114.46 254.398 L
S
GR
GS
[0.75 0 0 0.75 0 0.5] CT
0.149 GC
2 setlinecap
1 LJ
0.667 LW
N
108 179.87 M
114.46 179.87 L
S
GR
GS
[0.75 0 0 0.75 0 0.5] CT
0.149 GC
2 setlinecap
1 LJ
0.667 LW
N
108 105.341 M
114.46 105.341 L
S
GR
GS
[0.75 0 0 0.75 0 0.5] CT
0.149 GC
2 setlinecap
1 LJ
0.667 LW
N
108 30.813 M
114.46 30.813 L
S
GR
GS
[0.75 0 0 0.75 0 0.5] CT
0.149 GC
2 setlinecap
1 LJ
0.667 LW
N
754 254.398 M
747.54 254.398 L
S
GR
GS
[0.75 0 0 0.75 0 0.5] CT
0.149 GC
2 setlinecap
1 LJ
0.667 LW
N
754 179.87 M
747.54 179.87 L
S
GR
GS
[0.75 0 0 0.75 0 0.5] CT
0.149 GC
2 setlinecap
1 LJ
0.667 LW
N
754 105.341 M
747.54 105.341 L
S
GR
GS
[0.75 0 0 0.75 0 0.5] CT
0.149 GC
2 setlinecap
1 LJ
0.667 LW
N
754 30.813 M
747.54 30.813 L
S
GR
GS
[0.75 0 0 0.75 75.4 191.29881] CT
0.149 GC
N
/f1579298569{-21.766 5.76 M
-21.766 4.916 L
-18.766 4.916 -18.766 4.151 QT
-18.766 -8.443 L
-20.016 -7.849 -21.906 -7.849 QT
-21.906 -8.693 L
-18.969 -8.693 -17.469 -10.224 QT
-17.125 -10.224 L
-17.047 -10.224 -16.969 -10.162 QT
-16.891 -10.099 -16.891 -10.021 QT
-16.891 4.151 L
-16.891 4.916 -13.891 4.916 QT
-13.891 5.76 L
-21.766 5.76 L
cp}def
f1579298569
f
GR
GS
[0.75 0 0 0.75 75.4 191.29881] CT
0.149 GC
N
/f1219663315{-6 6.291 M
-8.938 6.291 -10 3.869 QT
-11.063 1.447 -11.063 -1.896 QT
-11.063 -3.974 -10.68 -5.818 QT
-10.297 -7.662 -9.164 -8.943 QT
-8.031 -10.224 -6 -10.224 QT
-4.422 -10.224 -3.414 -9.451 QT
-2.406 -8.678 -1.875 -7.451 QT
-1.344 -6.224 -1.148 -4.826 QT
-0.953 -3.428 -0.953 -1.896 QT
-0.953 0.166 -1.336 1.963 QT
-1.719 3.76 -2.836 5.026 QT
-3.953 6.291 -6 6.291 QT
cp
-6 5.666 M
-4.656 5.666 -4 4.291 QT
-3.344 2.916 -3.195 1.252 QT
-3.047 -0.412 -3.047 -2.287 QT
-3.047 -4.084 -3.195 -5.607 QT
-3.344 -7.131 -4 -8.365 QT
-4.656 -9.599 -6 -9.599 QT
-7.359 -9.599 -8.016 -8.357 QT
-8.672 -7.115 -8.82 -5.599 QT
-8.969 -4.084 -8.969 -2.287 QT
-8.969 -0.943 -8.906 0.236 QT
-8.844 1.416 -8.563 2.682 QT
-8.281 3.947 -7.656 4.807 QT
-7.031 5.666 -6 5.666 QT
cp}def
f1219663315
f
GR
GS
[0.75 0 0 0.75 75.4 135.4024] CT
0.149 GC
N
f1579298569
f
GR
GS
[0.75 0 0 0.75 75.4 135.4024] CT
0.149 GC
N
/f429638810{-9.906 3.026 M
-9.672 3.729 -9.156 4.307 QT
-8.641 4.885 -7.945 5.205 QT
-7.25 5.526 -6.5 5.526 QT
-4.766 5.526 -4.109 4.174 QT
-3.453 2.822 -3.453 0.901 QT
-3.453 0.072 -3.484 -0.498 QT
-3.516 -1.068 -3.641 -1.584 QT
-3.859 -2.428 -4.422 -3.06 QT
-4.984 -3.693 -5.781 -3.693 QT
-6.594 -3.693 -7.172 -3.451 QT
-7.75 -3.209 -8.117 -2.881 QT
-8.484 -2.553 -8.766 -2.185 QT
-9.047 -1.818 -9.109 -1.803 QT
-9.391 -1.803 L
-9.438 -1.803 -9.531 -1.881 QT
-9.625 -1.959 -9.625 -2.021 QT
-9.625 -10.037 L
-9.625 -10.099 -9.547 -10.162 QT
-9.469 -10.224 -9.391 -10.224 QT
-9.313 -10.224 L
-7.703 -9.459 -5.875 -9.459 QT
-4.094 -9.459 -2.453 -10.224 QT
-2.375 -10.224 L
-2.297 -10.224 -2.227 -10.17 QT
-2.156 -10.115 -2.156 -10.037 QT
-2.156 -9.818 L
-2.156 -9.693 -2.203 -9.693 QT
-3.016 -8.615 -4.258 -8.006 QT
-5.5 -7.396 -6.813 -7.396 QT
-7.781 -7.396 -8.781 -7.662 QT
-8.781 -3.131 L
-7.984 -3.771 -7.359 -4.045 QT
-6.734 -4.318 -5.766 -4.318 QT
-4.438 -4.318 -3.391 -3.56 QT
-2.344 -2.803 -1.781 -1.576 QT
-1.219 -0.349 -1.219 0.932 QT
-1.219 2.369 -1.93 3.604 QT
-2.641 4.838 -3.859 5.565 QT
-5.078 6.291 -6.5 6.291 QT
-7.688 6.291 -8.68 5.682 QT
-9.672 5.072 -10.234 4.041 QT
-10.797 3.01 -10.797 1.838 QT
-10.797 1.307 -10.445 0.963 QT
-10.094 0.619 -9.578 0.619 QT
-9.047 0.619 -8.688 0.971 QT
-8.328 1.322 -8.328 1.838 QT
-8.328 2.354 -8.688 2.713 QT
-9.047 3.072 -9.578 3.072 QT
-9.656 3.072 -9.758 3.057 QT
-9.859 3.041 -9.906 3.026 QT
cp}def
f429638810
f
GR
GS
[0.75 0 0 0.75 75.4 79.50602] CT
0.149 GC
N
/f1975841261{-22.797 5.76 M
-22.797 5.119 L
-22.797 5.057 -22.75 4.979 QT
-19.031 0.854 L
-18.188 -0.053 -17.656 -0.678 QT
-17.125 -1.303 -16.609 -2.107 QT
-16.094 -2.912 -15.797 -3.748 QT
-15.5 -4.584 -15.5 -5.521 QT
-15.5 -6.506 -15.867 -7.404 QT
-16.234 -8.303 -16.953 -8.842 QT
-17.672 -9.381 -18.688 -9.381 QT
-19.734 -9.381 -20.563 -8.756 QT
-21.391 -8.131 -21.734 -7.131 QT
-21.641 -7.162 -21.484 -7.162 QT
-20.938 -7.162 -20.555 -6.795 QT
-20.172 -6.428 -20.172 -5.849 QT
-20.172 -5.303 -20.555 -4.92 QT
-20.938 -4.537 -21.484 -4.537 QT
-22.047 -4.537 -22.422 -4.935 QT
-22.797 -5.334 -22.797 -5.849 QT
-22.797 -6.756 -22.461 -7.545 QT
-22.125 -8.334 -21.484 -8.951 QT
-20.844 -9.568 -20.039 -9.896 QT
-19.234 -10.224 -18.344 -10.224 QT
-16.969 -10.224 -15.781 -9.646 QT
-14.594 -9.068 -13.906 -8.006 QT
-13.219 -6.943 -13.219 -5.521 QT
-13.219 -4.49 -13.672 -3.553 QT
-14.125 -2.615 -14.844 -1.842 QT
-15.563 -1.068 -16.672 -0.099 QT
-17.781 0.869 -18.141 1.197 QT
-20.859 3.807 L
-18.547 3.807 L
-16.844 3.807 -15.703 3.783 QT
-14.563 3.76 -14.5 3.697 QT
-14.219 3.385 -13.922 1.479 QT
-13.219 1.479 L
-13.891 5.76 L
-22.797 5.76 L
cp}def
f1975841261
f
GR
GS
[0.75 0 0 0.75 75.4 79.50602] CT
0.149 GC
N
f1219663315
f
GR
GS
[0.75 0 0 0.75 75.4 23.60962] CT
0.149 GC
N
f1975841261
f
GR
GS
[0.75 0 0 0.75 75.4 23.60962] CT
0.149 GC
N
f429638810
f
GR
GS
[0 -0.75 0.75 0 54.39995 114.12492] CT
0.149 GC
N
/f-1298620967{-92.138 -9.504 M
-92.138 -10.426 L
-89.466 -10.426 -89.466 -11.957 QT
-89.466 -25.52 L
-89.466 -26.348 -92.138 -26.348 QT
-92.138 -27.27 L
-87.232 -27.27 L
-86.92 -27.27 -86.81 -26.973 QT
-81.154 -12.254 L
-75.482 -26.973 L
-75.388 -27.27 -75.076 -27.27 QT
-70.154 -27.27 L
-70.154 -26.348 L
-72.841 -26.348 -72.841 -25.52 QT
-72.841 -11.238 L
-72.841 -10.426 -70.154 -10.426 QT
-70.154 -9.504 L
-77.716 -9.504 L
-77.716 -10.426 L
-75.045 -10.426 -75.045 -11.238 QT
-75.045 -26.379 L
-81.451 -9.801 L
-81.56 -9.504 -81.873 -9.504 QT
-82.201 -9.504 -82.326 -9.801 QT
-88.638 -26.176 L
-88.638 -11.957 L
-88.638 -10.426 -85.966 -10.426 QT
-85.966 -9.504 L
-92.138 -9.504 L
cp}def
f-1298620967
f
GR
GS
[0 -0.75 0.75 0 54.39995 114.12492] CT
0.149 GC
N
/f1817266228{-62.391 -9.207 M
-63.969 -9.207 -65.298 -10.043 QT
-66.626 -10.879 -67.384 -12.27 QT
-68.141 -13.66 -68.141 -15.207 QT
-68.141 -16.723 -67.446 -18.098 QT
-66.751 -19.473 -65.516 -20.317 QT
-64.282 -21.16 -62.751 -21.16 QT
-61.563 -21.16 -60.68 -20.762 QT
-59.798 -20.363 -59.227 -19.653 QT
-58.657 -18.942 -58.36 -17.973 QT
-58.063 -17.004 -58.063 -15.848 QT
-58.063 -15.504 -58.329 -15.504 QT
-65.86 -15.504 L
-65.86 -15.223 L
-65.86 -13.067 -64.993 -11.52 QT
-64.126 -9.973 -62.157 -9.973 QT
-61.36 -9.973 -60.68 -10.332 QT
-60.001 -10.692 -59.501 -11.324 QT
-59.001 -11.957 -58.813 -12.676 QT
-58.798 -12.77 -58.727 -12.84 QT
-58.657 -12.91 -58.563 -12.91 QT
-58.329 -12.91 L
-58.063 -12.91 -58.063 -12.582 QT
-58.438 -11.098 -59.657 -10.153 QT
-60.876 -9.207 -62.391 -9.207 QT
cp
-65.844 -16.16 M
-59.907 -16.16 L
-59.907 -17.129 -60.18 -18.137 QT
-60.454 -19.145 -61.087 -19.809 QT
-61.719 -20.473 -62.751 -20.473 QT
-64.219 -20.473 -65.032 -19.098 QT
-65.844 -17.723 -65.844 -16.16 QT
cp}def
f1817266228
f
GR
GS
[0 -0.75 0.75 0 54.39995 114.12492] CT
0.149 GC
N
/f-1815360130{-56.08 -12.051 M
-56.08 -13.598 -54.861 -14.574 QT
-53.642 -15.551 -51.939 -15.949 QT
-50.236 -16.348 -48.689 -16.348 QT
-48.689 -17.41 L
-48.689 -18.16 -49.025 -18.863 QT
-49.361 -19.567 -49.978 -20.02 QT
-50.596 -20.473 -51.346 -20.473 QT
-53.08 -20.473 -53.971 -19.692 QT
-53.486 -19.692 -53.158 -19.324 QT
-52.83 -18.957 -52.83 -18.457 QT
-52.83 -17.942 -53.197 -17.567 QT
-53.564 -17.192 -54.08 -17.192 QT
-54.596 -17.192 -54.963 -17.567 QT
-55.33 -17.942 -55.33 -18.457 QT
-55.33 -19.832 -54.088 -20.496 QT
-52.846 -21.16 -51.346 -21.16 QT
-50.299 -21.16 -49.228 -20.707 QT
-48.158 -20.254 -47.478 -19.418 QT
-46.799 -18.582 -46.799 -17.457 QT
-46.799 -11.613 L
-46.799 -11.098 -46.588 -10.676 QT
-46.377 -10.254 -45.924 -10.254 QT
-45.486 -10.254 -45.275 -10.684 QT
-45.064 -11.113 -45.064 -11.613 QT
-45.064 -13.27 L
-44.299 -13.27 L
-44.299 -11.613 L
-44.299 -11.035 -44.603 -10.504 QT
-44.908 -9.973 -45.424 -9.66 QT
-45.939 -9.348 -46.533 -9.348 QT
-47.299 -9.348 -47.853 -9.942 QT
-48.408 -10.535 -48.471 -11.348 QT
-48.955 -10.363 -49.892 -9.785 QT
-50.83 -9.207 -51.892 -9.207 QT
-52.892 -9.207 -53.846 -9.504 QT
-54.799 -9.801 -55.439 -10.426 QT
-56.08 -11.051 -56.08 -12.051 QT
cp
-53.971 -12.051 M
-53.971 -11.145 -53.299 -10.52 QT
-52.627 -9.895 -51.721 -9.895 QT
-50.877 -9.895 -50.189 -10.317 QT
-49.502 -10.738 -49.096 -11.457 QT
-48.689 -12.176 -48.689 -12.988 QT
-48.689 -15.692 L
-49.877 -15.692 -51.111 -15.301 QT
-52.346 -14.91 -53.158 -14.09 QT
-53.971 -13.27 -53.971 -12.051 QT
cp}def
f-1815360130
f
GR
GS
[0 -0.75 0.75 0 54.39995 114.12492] CT
0.149 GC
N
/f-146741431{-43.145 -9.504 M
-43.145 -10.426 L
-42.27 -10.426 -41.692 -10.559 QT
-41.114 -10.692 -41.114 -11.238 QT
-41.114 -18.348 L
-41.114 -19.035 -41.325 -19.348 QT
-41.536 -19.66 -41.935 -19.731 QT
-42.333 -19.801 -43.145 -19.801 QT
-43.145 -20.707 L
-39.38 -20.988 L
-39.38 -18.457 L
-38.864 -19.567 -37.841 -20.278 QT
-36.817 -20.988 -35.614 -20.988 QT
-33.802 -20.988 -32.895 -20.129 QT
-31.989 -19.27 -31.989 -17.488 QT
-31.989 -11.238 L
-31.989 -10.692 -31.419 -10.559 QT
-30.849 -10.426 -29.958 -10.426 QT
-29.958 -9.504 L
-35.911 -9.504 L
-35.911 -10.426 L
-35.02 -10.426 -34.45 -10.559 QT
-33.88 -10.692 -33.88 -11.238 QT
-33.88 -17.41 L
-33.88 -18.676 -34.247 -19.496 QT
-34.614 -20.317 -35.77 -20.317 QT
-37.27 -20.317 -38.247 -19.113 QT
-39.224 -17.91 -39.224 -16.379 QT
-39.224 -11.238 L
-39.224 -10.692 -38.645 -10.559 QT
-38.067 -10.426 -37.192 -10.426 QT
-37.192 -9.504 L
-43.145 -9.504 L
cp}def
f-146741431
f
GR
GS
[0 -0.75 0.75 0 54.39995 114.12492] CT
0.149 GC
N
/f-707551934{-19.663 -9.504 M
-19.663 -10.426 L
-16.976 -10.426 -16.976 -11.238 QT
-16.976 -25.52 L
-16.976 -26.348 -19.663 -26.348 QT
-19.663 -27.27 L
-4.96 -27.27 L
-4.241 -21.317 L
-4.991 -21.317 L
-5.257 -23.551 -5.765 -24.567 QT
-6.273 -25.582 -7.374 -25.965 QT
-8.476 -26.348 -10.679 -26.348 QT
-13.241 -26.348 L
-13.71 -26.348 -13.968 -26.309 QT
-14.226 -26.27 -14.39 -26.09 QT
-14.554 -25.91 -14.554 -25.52 QT
-14.554 -19.176 L
-12.632 -19.176 L
-11.319 -19.176 -10.663 -19.403 QT
-10.007 -19.629 -9.765 -20.254 QT
-9.523 -20.879 -9.523 -22.207 QT
-8.757 -22.207 L
-8.757 -15.223 L
-9.523 -15.223 L
-9.523 -16.551 -9.765 -17.184 QT
-10.007 -17.817 -10.663 -18.043 QT
-11.319 -18.27 -12.632 -18.27 QT
-14.554 -18.27 L
-14.554 -11.238 L
-14.554 -10.692 -14.241 -10.559 QT
-13.929 -10.426 -13.241 -10.426 QT
-10.476 -10.426 L
-8.679 -10.426 -7.569 -10.707 QT
-6.46 -10.988 -5.843 -11.653 QT
-5.226 -12.317 -4.89 -13.379 QT
-4.554 -14.442 -4.257 -16.317 QT
-3.507 -16.317 L
-4.601 -9.504 L
-19.663 -9.504 L
cp}def
f-707551934
f
GR
GS
[0 -0.75 0.75 0 54.39995 114.12492] CT
0.149 GC
N
/f304773239{-1.821 -9.504 M
-1.821 -10.426 L
-0.931 -10.426 -0.361 -10.559 QT
0.21 -10.692 0.21 -11.238 QT
0.21 -18.348 L
0.21 -19.035 -0.001 -19.348 QT
-0.212 -19.66 -0.603 -19.731 QT
-0.993 -19.801 -1.821 -19.801 QT
-1.821 -20.707 L
1.897 -20.988 L
1.897 -18.457 L
2.319 -19.582 3.093 -20.285 QT
3.866 -20.988 4.975 -20.988 QT
5.741 -20.988 6.35 -20.535 QT
6.96 -20.082 6.96 -19.332 QT
6.96 -18.863 6.624 -18.512 QT
6.288 -18.16 5.804 -18.16 QT
5.319 -18.16 4.975 -18.504 QT
4.632 -18.848 4.632 -19.332 QT
4.632 -20.035 5.132 -20.317 QT
4.975 -20.317 L
3.913 -20.317 3.249 -19.559 QT
2.585 -18.801 2.304 -17.668 QT
2.022 -16.535 2.022 -15.504 QT
2.022 -11.238 L
2.022 -10.426 4.554 -10.426 QT
4.554 -9.504 L
-1.821 -9.504 L
cp}def
f304773239
f
GR
GS
[0 -0.75 0.75 0 54.39995 114.12492] CT
0.149 GC
N
/f-1974299555{8.519 -9.504 M
8.519 -10.426 L
9.409 -10.426 9.979 -10.559 QT
10.55 -10.692 10.55 -11.238 QT
10.55 -18.348 L
10.55 -19.035 10.339 -19.348 QT
10.128 -19.66 9.737 -19.731 QT
9.347 -19.801 8.519 -19.801 QT
8.519 -20.707 L
12.237 -20.988 L
12.237 -18.457 L
12.659 -19.582 13.433 -20.285 QT
14.206 -20.988 15.315 -20.988 QT
16.081 -20.988 16.69 -20.535 QT
17.3 -20.082 17.3 -19.332 QT
17.3 -18.863 16.964 -18.512 QT
16.628 -18.16 16.144 -18.16 QT
15.659 -18.16 15.315 -18.504 QT
14.972 -18.848 14.972 -19.332 QT
14.972 -20.035 15.472 -20.317 QT
15.315 -20.317 L
14.253 -20.317 13.589 -19.559 QT
12.925 -18.801 12.644 -17.668 QT
12.362 -16.535 12.362 -15.504 QT
12.362 -11.238 L
12.362 -10.426 14.894 -10.426 QT
14.894 -9.504 L
8.519 -9.504 L
cp}def
f-1974299555
f
GR
GS
[0 -0.75 0.75 0 54.39995 114.12492] CT
0.149 GC
N
/f1046912685{24.687 -9.207 M
23.124 -9.207 21.788 -10.004 QT
20.452 -10.801 19.679 -12.137 QT
18.905 -13.473 18.905 -15.035 QT
18.905 -16.238 19.335 -17.34 QT
19.765 -18.442 20.554 -19.309 QT
21.343 -20.176 22.398 -20.668 QT
23.452 -21.16 24.687 -21.16 QT
26.28 -21.16 27.601 -20.317 QT
28.921 -19.473 29.679 -18.059 QT
30.437 -16.645 30.437 -15.035 QT
30.437 -13.473 29.663 -12.137 QT
28.89 -10.801 27.562 -10.004 QT
26.234 -9.207 24.687 -9.207 QT
cp
24.687 -9.973 M
26.765 -9.973 27.468 -11.481 QT
28.171 -12.988 28.171 -15.332 QT
28.171 -16.645 28.03 -17.496 QT
27.89 -18.348 27.421 -19.051 QT
27.124 -19.488 26.671 -19.809 QT
26.218 -20.129 25.718 -20.301 QT
25.218 -20.473 24.687 -20.473 QT
23.874 -20.473 23.148 -20.106 QT
22.421 -19.738 21.937 -19.051 QT
21.452 -18.317 21.32 -17.434 QT
21.187 -16.551 21.187 -15.332 QT
21.187 -13.879 21.437 -12.715 QT
21.687 -11.551 22.46 -10.762 QT
23.234 -9.973 24.687 -9.973 QT
cp}def
f1046912685
f
GR
GS
[0 -0.75 0.75 0 54.39995 114.12492] CT
0.149 GC
N
/f-1160762944{32.059 -9.504 M
32.059 -10.426 L
32.949 -10.426 33.52 -10.559 QT
34.09 -10.692 34.09 -11.238 QT
34.09 -18.348 L
34.09 -19.035 33.879 -19.348 QT
33.668 -19.66 33.277 -19.731 QT
32.887 -19.801 32.059 -19.801 QT
32.059 -20.707 L
35.777 -20.988 L
35.777 -18.457 L
36.199 -19.582 36.973 -20.285 QT
37.746 -20.988 38.855 -20.988 QT
39.621 -20.988 40.23 -20.535 QT
40.84 -20.082 40.84 -19.332 QT
40.84 -18.863 40.504 -18.512 QT
40.168 -18.16 39.684 -18.16 QT
39.199 -18.16 38.855 -18.504 QT
38.512 -18.848 38.512 -19.332 QT
38.512 -20.035 39.012 -20.317 QT
38.855 -20.317 L
37.793 -20.317 37.129 -19.559 QT
36.465 -18.801 36.184 -17.668 QT
35.902 -16.535 35.902 -15.504 QT
35.902 -11.238 L
35.902 -10.426 38.434 -10.426 QT
38.434 -9.504 L
32.059 -9.504 L
cp}def
f-1160762944
f
GR
GS
[0 -0.75 0.75 0 54.39995 114.12492] CT
0.149 GC
N
/f-1637911092{58.589 -3.051 M
57.136 -4.192 56.089 -5.676 QT
55.042 -7.16 54.378 -8.832 QT
53.714 -10.504 53.386 -12.332 QT
53.058 -14.16 53.058 -16.004 QT
53.058 -17.863 53.386 -19.692 QT
53.714 -21.52 54.394 -23.215 QT
55.074 -24.91 56.128 -26.379 QT
57.183 -27.848 58.589 -28.957 QT
58.589 -29.004 58.714 -29.004 QT
58.964 -29.004 L
59.027 -29.004 59.097 -28.934 QT
59.167 -28.863 59.167 -28.77 QT
59.167 -28.66 59.105 -28.613 QT
57.839 -27.363 56.995 -25.942 QT
56.152 -24.52 55.636 -22.918 QT
55.12 -21.317 54.894 -19.59 QT
54.667 -17.863 54.667 -16.004 QT
54.667 -7.738 59.089 -3.442 QT
59.167 -3.379 59.167 -3.238 QT
59.167 -3.176 59.097 -3.09 QT
59.027 -3.004 58.964 -3.004 QT
58.714 -3.004 L
58.589 -3.004 58.589 -3.051 QT
cp}def
f-1637911092
f
GR
GS
[0 -0.75 0.75 0 54.39995 114.12492] CT
0.149 GC
N
/f493472972{61.575 -9.504 M
61.575 -10.426 L
62.45 -10.426 63.028 -10.559 QT
63.606 -10.692 63.606 -11.238 QT
63.606 -18.348 L
63.606 -19.035 63.395 -19.348 QT
63.184 -19.66 62.786 -19.731 QT
62.387 -19.801 61.575 -19.801 QT
61.575 -20.707 L
65.34 -20.988 L
65.34 -18.457 L
65.856 -19.567 66.879 -20.278 QT
67.903 -20.988 69.106 -20.988 QT
72.106 -20.988 72.622 -18.551 QT
73.153 -19.645 74.153 -20.317 QT
75.153 -20.988 76.34 -20.988 QT
77.528 -20.988 78.332 -20.613 QT
79.137 -20.238 79.543 -19.457 QT
79.95 -18.676 79.95 -17.488 QT
79.95 -11.238 L
79.95 -10.692 80.528 -10.559 QT
81.106 -10.426 81.981 -10.426 QT
81.981 -9.504 L
76.028 -9.504 L
76.028 -10.426 L
76.918 -10.426 77.489 -10.559 QT
78.059 -10.692 78.059 -11.238 QT
78.059 -17.41 L
78.059 -18.723 77.692 -19.52 QT
77.325 -20.317 76.184 -20.317 QT
74.684 -20.317 73.707 -19.113 QT
72.731 -17.91 72.731 -16.379 QT
72.731 -11.238 L
72.731 -10.692 73.301 -10.559 QT
73.872 -10.426 74.762 -10.426 QT
74.762 -9.504 L
68.809 -9.504 L
68.809 -10.426 L
69.7 -10.426 70.27 -10.559 QT
70.84 -10.692 70.84 -11.238 QT
70.84 -17.41 L
70.84 -18.676 70.473 -19.496 QT
70.106 -20.317 68.95 -20.317 QT
67.45 -20.317 66.473 -19.113 QT
65.497 -17.91 65.497 -16.379 QT
65.497 -11.238 L
65.497 -10.692 66.075 -10.559 QT
66.653 -10.426 67.528 -10.426 QT
67.528 -9.504 L
61.575 -9.504 L
cp}def
f493472972
f
GR
GS
[0 -0.75 0.75 0 54.39995 114.12492] CT
0.149 GC
N
/f-1142201482{84.481 -3.004 M
84.247 -3.004 84.247 -3.238 QT
84.247 -3.348 84.309 -3.395 QT
88.747 -7.738 88.747 -16.004 QT
88.747 -24.27 84.356 -28.567 QT
84.247 -28.629 84.247 -28.77 QT
84.247 -28.863 84.317 -28.934 QT
84.387 -29.004 84.481 -29.004 QT
84.731 -29.004 L
84.794 -29.004 84.856 -28.957 QT
86.715 -27.488 87.958 -25.379 QT
89.2 -23.27 89.778 -20.879 QT
90.356 -18.488 90.356 -16.004 QT
90.356 -14.16 90.044 -12.379 QT
89.731 -10.598 89.059 -8.863 QT
88.387 -7.129 87.34 -5.66 QT
86.294 -4.192 84.856 -3.051 QT
84.794 -3.004 84.731 -3.004 QT
84.481 -3.004 L
cp}def
f-1142201482
f
GR
GS
[0.75 0 0 0.75 0 0.5] CT
1 LJ
1.333 LW
N
108 26 M
269.5 108.126 L
431 183.47 L
592.5 245.297 L
754 277 L
S
GR
GS
[0.75 0 0 0.75 81 19.99999] CT
N
5.333 0 M
5.333 -2.946 2.946 -5.333 0 -5.333 C
-2.946 -5.333 -5.333 -2.946 -5.333 0 C
-5.333 2.946 -2.946 5.333 0 5.333 C
2.946 5.333 5.333 2.946 5.333 0 C
cp
f
GR
GS
[0.75 0 0 0.75 81 19.99999] CT
10.0 ML
1.333 LW
N
5.333 0 M
5.333 -2.946 2.946 -5.333 0 -5.333 C
-2.946 -5.333 -5.333 -2.946 -5.333 0 C
-5.333 2.946 -2.946 5.333 0 5.333 C
2.946 5.333 5.333 2.946 5.333 0 C
cp
S
GR
GS
[0.75 0 0 0.75 202.125 81.59449] CT
N
/f1331475442{5.333 0 M
5.333 -2.946 2.946 -5.333 0 -5.333 C
-2.946 -5.333 -5.333 -2.946 -5.333 0 C
-5.333 2.946 -2.946 5.333 0 5.333 C
2.946 5.333 5.333 2.946 5.333 0 C
cp}def
f1331475442
f
GR
GS
[0.75 0 0 0.75 202.125 81.59449] CT
10.0 ML
1.333 LW
N
5.333 0 M
5.333 -2.946 2.946 -5.333 0 -5.333 C
-2.946 -5.333 -5.333 -2.946 -5.333 0 C
-5.333 2.946 -2.946 5.333 0 5.333 C
2.946 5.333 5.333 2.946 5.333 0 C
cp
S
GR
GS
[0.75 0 0 0.75 323.25 138.10286] CT
N
f1331475442
f
GR
GS
[0.75 0 0 0.75 323.25 138.10286] CT
10.0 ML
1.333 LW
N
5.333 0 M
5.333 -2.946 2.946 -5.333 0 -5.333 C
-2.946 -5.333 -5.333 -2.946 -5.333 0 C
-5.333 2.946 -2.946 5.333 0 5.333 C
2.946 5.333 5.333 2.946 5.333 0 C
cp
S
GR
GS
[0.75 0 0 0.75 444.375 184.47307] CT
N
f1331475442
f
GR
GS
[0.75 0 0 0.75 444.375 184.47307] CT
10.0 ML
1.333 LW
N
5.333 0 M
5.333 -2.946 2.946 -5.333 0 -5.333 C
-2.946 -5.333 -5.333 -2.946 -5.333 0 C
-5.333 2.946 -2.946 5.333 0 5.333 C
2.946 5.333 5.333 2.946 5.333 0 C
cp
S
GR
GS
[0.75 0 0 0.75 565.5 208.25] CT
N
f1331475442
f
GR
GS
[0.75 0 0 0.75 565.5 208.25] CT
10.0 ML
1.333 LW
N
5.333 0 M
5.333 -2.946 2.946 -5.333 0 -5.333 C
-2.946 -5.333 -5.333 -2.946 -5.333 0 C
-5.333 2.946 -2.946 5.333 0 5.333 C
2.946 5.333 5.333 2.946 5.333 0 C
cp
S
GR
%%Trailer
%%Pages: 1
%%EOF
