%!PS-Adobe-3.0 EPSF-3.0
%%Creator: (MATLAB, The Mathworks, Inc. Version 9.5.0.944444 \(R2018b\). Operating System: Windows 10)
%%Title: (C:/Users/navsas/Dropbox/Collaborative ranging CRLB/fig/lemniscateTraj_peer_noAxes_B.eps)
%%CreationDate: 2018-11-28T11:02:48
%%Pages: (atend)
%%BoundingBox: 0 0 679 287
%%LanguageLevel: 3
%%EndComments
%%BeginProlog
%%BeginResource: procset (Apache XML Graphics Std ProcSet) 1.2 0
%%Version: 1.2 0
%%Copyright: (Copyright 2001-2003,2010 The Apache Software Foundation. License terms: http://www.apache.org/licenses/LICENSE-2.0)
/bd{bind def}bind def
/ld{load def}bd
/GR/grestore ld
/GS/gsave ld
/RM/rmoveto ld
/C/curveto ld
/t/show ld
/L/lineto ld
/ML/setmiterlimit ld
/CT/concat ld
/f/fill ld
/N/newpath ld
/S/stroke ld
/CC/setcmykcolor ld
/A/ashow ld
/cp/closepath ld
/RC/setrgbcolor ld
/LJ/setlinejoin ld
/GC/setgray ld
/LW/setlinewidth ld
/M/moveto ld
/re {4 2 roll M
1 index 0 rlineto
0 exch rlineto
neg 0 rlineto
cp } bd
/_ctm matrix def
/_tm matrix def
/BT { _ctm currentmatrix pop matrix _tm copy pop 0 0 moveto } bd
/ET { _ctm setmatrix } bd
/iTm { _ctm setmatrix _tm concat } bd
/Tm { _tm astore pop iTm 0 0 moveto } bd
/ux 0.0 def
/uy 0.0 def
/F {
  /Tp exch def
  /Tf exch def
  Tf findfont Tp scalefont setfont
  /cf Tf def  /cs Tp def
} bd
/ULS {currentpoint /uy exch def /ux exch def} bd
/ULE {
  /Tcx currentpoint pop def
  gsave
  newpath
  cf findfont cs scalefont dup
  /FontMatrix get 0 get /Ts exch def /FontInfo get dup
  /UnderlinePosition get Ts mul /To exch def
  /UnderlineThickness get Ts mul /Tt exch def
  ux uy To add moveto  Tcx uy To add lineto
  Tt setlinewidth stroke
  grestore
} bd
/OLE {
  /Tcx currentpoint pop def
  gsave
  newpath
  cf findfont cs scalefont dup
  /FontMatrix get 0 get /Ts exch def /FontInfo get dup
  /UnderlinePosition get Ts mul /To exch def
  /UnderlineThickness get Ts mul /Tt exch def
  ux uy To add cs add moveto Tcx uy To add cs add lineto
  Tt setlinewidth stroke
  grestore
} bd
/SOE {
  /Tcx currentpoint pop def
  gsave
  newpath
  cf findfont cs scalefont dup
  /FontMatrix get 0 get /Ts exch def /FontInfo get dup
  /UnderlinePosition get Ts mul /To exch def
  /UnderlineThickness get Ts mul /Tt exch def
  ux uy To add cs 10 mul 26 idiv add moveto Tcx uy To add cs 10 mul 26 idiv add lineto
  Tt setlinewidth stroke
  grestore
} bd
/QT {
/Y22 exch store
/X22 exch store
/Y21 exch store
/X21 exch store
currentpoint
/Y21 load 2 mul add 3 div exch
/X21 load 2 mul add 3 div exch
/X21 load 2 mul /X22 load add 3 div
/Y21 load 2 mul /Y22 load add 3 div
/X22 load /Y22 load curveto
} bd
/SSPD {
dup length /d exch dict def
{
/v exch def
/k exch def
currentpagedevice k known {
/cpdv currentpagedevice k get def
v cpdv ne {
/upd false def
/nullv v type /nulltype eq def
/nullcpdv cpdv type /nulltype eq def
nullv nullcpdv or
{
/upd true def
} {
/sametype v type cpdv type eq def
sametype {
v type /arraytype eq {
/vlen v length def
/cpdvlen cpdv length def
vlen cpdvlen eq {
0 1 vlen 1 sub {
/i exch def
/obj v i get def
/cpdobj cpdv i get def
obj cpdobj ne {
/upd true def
exit
} if
} for
} {
/upd true def
} ifelse
} {
v type /dicttype eq {
v {
/dv exch def
/dk exch def
/cpddv cpdv dk get def
dv cpddv ne {
/upd true def
exit
} if
} forall
} {
/upd true def
} ifelse
} ifelse
} if
} ifelse
upd true eq {
d k v put
} if
} if
} if
} forall
d length 0 gt {
d setpagedevice
} if
} bd
/RE { % /NewFontName [NewEncodingArray] /FontName RE -
  findfont dup length dict begin
  {
    1 index /FID ne
    {def} {pop pop} ifelse
  } forall
  /Encoding exch def
  /FontName 1 index def
  currentdict definefont pop
  end
} bind def
%%EndResource
%%BeginResource: procset (Apache XML Graphics EPS ProcSet) 1.0 0
%%Version: 1.0 0
%%Copyright: (Copyright 2002-2003 The Apache Software Foundation. License terms: http://www.apache.org/licenses/LICENSE-2.0)
/BeginEPSF { %def
/b4_Inc_state save def         % Save state for cleanup
/dict_count countdictstack def % Count objects on dict stack
/op_count count 1 sub def      % Count objects on operand stack
userdict begin                 % Push userdict on dict stack
/showpage { } def              % Redefine showpage, { } = null proc
0 setgray 0 setlinecap         % Prepare graphics state
1 setlinewidth 0 setlinejoin
10 setmiterlimit [ ] 0 setdash newpath
/languagelevel where           % If level not equal to 1 then
{pop languagelevel             % set strokeadjust and
1 ne                           % overprint to their defaults.
{false setstrokeadjust false setoverprint
} if
} if
} bd
/EndEPSF { %def
count op_count sub {pop} repeat            % Clean up stacks
countdictstack dict_count sub {end} repeat
b4_Inc_state restore
} bd
%%EndResource
%FOPBeginFontDict
%%IncludeResource: font Courier-Oblique
%%IncludeResource: font Courier-BoldOblique
%%IncludeResource: font Courier-Bold
%%IncludeResource: font ZapfDingbats
%%IncludeResource: font Symbol
%%IncludeResource: font Helvetica
%%IncludeResource: font Helvetica-Oblique
%%IncludeResource: font Helvetica-Bold
%%IncludeResource: font Helvetica-BoldOblique
%%IncludeResource: font Times-Roman
%%IncludeResource: font Times-Italic
%%IncludeResource: font Times-Bold
%%IncludeResource: font Times-BoldItalic
%%IncludeResource: font Courier
%FOPEndFontDict
%%BeginResource: encoding WinAnsiEncoding
/WinAnsiEncoding [
/.notdef /.notdef /.notdef /.notdef /.notdef
/.notdef /.notdef /.notdef /.notdef /.notdef
/.notdef /.notdef /.notdef /.notdef /.notdef
/.notdef /.notdef /.notdef /.notdef /.notdef
/.notdef /.notdef /.notdef /.notdef /.notdef
/.notdef /.notdef /.notdef /.notdef /.notdef
/.notdef /.notdef /space /exclam /quotedbl
/numbersign /dollar /percent /ampersand /quotesingle
/parenleft /parenright /asterisk /plus /comma
/hyphen /period /slash /zero /one
/two /three /four /five /six
/seven /eight /nine /colon /semicolon
/less /equal /greater /question /at
/A /B /C /D /E
/F /G /H /I /J
/K /L /M /N /O
/P /Q /R /S /T
/U /V /W /X /Y
/Z /bracketleft /backslash /bracketright /asciicircum
/underscore /quoteleft /a /b /c
/d /e /f /g /h
/i /j /k /l /m
/n /o /p /q /r
/s /t /u /v /w
/x /y /z /braceleft /bar
/braceright /asciitilde /bullet /Euro /bullet
/quotesinglbase /florin /quotedblbase /ellipsis /dagger
/daggerdbl /circumflex /perthousand /Scaron /guilsinglleft
/OE /bullet /Zcaron /bullet /bullet
/quoteleft /quoteright /quotedblleft /quotedblright /bullet
/endash /emdash /asciitilde /trademark /scaron
/guilsinglright /oe /bullet /zcaron /Ydieresis
/space /exclamdown /cent /sterling /currency
/yen /brokenbar /section /dieresis /copyright
/ordfeminine /guillemotleft /logicalnot /sfthyphen /registered
/macron /degree /plusminus /twosuperior /threesuperior
/acute /mu /paragraph /middot /cedilla
/onesuperior /ordmasculine /guillemotright /onequarter /onehalf
/threequarters /questiondown /Agrave /Aacute /Acircumflex
/Atilde /Adieresis /Aring /AE /Ccedilla
/Egrave /Eacute /Ecircumflex /Edieresis /Igrave
/Iacute /Icircumflex /Idieresis /Eth /Ntilde
/Ograve /Oacute /Ocircumflex /Otilde /Odieresis
/multiply /Oslash /Ugrave /Uacute /Ucircumflex
/Udieresis /Yacute /Thorn /germandbls /agrave
/aacute /acircumflex /atilde /adieresis /aring
/ae /ccedilla /egrave /eacute /ecircumflex
/edieresis /igrave /iacute /icircumflex /idieresis
/eth /ntilde /ograve /oacute /ocircumflex
/otilde /odieresis /divide /oslash /ugrave
/uacute /ucircumflex /udieresis /yacute /thorn
/ydieresis
] def
%%EndResource
%FOPBeginFontReencode
/Courier-Oblique findfont
dup length dict begin
  {1 index /FID ne {def} {pop pop} ifelse} forall
  /Encoding WinAnsiEncoding def
  currentdict
end
/Courier-Oblique exch definefont pop
/Courier-BoldOblique findfont
dup length dict begin
  {1 index /FID ne {def} {pop pop} ifelse} forall
  /Encoding WinAnsiEncoding def
  currentdict
end
/Courier-BoldOblique exch definefont pop
/Courier-Bold findfont
dup length dict begin
  {1 index /FID ne {def} {pop pop} ifelse} forall
  /Encoding WinAnsiEncoding def
  currentdict
end
/Courier-Bold exch definefont pop
/Helvetica findfont
dup length dict begin
  {1 index /FID ne {def} {pop pop} ifelse} forall
  /Encoding WinAnsiEncoding def
  currentdict
end
/Helvetica exch definefont pop
/Helvetica-Oblique findfont
dup length dict begin
  {1 index /FID ne {def} {pop pop} ifelse} forall
  /Encoding WinAnsiEncoding def
  currentdict
end
/Helvetica-Oblique exch definefont pop
/Helvetica-Bold findfont
dup length dict begin
  {1 index /FID ne {def} {pop pop} ifelse} forall
  /Encoding WinAnsiEncoding def
  currentdict
end
/Helvetica-Bold exch definefont pop
/Helvetica-BoldOblique findfont
dup length dict begin
  {1 index /FID ne {def} {pop pop} ifelse} forall
  /Encoding WinAnsiEncoding def
  currentdict
end
/Helvetica-BoldOblique exch definefont pop
/Times-Roman findfont
dup length dict begin
  {1 index /FID ne {def} {pop pop} ifelse} forall
  /Encoding WinAnsiEncoding def
  currentdict
end
/Times-Roman exch definefont pop
/Times-Italic findfont
dup length dict begin
  {1 index /FID ne {def} {pop pop} ifelse} forall
  /Encoding WinAnsiEncoding def
  currentdict
end
/Times-Italic exch definefont pop
/Times-Bold findfont
dup length dict begin
  {1 index /FID ne {def} {pop pop} ifelse} forall
  /Encoding WinAnsiEncoding def
  currentdict
end
/Times-Bold exch definefont pop
/Times-BoldItalic findfont
dup length dict begin
  {1 index /FID ne {def} {pop pop} ifelse} forall
  /Encoding WinAnsiEncoding def
  currentdict
end
/Times-BoldItalic exch definefont pop
/Courier findfont
dup length dict begin
  {1 index /FID ne {def} {pop pop} ifelse} forall
  /Encoding WinAnsiEncoding def
  currentdict
end
/Courier exch definefont pop
%FOPEndFontReencode
%%EndProlog
%%Page: 1 1
%%PageBoundingBox: 0 0 679 287
%%BeginPageSetup
[1 0 0 -1 0 287] CT
%%EndPageSetup
GS
[0.75 0 0 0.75 0 -0.25] CT
N
0 0 M
905 0 L
905 383 L
0 383 L
0 0 L
cp
clip
1 GC
N
0 0 905 383 re
f
GR
GS
[0.75 0 0 0.75 0 -0.25] CT
1 GC
N
0 0 905 383 re
f
GR
GS
[0.75 0 0 0.75 595.60643 134.00461] CT
1 0 0 RC
N
4 0 M
4 -2.209 2.209 -4 0 -4 C
-2.209 -4 -4 -2.209 -4 0 C
-4 2.209 -2.209 4 0 4 C
2.209 4 4 2.209 4 0 C
cp
f
GR
GS
[0.75 0 0 0.75 595.60643 134.00461] CT
1 0 0 RC
10.0 ML
N
4 0 M
4 -2.209 2.209 -4 0 -4 C
-2.209 -4 -4 -2.209 -4 0 C
-4 2.209 -2.209 4 0 4 C
2.209 4 4 2.209 4 0 C
cp
S
GR
GS
[0.75 0 0 0.75 462.08711 41.98215] CT
1 0 0 RC
N
/f351177404{4 0 M
4 -2.209 2.209 -4 0 -4 C
-2.209 -4 -4 -2.209 -4 0 C
-4 2.209 -2.209 4 0 4 C
2.209 4 4 2.209 4 0 C
cp}def
f351177404
f
GR
GS
[0.75 0 0 0.75 462.08711 41.98215] CT
1 0 0 RC
10.0 ML
N
4 0 M
4 -2.209 2.209 -4 0 -4 C
-2.209 -4 -4 -2.209 -4 0 C
-4 2.209 -2.209 4 0 4 C
2.209 4 4 2.209 4 0 C
cp
S
GR
GS
[0.75 0 0 0.75 329.32732 160.65084] CT
1 0 0 RC
N
f351177404
f
GR
GS
[0.75 0 0 0.75 329.32732 160.65084] CT
1 0 0 RC
10.0 ML
N
4 0 M
4 -2.209 2.209 -4 0 -4 C
-2.209 -4 -4 -2.209 -4 0 C
-4 2.209 -2.209 4 0 4 C
2.209 4 4 2.209 4 0 C
cp
S
GR
GS
[0.75 0 0 0.75 161.11091 234.90475] CT
1 0 0 RC
N
f351177404
f
GR
GS
[0.75 0 0 0.75 161.11091 234.90475] CT
1 0 0 RC
10.0 ML
N
4 0 M
4 -2.209 2.209 -4 0 -4 C
-2.209 -4 -4 -2.209 -4 0 C
-4 2.209 -2.209 4 0 4 C
2.209 4 4 2.209 4 0 C
cp
S
GR
GS
[0.75 0 0 0.75 0 -0.25] CT
1 LJ
4 LW
N
794.259 185 M
794.142 179.006 L
793.792 173.026 L
793.209 167.074 L
792.396 161.164 L
791.356 155.31 L
790.091 149.524 L
788.608 143.82 L
786.91 138.211 L
785.003 132.708 L
782.893 127.322 L
780.588 122.064 L
778.095 116.945 L
775.421 111.972 L
772.575 107.156 L
769.566 102.504 L
766.401 98.022 L
763.09 93.717 L
759.642 89.593 L
756.067 85.657 L
752.373 81.91 L
748.57 78.357 L
744.667 75 L
740.672 71.84 L
736.596 68.878 L
732.446 66.114 L
728.231 63.548 L
723.959 61.179 L
719.638 59.006 L
715.276 57.026 L
710.88 55.238 L
706.458 53.638 L
702.015 52.223 L
697.558 50.991 L
693.093 49.936 L
688.625 49.056 L
684.161 48.345 L
679.704 47.801 L
675.259 47.417 L
670.831 47.19 L
666.423 47.114 L
662.039 47.186 L
657.682 47.399 L
653.355 47.75 L
649.061 48.234 L
644.802 48.845 L
640.58 49.579 L
636.397 50.432 L
632.254 51.398 L
628.154 52.473 L
624.097 53.653 L
620.084 54.933 L
616.116 56.31 L
612.194 57.777 L
608.318 59.333 L
604.488 60.973 L
600.704 62.692 L
596.968 64.488 L
593.277 66.357 L
589.633 68.294 L
586.035 70.298 L
582.482 72.365 L
578.975 74.491 L
575.512 76.674 L
572.092 78.91 L
568.716 81.198 L
565.382 83.534 L
562.09 85.916 L
558.838 88.341 L
555.626 90.808 L
552.453 93.313 L
549.318 95.855 L
546.219 98.432 L
543.156 101.042 L
540.128 103.683 L
537.133 106.353 L
534.17 109.05 L
531.239 111.773 L
528.338 114.521 L
525.466 117.291 L
522.621 120.083 L
519.803 122.894 L
517.011 125.725 L
514.243 128.573 L
511.498 131.437 L
508.775 134.317 L
506.072 137.211 L
503.389 140.117 L
500.724 143.036 L
498.076 145.966 L
495.444 148.906 L
492.826 151.855 L
490.222 154.813 L
487.63 157.778 L
485.049 160.749 L
482.478 163.727 L
479.916 166.71 L
477.361 169.697 L
474.812 172.688 L
472.268 175.681 L
469.727 178.677 L
467.19 181.674 L
464.654 184.672 L
462.117 187.67 L
459.58 190.668 L
457.041 193.664 L
454.498 196.657 L
451.951 199.648 L
449.398 202.636 L
446.838 205.619 L
444.269 208.597 L
441.691 211.569 L
439.103 214.534 L
436.503 217.493 L
433.89 220.442 L
431.262 223.383 L
428.619 226.314 L
425.96 229.233 L
423.282 232.141 L
420.586 235.036 L
417.869 237.917 L
415.131 240.782 L
412.37 243.632 L
409.586 246.464 L
406.776 249.278 L
403.94 252.072 L
401.077 254.845 L
398.186 257.595 L
395.264 260.322 L
392.312 263.023 L
389.328 265.696 L
386.311 268.341 L
383.259 270.955 L
380.173 273.537 L
377.05 276.085 L
373.889 278.596 L
370.691 281.069 L
367.453 283.502 L
364.175 285.891 L
360.856 288.235 L
357.495 290.532 L
354.091 292.778 L
350.643 294.972 L
347.152 297.109 L
343.616 299.188 L
340.035 301.204 L
336.408 303.156 L
332.735 305.04 L
329.016 306.852 L
325.251 308.589 L
321.44 310.247 L
317.582 311.822 L
313.678 313.311 L
309.729 314.71 L
305.735 316.014 L
301.697 317.219 L
297.615 318.321 L
293.491 319.315 L
289.327 320.198 L
285.123 320.964 L
280.881 321.609 L
276.605 322.127 L
272.294 322.515 L
267.953 322.768 L
263.585 322.88 L
259.191 322.847 L
254.777 322.665 L
250.344 322.328 L
245.898 321.831 L
241.444 321.171 L
236.984 320.343 L
232.526 319.342 L
228.074 318.165 L
223.634 316.808 L
219.212 315.267 L
214.815 313.54 L
210.449 311.622 L
206.122 309.512 L
201.841 307.208 L
197.614 304.707 L
193.449 302.009 L
189.355 299.114 L
185.34 296.021 L
181.412 292.73 L
177.582 289.244 L
173.857 285.564 L
170.247 281.693 L
166.762 277.635 L
163.409 273.393 L
160.2 268.973 L
157.142 264.38 L
154.244 259.621 L
151.516 254.704 L
148.965 249.637 L
146.599 244.428 L
144.426 239.087 L
142.452 233.625 L
140.685 228.053 L
139.131 222.382 L
137.794 216.625 L
136.679 210.794 L
135.79 204.903 L
135.13 198.965 L
134.702 192.993 L
134.507 187.003 L
134.546 181.008 L
134.819 175.021 L
135.324 169.059 L
136.06 163.133 L
137.025 157.258 L
138.215 151.448 L
139.625 145.716 L
141.253 140.073 L
143.09 134.533 L
145.133 129.107 L
147.373 123.805 L
149.804 118.639 L
152.419 113.616 L
155.208 108.747 L
158.164 104.039 L
161.278 99.5 L
164.541 95.135 L
167.944 90.95 L
171.478 86.951 L
175.133 83.14 L
178.901 79.523 L
182.772 76.1 L
186.737 72.873 L
190.787 69.845 L
194.913 67.015 L
199.108 64.383 L
203.361 61.949 L
207.667 59.71 L
212.016 57.666 L
216.401 55.814 L
220.815 54.151 L
225.252 52.675 L
229.705 51.382 L
234.168 50.269 L
238.635 49.331 L
243.102 48.564 L
247.562 47.964 L
252.011 47.527 L
256.445 47.248 L
260.86 47.123 L
265.253 47.146 L
269.619 47.312 L
273.956 47.618 L
278.262 48.058 L
282.533 48.627 L
286.767 49.321 L
290.963 50.134 L
295.12 51.063 L
299.234 52.102 L
303.306 53.248 L
307.333 54.495 L
311.316 55.839 L
315.254 57.277 L
319.146 58.804 L
322.991 60.416 L
326.79 62.109 L
330.542 63.88 L
334.248 65.725 L
337.908 67.64 L
341.521 69.622 L
345.089 71.668 L
348.611 73.774 L
352.089 75.938 L
355.523 78.157 L
358.914 80.428 L
362.262 82.748 L
365.568 85.115 L
368.833 87.526 L
372.058 89.979 L
375.244 92.472 L
378.392 95.002 L
381.503 97.568 L
384.578 100.167 L
387.618 102.797 L
390.624 105.458 L
393.597 108.146 L
396.538 110.861 L
399.449 113.6 L
402.331 116.363 L
405.185 119.148 L
408.011 121.953 L
410.812 124.777 L
413.588 127.62 L
416.341 130.479 L
419.071 133.353 L
421.78 136.243 L
424.47 139.145 L
427.141 142.06 L
429.794 144.986 L
432.432 147.923 L
435.054 150.869 L
437.662 153.824 L
440.258 156.786 L
442.842 159.756 L
445.417 162.732 L
447.982 165.713 L
450.54 168.699 L
453.09 171.688 L
455.636 174.681 L
458.177 177.676 L
460.716 180.673 L
463.252 183.671 L
465.788 186.669 L
468.325 189.667 L
470.863 192.663 L
473.405 195.658 L
475.95 198.65 L
478.501 201.638 L
481.059 204.623 L
483.625 207.603 L
486.199 210.577 L
488.784 213.545 L
491.38 216.505 L
493.989 219.458 L
496.612 222.402 L
499.249 225.336 L
501.903 228.259 L
504.574 231.171 L
507.264 234.07 L
509.974 236.956 L
512.705 239.827 L
515.458 242.682 L
518.234 245.52 L
521.035 248.34 L
523.862 251.141 L
526.716 253.921 L
529.598 256.679 L
532.509 259.414 L
535.451 262.123 L
538.424 264.806 L
541.431 267.461 L
544.47 270.086 L
547.545 272.679 L
550.656 275.238 L
553.804 277.762 L
556.989 280.248 L
560.214 282.694 L
563.479 285.098 L
566.784 287.458 L
570.131 289.77 L
573.52 292.034 L
576.953 294.245 L
580.43 296.401 L
583.951 298.5 L
587.517 300.538 L
591.128 302.512 L
594.786 304.419 L
598.489 306.255 L
602.239 308.017 L
606.035 309.702 L
609.877 311.305 L
613.766 312.824 L
617.7 314.253 L
621.679 315.589 L
625.702 316.827 L
629.77 317.964 L
633.879 318.995 L
638.03 319.916 L
642.221 320.721 L
646.451 321.407 L
650.716 321.968 L
655.015 322.401 L
659.346 322.699 L
663.706 322.859 L
668.091 322.875 L
672.5 322.743 L
676.926 322.458 L
681.368 322.015 L
685.82 321.41 L
690.279 320.638 L
694.738 319.696 L
699.193 318.578 L
703.638 317.282 L
708.066 315.803 L
712.473 314.138 L
716.85 312.284 L
721.19 310.238 L
725.488 307.999 L
729.733 305.564 L
733.92 302.932 L
738.039 300.103 L
742.081 297.076 L
746.039 293.851 L
749.903 290.43 L
753.664 286.815 L
757.313 283.007 L
760.841 279.011 L
764.239 274.83 L
767.497 270.469 L
770.607 265.933 L
773.559 261.229 L
776.345 256.364 L
778.956 251.346 L
781.385 246.183 L
783.623 240.885 L
785.664 235.462 L
787.501 229.926 L
789.127 224.286 L
790.537 218.557 L
791.727 212.749 L
792.692 206.877 L
793.428 200.952 L
793.934 194.991 L
794.207 189.005 L
S
GR
GS
[0.75 0 0 0.75 0 -0.25] CT
1 0 0 RC
N
/f1278332152{802.971 179.678 M
803 179 L
802.971 178.322 L
802.885 177.648 L
802.742 176.984 L
802.543 176.335 L
802.29 175.705 L
801.984 175.098 L
801.628 174.52 L
801.224 173.974 L
800.776 173.464 L
800.285 172.995 L
799.757 172.568 L
799.194 172.188 L
798.602 171.857 L
797.983 171.577 L
797.343 171.351 L
796.685 171.18 L
796.016 171.065 L
795.34 171.007 L
794.66 171.007 L
793.984 171.065 L
793.315 171.18 L
792.657 171.351 L
792.017 171.577 L
791.398 171.857 L
790.806 172.188 L
790.243 172.568 L
789.715 172.995 L
789.224 173.464 L
788.776 173.974 L
788.372 174.52 L
788.016 175.098 L
787.71 175.705 L
787.457 176.335 L
787.258 176.984 L
787.115 177.648 L
787.029 178.322 L
787 179 L
787.029 179.678 L
787.115 180.352 L
787.258 181.016 L
787.457 181.665 L
787.71 182.295 L
788.016 182.902 L
788.372 183.48 L
788.776 184.026 L
789.224 184.536 L
789.715 185.005 L
790.243 185.432 L
790.806 185.812 L
791.398 186.143 L
792.017 186.423 L
792.657 186.649 L
793.315 186.82 L
793.984 186.935 L
794.66 186.993 L
795.34 186.993 L
796.016 186.935 L
796.685 186.82 L
797.343 186.649 L
797.983 186.423 L
798.602 186.143 L
799.194 185.812 L
799.757 185.432 L
800.285 185.005 L
800.776 184.536 L
801.224 184.026 L
801.628 183.48 L
801.984 182.902 L
802.29 182.295 L
802.543 181.665 L
802.742 181.016 L
802.885 180.352 L
cp
222.971 312.678 M
223 312 L
222.971 311.322 L
222.885 310.648 L
222.742 309.984 L
222.543 309.335 L
222.29 308.705 L
221.984 308.098 L
221.628 307.52 L
221.224 306.974 L
220.776 306.464 L
220.285 305.995 L
219.757 305.568 L
219.194 305.188 L
218.602 304.857 L
217.983 304.577 L
217.343 304.351 L
216.685 304.18 L
216.016 304.065 L
215.34 304.007 L
214.66 304.007 L
213.984 304.065 L
213.315 304.18 L
212.657 304.351 L
212.017 304.577 L
211.398 304.857 L
210.806 305.188 L
210.243 305.568 L
209.715 305.995 L
209.224 306.464 L
208.776 306.974 L
208.372 307.52 L
208.016 308.098 L
207.71 308.705 L
207.457 309.335 L
207.258 309.984 L
207.115 310.648 L
207.029 311.322 L
207 312 L
207.029 312.678 L
207.115 313.352 L
207.258 314.016 L
207.457 314.665 L
207.71 315.295 L
208.016 315.902 L
208.372 316.48 L
208.776 317.026 L
209.224 317.536 L
209.715 318.005 L
210.243 318.432 L
210.806 318.812 L
211.398 319.143 L
212.017 319.423 L
212.657 319.649 L
213.315 319.82 L
213.984 319.935 L
214.66 319.993 L
215.34 319.993 L
216.016 319.935 L
216.685 319.82 L
217.343 319.649 L
217.983 319.423 L
218.602 319.143 L
219.194 318.812 L
219.757 318.432 L
220.285 318.005 L
220.776 317.536 L
221.224 317.026 L
221.628 316.48 L
221.984 315.902 L
222.29 315.295 L
222.543 314.665 L
222.742 314.016 L
222.885 313.352 L
cp
447.971 213.678 M
448 213 L
447.971 212.322 L
447.885 211.648 L
447.742 210.984 L
447.543 210.335 L
447.29 209.705 L
446.984 209.098 L
446.628 208.52 L
446.224 207.974 L
445.776 207.464 L
445.285 206.995 L
444.757 206.568 L
444.194 206.188 L
443.602 205.857 L
442.983 205.577 L
442.343 205.351 L
441.685 205.18 L
441.016 205.065 L
440.34 205.007 L
439.66 205.007 L
438.984 205.065 L
438.315 205.18 L
437.657 205.351 L
437.017 205.577 L
436.398 205.857 L
435.806 206.188 L
435.243 206.568 L
434.715 206.995 L
434.224 207.464 L
433.776 207.974 L
433.372 208.52 L
433.016 209.098 L
432.71 209.705 L
432.457 210.335 L
432.258 210.984 L
432.115 211.648 L
432.029 212.322 L
432 213 L
432.029 213.678 L
432.115 214.352 L
432.258 215.016 L
432.457 215.665 L
432.71 216.295 L
433.016 216.902 L
433.372 217.48 L
433.776 218.026 L
434.224 218.536 L
434.715 219.005 L
435.243 219.432 L
435.806 219.812 L
436.398 220.143 L
437.017 220.423 L
437.657 220.649 L
438.315 220.82 L
438.984 220.935 L
439.66 220.993 L
440.34 220.993 L
441.016 220.935 L
441.685 220.82 L
442.343 220.649 L
442.983 220.423 L
443.602 220.143 L
444.194 219.812 L
444.757 219.432 L
445.285 219.005 L
445.776 218.536 L
446.224 218.026 L
446.628 217.48 L
446.984 216.902 L
447.29 216.295 L
447.543 215.665 L
447.742 215.016 L
447.885 214.352 L
cp}def
f1278332152
f
GR
GS
[0.75 0 0 0.75 0 -0.25] CT
1 0 0 RC
1 LJ
0.667 LW
N
188 70 M
189.015 69.442 L
S
GR
GS
[0.75 0 0 0.75 0 -0.25] CT
1 0 0 RC
1 LJ
0.667 LW
N
172.769 64.111 M
208 59 L
189.015 69.442 L
172.769 64.111 L
S
GR
GS
[0.75 0 0 0.75 0 -0.25] CT
1 0 0 RC
1 LJ
0.667 LW
N
208 59 M
184.817 86.017 L
189.015 69.442 L
208 59 L
S
GR
GS
[0.75 0 0 0.75 0 -0.25] CT
1 0 0 RC
N
/f-2052759019{208 59 M
172.769 64.111 L
189.015 69.442 L
184.817 86.017 L
cp}def
f-2052759019
f
GR
GS
[0.75 0 0 0.75 0 -0.25] CT
[10 6] 0 setdash
2 LJ
0.667 LW
N
432 208 M
197 71 L
S
GR
GS
[0.75 0 0 0.75 0 -0.25] CT
[10 6] 0 setdash
2 LJ
0.667 LW
N
215 303 M
198 71 L
S
GR
GS
[0.75 0 0 0.75 0 -0.25] CT
[10 6] 0 setdash
2 LJ
0.667 LW
N
610 57 M
199 72 L
S
GR
GS
[0.75 0 0 0.75 0 -0.25] CT
[10 6] 0 setdash
2 LJ
0.667 LW
N
786 180 M
199 73 L
S
GR
GS
[0.75 0 0 0.75 574.71432 138.61824] CT
N
1.672 20.212 M
1.672 19.822 1.75 19.462 QT
3.703 11.712 L
0.875 11.712 L
0.594 11.712 0.594 11.353 QT
0.703 10.759 0.953 10.759 QT
3.938 10.759 L
5.016 6.353 L
5.125 5.994 5.445 5.744 QT
5.766 5.494 6.156 5.494 QT
6.5 5.494 6.734 5.697 QT
6.969 5.9 6.969 6.244 QT
6.969 6.322 6.961 6.369 QT
6.953 6.416 6.938 6.478 QT
5.859 10.759 L
8.641 10.759 L
8.906 10.759 8.906 11.119 QT
8.906 11.181 8.859 11.337 QT
8.813 11.494 8.75 11.603 QT
8.688 11.712 8.563 11.712 QT
5.609 11.712 L
3.672 19.509 L
3.484 20.275 3.484 20.837 QT
3.484 21.994 4.266 21.994 QT
5.453 21.994 6.375 20.876 QT
7.297 19.759 7.781 18.431 QT
7.891 18.275 7.984 18.275 QT
8.313 18.275 L
8.422 18.275 8.492 18.345 QT
8.563 18.416 8.563 18.509 QT
8.563 18.556 8.531 18.587 QT
7.938 20.228 6.805 21.462 QT
5.672 22.697 4.203 22.697 QT
3.141 22.697 2.406 22.001 QT
1.672 21.306 1.672 20.212 QT
cp
f
GR
GS
[0.75 0 0 0.75 574.71432 138.61824] CT
N
11.395 26.4 M
11.395 25.728 L
13.77 25.728 13.77 25.134 QT
13.77 15.15 L
12.786 15.634 11.286 15.634 QT
11.286 14.962 L
13.614 14.962 14.802 13.744 QT
15.067 13.744 L
15.13 13.744 15.192 13.798 QT
15.255 13.853 15.255 13.915 QT
15.255 25.134 L
15.255 25.728 17.63 25.728 QT
17.63 26.4 L
11.395 26.4 L
cp
f
GR
GS
[0.75 0 0 0.75 471.96437 39.61823] CT
N
/f-1833028947{1.672 20.212 M
1.672 19.822 1.75 19.462 QT
3.703 11.712 L
0.875 11.712 L
0.594 11.712 0.594 11.353 QT
0.703 10.759 0.953 10.759 QT
3.938 10.759 L
5.016 6.353 L
5.125 5.994 5.445 5.744 QT
5.766 5.494 6.156 5.494 QT
6.5 5.494 6.734 5.697 QT
6.969 5.9 6.969 6.244 QT
6.969 6.322 6.961 6.369 QT
6.953 6.416 6.938 6.478 QT
5.859 10.759 L
8.641 10.759 L
8.906 10.759 8.906 11.119 QT
8.906 11.181 8.859 11.337 QT
8.813 11.494 8.75 11.603 QT
8.688 11.712 8.563 11.712 QT
5.609 11.712 L
3.672 19.509 L
3.484 20.275 3.484 20.837 QT
3.484 21.994 4.266 21.994 QT
5.453 21.994 6.375 20.876 QT
7.297 19.759 7.781 18.431 QT
7.891 18.275 7.984 18.275 QT
8.313 18.275 L
8.422 18.275 8.492 18.345 QT
8.563 18.416 8.563 18.509 QT
8.563 18.556 8.531 18.587 QT
7.938 20.228 6.805 21.462 QT
5.672 22.697 4.203 22.697 QT
3.141 22.697 2.406 22.001 QT
1.672 21.306 1.672 20.212 QT
cp}def
f-1833028947
f
GR
GS
[0.75 0 0 0.75 471.96437 39.61823] CT
N
/f-1028082059{10.583 26.4 M
10.583 25.884 L
10.583 25.837 10.614 25.79 QT
13.567 22.525 L
14.239 21.79 14.653 21.306 QT
15.067 20.822 15.473 20.181 QT
15.88 19.54 16.114 18.876 QT
16.348 18.212 16.348 17.462 QT
16.348 16.681 16.067 15.97 QT
15.786 15.259 15.216 14.837 QT
14.645 14.415 13.833 14.415 QT
13.005 14.415 12.348 14.908 QT
11.692 15.4 11.427 16.197 QT
11.489 16.181 11.63 16.181 QT
12.052 16.181 12.356 16.462 QT
12.661 16.744 12.661 17.212 QT
12.661 17.634 12.356 17.939 QT
12.052 18.244 11.63 18.244 QT
11.177 18.244 10.88 17.931 QT
10.583 17.619 10.583 17.212 QT
10.583 16.494 10.848 15.869 QT
11.114 15.244 11.622 14.751 QT
12.13 14.259 12.762 14.001 QT
13.395 13.744 14.114 13.744 QT
15.192 13.744 16.13 14.205 QT
17.067 14.665 17.614 15.501 QT
18.161 16.337 18.161 17.462 QT
18.161 18.29 17.802 19.033 QT
17.442 19.775 16.88 20.384 QT
16.317 20.994 15.434 21.759 QT
14.552 22.525 14.27 22.79 QT
12.114 24.853 L
13.942 24.853 L
15.286 24.853 16.192 24.83 QT
17.098 24.806 17.161 24.759 QT
17.38 24.525 17.614 23.009 QT
18.161 23.009 L
17.63 26.4 L
10.583 26.4 L
cp}def
f-1028082059
f
GR
GS
[0.75 0 0 0.75 138.21436 229.36824] CT
N
f-1833028947
f
GR
GS
[0.75 0 0 0.75 138.21436 229.36824] CT
N
/f2029717348{10.161 23.259 M
10.161 22.603 L
16.036 13.837 L
16.098 13.744 16.223 13.744 QT
16.505 13.744 L
16.723 13.744 16.723 13.962 QT
16.723 22.603 L
18.583 22.603 L
18.583 23.259 L
16.723 23.259 L
16.723 25.134 L
16.723 25.525 17.278 25.626 QT
17.833 25.728 18.567 25.728 QT
18.567 26.4 L
13.333 26.4 L
13.333 25.728 L
14.067 25.728 14.622 25.626 QT
15.177 25.525 15.177 25.134 QT
15.177 23.259 L
10.161 23.259 L
cp
10.786 22.603 M
15.286 22.603 L
15.286 15.869 L
10.786 22.603 L
cp}def
f2029717348
f
GR
GS
[0.75 0 0 0.75 158.36272 136.53379] CT
N
/f1237405860{8.358 3.987 M
7.827 3.425 L
11.468 -0.216 L
15.077 3.425 L
14.546 3.987 L
11.468 1.284 L
8.358 3.987 L
cp}def
f1237405860
f
GR
GS
[0.75 0 0 0.75 158.36272 136.53379] CT
N
/f2011899593{4.688 25.852 M
3 25.852 2.016 24.571 QT
1.031 23.29 1.031 21.54 QT
1.031 19.806 1.93 17.946 QT
2.828 16.087 4.344 14.852 QT
5.859 13.618 7.625 13.618 QT
8.406 13.618 9.047 14.063 QT
9.688 14.509 10.047 15.243 QT
11.563 9.227 L
11.672 8.759 11.688 8.493 QT
11.688 8.056 9.938 8.056 QT
9.656 8.056 9.656 7.712 QT
9.672 7.634 9.719 7.462 QT
9.766 7.29 9.844 7.204 QT
9.922 7.118 10.047 7.118 QT
13.688 6.821 L
14.016 6.821 14.016 7.165 QT
10.125 22.696 L
9.938 23.149 9.938 23.993 QT
9.938 25.149 10.719 25.149 QT
11.563 25.149 12.008 24.071 QT
12.453 22.993 12.75 21.587 QT
12.797 21.431 12.953 21.431 QT
13.297 21.431 L
13.391 21.431 13.461 21.524 QT
13.531 21.618 13.531 21.696 QT
13.047 23.571 12.492 24.712 QT
11.938 25.852 10.672 25.852 QT
9.75 25.852 9.055 25.321 QT
8.359 24.79 8.188 23.915 QT
6.453 25.852 4.688 25.852 QT
cp
4.719 25.149 M
5.703 25.149 6.617 24.415 QT
7.531 23.681 8.188 22.696 QT
8.219 22.665 8.219 22.587 QT
9.688 16.649 L
9.531 15.696 8.992 15.009 QT
8.453 14.321 7.547 14.321 QT
6.641 14.321 5.859 15.063 QT
5.078 15.806 4.531 16.821 QT
4.016 17.915 3.531 19.798 QT
3.047 21.681 3.047 22.727 QT
3.047 23.649 3.445 24.399 QT
3.844 25.149 4.719 25.149 QT
cp}def
f2011899593
f
GR
GS
[0.75 0 0 0.75 158.36272 136.53379] CT
N
/f595259469{14.411 26.415 M
14.411 25.759 L
20.286 16.993 L
20.348 16.899 20.473 16.899 QT
20.755 16.899 L
20.973 16.899 20.973 17.118 QT
20.973 25.759 L
22.833 25.759 L
22.833 26.415 L
20.973 26.415 L
20.973 28.29 L
20.973 28.681 21.528 28.782 QT
22.083 28.884 22.817 28.884 QT
22.817 29.556 L
17.583 29.556 L
17.583 28.884 L
18.317 28.884 18.872 28.782 QT
19.427 28.681 19.427 28.29 QT
19.427 26.415 L
14.411 26.415 L
cp
15.036 25.759 M
19.536 25.759 L
19.536 19.024 L
15.036 25.759 L
cp}def
f595259469
f
GR
GS
[0.75 0 0 0.75 158.36272 136.53379] CT
N
/f662991216{25.104 32.977 M
25.104 32.899 25.166 32.821 QT
25.854 32.165 26.236 31.298 QT
26.619 30.431 26.619 29.477 QT
26.619 29.243 L
26.307 29.556 25.854 29.556 QT
25.416 29.556 25.111 29.251 QT
24.807 28.946 24.807 28.509 QT
24.807 28.056 25.111 27.759 QT
25.416 27.462 25.854 27.462 QT
26.541 27.462 26.822 28.095 QT
27.104 28.727 27.104 29.477 QT
27.104 30.54 26.682 31.493 QT
26.26 32.446 25.494 33.196 QT
25.416 33.243 25.369 33.243 QT
25.275 33.243 25.19 33.157 QT
25.104 33.071 25.104 32.977 QT
cp}def
f662991216
f
GR
GS
[0.75 0 0 0.75 158.36272 136.53379] CT
N
/f173989414{29.867 29.227 M
29.867 29.118 29.883 29.071 QT
31.304 23.399 L
31.445 22.868 31.445 22.462 QT
31.445 21.649 30.883 21.649 QT
30.289 21.649 30 22.36 QT
29.711 23.071 29.445 24.149 QT
29.445 24.212 29.39 24.243 QT
29.336 24.274 29.289 24.274 QT
29.07 24.274 L
29.008 24.274 28.961 24.204 QT
28.914 24.134 28.914 24.087 QT
29.117 23.259 29.304 22.681 QT
29.492 22.102 29.898 21.634 QT
30.304 21.165 30.898 21.165 QT
31.617 21.165 32.164 21.61 QT
32.711 22.056 32.711 22.759 QT
33.273 22.009 34.039 21.587 QT
34.804 21.165 35.648 21.165 QT
36.554 21.165 37.211 21.618 QT
37.867 22.071 37.867 22.915 QT
38.445 22.102 39.226 21.634 QT
40.008 21.165 40.945 21.165 QT
41.929 21.165 42.523 21.696 QT
43.117 22.227 43.117 23.212 QT
43.117 23.993 42.773 25.095 QT
42.429 26.196 41.914 27.556 QT
41.633 28.212 41.633 28.696 QT
41.633 29.274 42.086 29.274 QT
42.82 29.274 43.312 28.47 QT
43.804 27.665 44.008 26.759 QT
44.07 26.649 44.164 26.649 QT
44.398 26.649 L
44.461 26.649 44.515 26.704 QT
44.57 26.759 44.57 26.821 QT
44.57 26.837 44.554 26.868 QT
44.289 27.946 43.648 28.86 QT
43.008 29.774 42.039 29.774 QT
41.367 29.774 40.898 29.313 QT
40.429 28.852 40.429 28.196 QT
40.429 27.852 40.586 27.446 QT
41.117 26.024 41.476 24.899 QT
41.836 23.774 41.836 22.915 QT
41.836 22.399 41.617 22.024 QT
41.398 21.649 40.898 21.649 QT
39.867 21.649 39.109 22.282 QT
38.351 22.915 37.789 23.977 QT
37.758 24.149 37.726 24.259 QT
36.508 29.134 L
36.445 29.399 36.218 29.587 QT
35.992 29.774 35.711 29.774 QT
35.492 29.774 35.32 29.626 QT
35.148 29.477 35.148 29.227 QT
35.148 29.118 35.164 29.071 QT
36.383 24.227 L
36.57 23.446 36.57 22.915 QT
36.57 22.399 36.351 22.024 QT
36.133 21.649 35.617 21.649 QT
34.914 21.649 34.336 21.954 QT
33.758 22.259 33.32 22.766 QT
32.883 23.274 32.523 23.977 QT
31.226 29.134 L
31.164 29.399 30.937 29.587 QT
30.711 29.774 30.429 29.774 QT
30.195 29.774 30.031 29.626 QT
29.867 29.477 29.867 29.227 QT
cp}def
f173989414
f
GR
GS
[0.75 0 0 0.75 158.36272 136.53379] CT
N
/f-1498425187{54.496 32.259 M
52.996 31.071 51.902 29.532 QT
50.809 27.993 50.121 26.251 QT
49.434 24.509 49.09 22.61 QT
48.746 20.712 48.746 18.806 QT
48.746 16.868 49.09 14.97 QT
49.434 13.071 50.137 11.321 QT
50.84 9.571 51.934 8.04 QT
53.027 6.509 54.496 5.352 QT
54.496 5.306 54.621 5.306 QT
54.871 5.306 L
54.949 5.306 55.019 5.376 QT
55.09 5.446 55.09 5.54 QT
55.09 5.665 55.027 5.712 QT
53.715 7.009 52.84 8.485 QT
51.965 9.962 51.426 11.626 QT
50.887 13.29 50.652 15.079 QT
50.418 16.868 50.418 18.806 QT
50.418 27.384 55.012 31.837 QT
55.09 31.931 55.09 32.071 QT
55.09 32.134 55.012 32.22 QT
54.934 32.306 54.871 32.306 QT
54.621 32.306 L
54.496 32.306 54.496 32.259 QT
cp}def
f-1498425187
f
GR
GS
[0.75 0 0 0.75 158.36272 136.53379] CT
N
/f-1223606318{58.163 23.368 M
58.163 22.977 58.241 22.618 QT
60.195 14.868 L
57.366 14.868 L
57.085 14.868 57.085 14.509 QT
57.195 13.915 57.445 13.915 QT
60.429 13.915 L
61.507 9.509 L
61.616 9.149 61.937 8.899 QT
62.257 8.649 62.648 8.649 QT
62.991 8.649 63.226 8.852 QT
63.46 9.056 63.46 9.399 QT
63.46 9.477 63.452 9.524 QT
63.445 9.571 63.429 9.634 QT
62.351 13.915 L
65.132 13.915 L
65.398 13.915 65.398 14.274 QT
65.398 14.337 65.351 14.493 QT
65.304 14.649 65.241 14.759 QT
65.179 14.868 65.054 14.868 QT
62.101 14.868 L
60.163 22.665 L
59.976 23.431 59.976 23.993 QT
59.976 25.149 60.757 25.149 QT
61.945 25.149 62.866 24.032 QT
63.788 22.915 64.273 21.587 QT
64.382 21.431 64.476 21.431 QT
64.804 21.431 L
64.913 21.431 64.984 21.501 QT
65.054 21.571 65.054 21.665 QT
65.054 21.712 65.023 21.743 QT
64.429 23.384 63.296 24.618 QT
62.163 25.852 60.695 25.852 QT
59.632 25.852 58.898 25.157 QT
58.163 24.462 58.163 23.368 QT
cp}def
f-1223606318
f
GR
GS
[0.75 0 0 0.75 158.36272 136.53379] CT
N
/f236917280{67.777 27.399 M
67.965 27.946 68.371 28.399 QT
68.777 28.852 69.324 29.11 QT
69.871 29.368 70.465 29.368 QT
71.84 29.368 72.363 28.306 QT
72.887 27.243 72.887 25.712 QT
72.887 25.056 72.863 24.602 QT
72.84 24.149 72.73 23.743 QT
72.559 23.071 72.121 22.571 QT
71.684 22.071 71.043 22.071 QT
70.402 22.071 69.941 22.266 QT
69.48 22.462 69.191 22.72 QT
68.902 22.977 68.684 23.266 QT
68.465 23.556 68.402 23.571 QT
68.184 23.571 L
68.137 23.571 68.074 23.509 QT
68.012 23.446 68.012 23.399 QT
68.012 17.056 L
68.012 17.009 68.066 16.954 QT
68.121 16.899 68.184 16.899 QT
68.246 16.899 L
69.527 17.509 70.965 17.509 QT
72.371 17.509 73.684 16.899 QT
73.73 16.899 L
73.809 16.899 73.863 16.946 QT
73.918 16.993 73.918 17.056 QT
73.918 17.227 L
73.918 17.321 73.871 17.321 QT
73.23 18.181 72.254 18.665 QT
71.277 19.149 70.215 19.149 QT
69.465 19.149 68.668 18.931 QT
68.668 22.524 L
69.293 22.009 69.793 21.79 QT
70.293 21.571 71.059 21.571 QT
72.105 21.571 72.934 22.181 QT
73.762 22.79 74.207 23.759 QT
74.652 24.727 74.652 25.727 QT
74.652 26.868 74.09 27.845 QT
73.527 28.821 72.566 29.399 QT
71.605 29.977 70.465 29.977 QT
69.543 29.977 68.754 29.493 QT
67.965 29.009 67.52 28.188 QT
67.074 27.368 67.074 26.462 QT
67.074 26.024 67.348 25.759 QT
67.621 25.493 68.043 25.493 QT
68.465 25.493 68.746 25.766 QT
69.027 26.04 69.027 26.462 QT
69.027 26.868 68.746 27.149 QT
68.465 27.431 68.043 27.431 QT
67.98 27.431 67.895 27.415 QT
67.809 27.399 67.777 27.399 QT
cp}def
f236917280
f
GR
GS
[0.75 0 0 0.75 158.36272 136.53379] CT
N
/f-46313393{78.538 32.306 M
78.303 32.306 78.303 32.071 QT
78.303 31.946 78.35 31.899 QT
82.975 27.384 82.975 18.806 QT
82.975 10.227 78.413 5.774 QT
78.303 5.696 78.303 5.54 QT
78.303 5.446 78.374 5.376 QT
78.444 5.306 78.538 5.306 QT
78.788 5.306 L
78.866 5.306 78.928 5.352 QT
80.866 6.884 82.155 9.071 QT
83.444 11.259 84.046 13.743 QT
84.647 16.227 84.647 18.806 QT
84.647 20.712 84.327 22.563 QT
84.007 24.415 83.296 26.22 QT
82.585 28.024 81.507 29.548 QT
80.428 31.071 78.928 32.259 QT
78.866 32.306 78.788 32.306 QT
78.538 32.306 L
cp}def
f-46313393
f
GR
GS
[0.75 0 0 0.75 251.36272 147.78379] CT
N
f1237405860
f
GR
GS
[0.75 0 0 0.75 251.36272 147.78379] CT
N
f2011899593
f
GR
GS
[0.75 0 0 0.75 251.36272 147.78379] CT
N
/f901382948{15.692 28.087 M
16.13 28.743 16.88 29.056 QT
17.63 29.368 18.505 29.368 QT
19.598 29.368 20.067 28.431 QT
20.536 27.493 20.536 26.29 QT
20.536 25.759 20.434 25.22 QT
20.333 24.681 20.106 24.212 QT
19.88 23.743 19.473 23.47 QT
19.067 23.196 18.489 23.196 QT
17.223 23.196 L
17.052 23.196 17.052 23.009 QT
17.052 22.852 L
17.052 22.696 17.223 22.696 QT
18.27 22.618 L
18.942 22.618 19.38 22.118 QT
19.817 21.618 20.02 20.899 QT
20.223 20.181 20.223 19.524 QT
20.223 18.618 19.802 18.032 QT
19.38 17.446 18.505 17.446 QT
17.77 17.446 17.114 17.72 QT
16.458 17.993 16.067 18.556 QT
16.114 18.54 16.137 18.54 QT
16.161 18.54 16.192 18.54 QT
16.63 18.54 16.919 18.837 QT
17.208 19.134 17.208 19.54 QT
17.208 19.946 16.919 20.243 QT
16.63 20.54 16.192 20.54 QT
15.786 20.54 15.489 20.243 QT
15.192 19.946 15.192 19.54 QT
15.192 18.727 15.684 18.126 QT
16.177 17.524 16.95 17.212 QT
17.723 16.899 18.505 16.899 QT
19.083 16.899 19.716 17.071 QT
20.348 17.243 20.872 17.563 QT
21.395 17.884 21.723 18.384 QT
22.052 18.884 22.052 19.524 QT
22.052 20.321 21.692 21.001 QT
21.333 21.681 20.716 22.173 QT
20.098 22.665 19.348 22.899 QT
20.177 23.056 20.919 23.524 QT
21.661 23.993 22.114 24.712 QT
22.567 25.431 22.567 26.274 QT
22.567 27.321 21.989 28.173 QT
21.411 29.024 20.473 29.501 QT
19.536 29.977 18.505 29.977 QT
17.614 29.977 16.716 29.634 QT
15.817 29.29 15.247 28.618 QT
14.677 27.946 14.677 26.993 QT
14.677 26.524 14.989 26.204 QT
15.302 25.884 15.786 25.884 QT
16.083 25.884 16.341 26.032 QT
16.598 26.181 16.739 26.438 QT
16.88 26.696 16.88 26.993 QT
16.88 27.462 16.559 27.774 QT
16.239 28.087 15.786 28.087 QT
15.692 28.087 L
cp}def
f901382948
f
GR
GS
[0.75 0 0 0.75 251.36272 147.78379] CT
N
f662991216
f
GR
GS
[0.75 0 0 0.75 251.36272 147.78379] CT
N
f173989414
f
GR
GS
[0.75 0 0 0.75 251.36272 147.78379] CT
N
f-1498425187
f
GR
GS
[0.75 0 0 0.75 251.36272 147.78379] CT
N
f-1223606318
f
GR
GS
[0.75 0 0 0.75 251.36272 147.78379] CT
N
f236917280
f
GR
GS
[0.75 0 0 0.75 251.36272 147.78379] CT
N
f-46313393
f
GR
GS
[0.75 0 0 0.75 0 -0.25] CT
1 0 0 RC
N
/f260923867{627.96 57.475 M
628 56.5 L
627.96 55.525 L
627.842 54.556 L
627.645 53.602 L
627.372 52.669 L
627.023 51.763 L
626.603 50.891 L
626.114 50.06 L
625.558 49.275 L
624.942 48.543 L
624.267 47.867 L
623.541 47.254 L
622.767 46.707 L
621.952 46.231 L
621.101 45.829 L
620.221 45.504 L
619.317 45.258 L
618.397 45.093 L
617.467 45.01 L
616.533 45.01 L
615.603 45.093 L
614.682 45.258 L
613.779 45.504 L
612.899 45.829 L
612.048 46.231 L
611.233 46.707 L
610.459 47.254 L
609.733 47.867 L
609.059 48.543 L
608.442 49.275 L
607.886 50.06 L
607.397 50.891 L
606.977 51.763 L
606.628 52.669 L
606.355 53.602 L
606.158 54.556 L
606.04 55.525 L
606 56.5 L
606.04 57.475 L
606.158 58.444 L
606.355 59.398 L
606.628 60.331 L
606.977 61.237 L
607.397 62.108 L
607.886 62.94 L
608.442 63.725 L
609.059 64.457 L
609.733 65.133 L
610.459 65.746 L
611.233 66.293 L
612.048 66.769 L
612.899 67.171 L
613.779 67.496 L
614.682 67.742 L
615.603 67.907 L
616.533 67.99 L
617.467 67.99 L
618.397 67.907 L
619.317 67.742 L
620.221 67.496 L
621.101 67.171 L
621.952 66.769 L
622.767 66.293 L
623.541 65.746 L
624.267 65.133 L
624.942 64.457 L
625.558 63.725 L
626.114 62.94 L
626.603 62.108 L
627.023 61.237 L
627.372 60.331 L
627.645 59.398 L
627.842 58.444 L
cp
804.96 179.475 M
805 178.5 L
804.96 177.525 L
804.842 176.556 L
804.645 175.602 L
804.372 174.669 L
804.024 173.763 L
803.603 172.892 L
803.114 172.06 L
802.558 171.275 L
801.942 170.543 L
801.267 169.867 L
800.541 169.254 L
799.767 168.707 L
798.952 168.231 L
798.101 167.829 L
797.221 167.504 L
796.317 167.258 L
795.397 167.093 L
794.467 167.01 L
793.533 167.01 L
792.603 167.093 L
791.683 167.258 L
790.779 167.504 L
789.899 167.829 L
789.048 168.231 L
788.233 168.707 L
787.459 169.254 L
786.733 169.867 L
786.058 170.543 L
785.442 171.275 L
784.886 172.06 L
784.397 172.892 L
783.977 173.763 L
783.628 174.669 L
783.355 175.602 L
783.158 176.556 L
783.04 177.525 L
783 178.5 L
783.04 179.475 L
783.158 180.443 L
783.355 181.398 L
783.628 182.331 L
783.977 183.237 L
784.397 184.108 L
784.886 184.94 L
785.442 185.725 L
786.058 186.457 L
786.733 187.133 L
787.459 187.746 L
788.233 188.293 L
789.048 188.769 L
789.899 189.171 L
790.779 189.496 L
791.683 189.742 L
792.603 189.907 L
793.533 189.99 L
794.467 189.99 L
795.397 189.907 L
796.317 189.742 L
797.221 189.496 L
798.101 189.171 L
798.952 188.769 L
799.767 188.293 L
800.541 187.746 L
801.267 187.133 L
801.942 186.457 L
802.558 185.725 L
803.114 184.94 L
803.603 184.108 L
804.024 183.237 L
804.372 182.331 L
804.645 181.398 L
804.842 180.443 L
cp
451.96 214.475 M
452 213.5 L
451.96 212.525 L
451.842 211.556 L
451.645 210.602 L
451.372 209.669 L
451.024 208.763 L
450.603 207.892 L
450.114 207.06 L
449.558 206.275 L
448.942 205.543 L
448.267 204.867 L
447.541 204.254 L
446.767 203.707 L
445.952 203.231 L
445.101 202.829 L
444.221 202.504 L
443.317 202.258 L
442.397 202.093 L
441.467 202.01 L
440.533 202.01 L
439.603 202.093 L
438.683 202.258 L
437.779 202.504 L
436.899 202.829 L
436.048 203.231 L
435.233 203.707 L
434.459 204.254 L
433.733 204.867 L
433.058 205.543 L
432.442 206.275 L
431.886 207.06 L
431.397 207.892 L
430.977 208.763 L
430.628 209.669 L
430.355 210.602 L
430.158 211.556 L
430.04 212.525 L
430 213.5 L
430.04 214.475 L
430.158 215.443 L
430.355 216.398 L
430.628 217.331 L
430.977 218.237 L
431.397 219.108 L
431.886 219.94 L
432.442 220.725 L
433.058 221.457 L
433.733 222.133 L
434.459 222.746 L
435.233 223.293 L
436.048 223.769 L
436.899 224.171 L
437.779 224.496 L
438.683 224.742 L
439.603 224.907 L
440.533 224.99 L
441.467 224.99 L
442.397 224.907 L
443.317 224.742 L
444.221 224.496 L
445.101 224.171 L
445.952 223.769 L
446.767 223.293 L
447.541 222.746 L
448.267 222.133 L
448.942 221.457 L
449.558 220.725 L
450.114 219.94 L
450.603 219.108 L
451.024 218.237 L
451.372 217.331 L
451.645 216.398 L
451.842 215.443 L
cp
225.96 314.475 M
226 313.5 L
225.96 312.525 L
225.842 311.556 L
225.645 310.602 L
225.372 309.669 L
225.024 308.763 L
224.603 307.892 L
224.114 307.06 L
223.558 306.275 L
222.942 305.543 L
222.267 304.867 L
221.541 304.254 L
220.767 303.707 L
219.952 303.231 L
219.101 302.829 L
218.221 302.504 L
217.317 302.258 L
216.397 302.093 L
215.467 302.01 L
214.533 302.01 L
213.603 302.093 L
212.683 302.258 L
211.779 302.504 L
210.899 302.829 L
210.048 303.231 L
209.233 303.707 L
208.459 304.254 L
207.733 304.867 L
207.058 305.543 L
206.442 306.275 L
205.886 307.06 L
205.397 307.892 L
204.976 308.763 L
204.628 309.669 L
204.355 310.602 L
204.158 311.556 L
204.04 312.525 L
204 313.5 L
204.04 314.475 L
204.158 315.444 L
204.355 316.398 L
204.628 317.331 L
204.976 318.237 L
205.397 319.108 L
205.886 319.94 L
206.442 320.725 L
207.058 321.457 L
207.733 322.133 L
208.459 322.746 L
209.233 323.293 L
210.048 323.769 L
210.899 324.171 L
211.779 324.496 L
212.683 324.742 L
213.603 324.907 L
214.533 324.99 L
215.467 324.99 L
216.397 324.907 L
217.317 324.742 L
218.221 324.496 L
219.101 324.171 L
219.952 323.769 L
220.767 323.293 L
221.541 322.746 L
222.267 322.133 L
222.942 321.457 L
223.558 320.725 L
224.114 319.94 L
224.603 319.108 L
225.024 318.237 L
225.372 317.331 L
225.645 316.398 L
225.842 315.444 L
cp}def
f260923867
f
GR
GS
[0.75 0 0 0.75 327.96437 168.61824] CT
N
f-1833028947
f
GR
GS
[0.75 0 0 0.75 327.96437 168.61824] CT
N
/f-855994398{11.442 24.931 M
11.88 25.587 12.63 25.9 QT
13.38 26.212 14.255 26.212 QT
15.348 26.212 15.817 25.275 QT
16.286 24.337 16.286 23.134 QT
16.286 22.603 16.184 22.064 QT
16.083 21.525 15.856 21.056 QT
15.63 20.587 15.223 20.314 QT
14.817 20.04 14.239 20.04 QT
12.973 20.04 L
12.802 20.04 12.802 19.853 QT
12.802 19.697 L
12.802 19.54 12.973 19.54 QT
14.02 19.462 L
14.692 19.462 15.13 18.962 QT
15.567 18.462 15.77 17.744 QT
15.973 17.025 15.973 16.369 QT
15.973 15.462 15.552 14.876 QT
15.13 14.29 14.255 14.29 QT
13.52 14.29 12.864 14.564 QT
12.208 14.837 11.817 15.4 QT
11.864 15.384 11.887 15.384 QT
11.911 15.384 11.942 15.384 QT
12.38 15.384 12.669 15.681 QT
12.958 15.978 12.958 16.384 QT
12.958 16.79 12.669 17.087 QT
12.38 17.384 11.942 17.384 QT
11.536 17.384 11.239 17.087 QT
10.942 16.79 10.942 16.384 QT
10.942 15.572 11.434 14.97 QT
11.927 14.369 12.7 14.056 QT
13.473 13.744 14.255 13.744 QT
14.833 13.744 15.466 13.915 QT
16.098 14.087 16.622 14.408 QT
17.145 14.728 17.473 15.228 QT
17.802 15.728 17.802 16.369 QT
17.802 17.165 17.442 17.845 QT
17.083 18.525 16.466 19.017 QT
15.848 19.509 15.098 19.744 QT
15.927 19.9 16.669 20.369 QT
17.411 20.837 17.864 21.556 QT
18.317 22.275 18.317 23.119 QT
18.317 24.165 17.739 25.017 QT
17.161 25.869 16.223 26.345 QT
15.286 26.822 14.255 26.822 QT
13.364 26.822 12.466 26.478 QT
11.567 26.134 10.997 25.462 QT
10.427 24.79 10.427 23.837 QT
10.427 23.369 10.739 23.048 QT
11.052 22.728 11.536 22.728 QT
11.833 22.728 12.091 22.876 QT
12.348 23.025 12.489 23.283 QT
12.63 23.54 12.63 23.837 QT
12.63 24.306 12.309 24.619 QT
11.989 24.931 11.536 24.931 QT
11.442 24.931 L
cp}def
f-855994398
f
GR
GS
[0.75 0 0 0.75 96.96436 23.11824] CT
N
/f-1257444556{0.594 22.4 M
0.594 21.025 L
2.891 21.025 3.141 20.775 QT
6.781 16.65 L
2.734 11.791 L
0.719 11.791 L
0.719 10.416 L
7.078 10.416 L
7.078 11.791 L
6.109 11.791 L
8.531 14.681 L
10.875 12.009 L
10.875 11.9 10.484 11.845 QT
10.094 11.791 9.859 11.791 QT
9.859 10.416 L
15.25 10.416 L
15.25 11.791 L
12.953 11.791 12.719 12.041 QT
9.422 15.759 L
13.797 21.025 L
15.828 21.025 L
15.828 22.4 L
9.453 22.4 L
9.453 21.025 L
10.453 21.025 L
7.672 17.728 L
4.969 20.806 L
4.969 20.9 5.359 20.962 QT
5.75 21.025 6 21.025 QT
6 22.4 L
0.594 22.4 L
cp}def
f-1257444556
f
GR
GS
[0.75 0 0 0.75 96.96436 23.11824] CT
N
/f-803425662{17.654 26.072 M
17.654 25.962 17.669 25.915 QT
19.091 20.244 L
19.232 19.712 19.232 19.306 QT
19.232 18.494 18.669 18.494 QT
18.076 18.494 17.787 19.205 QT
17.498 19.915 17.232 20.994 QT
17.232 21.056 17.177 21.087 QT
17.123 21.119 17.076 21.119 QT
16.857 21.119 L
16.794 21.119 16.748 21.048 QT
16.701 20.978 16.701 20.931 QT
16.904 20.103 17.091 19.525 QT
17.279 18.947 17.685 18.478 QT
18.091 18.009 18.685 18.009 QT
19.404 18.009 19.951 18.455 QT
20.498 18.9 20.498 19.603 QT
21.06 18.853 21.826 18.431 QT
22.591 18.009 23.435 18.009 QT
24.341 18.009 24.998 18.462 QT
25.654 18.915 25.654 19.759 QT
26.232 18.947 27.013 18.478 QT
27.794 18.009 28.732 18.009 QT
29.716 18.009 30.31 18.54 QT
30.904 19.072 30.904 20.056 QT
30.904 20.837 30.56 21.939 QT
30.216 23.04 29.701 24.4 QT
29.419 25.056 29.419 25.54 QT
29.419 26.119 29.873 26.119 QT
30.607 26.119 31.099 25.314 QT
31.591 24.509 31.794 23.603 QT
31.857 23.494 31.951 23.494 QT
32.185 23.494 L
32.248 23.494 32.302 23.548 QT
32.357 23.603 32.357 23.665 QT
32.357 23.681 32.341 23.712 QT
32.076 24.79 31.435 25.705 QT
30.794 26.619 29.826 26.619 QT
29.154 26.619 28.685 26.158 QT
28.216 25.697 28.216 25.04 QT
28.216 24.697 28.373 24.29 QT
28.904 22.869 29.263 21.744 QT
29.623 20.619 29.623 19.759 QT
29.623 19.244 29.404 18.869 QT
29.185 18.494 28.685 18.494 QT
27.654 18.494 26.896 19.126 QT
26.138 19.759 25.576 20.822 QT
25.544 20.994 25.513 21.103 QT
24.294 25.978 L
24.232 26.244 24.005 26.431 QT
23.779 26.619 23.498 26.619 QT
23.279 26.619 23.107 26.47 QT
22.935 26.322 22.935 26.072 QT
22.935 25.962 22.951 25.915 QT
24.169 21.072 L
24.357 20.29 24.357 19.759 QT
24.357 19.244 24.138 18.869 QT
23.919 18.494 23.404 18.494 QT
22.701 18.494 22.123 18.798 QT
21.544 19.103 21.107 19.611 QT
20.669 20.119 20.31 20.822 QT
19.013 25.978 L
18.951 26.244 18.724 26.431 QT
18.498 26.619 18.216 26.619 QT
17.982 26.619 17.818 26.47 QT
17.654 26.322 17.654 26.072 QT
cp}def
f-803425662
f
GR
GS
[0.75 0 0 0.75 96.96436 23.11824] CT
N
/f-890823355{42.283 29.103 M
40.783 27.916 39.689 26.376 QT
38.596 24.837 37.908 23.095 QT
37.221 21.353 36.877 19.455 QT
36.533 17.556 36.533 15.65 QT
36.533 13.712 36.877 11.814 QT
37.221 9.916 37.924 8.166 QT
38.627 6.416 39.721 4.884 QT
40.814 3.353 42.283 2.197 QT
42.283 2.15 42.408 2.15 QT
42.658 2.15 L
42.736 2.15 42.806 2.22 QT
42.877 2.291 42.877 2.384 QT
42.877 2.509 42.814 2.556 QT
41.502 3.853 40.627 5.33 QT
39.752 6.806 39.213 8.47 QT
38.674 10.134 38.439 11.923 QT
38.205 13.712 38.205 15.65 QT
38.205 24.228 42.799 28.681 QT
42.877 28.775 42.877 28.916 QT
42.877 28.978 42.799 29.064 QT
42.721 29.15 42.658 29.15 QT
42.408 29.15 L
42.283 29.15 42.283 29.103 QT
cp}def
f-890823355
f
GR
GS
[0.75 0 0 0.75 96.96436 23.11824] CT
N
/f246314812{45.95 20.212 M
45.95 19.822 46.028 19.462 QT
47.982 11.712 L
45.153 11.712 L
44.872 11.712 44.872 11.353 QT
44.982 10.759 45.232 10.759 QT
48.216 10.759 L
49.294 6.353 L
49.403 5.994 49.724 5.744 QT
50.044 5.494 50.435 5.494 QT
50.778 5.494 51.013 5.697 QT
51.247 5.9 51.247 6.244 QT
51.247 6.322 51.239 6.369 QT
51.232 6.416 51.216 6.478 QT
50.138 10.759 L
52.919 10.759 L
53.185 10.759 53.185 11.119 QT
53.185 11.181 53.138 11.337 QT
53.091 11.494 53.028 11.603 QT
52.966 11.712 52.841 11.712 QT
49.888 11.712 L
47.95 19.509 L
47.763 20.275 47.763 20.837 QT
47.763 21.994 48.544 21.994 QT
49.732 21.994 50.653 20.876 QT
51.575 19.759 52.06 18.431 QT
52.169 18.275 52.263 18.275 QT
52.591 18.275 L
52.7 18.275 52.771 18.345 QT
52.841 18.416 52.841 18.509 QT
52.841 18.556 52.81 18.587 QT
52.216 20.228 51.083 21.462 QT
49.95 22.697 48.482 22.697 QT
47.419 22.697 46.685 22.001 QT
45.95 21.306 45.95 20.212 QT
cp}def
f246314812
f
GR
GS
[0.75 0 0 0.75 96.96436 23.11824] CT
N
/f-523680091{55.564 24.244 M
55.752 24.79 56.158 25.244 QT
56.564 25.697 57.111 25.955 QT
57.658 26.212 58.252 26.212 QT
59.627 26.212 60.15 25.15 QT
60.674 24.087 60.674 22.556 QT
60.674 21.9 60.65 21.447 QT
60.627 20.994 60.517 20.587 QT
60.346 19.915 59.908 19.415 QT
59.471 18.915 58.83 18.915 QT
58.189 18.915 57.728 19.111 QT
57.267 19.306 56.978 19.564 QT
56.689 19.822 56.471 20.111 QT
56.252 20.4 56.189 20.415 QT
55.971 20.415 L
55.924 20.415 55.861 20.353 QT
55.799 20.29 55.799 20.244 QT
55.799 13.9 L
55.799 13.853 55.853 13.798 QT
55.908 13.744 55.971 13.744 QT
56.033 13.744 L
57.314 14.353 58.752 14.353 QT
60.158 14.353 61.471 13.744 QT
61.517 13.744 L
61.596 13.744 61.65 13.79 QT
61.705 13.837 61.705 13.9 QT
61.705 14.072 L
61.705 14.165 61.658 14.165 QT
61.017 15.025 60.041 15.509 QT
59.064 15.994 58.002 15.994 QT
57.252 15.994 56.455 15.775 QT
56.455 19.369 L
57.08 18.853 57.58 18.634 QT
58.08 18.415 58.846 18.415 QT
59.892 18.415 60.721 19.025 QT
61.549 19.634 61.994 20.603 QT
62.439 21.572 62.439 22.572 QT
62.439 23.712 61.877 24.689 QT
61.314 25.665 60.353 26.244 QT
59.392 26.822 58.252 26.822 QT
57.33 26.822 56.541 26.337 QT
55.752 25.853 55.306 25.033 QT
54.861 24.212 54.861 23.306 QT
54.861 22.869 55.135 22.603 QT
55.408 22.337 55.83 22.337 QT
56.252 22.337 56.533 22.611 QT
56.814 22.884 56.814 23.306 QT
56.814 23.712 56.533 23.994 QT
56.252 24.275 55.83 24.275 QT
55.767 24.275 55.681 24.259 QT
55.596 24.244 55.564 24.244 QT
cp}def
f-523680091
f
GR
GS
[0.75 0 0 0.75 96.96436 23.11824] CT
N
/f2106431499{66.325 29.15 M
66.09 29.15 66.09 28.916 QT
66.09 28.791 66.137 28.744 QT
70.762 24.228 70.762 15.65 QT
70.762 7.072 66.2 2.619 QT
66.09 2.541 66.09 2.384 QT
66.09 2.291 66.161 2.22 QT
66.231 2.15 66.325 2.15 QT
66.575 2.15 L
66.653 2.15 66.715 2.197 QT
68.653 3.728 69.942 5.916 QT
71.231 8.103 71.833 10.587 QT
72.434 13.072 72.434 15.65 QT
72.434 17.556 72.114 19.408 QT
71.793 21.259 71.083 23.064 QT
70.372 24.869 69.293 26.392 QT
68.215 27.916 66.715 29.103 QT
66.653 29.15 66.575 29.15 QT
66.325 29.15 L
cp}def
f2106431499
f
GR
GS
[0.75 0 0 0.75 424.6127 112.53378] CT
N
f1237405860
f
GR
GS
[0.75 0 0 0.75 424.6127 112.53378] CT
N
f2011899593
f
GR
GS
[0.75 0 0 0.75 424.6127 112.53378] CT
N
/f-1469002660{15.645 29.556 M
15.645 28.884 L
18.02 28.884 18.02 28.29 QT
18.02 18.306 L
17.036 18.79 15.536 18.79 QT
15.536 18.118 L
17.864 18.118 19.052 16.899 QT
19.317 16.899 L
19.38 16.899 19.442 16.954 QT
19.505 17.009 19.505 17.071 QT
19.505 28.29 L
19.505 28.884 21.88 28.884 QT
21.88 29.556 L
15.645 29.556 L
cp}def
f-1469002660
f
GR
GS
[0.75 0 0 0.75 424.6127 112.53378] CT
N
f662991216
f
GR
GS
[0.75 0 0 0.75 424.6127 112.53378] CT
N
f173989414
f
GR
GS
[0.75 0 0 0.75 424.6127 112.53378] CT
N
f-1498425187
f
GR
GS
[0.75 0 0 0.75 424.6127 112.53378] CT
N
f-1223606318
f
GR
GS
[0.75 0 0 0.75 424.6127 112.53378] CT
N
/f-370978875{67.887 29.556 M
67.887 28.884 L
70.262 28.884 70.262 28.29 QT
70.262 18.306 L
69.277 18.79 67.777 18.79 QT
67.777 18.118 L
70.105 18.118 71.293 16.899 QT
71.559 16.899 L
71.621 16.899 71.684 16.954 QT
71.746 17.009 71.746 17.071 QT
71.746 28.29 L
71.746 28.884 74.121 28.884 QT
74.121 29.556 L
67.887 29.556 L
cp}def
f-370978875
f
GR
GS
[0.75 0 0 0.75 424.6127 112.53378] CT
N
f-46313393
f
GR
GS
[0.75 0 0 0.75 319.61272 49.53379] CT
N
f1237405860
f
GR
GS
[0.75 0 0 0.75 319.61272 49.53379] CT
N
f2011899593
f
GR
GS
[0.75 0 0 0.75 319.61272 49.53379] CT
N
/f-458724492{14.833 29.556 M
14.833 29.04 L
14.833 28.993 14.864 28.946 QT
17.817 25.681 L
18.489 24.946 18.903 24.462 QT
19.317 23.977 19.723 23.337 QT
20.13 22.696 20.364 22.032 QT
20.598 21.368 20.598 20.618 QT
20.598 19.837 20.317 19.126 QT
20.036 18.415 19.466 17.993 QT
18.895 17.571 18.083 17.571 QT
17.255 17.571 16.598 18.063 QT
15.942 18.556 15.677 19.352 QT
15.739 19.337 15.88 19.337 QT
16.302 19.337 16.606 19.618 QT
16.911 19.899 16.911 20.368 QT
16.911 20.79 16.606 21.095 QT
16.302 21.399 15.88 21.399 QT
15.427 21.399 15.13 21.087 QT
14.833 20.774 14.833 20.368 QT
14.833 19.649 15.098 19.024 QT
15.364 18.399 15.872 17.907 QT
16.38 17.415 17.012 17.157 QT
17.645 16.899 18.364 16.899 QT
19.442 16.899 20.38 17.36 QT
21.317 17.821 21.864 18.657 QT
22.411 19.493 22.411 20.618 QT
22.411 21.446 22.052 22.188 QT
21.692 22.931 21.13 23.54 QT
20.567 24.149 19.684 24.915 QT
18.802 25.681 18.52 25.946 QT
16.364 28.009 L
18.192 28.009 L
19.536 28.009 20.442 27.985 QT
21.348 27.962 21.411 27.915 QT
21.63 27.681 21.864 26.165 QT
22.411 26.165 L
21.88 29.556 L
14.833 29.556 L
cp}def
f-458724492
f
GR
GS
[0.75 0 0 0.75 319.61272 49.53379] CT
N
f662991216
f
GR
GS
[0.75 0 0 0.75 319.61272 49.53379] CT
N
f173989414
f
GR
GS
[0.75 0 0 0.75 319.61272 49.53379] CT
N
f-1498425187
f
GR
GS
[0.75 0 0 0.75 319.61272 49.53379] CT
N
f-1223606318
f
GR
GS
[0.75 0 0 0.75 319.61272 49.53379] CT
N
f236917280
f
GR
GS
[0.75 0 0 0.75 319.61272 49.53379] CT
N
f-46313393
f
GR
%%Trailer
%%Pages: 1
%%EOF
