\relax 
\providecommand\hyper@newdestlabel[2]{}
\@writefile{toc}{\contentsline {chapter}{\numberline {9}Tests and On-field Results}{167}{chapter.9}\protected@file@percent }
\@writefile{lof}{\addvspace {10\p@ }}
\@writefile{lot}{\addvspace {10\p@ }}
\newlabel{ch:results}{{9}{167}{Tests and On-field Results}{chapter.9}{}}
\acronymused{CAPS.loc}
\acronymused{CAPS.loc}
\acronymused{CAPS.loc}
\acronymused{CP}
\acronymused{CAPS.loc}
\@writefile{toc}{\contentsline {section}{\numberline {9.1}Offline asynchronous measurements combination}{167}{section.9.1}\protected@file@percent }
\newlabel{sec:offline}{{9.1}{167}{Offline asynchronous measurements combination}{section.9.1}{}}
\acronymused{DD}
\acronymused{CAPS.loc}
\acronymused{ROS}
\acronymused{CAPS.loc}
\@writefile{toc}{\contentsline {subsection}{\numberline {9.1.1}Baseline length estimation through Android GNSS raw measurements}{168}{subsection.9.1.1}\protected@file@percent }
\acronymused{DD}
\acronymused{GNSS}
\acronymused{PoC}
\@writefile{toc}{\contentsline {subsubsection}{Static non-zero-baseline test}{168}{subsection.9.1.1}\protected@file@percent }
\acronymused{GPS}
\acronymused{GPS}
\@writefile{lof}{\contentsline {figure}{\numberline {9.1}{\ignorespaces {\relax \fontsize  {10}{12}\selectfont  \abovedisplayskip 10\p@ plus2\p@ minus5\p@ \abovedisplayshortskip \z@ plus3\p@ \belowdisplayshortskip 6\p@ plus3\p@ minus3\p@ \def \leftmargin \leftmargini \parsep 4.5\p@ plus2\p@ minus\p@ \topsep 9\p@ plus3\p@ minus5\p@ \itemsep 4.5\p@ plus2\p@ minus\p@ {\leftmargin \leftmargini \topsep 6\p@ plus2\p@ minus2\p@ \parsep 3\p@ plus2\p@ minus\p@ \itemsep \parsep }\belowdisplayskip \abovedisplayskip \SI {20}{\meter } baseline test with \ac {DDR} and \ac {APD} comparison. \ac {GDOP}$=2.0$ }\relax }}{168}{figure.caption.140}\protected@file@percent }
\acronymused{DDR}
\acronymused{APD}
\acronymused{GDOP}
\newlabel{fig:unfiltered}{{9.1}{168}{{\small \SI {20}{\meter } baseline test with \ac {DDR} and \ac {APD} comparison. \ac {GDOP}$=2.0$ }\relax }{figure.caption.140}{}}
\@writefile{lof}{\contentsline {figure}{\numberline {9.2}{\ignorespaces {\relax \fontsize  {10}{12}\selectfont  \abovedisplayskip 10\p@ plus2\p@ minus5\p@ \abovedisplayshortskip \z@ plus3\p@ \belowdisplayshortskip 6\p@ plus3\p@ minus3\p@ \def \leftmargin \leftmargini \parsep 4.5\p@ plus2\p@ minus\p@ \topsep 9\p@ plus3\p@ minus5\p@ \itemsep 4.5\p@ plus2\p@ minus\p@ {\leftmargin \leftmargini \topsep 6\p@ plus2\p@ minus2\p@ \parsep 3\p@ plus2\p@ minus\p@ \itemsep \parsep }\belowdisplayskip \abovedisplayskip \SI {20}{\meter } baseline test with DDR, W-DDR and \ac {APD} comparison. \ac {GDOP}$=2.5$, increased by filtering bad measurements}\relax }}{169}{figure.caption.141}\protected@file@percent }
\acronymused{APD}
\acronymused{GDOP}
\newlabel{fig:filtered}{{9.2}{169}{{\small \SI {20}{\meter } baseline test with DDR, W-DDR and \ac {APD} comparison. \ac {GDOP}$=2.5$, increased by filtering bad measurements}\relax }{figure.caption.141}{}}
\acronymused{DDR}
\acronymused{W-DDR}
\acronymused{APD}
\acronymused{PVT}
\acronymused{APD}
\acronymused{W-DDR}
\acronymused{APD}
\acronymused{GDOP}
\@writefile{toc}{\contentsline {section}{\numberline {9.2}Real-time CAPS.loc experiments}{169}{section.9.2}\protected@file@percent }
\newlabel{sec:capsResults}{{9.2}{169}{Real-time CAPS.loc experiments}{section.9.2}{}}
\acronymused{CAPS.loc}
\@writefile{lot}{\contentsline {table}{\numberline {9.1}{\ignorespaces Test with two Comparison of the quality of time-compensated GNSS-based ranges with different optimizations\relax }}{170}{table.caption.142}\protected@file@percent }
\newlabel{tab:offline}{{9.1}{170}{Test with two Comparison of the quality of time-compensated GNSS-based ranges with different optimizations\relax }{table.caption.142}{}}
\@writefile{lof}{\contentsline {figure}{\numberline {9.3}{\ignorespaces {\relax \fontsize  {10}{12}\selectfont  \abovedisplayskip 10\p@ plus2\p@ minus5\p@ \abovedisplayshortskip \z@ plus3\p@ \belowdisplayshortskip 6\p@ plus3\p@ minus3\p@ \def \leftmargin \leftmargini \parsep 4.5\p@ plus2\p@ minus\p@ \topsep 9\p@ plus3\p@ minus5\p@ \itemsep 4.5\p@ plus2\p@ minus\p@ {\leftmargin \leftmargini \topsep 6\p@ plus2\p@ minus2\p@ \parsep 3\p@ plus2\p@ minus\p@ \itemsep \parsep }\belowdisplayskip \abovedisplayskip Experiment setup exploiting 4G connectivity and \ac {CPS} on a remote server (Amazon Web Service).}\relax }}{170}{figure.caption.143}\protected@file@percent }
\acronymused{CPS}
\newlabel{fig:smarpthoneExpScheme}{{9.3}{170}{{\small Experiment setup exploiting 4G connectivity and \ac {CPS} on a remote server (Amazon Web Service).}\relax }{figure.caption.143}{}}
\@writefile{toc}{\contentsline {subsection}{\numberline {9.2.1}Setup}{170}{subsection.9.2.1}\protected@file@percent }
\newlabel{sub:setup}{{9.2.1}{170}{Setup}{subsection.9.2.1}{}}
\acronymused{CP}
\acronymused{CPA}
\acronymused{GNSS}
\acronymused{GPS}
\acronymused{EKF}
\acronymused{GNSS}
\acronymused{GNSS}
\acronymused{GNSS}
\acronymused{CPS}
\acronymused{CP}
\acronymused{CP}
\@writefile{lof}{\contentsline {figure}{\numberline {9.4}{\ignorespaces {\relax \fontsize  {10}{12}\selectfont  \abovedisplayskip 10\p@ plus2\p@ minus5\p@ \abovedisplayshortskip \z@ plus3\p@ \belowdisplayshortskip 6\p@ plus3\p@ minus3\p@ \def \leftmargin \leftmargini \parsep 4.5\p@ plus2\p@ minus\p@ \topsep 9\p@ plus3\p@ minus5\p@ \itemsep 4.5\p@ plus2\p@ minus\p@ {\leftmargin \leftmargini \topsep 6\p@ plus2\p@ minus2\p@ \parsep 3\p@ plus2\p@ minus\p@ \itemsep \parsep }\belowdisplayskip \abovedisplayskip Example of pedestrian urban paths with different profitability of the paradigm (greed dots indicate profitable integration). The cross marker indicates the origin of the local EN frame.}\relax }}{171}{figure.caption.144}\protected@file@percent }
\newlabel{fig:exampleCAPS-loc}{{9.4}{171}{{\small Example of pedestrian urban paths with different profitability of the paradigm (greed dots indicate profitable integration). The cross marker indicates the origin of the local EN frame.}\relax }{figure.caption.144}{}}
\acronymused{CPS}
\acronymused{ECEF}
\acronymused{LLA}
\@writefile{toc}{\contentsline {subsection}{\numberline {9.2.2}Performance metrics}{171}{subsection.9.2.2}\protected@file@percent }
\newlabel{subsec:metrics}{{9.2.2}{171}{Performance metrics}{subsection.9.2.2}{}}
\acronymused{GNSS}
\acronymused{CP}
\acronymused{CAPS.loc}
\acronymused{CP}
\acronymused{GNSS}
\newlabel{eq:cpAvail}{{9.1}{171}{Performance metrics}{equation.9.2.1}{}}
\acronymused{GNSS}
\acronymused{CP}
\acronymused{RMS}
\newlabel{eq:3DpositionError}{{9.2}{172}{Performance metrics}{equation.9.2.2}{}}
\newlabel{eq:2DpositionError}{{9.3}{172}{Performance metrics}{equation.9.2.3}{}}
\acronymused{ENU}
\acronymused{ENU}
\acronymused{ECEF}
\acronymused{ECEF}
\acronymused{CP}
\acronymused{CP}
\acronymused{CP}
\acronymused{CP}
\acronymused{GPS}
\newlabel{eq:Profit}{{9.4}{172}{Performance metrics}{equation.9.2.4}{}}
\@writefile{lof}{\contentsline {figure}{\numberline {9.5}{\ignorespaces {\relax \fontsize  {10}{12}\selectfont  \abovedisplayskip 10\p@ plus2\p@ minus5\p@ \abovedisplayshortskip \z@ plus3\p@ \belowdisplayshortskip 6\p@ plus3\p@ minus3\p@ \def \leftmargin \leftmargini \parsep 4.5\p@ plus2\p@ minus\p@ \topsep 9\p@ plus3\p@ minus5\p@ \itemsep 4.5\p@ plus2\p@ minus\p@ {\leftmargin \leftmargini \topsep 6\p@ plus2\p@ minus2\p@ \parsep 3\p@ plus2\p@ minus\p@ \itemsep \parsep }\belowdisplayskip \abovedisplayskip Classification of profitability according to the hysteresis threshold $T_{H}$}\relax }}{172}{figure.caption.145}\protected@file@percent }
\newlabel{fig:threshold}{{9.5}{172}{{\small Classification of profitability according to the hysteresis threshold $T_{H}$}\relax }{figure.caption.145}{}}
\acronymused{CP}
\acronymused{CP}
\acronymused{CP}
\@writefile{lof}{\contentsline {figure}{\numberline {9.6}{\ignorespaces {\relax \fontsize  {10}{12}\selectfont  \abovedisplayskip 10\p@ plus2\p@ minus5\p@ \abovedisplayshortskip \z@ plus3\p@ \belowdisplayshortskip 6\p@ plus3\p@ minus3\p@ \def \leftmargin \leftmargini \parsep 4.5\p@ plus2\p@ minus\p@ \topsep 9\p@ plus3\p@ minus5\p@ \itemsep 4.5\p@ plus2\p@ minus\p@ {\leftmargin \leftmargini \topsep 6\p@ plus2\p@ minus2\p@ \parsep 3\p@ plus2\p@ minus\p@ \itemsep \parsep }\belowdisplayskip \abovedisplayskip Sample Pie charts of \ac {CP} profitability for two different smarpthones}.\relax }}{173}{figure.caption.146}\protected@file@percent }
\acronymused{CP}
\newlabel{fig:04102019_ex03_piechart}{{9.6}{173}{{\small Sample Pie charts of \ac {CP} profitability for two different smarpthones}.\relax }{figure.caption.146}{}}
\acronymused{CP}
\acronymused{CP}
\acronymused{CP}
\newlabel{eq:meanErrorWhenProfitable}{{9.5}{173}{Performance metrics}{equation.9.2.5}{}}
\acronymused{GNSS}
\acronymused{CP}
\acronymused{CP}
\acronymused{CP}
\acronymused{GNSS}
\newlabel{eq:improvement}{{9.6}{173}{Performance metrics}{equation.9.2.6}{}}
\acronymused{GNSS}
\acronymused{GNSS}
\@writefile{lof}{\contentsline {figure}{\numberline {9.7}{\ignorespaces {\relax \fontsize  {10}{12}\selectfont  \abovedisplayskip 10\p@ plus2\p@ minus5\p@ \abovedisplayshortskip \z@ plus3\p@ \belowdisplayshortskip 6\p@ plus3\p@ minus3\p@ \def \leftmargin \leftmargini \parsep 4.5\p@ plus2\p@ minus\p@ \topsep 9\p@ plus3\p@ minus5\p@ \itemsep 4.5\p@ plus2\p@ minus\p@ {\leftmargin \leftmargini \topsep 6\p@ plus2\p@ minus2\p@ \parsep 3\p@ plus2\p@ minus\p@ \itemsep \parsep }\belowdisplayskip \abovedisplayskip Example of barplot showing superimposed (3-D and 2-D) of the positioning solution for profitable \ac {CP} and \ac {GNSS}-only (GPS) \ac {PVT} for dataset \texttt  {0210219-01}.}\relax }}{174}{figure.caption.147}\protected@file@percent }
\acronymused{CP}
\acronymused{GNSS}
\acronymused{PVT}
\newlabel{fig:0210219-ex01_barplot}{{9.7}{174}{{\small Example of barplot showing superimposed (3-D and 2-D) of the positioning solution for profitable \ac {CP} and \ac {GNSS}-only (GPS) \ac {PVT} for dataset \texttt {0210219-01}.}\relax }{figure.caption.147}{}}
\@writefile{toc}{\contentsline {subsection}{\numberline {9.2.3}Test Scenarios}{174}{subsection.9.2.3}\protected@file@percent }
\newlabel{subsec:testscenarios}{{9.2.3}{174}{Test Scenarios}{subsection.9.2.3}{}}
\@writefile{toc}{\contentsline {subsubsection}{Agents dynamics}{174}{subsection.9.2.3}\protected@file@percent }
\acronymused{GNSS}
\acronymused{GNSS}
\acronymused{CP}
\acronymused{GNSS}
\newlabel{fig:relDynamic01}{{9.8a}{175}{Type \textbf {B}\relax }{figure.caption.148}{}}
\newlabel{sub@fig:relDynamic01}{{a}{175}{Type \textbf {B}\relax }{figure.caption.148}{}}
\newlabel{fig:relDynamic02}{{9.8b}{175}{Type \textbf {C}\relax }{figure.caption.148}{}}
\newlabel{sub@fig:relDynamic02}{{b}{175}{Type \textbf {C}\relax }{figure.caption.148}{}}
\newlabel{fig:relDynamic03}{{9.8c}{175}{Type \textbf {D}\relax }{figure.caption.148}{}}
\newlabel{sub@fig:relDynamic03}{{c}{175}{Type \textbf {D}\relax }{figure.caption.148}{}}
\@writefile{lof}{\contentsline {figure}{\numberline {9.8}{\ignorespaces \relax \fontsize  {10}{12}\selectfont  \abovedisplayskip 10\p@ plus2\p@ minus5\p@ \abovedisplayshortskip \z@ plus3\p@ \belowdisplayshortskip 6\p@ plus3\p@ minus3\p@ \def \leftmargin \leftmargini \parsep 4.5\p@ plus2\p@ minus\p@ \topsep 9\p@ plus3\p@ minus5\p@ \itemsep 4.5\p@ plus2\p@ minus\p@ {\leftmargin \leftmargini \topsep 6\p@ plus2\p@ minus2\p@ \parsep 3\p@ plus2\p@ minus\p@ \itemsep \parsep }\belowdisplayskip \abovedisplayskip Relative dynamics example between two cooperating agents.\relax }}{175}{figure.caption.148}\protected@file@percent }
\newlabel{fig:dynamicsTest}{{9.8}{175}{\small Relative dynamics example between two cooperating agents.\relax }{figure.caption.148}{}}
\@writefile{toc}{\contentsline {subsubsection}{Baseline length}{175}{figure.caption.148}\protected@file@percent }
\acronymused{CAPS.loc}
\@writefile{toc}{\contentsline {section}{\numberline {9.3}Results}{175}{section.9.3}\protected@file@percent }
\newlabel{sec:results_detail}{{9.3}{175}{Results}{section.9.3}{}}
\acronymused{CP}
\@writefile{lot}{\contentsline {table}{\numberline {9.2}{\ignorespaces List of experiments conducted within the internal CAPS.loc test campaign in October 2019. The blue rows indicate the selected samples detailed in \ref  {sec:results_detail}.\relax }}{176}{table.caption.149}\protected@file@percent }
\newlabel{tab:experimentTable}{{9.2}{176}{List of experiments conducted within the internal CAPS.loc test campaign in October 2019. The blue rows indicate the selected samples detailed in \ref {sec:results_detail}.\relax }{table.caption.149}{}}
\@writefile{toc}{\contentsline {subsubsection}{Experiment f-01 16102019-01-A: Static receivers at zero-baseline}{176}{section.9.3}\protected@file@percent }
\acronymused{GPS}
\acronymused{EKF}
\acronymused{CAPS.loc}
\acronymused{CP}
\@writefile{lof}{\contentsline {figure}{\numberline {9.9}{\ignorespaces {\relax \fontsize  {10}{12}\selectfont  \abovedisplayskip 10\p@ plus2\p@ minus5\p@ \abovedisplayshortskip \z@ plus3\p@ \belowdisplayshortskip 6\p@ plus3\p@ minus3\p@ \def \leftmargin \leftmargini \parsep 4.5\p@ plus2\p@ minus\p@ \topsep 9\p@ plus3\p@ minus5\p@ \itemsep 4.5\p@ plus2\p@ minus\p@ {\leftmargin \leftmargini \topsep 6\p@ plus2\p@ minus2\p@ \parsep 3\p@ plus2\p@ minus\p@ \itemsep \parsep }\belowdisplayskip \abovedisplayskip Pie charts of \ac {CP} profitability for the two smarpthone in the experiment \texttt  {f-01}}\relax }}{177}{figure.caption.150}\protected@file@percent }
\acronymused{CP}
\newlabel{fig:16102019_ex01_piechart}{{9.9}{177}{{\small Pie charts of \ac {CP} profitability for the two smarpthone in the experiment \texttt {f-01}}\relax }{figure.caption.150}{}}
\@writefile{lof}{\contentsline {figure}{\numberline {9.10}{\ignorespaces {\relax \fontsize  {10}{12}\selectfont  \abovedisplayskip 10\p@ plus2\p@ minus5\p@ \abovedisplayshortskip \z@ plus3\p@ \belowdisplayshortskip 6\p@ plus3\p@ minus3\p@ \def \leftmargin \leftmargini \parsep 4.5\p@ plus2\p@ minus\p@ \topsep 9\p@ plus3\p@ minus5\p@ \itemsep 4.5\p@ plus2\p@ minus\p@ {\leftmargin \leftmargini \topsep 6\p@ plus2\p@ minus2\p@ \parsep 3\p@ plus2\p@ minus\p@ \itemsep \parsep }\belowdisplayskip \abovedisplayskip Time series of profitability/unprofitability of \ac {CP} in the experiment \texttt  {F-01}.}\relax }}{177}{figure.caption.151}\protected@file@percent }
\acronymused{CP}
\newlabel{fig:binary_profit}{{9.10}{177}{{\small Time series of profitability/unprofitability of \ac {CP} in the experiment \texttt {F-01}.}\relax }{figure.caption.151}{}}
\@writefile{toc}{\contentsline {subsubsection}{Experiment d-02 11102019-02-B: side-by-side pedestrian walk with variable speed and baseline}{177}{figure.caption.151}\protected@file@percent }
\acronymused{GPS}
\acronymused{EKF}
\@writefile{lof}{\contentsline {figure}{\numberline {9.11}{\ignorespaces {\relax \fontsize  {10}{12}\selectfont  \abovedisplayskip 10\p@ plus2\p@ minus5\p@ \abovedisplayshortskip \z@ plus3\p@ \belowdisplayshortskip 6\p@ plus3\p@ minus3\p@ \def \leftmargin \leftmargini \parsep 4.5\p@ plus2\p@ minus\p@ \topsep 9\p@ plus3\p@ minus5\p@ \itemsep 4.5\p@ plus2\p@ minus\p@ {\leftmargin \leftmargini \topsep 6\p@ plus2\p@ minus2\p@ \parsep 3\p@ plus2\p@ minus\p@ \itemsep \parsep }\belowdisplayskip \abovedisplayskip Pie charts of \ac {CP} profitability for the two smartphones in the experiment \texttt  {d-02}.}\relax }}{178}{figure.caption.152}\protected@file@percent }
\acronymused{CP}
\newlabel{fig:d02_piechart}{{9.11}{178}{{\small Pie charts of \ac {CP} profitability for the two smartphones in the experiment \texttt {d-02}.}\relax }{figure.caption.152}{}}
\acronymused{GNSS}
\@writefile{toc}{\contentsline {subsubsection}{Experiment g-05 30102019-05-D: Vehicular (Bicycle) and pedestrian dynamics with variable speed and baseline}{178}{figure.caption.152}\protected@file@percent }
\acronymused{GPS}
\acronymused{EKF}
\@writefile{lof}{\contentsline {figure}{\numberline {9.12}{\ignorespaces {\relax \fontsize  {10}{12}\selectfont  \abovedisplayskip 10\p@ plus2\p@ minus5\p@ \abovedisplayshortskip \z@ plus3\p@ \belowdisplayshortskip 6\p@ plus3\p@ minus3\p@ \def \leftmargin \leftmargini \parsep 4.5\p@ plus2\p@ minus\p@ \topsep 9\p@ plus3\p@ minus5\p@ \itemsep 4.5\p@ plus2\p@ minus\p@ {\leftmargin \leftmargini \topsep 6\p@ plus2\p@ minus2\p@ \parsep 3\p@ plus2\p@ minus\p@ \itemsep \parsep }\belowdisplayskip \abovedisplayskip Pie charts of \ac {CP} profitability for the two smartphones in the experiment \texttt  {g-05}.}\relax }}{179}{figure.caption.153}\protected@file@percent }
\acronymused{CP}
\newlabel{fig:g05_piechart}{{9.12}{179}{{\small Pie charts of \ac {CP} profitability for the two smartphones in the experiment \texttt {g-05}.}\relax }{figure.caption.153}{}}
\acronymused{EKF}
\acronymused{CP}
\acronymused{CP}
\@writefile{toc}{\contentsline {subsubsection}{Experiment c-01 04102019-01-C: Pedestrian relative dynamics with variable speed, baseline and altitude}{179}{figure.caption.153}\protected@file@percent }
\acronymused{GPS}
\acronymused{EKF}
\@writefile{lof}{\contentsline {figure}{\numberline {9.13}{\ignorespaces {\relax \fontsize  {10}{12}\selectfont  \abovedisplayskip 10\p@ plus2\p@ minus5\p@ \abovedisplayshortskip \z@ plus3\p@ \belowdisplayshortskip 6\p@ plus3\p@ minus3\p@ \def \leftmargin \leftmargini \parsep 4.5\p@ plus2\p@ minus\p@ \topsep 9\p@ plus3\p@ minus5\p@ \itemsep 4.5\p@ plus2\p@ minus\p@ {\leftmargin \leftmargini \topsep 6\p@ plus2\p@ minus2\p@ \parsep 3\p@ plus2\p@ minus\p@ \itemsep \parsep }\belowdisplayskip \abovedisplayskip Example of pedestrian urban scenario with anchored variable baseline vector (experiment C-01) which exploit the CAPS.loc framework for \ac {CP}.}\relax }}{180}{figure.caption.154}\protected@file@percent }
\acronymused{CP}
\newlabel{fig:exampleScenario}{{9.13}{180}{{\small Example of pedestrian urban scenario with anchored variable baseline vector (experiment C-01) which exploit the CAPS.loc framework for \ac {CP}.}\relax }{figure.caption.154}{}}
\@writefile{lof}{\contentsline {figure}{\numberline {9.14}{\ignorespaces {\relax \fontsize  {10}{12}\selectfont  \abovedisplayskip 10\p@ plus2\p@ minus5\p@ \abovedisplayshortskip \z@ plus3\p@ \belowdisplayshortskip 6\p@ plus3\p@ minus3\p@ \def \leftmargin \leftmargini \parsep 4.5\p@ plus2\p@ minus\p@ \topsep 9\p@ plus3\p@ minus5\p@ \itemsep 4.5\p@ plus2\p@ minus\p@ {\leftmargin \leftmargini \topsep 6\p@ plus2\p@ minus2\p@ \parsep 3\p@ plus2\p@ minus\p@ \itemsep \parsep }\belowdisplayskip \abovedisplayskip Pie charts of \ac {CP} profitability for the two smartphones in the experiment \texttt  {c-01}.}\relax }}{180}{figure.caption.155}\protected@file@percent }
\acronymused{CP}
\newlabel{fig:c01_piechart}{{9.14}{180}{{\small Pie charts of \ac {CP} profitability for the two smartphones in the experiment \texttt {c-01}.}\relax }{figure.caption.155}{}}
\acronymused{EKF}
\acronymused{SM02}
\@writefile{lof}{\contentsline {figure}{\numberline {9.15}{\ignorespaces {\relax \fontsize  {10}{12}\selectfont  \abovedisplayskip 10\p@ plus2\p@ minus5\p@ \abovedisplayshortskip \z@ plus3\p@ \belowdisplayshortskip 6\p@ plus3\p@ minus3\p@ \def \leftmargin \leftmargini \parsep 4.5\p@ plus2\p@ minus\p@ \topsep 9\p@ plus3\p@ minus5\p@ \itemsep 4.5\p@ plus2\p@ minus\p@ {\leftmargin \leftmargini \topsep 6\p@ plus2\p@ minus2\p@ \parsep 3\p@ plus2\p@ minus\p@ \itemsep \parsep }\belowdisplayskip \abovedisplayskip Collection of mean errors comparisons for the experiments described in \ref  {sec:results_detail}}\relax }}{181}{figure.caption.156}\protected@file@percent }
\newlabel{fig:all_exampleImprovement}{{9.15}{181}{{\small Collection of mean errors comparisons for the experiments described in \ref {sec:results_detail}}\relax }{figure.caption.156}{}}
\@writefile{lof}{\contentsline {figure}{\numberline {9.16}{\ignorespaces {\relax \fontsize  {10}{12}\selectfont  \abovedisplayskip 10\p@ plus2\p@ minus5\p@ \abovedisplayshortskip \z@ plus3\p@ \belowdisplayshortskip 6\p@ plus3\p@ minus3\p@ \def \leftmargin \leftmargini \parsep 4.5\p@ plus2\p@ minus\p@ \topsep 9\p@ plus3\p@ minus5\p@ \itemsep 4.5\p@ plus2\p@ minus\p@ {\leftmargin \leftmargini \topsep 6\p@ plus2\p@ minus2\p@ \parsep 3\p@ plus2\p@ minus\p@ \itemsep \parsep }\belowdisplayskip \abovedisplayskip Collection of \ac {CDF}s for the sample experiments described in Section \ref  {sec:results_detail}}.\relax }}{182}{figure.caption.157}\protected@file@percent }
\acronymused{CDF}
\newlabel{fig:all_CDF}{{9.16}{182}{{\small Collection of \ac {CDF}s for the sample experiments described in Section \ref {sec:results_detail}}.\relax }{figure.caption.157}{}}
\acronymused{CDF}
\@writefile{toc}{\contentsline {subsection}{\numberline {9.3.1}Summary of experimental results and general comments}{183}{subsection.9.3.1}\protected@file@percent }
\newlabel{sub:summary}{{9.3.1}{183}{Summary of experimental results and general comments}{subsection.9.3.1}{}}
\@writefile{lot}{\contentsline {table}{\numberline {9.3}{\ignorespaces Xiaomi Mi 8 Pro [SM01]: Static and semi-kinematic pedestrian tests in proximity to Politecnico Campus (Mixed urban environment). $T_{H}=\SI {0.05}{\meter }$.\relax }}{183}{table.caption.158}\protected@file@percent }
\newlabel{tab:resSM01}{{9.3}{183}{Xiaomi Mi 8 Pro [SM01]: Static and semi-kinematic pedestrian tests in proximity to Politecnico Campus (Mixed urban environment). $T_{H}=\SI {0.05}{\meter }$.\relax }{table.caption.158}{}}
\acronymused{CAPS.loc}
\@writefile{lot}{\contentsline {table}{\numberline {9.4}{\ignorespaces Xiaomi Mi 8 Pro [SM02]: Static and semi-kinematic pedestrian tests in proximity to Politecnico Campus (Mixed urban environment). $T_{H}=\SI {0.05}{\meter }$.\relax }}{184}{table.caption.159}\protected@file@percent }
\newlabel{tab:resSM02}{{9.4}{184}{Xiaomi Mi 8 Pro [SM02]: Static and semi-kinematic pedestrian tests in proximity to Politecnico Campus (Mixed urban environment). $T_{H}=\SI {0.05}{\meter }$.\relax }{table.caption.159}{}}
\@writefile{toc}{\contentsline {subsubsection}{Availability}{185}{table.caption.159}\protected@file@percent }
\acronymused{CP}
\acronymused{CP}
\acronymused{CAPS.loc}
\acronymused{CRM}
\@writefile{toc}{\contentsline {subsubsection}{Expected improvement in real scenarios}{185}{table.caption.159}\protected@file@percent }
\acronymused{CP}
\acronymused{CP}
\@writefile{toc}{\contentsline {section}{\numberline {9.4}Final remarks and further works}{185}{section.9.4}\protected@file@percent }
\newlabel{sec:furtherworks}{{9.4}{185}{Final remarks and further works}{section.9.4}{}}
\acronymused{CAPS.loc}
\acronymused{CP}
\acronymused{GNSS}
\acronymused{CP}
\acronymused{CAPS.loc}
\acronymused{CAPS.loc}
\acronymused{CRU}
\acronymused{H-PVT}
\acronymused{GNSS}
\acronymused{GNSS}
\acronymused{CRLB}
\acronymused{CPA}
\@setckpt{Chapter9/chapter9}{
\setcounter{page}{187}
\setcounter{equation}{6}
\setcounter{enumi}{4}
\setcounter{enumii}{0}
\setcounter{enumiii}{0}
\setcounter{enumiv}{0}
\setcounter{footnote}{0}
\setcounter{mpfootnote}{0}
\setcounter{part}{0}
\setcounter{chapter}{9}
\setcounter{section}{4}
\setcounter{subsection}{0}
\setcounter{subsubsection}{0}
\setcounter{paragraph}{0}
\setcounter{subparagraph}{0}
\setcounter{figure}{16}
\setcounter{table}{4}
\setcounter{SDpage}{0}
\setcounter{NumberSD}{0}
\setcounter{tomo}{0}
\setcounter{parentequation}{0}
\setcounter{caption@flags}{0}
\setcounter{ContinuedFloat}{0}
\setcounter{subfigure}{0}
\setcounter{subtable}{0}
\setcounter{float@type}{16}
\setcounter{tabx@nest}{0}
\setcounter{listtotal}{0}
\setcounter{listcount}{0}
\setcounter{liststart}{0}
\setcounter{liststop}{0}
\setcounter{citecount}{0}
\setcounter{citetotal}{0}
\setcounter{multicitecount}{0}
\setcounter{multicitetotal}{0}
\setcounter{instcount}{403}
\setcounter{maxnames}{3}
\setcounter{minnames}{1}
\setcounter{maxitems}{3}
\setcounter{minitems}{1}
\setcounter{citecounter}{0}
\setcounter{maxcitecounter}{0}
\setcounter{savedcitecounter}{0}
\setcounter{uniquelist}{0}
\setcounter{uniquename}{0}
\setcounter{refsection}{0}
\setcounter{refsegment}{0}
\setcounter{maxextratitle}{0}
\setcounter{maxextratitleyear}{0}
\setcounter{maxextraname}{5}
\setcounter{maxextradate}{0}
\setcounter{maxextraalpha}{0}
\setcounter{abbrvpenalty}{50}
\setcounter{highnamepenalty}{50}
\setcounter{lownamepenalty}{25}
\setcounter{maxparens}{3}
\setcounter{parenlevel}{0}
\setcounter{mincomprange}{10}
\setcounter{maxcomprange}{100000}
\setcounter{mincompwidth}{1}
\setcounter{afterword}{0}
\setcounter{savedafterword}{0}
\setcounter{annotator}{0}
\setcounter{savedannotator}{0}
\setcounter{author}{0}
\setcounter{savedauthor}{0}
\setcounter{bookauthor}{0}
\setcounter{savedbookauthor}{0}
\setcounter{commentator}{0}
\setcounter{savedcommentator}{0}
\setcounter{editor}{0}
\setcounter{savededitor}{0}
\setcounter{editora}{0}
\setcounter{savededitora}{0}
\setcounter{editorb}{0}
\setcounter{savededitorb}{0}
\setcounter{editorc}{0}
\setcounter{savededitorc}{0}
\setcounter{foreword}{0}
\setcounter{savedforeword}{0}
\setcounter{holder}{0}
\setcounter{savedholder}{0}
\setcounter{introduction}{0}
\setcounter{savedintroduction}{0}
\setcounter{namea}{0}
\setcounter{savednamea}{0}
\setcounter{nameb}{0}
\setcounter{savednameb}{0}
\setcounter{namec}{0}
\setcounter{savednamec}{0}
\setcounter{translator}{0}
\setcounter{savedtranslator}{0}
\setcounter{shortauthor}{0}
\setcounter{savedshortauthor}{0}
\setcounter{shorteditor}{0}
\setcounter{savedshorteditor}{0}
\setcounter{labelname}{0}
\setcounter{savedlabelname}{0}
\setcounter{institution}{0}
\setcounter{savedinstitution}{0}
\setcounter{lista}{0}
\setcounter{savedlista}{0}
\setcounter{listb}{0}
\setcounter{savedlistb}{0}
\setcounter{listc}{0}
\setcounter{savedlistc}{0}
\setcounter{listd}{0}
\setcounter{savedlistd}{0}
\setcounter{liste}{0}
\setcounter{savedliste}{0}
\setcounter{listf}{0}
\setcounter{savedlistf}{0}
\setcounter{location}{0}
\setcounter{savedlocation}{0}
\setcounter{organization}{0}
\setcounter{savedorganization}{0}
\setcounter{origlocation}{0}
\setcounter{savedoriglocation}{0}
\setcounter{origpublisher}{0}
\setcounter{savedorigpublisher}{0}
\setcounter{publisher}{0}
\setcounter{savedpublisher}{0}
\setcounter{language}{0}
\setcounter{savedlanguage}{0}
\setcounter{origlanguage}{0}
\setcounter{savedoriglanguage}{0}
\setcounter{pageref}{0}
\setcounter{savedpageref}{0}
\setcounter{textcitecount}{0}
\setcounter{textcitetotal}{0}
\setcounter{textcitemaxnames}{0}
\setcounter{biburlnumpenalty}{0}
\setcounter{biburlucpenalty}{0}
\setcounter{biburllcpenalty}{0}
\setcounter{smartand}{1}
\setcounter{bbx:relatedcount}{0}
\setcounter{bbx:relatedtotal}{0}
\setcounter{Item}{9}
\setcounter{Hfootnote}{2}
\setcounter{bookmark@seq@number}{126}
\setcounter{nlinenum}{0}
\setcounter{algorithm}{1}
\setcounter{ALC@unique}{6}
\setcounter{ALC@line}{6}
\setcounter{ALC@rem}{0}
\setcounter{ALC@depth}{0}
\setcounter{lstnumber}{1}
\setcounter{FancyVerbLine}{0}
\setcounter{section@level}{0}
\setcounter{lstlisting}{0}
}
