%!PS-Adobe-3.0 EPSF-3.0
%%Creator: (MATLAB, The Mathworks, Inc. Version 9.5.0.944444 \(R2018b\). Operating System: Windows 10)
%%Title: (C:/Users/Alex/Documents/PhD Docs/01. GIT/my_phd_thesis/Chapter8/Figures/capsloc_res/16102019_exp01_SM01_trajAndProfit.eps)
%%CreationDate: 2019-10-31T17:00:22
%%Pages: (atend)
%%BoundingBox: 0 0 510 438
%%LanguageLevel: 3
%%EndComments
%%BeginProlog
%%BeginResource: procset (Apache XML Graphics Std ProcSet) 1.2 0
%%Version: 1.2 0
%%Copyright: (Copyright 2001-2003,2010 The Apache Software Foundation. License terms: http://www.apache.org/licenses/LICENSE-2.0)
/bd{bind def}bind def
/ld{load def}bd
/GR/grestore ld
/GS/gsave ld
/RM/rmoveto ld
/C/curveto ld
/t/show ld
/L/lineto ld
/ML/setmiterlimit ld
/CT/concat ld
/f/fill ld
/N/newpath ld
/S/stroke ld
/CC/setcmykcolor ld
/A/ashow ld
/cp/closepath ld
/RC/setrgbcolor ld
/LJ/setlinejoin ld
/GC/setgray ld
/LW/setlinewidth ld
/M/moveto ld
/re {4 2 roll M
1 index 0 rlineto
0 exch rlineto
neg 0 rlineto
cp } bd
/_ctm matrix def
/_tm matrix def
/BT { _ctm currentmatrix pop matrix _tm copy pop 0 0 moveto } bd
/ET { _ctm setmatrix } bd
/iTm { _ctm setmatrix _tm concat } bd
/Tm { _tm astore pop iTm 0 0 moveto } bd
/ux 0.0 def
/uy 0.0 def
/F {
  /Tp exch def
  /Tf exch def
  Tf findfont Tp scalefont setfont
  /cf Tf def  /cs Tp def
} bd
/ULS {currentpoint /uy exch def /ux exch def} bd
/ULE {
  /Tcx currentpoint pop def
  gsave
  newpath
  cf findfont cs scalefont dup
  /FontMatrix get 0 get /Ts exch def /FontInfo get dup
  /UnderlinePosition get Ts mul /To exch def
  /UnderlineThickness get Ts mul /Tt exch def
  ux uy To add moveto  Tcx uy To add lineto
  Tt setlinewidth stroke
  grestore
} bd
/OLE {
  /Tcx currentpoint pop def
  gsave
  newpath
  cf findfont cs scalefont dup
  /FontMatrix get 0 get /Ts exch def /FontInfo get dup
  /UnderlinePosition get Ts mul /To exch def
  /UnderlineThickness get Ts mul /Tt exch def
  ux uy To add cs add moveto Tcx uy To add cs add lineto
  Tt setlinewidth stroke
  grestore
} bd
/SOE {
  /Tcx currentpoint pop def
  gsave
  newpath
  cf findfont cs scalefont dup
  /FontMatrix get 0 get /Ts exch def /FontInfo get dup
  /UnderlinePosition get Ts mul /To exch def
  /UnderlineThickness get Ts mul /Tt exch def
  ux uy To add cs 10 mul 26 idiv add moveto Tcx uy To add cs 10 mul 26 idiv add lineto
  Tt setlinewidth stroke
  grestore
} bd
/QT {
/Y22 exch store
/X22 exch store
/Y21 exch store
/X21 exch store
currentpoint
/Y21 load 2 mul add 3 div exch
/X21 load 2 mul add 3 div exch
/X21 load 2 mul /X22 load add 3 div
/Y21 load 2 mul /Y22 load add 3 div
/X22 load /Y22 load curveto
} bd
/SSPD {
dup length /d exch dict def
{
/v exch def
/k exch def
currentpagedevice k known {
/cpdv currentpagedevice k get def
v cpdv ne {
/upd false def
/nullv v type /nulltype eq def
/nullcpdv cpdv type /nulltype eq def
nullv nullcpdv or
{
/upd true def
} {
/sametype v type cpdv type eq def
sametype {
v type /arraytype eq {
/vlen v length def
/cpdvlen cpdv length def
vlen cpdvlen eq {
0 1 vlen 1 sub {
/i exch def
/obj v i get def
/cpdobj cpdv i get def
obj cpdobj ne {
/upd true def
exit
} if
} for
} {
/upd true def
} ifelse
} {
v type /dicttype eq {
v {
/dv exch def
/dk exch def
/cpddv cpdv dk get def
dv cpddv ne {
/upd true def
exit
} if
} forall
} {
/upd true def
} ifelse
} ifelse
} if
} ifelse
upd true eq {
d k v put
} if
} if
} if
} forall
d length 0 gt {
d setpagedevice
} if
} bd
/RE { % /NewFontName [NewEncodingArray] /FontName RE -
  findfont dup length dict begin
  {
    1 index /FID ne
    {def} {pop pop} ifelse
  } forall
  /Encoding exch def
  /FontName 1 index def
  currentdict definefont pop
  end
} bind def
%%EndResource
%%BeginResource: procset (Apache XML Graphics EPS ProcSet) 1.0 0
%%Version: 1.0 0
%%Copyright: (Copyright 2002-2003 The Apache Software Foundation. License terms: http://www.apache.org/licenses/LICENSE-2.0)
/BeginEPSF { %def
/b4_Inc_state save def         % Save state for cleanup
/dict_count countdictstack def % Count objects on dict stack
/op_count count 1 sub def      % Count objects on operand stack
userdict begin                 % Push userdict on dict stack
/showpage { } def              % Redefine showpage, { } = null proc
0 setgray 0 setlinecap         % Prepare graphics state
1 setlinewidth 0 setlinejoin
10 setmiterlimit [ ] 0 setdash newpath
/languagelevel where           % If level not equal to 1 then
{pop languagelevel             % set strokeadjust and
1 ne                           % overprint to their defaults.
{false setstrokeadjust false setoverprint
} if
} if
} bd
/EndEPSF { %def
count op_count sub {pop} repeat            % Clean up stacks
countdictstack dict_count sub {end} repeat
b4_Inc_state restore
} bd
%%EndResource
%FOPBeginFontDict
%%IncludeResource: font Courier-Oblique
%%IncludeResource: font Courier-BoldOblique
%%IncludeResource: font Courier-Bold
%%IncludeResource: font ZapfDingbats
%%IncludeResource: font Symbol
%%IncludeResource: font Helvetica
%%IncludeResource: font Helvetica-Oblique
%%IncludeResource: font Helvetica-Bold
%%IncludeResource: font Helvetica-BoldOblique
%%IncludeResource: font Times-Roman
%%IncludeResource: font Times-Italic
%%IncludeResource: font Times-Bold
%%IncludeResource: font Times-BoldItalic
%%IncludeResource: font Courier
%FOPEndFontDict
%%BeginResource: encoding WinAnsiEncoding
/WinAnsiEncoding [
/.notdef /.notdef /.notdef /.notdef /.notdef
/.notdef /.notdef /.notdef /.notdef /.notdef
/.notdef /.notdef /.notdef /.notdef /.notdef
/.notdef /.notdef /.notdef /.notdef /.notdef
/.notdef /.notdef /.notdef /.notdef /.notdef
/.notdef /.notdef /.notdef /.notdef /.notdef
/.notdef /.notdef /space /exclam /quotedbl
/numbersign /dollar /percent /ampersand /quotesingle
/parenleft /parenright /asterisk /plus /comma
/hyphen /period /slash /zero /one
/two /three /four /five /six
/seven /eight /nine /colon /semicolon
/less /equal /greater /question /at
/A /B /C /D /E
/F /G /H /I /J
/K /L /M /N /O
/P /Q /R /S /T
/U /V /W /X /Y
/Z /bracketleft /backslash /bracketright /asciicircum
/underscore /quoteleft /a /b /c
/d /e /f /g /h
/i /j /k /l /m
/n /o /p /q /r
/s /t /u /v /w
/x /y /z /braceleft /bar
/braceright /asciitilde /bullet /Euro /bullet
/quotesinglbase /florin /quotedblbase /ellipsis /dagger
/daggerdbl /circumflex /perthousand /Scaron /guilsinglleft
/OE /bullet /Zcaron /bullet /bullet
/quoteleft /quoteright /quotedblleft /quotedblright /bullet
/endash /emdash /asciitilde /trademark /scaron
/guilsinglright /oe /bullet /zcaron /Ydieresis
/space /exclamdown /cent /sterling /currency
/yen /brokenbar /section /dieresis /copyright
/ordfeminine /guillemotleft /logicalnot /sfthyphen /registered
/macron /degree /plusminus /twosuperior /threesuperior
/acute /mu /paragraph /middot /cedilla
/onesuperior /ordmasculine /guillemotright /onequarter /onehalf
/threequarters /questiondown /Agrave /Aacute /Acircumflex
/Atilde /Adieresis /Aring /AE /Ccedilla
/Egrave /Eacute /Ecircumflex /Edieresis /Igrave
/Iacute /Icircumflex /Idieresis /Eth /Ntilde
/Ograve /Oacute /Ocircumflex /Otilde /Odieresis
/multiply /Oslash /Ugrave /Uacute /Ucircumflex
/Udieresis /Yacute /Thorn /germandbls /agrave
/aacute /acircumflex /atilde /adieresis /aring
/ae /ccedilla /egrave /eacute /ecircumflex
/edieresis /igrave /iacute /icircumflex /idieresis
/eth /ntilde /ograve /oacute /ocircumflex
/otilde /odieresis /divide /oslash /ugrave
/uacute /ucircumflex /udieresis /yacute /thorn
/ydieresis
] def
%%EndResource
%FOPBeginFontReencode
/Courier-Oblique findfont
dup length dict begin
  {1 index /FID ne {def} {pop pop} ifelse} forall
  /Encoding WinAnsiEncoding def
  currentdict
end
/Courier-Oblique exch definefont pop
/Courier-BoldOblique findfont
dup length dict begin
  {1 index /FID ne {def} {pop pop} ifelse} forall
  /Encoding WinAnsiEncoding def
  currentdict
end
/Courier-BoldOblique exch definefont pop
/Courier-Bold findfont
dup length dict begin
  {1 index /FID ne {def} {pop pop} ifelse} forall
  /Encoding WinAnsiEncoding def
  currentdict
end
/Courier-Bold exch definefont pop
/Helvetica findfont
dup length dict begin
  {1 index /FID ne {def} {pop pop} ifelse} forall
  /Encoding WinAnsiEncoding def
  currentdict
end
/Helvetica exch definefont pop
/Helvetica-Oblique findfont
dup length dict begin
  {1 index /FID ne {def} {pop pop} ifelse} forall
  /Encoding WinAnsiEncoding def
  currentdict
end
/Helvetica-Oblique exch definefont pop
/Helvetica-Bold findfont
dup length dict begin
  {1 index /FID ne {def} {pop pop} ifelse} forall
  /Encoding WinAnsiEncoding def
  currentdict
end
/Helvetica-Bold exch definefont pop
/Helvetica-BoldOblique findfont
dup length dict begin
  {1 index /FID ne {def} {pop pop} ifelse} forall
  /Encoding WinAnsiEncoding def
  currentdict
end
/Helvetica-BoldOblique exch definefont pop
/Times-Roman findfont
dup length dict begin
  {1 index /FID ne {def} {pop pop} ifelse} forall
  /Encoding WinAnsiEncoding def
  currentdict
end
/Times-Roman exch definefont pop
/Times-Italic findfont
dup length dict begin
  {1 index /FID ne {def} {pop pop} ifelse} forall
  /Encoding WinAnsiEncoding def
  currentdict
end
/Times-Italic exch definefont pop
/Times-Bold findfont
dup length dict begin
  {1 index /FID ne {def} {pop pop} ifelse} forall
  /Encoding WinAnsiEncoding def
  currentdict
end
/Times-Bold exch definefont pop
/Times-BoldItalic findfont
dup length dict begin
  {1 index /FID ne {def} {pop pop} ifelse} forall
  /Encoding WinAnsiEncoding def
  currentdict
end
/Times-BoldItalic exch definefont pop
/Courier findfont
dup length dict begin
  {1 index /FID ne {def} {pop pop} ifelse} forall
  /Encoding WinAnsiEncoding def
  currentdict
end
/Courier exch definefont pop
%FOPEndFontReencode
%%EndProlog
%%Page: 1 1
%%PageBoundingBox: 0 0 510 438
%%BeginPageSetup
[1 0 0 -1 0 438] CT
%%EndPageSetup
GS
[0.75 0 0 0.75 0 0] CT
1 GC
N
0 0 680 584 re
f
GR
GS
[0.75 0 0 0.75 0 0] CT
1 GC
N
0 0 680 584 re
f
GR
GS
[0.75 0 0 0.75 0 0] CT
1 GC
N
88 520 M
615 520 L
615 44 L
88 44 L
cp
f
GR
GS
[0.75 0 0 0.75 0 0] CT
0.149 GC
2 setlinecap
1 LJ
0.667 LW
N
88 520 M
615 520 L
S
GR
GS
[0.75 0 0 0.75 0 0] CT
0.149 GC
2 setlinecap
1 LJ
0.667 LW
N
88 44 M
615 44 L
S
GR
GS
[0.75 0 0 0.75 0 0] CT
0.149 GC
2 setlinecap
1 LJ
0.667 LW
N
88 520 M
88 514.73 L
S
GR
GS
[0.75 0 0 0.75 0 0] CT
0.149 GC
2 setlinecap
1 LJ
0.667 LW
N
219.75 520 M
219.75 514.73 L
S
GR
GS
[0.75 0 0 0.75 0 0] CT
0.149 GC
2 setlinecap
1 LJ
0.667 LW
N
351.5 520 M
351.5 514.73 L
S
GR
GS
[0.75 0 0 0.75 0 0] CT
0.149 GC
2 setlinecap
1 LJ
0.667 LW
N
483.25 520 M
483.25 514.73 L
S
GR
GS
[0.75 0 0 0.75 0 0] CT
0.149 GC
2 setlinecap
1 LJ
0.667 LW
N
615 520 M
615 514.73 L
S
GR
GS
[0.75 0 0 0.75 0 0] CT
0.149 GC
2 setlinecap
1 LJ
0.667 LW
N
88 44 M
88 49.27 L
S
GR
GS
[0.75 0 0 0.75 0 0] CT
0.149 GC
2 setlinecap
1 LJ
0.667 LW
N
219.75 44 M
219.75 49.27 L
S
GR
GS
[0.75 0 0 0.75 0 0] CT
0.149 GC
2 setlinecap
1 LJ
0.667 LW
N
351.5 44 M
351.5 49.27 L
S
GR
GS
[0.75 0 0 0.75 0 0] CT
0.149 GC
2 setlinecap
1 LJ
0.667 LW
N
483.25 44 M
483.25 49.27 L
S
GR
GS
[0.75 0 0 0.75 0 0] CT
0.149 GC
2 setlinecap
1 LJ
0.667 LW
N
615 44 M
615 49.27 L
S
GR
GS
[0.75 0 0 0.75 66 394.80002] CT
0.149 GC
/Helvetica 18.667 F
GS
[1 0 0 1 0 0] CT
-13.5 19 moveto 
1 -1 scale
(-40) t 
GR
GR
GS
[0.75 0 0 0.75 164.8125 394.80002] CT
0.149 GC
/Helvetica 18.667 F
GS
[1 0 0 1 0 0] CT
-13.5 19 moveto 
1 -1 scale
(-20) t 
GR
GR
GS
[0.75 0 0 0.75 263.625 394.80002] CT
0.149 GC
/Helvetica 18.667 F
GS
[1 0 0 1 0 0] CT
-5.5 19 moveto 
1 -1 scale
(0) t 
GR
GR
GS
[0.75 0 0 0.75 362.4375 394.80002] CT
0.149 GC
/Helvetica 18.667 F
GS
[1 0 0 1 0 0] CT
-10.5 19 moveto 
1 -1 scale
(20) t 
GR
GR
GS
[0.75 0 0 0.75 461.25 394.80002] CT
0.149 GC
/Helvetica 18.667 F
GS
[1 0 0 1 0 0] CT
-10.5 19 moveto 
1 -1 scale
(40) t 
GR
GR
GS
[0.75 0 0 0.75 263.62518 413.8] CT
0.149 GC
/Helvetica 20.533 F
GS
[1 0 0 1 0 0] CT
-25.5 21 moveto 
1 -1 scale
(E \(m\)) t 
GR
GR
GS
[0.75 0 0 0.75 0 0] CT
0.149 GC
2 setlinecap
1 LJ
0.667 LW
N
88 520 M
88 44 L
S
GR
GS
[0.75 0 0 0.75 0 0] CT
0.149 GC
2 setlinecap
1 LJ
0.667 LW
N
615 520 M
615 44 L
S
GR
GS
[0.75 0 0 0.75 0 0] CT
0.149 GC
2 setlinecap
1 LJ
0.667 LW
N
88 520 M
93.27 520 L
S
GR
GS
[0.75 0 0 0.75 0 0] CT
0.149 GC
2 setlinecap
1 LJ
0.667 LW
N
88 460.5 M
93.27 460.5 L
S
GR
GS
[0.75 0 0 0.75 0 0] CT
0.149 GC
2 setlinecap
1 LJ
0.667 LW
N
88 401 M
93.27 401 L
S
GR
GS
[0.75 0 0 0.75 0 0] CT
0.149 GC
2 setlinecap
1 LJ
0.667 LW
N
88 341.5 M
93.27 341.5 L
S
GR
GS
[0.75 0 0 0.75 0 0] CT
0.149 GC
2 setlinecap
1 LJ
0.667 LW
N
88 282 M
93.27 282 L
S
GR
GS
[0.75 0 0 0.75 0 0] CT
0.149 GC
2 setlinecap
1 LJ
0.667 LW
N
88 222.5 M
93.27 222.5 L
S
GR
GS
[0.75 0 0 0.75 0 0] CT
0.149 GC
2 setlinecap
1 LJ
0.667 LW
N
88 163 M
93.27 163 L
S
GR
GS
[0.75 0 0 0.75 0 0] CT
0.149 GC
2 setlinecap
1 LJ
0.667 LW
N
88 103.5 M
93.27 103.5 L
S
GR
GS
[0.75 0 0 0.75 0 0] CT
0.149 GC
2 setlinecap
1 LJ
0.667 LW
N
88 44 M
93.27 44 L
S
GR
GS
[0.75 0 0 0.75 0 0] CT
0.149 GC
2 setlinecap
1 LJ
0.667 LW
N
615 520 M
609.73 520 L
S
GR
GS
[0.75 0 0 0.75 0 0] CT
0.149 GC
2 setlinecap
1 LJ
0.667 LW
N
615 460.5 M
609.73 460.5 L
S
GR
GS
[0.75 0 0 0.75 0 0] CT
0.149 GC
2 setlinecap
1 LJ
0.667 LW
N
615 401 M
609.73 401 L
S
GR
GS
[0.75 0 0 0.75 0 0] CT
0.149 GC
2 setlinecap
1 LJ
0.667 LW
N
615 341.5 M
609.73 341.5 L
S
GR
GS
[0.75 0 0 0.75 0 0] CT
0.149 GC
2 setlinecap
1 LJ
0.667 LW
N
615 282 M
609.73 282 L
S
GR
GS
[0.75 0 0 0.75 0 0] CT
0.149 GC
2 setlinecap
1 LJ
0.667 LW
N
615 222.5 M
609.73 222.5 L
S
GR
GS
[0.75 0 0 0.75 0 0] CT
0.149 GC
2 setlinecap
1 LJ
0.667 LW
N
615 163 M
609.73 163 L
S
GR
GS
[0.75 0 0 0.75 0 0] CT
0.149 GC
2 setlinecap
1 LJ
0.667 LW
N
615 103.5 M
609.73 103.5 L
S
GR
GS
[0.75 0 0 0.75 0 0] CT
0.149 GC
2 setlinecap
1 LJ
0.667 LW
N
615 44 M
609.73 44 L
S
GR
GS
[0.75 0 0 0.75 61.19999 390] CT
0.149 GC
/Helvetica 18.667 F
GS
[1 0 0 1 0 0] CT
-27 7 moveto 
1 -1 scale
(-20) t 
GR
GR
GS
[0.75 0 0 0.75 61.19999 345.375] CT
0.149 GC
/Helvetica 18.667 F
GS
[1 0 0 1 0 0] CT
-27 7 moveto 
1 -1 scale
(-15) t 
GR
GR
GS
[0.75 0 0 0.75 61.19999 300.75] CT
0.149 GC
/Helvetica 18.667 F
GS
[1 0 0 1 0 0] CT
-27 7 moveto 
1 -1 scale
(-10) t 
GR
GR
GS
[0.75 0 0 0.75 61.19999 256.125] CT
0.149 GC
/Helvetica 18.667 F
GS
[1 0 0 1 0 0] CT
-17 7 moveto 
1 -1 scale
(-5) t 
GR
GR
GS
[0.75 0 0 0.75 61.19999 211.5] CT
0.149 GC
/Helvetica 18.667 F
GS
[1 0 0 1 0 0] CT
-11 7 moveto 
1 -1 scale
(0) t 
GR
GR
GS
[0.75 0 0 0.75 61.19999 166.875] CT
0.149 GC
/Helvetica 18.667 F
GS
[1 0 0 1 0 0] CT
-11 7 moveto 
1 -1 scale
(5) t 
GR
GR
GS
[0.75 0 0 0.75 61.19999 122.25] CT
0.149 GC
/Helvetica 18.667 F
GS
[1 0 0 1 0 0] CT
-21 7 moveto 
1 -1 scale
(10) t 
GR
GR
GS
[0.75 0 0 0.75 61.19999 77.625] CT
0.149 GC
/Helvetica 18.667 F
GS
[1 0 0 1 0 0] CT
-21 7 moveto 
1 -1 scale
(15) t 
GR
GR
GS
[0.75 0 0 0.75 61.19999 33] CT
0.149 GC
/Helvetica 18.667 F
GS
[1 0 0 1 0 0] CT
-21 7 moveto 
1 -1 scale
(20) t 
GR
GR
GS
[0 -0.75 0.75 0 37.95001 211.49984] CT
0.149 GC
/Helvetica 20.533 F
GS
[1 0 0 1 0 0] CT
-26 -5 moveto 
1 -1 scale
(N \(m\)) t 
GR
GR
GS
[0.75 0 0 0.75 228.46797 97.90481] CT
0 0.447 0.741 RC
N
1.333 0 M
1.333 0.736 0.736 1.333 0 1.333 C
-0.736 1.333 -1.333 0.736 -1.333 0 C
-1.333 -0.736 -0.736 -1.333 0 -1.333 C
0.736 -1.333 1.333 -0.736 1.333 0 C
cp
f
GR
GS
[0.75 0 0 0.75 240.28789 108.67505] CT
0 0.447 0.741 RC
N
/f-1057828618{1.333 0 M
1.333 0.736 0.736 1.333 0 1.333 C
-0.736 1.333 -1.333 0.736 -1.333 0 C
-1.333 -0.736 -0.736 -1.333 0 -1.333 C
0.736 -1.333 1.333 -0.736 1.333 0 C
cp}def
f-1057828618
f
GR
GS
[0.75 0 0 0.75 229.81659 157.84639] CT
0 0.447 0.741 RC
N
f-1057828618
f
GR
GS
[0.75 0 0 0.75 198.61967 198.90477] CT
0 0.447 0.741 RC
N
f-1057828618
f
GR
GS
[0.75 0 0 0.75 223.30305 345.17633] CT
0 0.447 0.741 RC
N
f-1057828618
f
GR
GS
[0.75 0 0 0.75 243.81111 371.66988] CT
0 0.447 0.741 RC
N
f-1057828618
f
GR
GS
[0.75 0 0 0.75 226.01541 383.80573] CT
0 0.447 0.741 RC
N
f-1057828618
f
GR
GS
[0.75 0 0 0.75 405.00018 129.85165] CT
0 0.447 0.741 RC
N
f-1057828618
f
GR
GS
[0.75 0 0 0.75 269.47366 315.35349] CT
0 0.447 0.741 RC
N
f-1057828618
f
GR
GS
[0.75 0 0 0.75 367.10335 176.11345] CT
0 0.447 0.741 RC
N
f-1057828618
f
GR
GS
[0.75 0 0 0.75 317.49115 295.54756] CT
0 0.447 0.741 RC
N
f-1057828618
f
GR
GS
[0.75 0 0 0.75 293.46336 344.72713] CT
0 0.447 0.741 RC
N
f-1057828618
f
GR
GS
[0.75 0 0 0.75 282.26955 304.32941] CT
0 0.447 0.741 RC
N
f-1057828618
f
GR
GS
[0.75 0 0 0.75 274.51474 279.28182] CT
0 0.447 0.741 RC
N
f-1057828618
f
GR
GS
[0.75 0 0 0.75 267.59177 252.87078] CT
0 0.447 0.741 RC
N
f-1057828618
f
GR
GS
[0.75 0 0 0.75 280.37215 222.1672] CT
0 0.447 0.741 RC
N
f-1057828618
f
GR
GS
[0.75 0 0 0.75 279.30521 217.86152] CT
0 0.447 0.741 RC
N
f-1057828618
f
GR
GS
[0.75 0 0 0.75 278.0937 232.49238] CT
0 0.447 0.741 RC
N
f-1057828618
f
GR
GS
[0.75 0 0 0.75 279.7736 205.90231] CT
0 0.447 0.741 RC
N
f-1057828618
f
GR
GS
[0.75 0 0 0.75 267.32398 215.76801] CT
0 0.447 0.741 RC
N
f-1057828618
f
GR
GS
[0.75 0 0 0.75 301.63067 265.33859] CT
0 0.447 0.741 RC
N
f-1057828618
f
GR
GS
[0.75 0 0 0.75 266.6153 231.56941] CT
0 0.447 0.741 RC
N
f-1057828618
f
GR
GS
[0.75 0 0 0.75 260.47387 238.45821] CT
0 0.447 0.741 RC
N
f-1057828618
f
GR
GS
[0.75 0 0 0.75 242.41047 239.8377] CT
0 0.447 0.741 RC
N
f-1057828618
f
GR
GS
[0.75 0 0 0.75 224.94818 234.81262] CT
0 0.447 0.741 RC
N
f-1057828618
f
GR
GS
[0.75 0 0 0.75 226.35807 221.44217] CT
0 0.447 0.741 RC
N
f-1057828618
f
GR
GS
[0.75 0 0 0.75 203.39584 259.38169] CT
0 0.447 0.741 RC
N
f-1057828618
f
GR
GS
[0.75 0 0 0.75 215.17847 230.66476] CT
0 0.447 0.741 RC
N
f-1057828618
f
GR
GS
[0.75 0 0 0.75 192.58891 225.43002] CT
0 0.447 0.741 RC
N
f-1057828618
f
GR
GS
[0.75 0 0 0.75 188.98997 242.28964] CT
0 0.447 0.741 RC
N
f-1057828618
f
GR
GS
[0.75 0 0 0.75 176.12771 268.49982] CT
0 0.447 0.741 RC
N
f-1057828618
f
GR
GS
[0.75 0 0 0.75 198.9968 280.3198] CT
0 0.447 0.741 RC
N
f-1057828618
f
GR
GS
[0.75 0 0 0.75 199.33344 298.55759] CT
0 0.447 0.741 RC
N
f-1057828618
f
GR
GS
[0.75 0 0 0.75 201.63393 281.43333] CT
0 0.447 0.741 RC
N
f-1057828618
f
GR
GS
[0.75 0 0 0.75 241.15526 351.56399] CT
0 0.447 0.741 RC
N
f-1057828618
f
GR
GS
[0.75 0 0 0.75 239.67888 303.88586] CT
0 0.447 0.741 RC
N
f-1057828618
f
GR
GS
[0.75 0 0 0.75 174.81228 307.52657] CT
0 0.447 0.741 RC
N
f-1057828618
f
GR
GS
[0.75 0 0 0.75 99.34102 317.17204] CT
0 0.447 0.741 RC
N
f-1057828618
f
GR
GS
[0.75 0 0 0.75 112.22106 325.35768] CT
0 0.447 0.741 RC
N
f-1057828618
f
GR
GS
[0.75 0 0 0.75 105.48779 321.20602] CT
0 0.447 0.741 RC
N
f-1057828618
f
GR
GS
[0.75 0 0 0.75 83.32374 343.17975] CT
0 0.447 0.741 RC
N
f-1057828618
f
GR
GS
[0.75 0 0 0.75 224.59497 263.54116] CT
0 0.447 0.741 RC
N
f-1057828618
f
GR
GS
[0.75 0 0 0.75 207.23595 221.13011] CT
0 0.447 0.741 RC
N
f-1057828618
f
GR
GS
[0.75 0 0 0.75 238.68205 215.39822] CT
0 0.447 0.741 RC
N
f-1057828618
f
GR
GS
[0.75 0 0 0.75 204.9516 175.60383] CT
0 0.447 0.741 RC
N
f-1057828618
f
GR
GS
[0.75 0 0 0.75 191.61136 206.11791] CT
0 0.447 0.741 RC
N
f-1057828618
f
GR
GS
[0.75 0 0 0.75 261.04935 187.21618] CT
0 0.447 0.741 RC
N
f-1057828618
f
GR
GS
[0.75 0 0 0.75 261.86421 215.13281] CT
0 0.447 0.741 RC
N
f-1057828618
f
GR
GS
[0.75 0 0 0.75 237.63167 330.40899] CT
0 0.447 0.741 RC
N
f-1057828618
f
GR
GS
[0.75 0 0 0.75 187.47179 319.44186] CT
0 0.447 0.741 RC
N
f-1057828618
f
GR
GS
[0.75 0 0 0.75 197.80607 296.36378] CT
0 0.447 0.741 RC
N
f-1057828618
f
GR
GS
[0.75 0 0 0.75 159.10714 378.18711] CT
0 0.447 0.741 RC
N
f-1057828618
f
GR
GS
[0.75 0 0 0.75 186.11438 226.77807] CT
0 0.447 0.741 RC
N
f-1057828618
f
GR
GS
[0.75 0 0 0.75 226.24191 165.60429] CT
0 0.447 0.741 RC
N
f-1057828618
f
GR
GS
[0.75 0 0 0.75 226.82785 312.97197] CT
0 0.447 0.741 RC
N
f-1057828618
f
GR
GS
[0.75 0 0 0.75 107.42216 324.18631] CT
0 0.447 0.741 RC
N
f-1057828618
f
GR
GS
[0.75 0 0 0.75 143.0716 314.46339] CT
0 0.447 0.741 RC
N
f-1057828618
f
GR
GS
[0.75 0 0 0.75 128.25932 326.35545] CT
0 0.447 0.741 RC
N
f-1057828618
f
GR
GS
[0.75 0 0 0.75 136.65832 385.81897] CT
0 0.447 0.741 RC
N
f-1057828618
f
GR
GS
[0.75 0 0 0.75 114.2306 259.6431] CT
0 0.447 0.741 RC
N
f-1057828618
f
GR
GS
[0.75 0 0 0.75 119.05587 345.57671] CT
0 0.447 0.741 RC
N
f-1057828618
f
GR
GS
[0.75 0 0 0.75 142.00293 319.81936] CT
0 0.447 0.741 RC
N
f-1057828618
f
GR
GS
[0.75 0 0 0.75 163.88259 378.01794] CT
0 0.447 0.741 RC
N
f-1057828618
f
GR
GS
[0.75 0 0 0.75 194.03206 215.02077] CT
0 0.447 0.741 RC
N
f-1057828618
f
GR
GS
[0.75 0 0 0.75 192.93954 218.61292] CT
0 0.447 0.741 RC
N
f-1057828618
f
GR
GS
[0.75 0 0 0.75 244.16844 375.77641] CT
0 0.447 0.741 RC
N
f-1057828618
f
GR
GS
[0.75 0 0 0.75 313.69695 268.46782] CT
0 0.447 0.741 RC
N
f-1057828618
f
GR
GS
[0.75 0 0 0.75 260.49662 335.20427] CT
0 0.447 0.741 RC
N
f-1057828618
f
GR
GS
[0.75 0 0 0.75 294.46916 251.3063] CT
0 0.447 0.741 RC
N
f-1057828618
f
GR
GS
[0.75 0 0 0.75 247.48082 339.14397] CT
0 0.447 0.741 RC
N
f-1057828618
f
GR
GS
[0.75 0 0 0.75 297.32243 119.81155] CT
0 0.447 0.741 RC
N
f-1057828618
f
GR
GS
[0.75 0 0 0.75 327.83723 91.22995] CT
0 0.447 0.741 RC
N
f-1057828618
f
GR
GS
[0.75 0 0 0.75 302.353 198.21794] CT
0 0.447 0.741 RC
N
f-1057828618
f
GR
GS
[0.75 0 0 0.75 299.38513 283.8606] CT
0 0.447 0.741 RC
N
f-1057828618
f
GR
GS
[0.75 0 0 0.75 309.80088 348.35149] CT
0 0.447 0.741 RC
N
f-1057828618
f
GR
GS
[0.75 0 0 0.75 315.23037 304.5957] CT
0 0.447 0.741 RC
N
f-1057828618
f
GR
GS
[0.75 0 0 0.75 365.57977 84.18418] CT
0 0.447 0.741 RC
N
f-1057828618
f
GR
GS
[0.75 0 0 0.75 334.09978 328.37885] CT
0 0.447 0.741 RC
N
f-1057828618
f
GR
GS
[0.75 0 0 0.75 338.69339 322.57738] CT
0 0.447 0.741 RC
N
f-1057828618
f
GR
GS
[0.75 0 0 0.75 351.37212 259.54596] CT
0 0.447 0.741 RC
N
f-1057828618
f
GR
GS
[0.75 0 0 0.75 313.72799 227.9119] CT
0 0.447 0.741 RC
N
f-1057828618
f
GR
GS
[0.75 0 0 0.75 312.60217 266.53619] CT
0 0.447 0.741 RC
N
f-1057828618
f
GR
GS
[0.75 0 0 0.75 339.51846 197.89515] CT
0 0.447 0.741 RC
N
f-1057828618
f
GR
GS
[0.75 0 0 0.75 253.04313 216.70702] CT
0 0.447 0.741 RC
N
f-1057828618
f
GR
GS
[0.75 0 0 0.75 280.01649 261.17876] CT
0 0.447 0.741 RC
N
f-1057828618
f
GR
GS
[0.75 0 0 0.75 300.18258 368.33331] CT
0 0.447 0.741 RC
N
f-1057828618
f
GR
GS
[0.75 0 0 0.75 348.30146 215.37877] CT
0 0.447 0.741 RC
N
f-1057828618
f
GR
GS
[0.75 0 0 0.75 307.53918 300.31574] CT
0 0.447 0.741 RC
N
f-1057828618
f
GR
GS
[0.75 0 0 0.75 325.58601 283.11337] CT
0 0.447 0.741 RC
N
f-1057828618
f
GR
GS
[0.75 0 0 0.75 280.85609 358.85728] CT
0 0.447 0.741 RC
N
f-1057828618
f
GR
GS
[0.75 0 0 0.75 285.04408 243.87142] CT
0 0.447 0.741 RC
N
f-1057828618
f
GR
GS
[0.75 0 0 0.75 151.90874 377.33416] CT
0 0.447 0.741 RC
N
f-1057828618
f
GR
GS
[0.75 0 0 0.75 171.09695 222.09652] CT
0 0.447 0.741 RC
N
f-1057828618
f
GR
GS
[0.75 0 0 0.75 111.77038 346.17499] CT
0 0.447 0.741 RC
N
f-1057828618
f
GR
GS
[0.75 0 0 0.75 127.71811 224.16522] CT
0 0.447 0.741 RC
N
f-1057828618
f
GR
GS
[0.75 0 0 0.75 119.94151 260.52594] CT
0 0.447 0.741 RC
N
f-1057828618
f
GR
GS
[0.75 0 0 0.75 122.00522 210.95132] CT
0 0.447 0.741 RC
N
f-1057828618
f
GR
GS
[0.75 0 0 0.75 271.14052 141.24795] CT
0 0.447 0.741 RC
N
f-1057828618
f
GR
GS
[0.75 0 0 0.75 246.85863 175.94753] CT
0 0.447 0.741 RC
N
f-1057828618
f
GR
GS
[0.75 0 0 0.75 232.15253 114.07467] CT
0 0.447 0.741 RC
N
f-1057828618
f
GR
GS
[0.75 0 0 0.75 222.71464 146.78253] CT
0 0.447 0.741 RC
N
f-1057828618
f
GR
GS
[0.75 0 0 0.75 192.63389 138.68881] CT
0 0.447 0.741 RC
N
f-1057828618
f
GR
GS
[0.75 0 0 0.75 229.41934 205.72572] CT
0 0.447 0.741 RC
N
f-1057828618
f
GR
GS
[0.75 0 0 0.75 204.14575 198.74103] CT
0 0.447 0.741 RC
N
f-1057828618
f
GR
GS
[0.75 0 0 0.75 217.39742 173.33582] CT
0 0.447 0.741 RC
N
f-1057828618
f
GR
GS
[0.75 0 0 0.75 213.53838 183.66741] CT
0 0.447 0.741 RC
N
f-1057828618
f
GR
GS
[0.75 0 0 0.75 179.15905 184.96537] CT
0 0.447 0.741 RC
N
f-1057828618
f
GR
GS
[0.75 0 0 0.75 197.30647 230.22233] CT
0 0.447 0.741 RC
N
f-1057828618
f
GR
GS
[0.75 0 0 0.75 175.25623 145.20086] CT
0 0.447 0.741 RC
N
f-1057828618
f
GR
GS
[0.75 0 0 0.75 196.50778 295.18236] CT
0 0.447 0.741 RC
N
f-1057828618
f
GR
GS
[0.75 0 0 0.75 201.25562 325.16787] CT
0 0.447 0.741 RC
N
f-1057828618
f
GR
GS
[0.75 0 0 0.75 177.23107 272.63235] CT
0 0.447 0.741 RC
N
f-1057828618
f
GR
GS
[0.75 0 0 0.75 161.28275 203.90678] CT
0 0.447 0.741 RC
N
f-1057828618
f
GR
GS
[0.75 0 0 0.75 246.77783 204.55108] CT
0 0.447 0.741 RC
N
f-1057828618
f
GR
GS
[0.75 0 0 0.75 250.69146 183.91245] CT
0 0.447 0.741 RC
N
f-1057828618
f
GR
GS
[0.75 0 0 0.75 251.53221 168.58047] CT
0 0.447 0.741 RC
N
f-1057828618
f
GR
GS
[0.75 0 0 0.75 269.68884 151.42335] CT
0 0.447 0.741 RC
N
f-1057828618
f
GR
GS
[0.75 0 0 0.75 281.52413 160.89215] CT
0 0.447 0.741 RC
N
f-1057828618
f
GR
GS
[0.75 0 0 0.75 266.08873 175.52994] CT
0 0.447 0.741 RC
N
f-1057828618
f
GR
GS
[0.75 0 0 0.75 271.60442 190.61522] CT
0 0.447 0.741 RC
N
f-1057828618
f
GR
GS
[0.75 0 0 0.75 260.06564 134.79733] CT
0 0.447 0.741 RC
N
f-1057828618
f
GR
GS
[0.75 0 0 0.75 256.71732 156.20189] CT
0 0.447 0.741 RC
N
f-1057828618
f
GR
GS
[0.75 0 0 0.75 274.69073 115.59059] CT
0 0.447 0.741 RC
N
f-1057828618
f
GR
GS
[0.75 0 0 0.75 283.49618 163.7072] CT
0 0.447 0.741 RC
N
f-1057828618
f
GR
GS
[0.75 0 0 0.75 287.46362 181.41114] CT
0 0.447 0.741 RC
N
f-1057828618
f
GR
GS
[0.75 0 0 0.75 280.78672 207.46268] CT
0 0.447 0.741 RC
N
f-1057828618
f
GR
GS
[0.75 0 0 0.75 268.14157 225.78557] CT
0 0.447 0.741 RC
N
f-1057828618
f
GR
GS
[0.75 0 0 0.75 280.28982 223.08444] CT
0 0.447 0.741 RC
N
f-1057828618
f
GR
GS
[0.75 0 0 0.75 300.81081 176.91241] CT
0 0.447 0.741 RC
N
f-1057828618
f
GR
GS
[0.75 0 0 0.75 269.20386 191.68048] CT
0.851 0.325 0.098 RC
N
f-1057828618
f
GR
GS
[0.75 0 0 0.75 268.48389 190.69169] CT
0.851 0.325 0.098 RC
N
f-1057828618
f
GR
GS
[0.75 0 0 0.75 269.42862 192.13971] CT
0.851 0.325 0.098 RC
N
f-1057828618
f
GR
GS
[0.75 0 0 0.75 269.78053 189.53982] CT
0.851 0.325 0.098 RC
N
f-1057828618
f
GR
GS
[0.75 0 0 0.75 268.88628 186.24685] CT
0.851 0.325 0.098 RC
N
f-1057828618
f
GR
GS
[0.75 0 0 0.75 264.98186 188.87354] CT
0.851 0.325 0.098 RC
N
f-1057828618
f
GR
GS
[0.75 0 0 0.75 262.24905 187.5085] CT
0.851 0.325 0.098 RC
N
f-1057828618
f
GR
GS
[0.75 0 0 0.75 259.51913 188.46487] CT
0.851 0.325 0.098 RC
N
f-1057828618
f
GR
GS
[0.75 0 0 0.75 257.27341 189.08042] CT
0.851 0.325 0.098 RC
N
f-1057828618
f
GR
GS
[0.75 0 0 0.75 256.14496 190.04217] CT
0.851 0.325 0.098 RC
N
f-1057828618
f
GR
GS
[0.75 0 0 0.75 256.08048 189.79793] CT
0.851 0.325 0.098 RC
N
f-1057828618
f
GR
GS
[0.75 0 0 0.75 255.67319 188.85958] CT
0.851 0.325 0.098 RC
N
f-1057828618
f
GR
GS
[0.75 0 0 0.75 256.41936 191.74739] CT
0.851 0.325 0.098 RC
N
f-1057828618
f
GR
GS
[0.75 0 0 0.75 257.4332 196.33932] CT
0.851 0.325 0.098 RC
N
f-1057828618
f
GR
GS
[0.75 0 0 0.75 258.16788 198.60807] CT
0.851 0.325 0.098 RC
N
f-1057828618
f
GR
GS
[0.75 0 0 0.75 258.49356 200.53516] CT
0.851 0.325 0.098 RC
N
f-1057828618
f
GR
GS
[0.75 0 0 0.75 258.7207 203.07195] CT
0.851 0.325 0.098 RC
N
f-1057828618
f
GR
GS
[0.75 0 0 0.75 258.8012 204.71995] CT
0.851 0.325 0.098 RC
N
f-1057828618
f
GR
GS
[0.75 0 0 0.75 259.04556 204.96602] CT
0.851 0.325 0.098 RC
N
f-1057828618
f
GR
GS
[0.75 0 0 0.75 259.48093 206.26785] CT
0.851 0.325 0.098 RC
N
f-1057828618
f
GR
GS
[0.75 0 0 0.75 260.5445 207.47781] CT
0.851 0.325 0.098 RC
N
f-1057828618
f
GR
GS
[0.75 0 0 0.75 260.5445 207.47781] CT
0.851 0.325 0.098 RC
N
f-1057828618
f
GR
GS
[0.75 0 0 0.75 260.82623 207.7852] CT
0.851 0.325 0.098 RC
N
f-1057828618
f
GR
GS
[0.75 0 0 0.75 261.31851 208.35011] CT
0.851 0.325 0.098 RC
N
f-1057828618
f
GR
GS
[0.75 0 0 0.75 261.7972 209.37296] CT
0.851 0.325 0.098 RC
N
f-1057828618
f
GR
GS
[0.75 0 0 0.75 261.95544 210.21318] CT
0.851 0.325 0.098 RC
N
f-1057828618
f
GR
GS
[0.75 0 0 0.75 262.13656 211.14526] CT
0.851 0.325 0.098 RC
N
f-1057828618
f
GR
GS
[0.75 0 0 0.75 262.19035 211.25526] CT
0.851 0.325 0.098 RC
N
f-1057828618
f
GR
GS
[0.75 0 0 0.75 262.22495 211.44173] CT
0.851 0.325 0.098 RC
N
f-1057828618
f
GR
GS
[0.75 0 0 0.75 262.22495 211.44173] CT
0.851 0.325 0.098 RC
N
f-1057828618
f
GR
GS
[0.75 0 0 0.75 262.43053 211.64669] CT
0.851 0.325 0.098 RC
N
f-1057828618
f
GR
GS
[0.75 0 0 0.75 262.69453 212.45595] CT
0.851 0.325 0.098 RC
N
f-1057828618
f
GR
GS
[0.75 0 0 0.75 262.79347 212.74567] CT
0.851 0.325 0.098 RC
N
f-1057828618
f
GR
GS
[0.75 0 0 0.75 262.80322 212.82493] CT
0.851 0.325 0.098 RC
N
f-1057828618
f
GR
GS
[0.75 0 0 0.75 262.80077 212.78785] CT
0.851 0.325 0.098 RC
N
f-1057828618
f
GR
GS
[0.75 0 0 0.75 262.70281 213.03227] CT
0.851 0.325 0.098 RC
N
f-1057828618
f
GR
GS
[0.75 0 0 0.75 262.80375 213.83475] CT
0.851 0.325 0.098 RC
N
f-1057828618
f
GR
GS
[0.75 0 0 0.75 262.94575 214.60957] CT
0.851 0.325 0.098 RC
N
f-1057828618
f
GR
GS
[0.75 0 0 0.75 262.97775 214.64797] CT
0.851 0.325 0.098 RC
N
f-1057828618
f
GR
GS
[0.75 0 0 0.75 262.89031 214.67331] CT
0.851 0.325 0.098 RC
N
f-1057828618
f
GR
GS
[0.75 0 0 0.75 262.86745 215.17397] CT
0.851 0.325 0.098 RC
N
f-1057828618
f
GR
GS
[0.75 0 0 0.75 262.71826 215.59222] CT
0.851 0.325 0.098 RC
N
f-1057828618
f
GR
GS
[0.75 0 0 0.75 262.49599 216.06844] CT
0.851 0.325 0.098 RC
N
f-1057828618
f
GR
GS
[0.75 0 0 0.75 262.67271 216.92688] CT
0.851 0.325 0.098 RC
N
f-1057828618
f
GR
GS
[0.75 0 0 0.75 262.80206 218.21226] CT
0.851 0.325 0.098 RC
N
f-1057828618
f
GR
GS
[0.75 0 0 0.75 262.87919 219.53059] CT
0.851 0.325 0.098 RC
N
f-1057828618
f
GR
GS
[0.75 0 0 0.75 262.91238 220.32175] CT
0.851 0.325 0.098 RC
N
f-1057828618
f
GR
GS
[0.75 0 0 0.75 263.13123 221.72946] CT
0.851 0.325 0.098 RC
N
f-1057828618
f
GR
GS
[0.75 0 0 0.75 263.41303 222.20043] CT
0.851 0.325 0.098 RC
N
f-1057828618
f
GR
GS
[0.75 0 0 0.75 263.76102 222.88236] CT
0.851 0.325 0.098 RC
N
f-1057828618
f
GR
GS
[0.75 0 0 0.75 263.83829 223.58885] CT
0.851 0.325 0.098 RC
N
f-1057828618
f
GR
GS
[0.75 0 0 0.75 264.32272 224.33029] CT
0.851 0.325 0.098 RC
N
f-1057828618
f
GR
GS
[0.75 0 0 0.75 264.66424 225.13293] CT
0.851 0.325 0.098 RC
N
f-1057828618
f
GR
GS
[0.75 0 0 0.75 264.97504 225.4826] CT
0.851 0.325 0.098 RC
N
f-1057828618
f
GR
GS
[0.75 0 0 0.75 265.43692 226.59441] CT
0.851 0.325 0.098 RC
N
f-1057828618
f
GR
GS
[0.75 0 0 0.75 265.43692 226.59441] CT
0.851 0.325 0.098 RC
N
f-1057828618
f
GR
GS
[0.75 0 0 0.75 265.549 227.34494] CT
0.851 0.325 0.098 RC
N
f-1057828618
f
GR
GS
[0.75 0 0 0.75 265.549 227.34494] CT
0.851 0.325 0.098 RC
N
f-1057828618
f
GR
GS
[0.75 0 0 0.75 265.39989 227.85027] CT
0.851 0.325 0.098 RC
N
f-1057828618
f
GR
GS
[0.75 0 0 0.75 265.32594 228.501] CT
0.851 0.325 0.098 RC
N
f-1057828618
f
GR
GS
[0.75 0 0 0.75 265.52769 229.1456] CT
0.851 0.325 0.098 RC
N
f-1057828618
f
GR
GS
[0.75 0 0 0.75 265.54896 229.23182] CT
0.851 0.325 0.098 RC
N
f-1057828618
f
GR
GS
[0.75 0 0 0.75 265.59441 229.03677] CT
0.851 0.325 0.098 RC
N
f-1057828618
f
GR
GS
[0.75 0 0 0.75 265.48636 228.78447] CT
0.851 0.325 0.098 RC
N
f-1057828618
f
GR
GS
[0.75 0 0 0.75 265.82513 228.40338] CT
0.851 0.325 0.098 RC
N
f-1057828618
f
GR
GS
[0.75 0 0 0.75 266.1394 228.01604] CT
0.851 0.325 0.098 RC
N
f-1057828618
f
GR
GS
[0.75 0 0 0.75 266.74109 227.87629] CT
0.851 0.325 0.098 RC
N
f-1057828618
f
GR
GS
[0.75 0 0 0.75 267.38333 227.49046] CT
0.851 0.325 0.098 RC
N
f-1057828618
f
GR
GS
[0.75 0 0 0.75 267.93805 226.88278] CT
0.851 0.325 0.098 RC
N
f-1057828618
f
GR
GS
[0.75 0 0 0.75 268.12576 226.2784] CT
0.851 0.325 0.098 RC
N
f-1057828618
f
GR
GS
[0.75 0 0 0.75 267.62082 226.27801] CT
0.851 0.325 0.098 RC
N
f-1057828618
f
GR
GS
[0.75 0 0 0.75 267.62082 226.27801] CT
0.851 0.325 0.098 RC
N
f-1057828618
f
GR
GS
[0.75 0 0 0.75 267.10689 225.60292] CT
0.851 0.325 0.098 RC
N
f-1057828618
f
GR
GS
[0.75 0 0 0.75 266.57474 225.49024] CT
0.851 0.325 0.098 RC
N
f-1057828618
f
GR
GS
[0.75 0 0 0.75 266.53697 225.16379] CT
0.851 0.325 0.098 RC
N
f-1057828618
f
GR
GS
[0.75 0 0 0.75 266.58021 225.05312] CT
0.851 0.325 0.098 RC
N
f-1057828618
f
GR
GS
[0.75 0 0 0.75 266.48595 224.89561] CT
0.851 0.325 0.098 RC
N
f-1057828618
f
GR
GS
[0.75 0 0 0.75 266.49161 224.29749] CT
0.851 0.325 0.098 RC
N
f-1057828618
f
GR
GS
[0.75 0 0 0.75 266.29047 224.23267] CT
0.851 0.325 0.098 RC
N
f-1057828618
f
GR
GS
[0.75 0 0 0.75 266.03872 224.00546] CT
0.851 0.325 0.098 RC
N
f-1057828618
f
GR
GS
[0.75 0 0 0.75 265.61096 223.50126] CT
0.851 0.325 0.098 RC
N
f-1057828618
f
GR
GS
[0.75 0 0 0.75 265.06036 222.89751] CT
0.851 0.325 0.098 RC
N
f-1057828618
f
GR
GS
[0.75 0 0 0.75 265.06295 222.39386] CT
0.851 0.325 0.098 RC
N
f-1057828618
f
GR
GS
[0.75 0 0 0.75 264.94453 222.13442] CT
0.851 0.325 0.098 RC
N
f-1057828618
f
GR
GS
[0.75 0 0 0.75 264.57731 221.53168] CT
0.851 0.325 0.098 RC
N
f-1057828618
f
GR
GS
[0.75 0 0 0.75 264.3983 221.02226] CT
0.851 0.325 0.098 RC
N
f-1057828618
f
GR
GS
[0.75 0 0 0.75 264.06885 221.25618] CT
0.851 0.325 0.098 RC
N
f-1057828618
f
GR
GS
[0.75 0 0 0.75 264.21075 221.10871] CT
0.851 0.325 0.098 RC
N
f-1057828618
f
GR
GS
[0.75 0 0 0.75 264.28336 220.54715] CT
0.851 0.325 0.098 RC
N
f-1057828618
f
GR
GS
[0.75 0 0 0.75 264.47056 219.4257] CT
0.851 0.325 0.098 RC
N
f-1057828618
f
GR
GS
[0.75 0 0 0.75 264.47056 219.4257] CT
0.851 0.325 0.098 RC
N
f-1057828618
f
GR
GS
[0.75 0 0 0.75 264.58282 218.62363] CT
0.851 0.325 0.098 RC
N
f-1057828618
f
GR
GS
[0.75 0 0 0.75 264.86108 217.88525] CT
0.851 0.325 0.098 RC
N
f-1057828618
f
GR
GS
[0.75 0 0 0.75 264.87511 217.15169] CT
0.851 0.325 0.098 RC
N
f-1057828618
f
GR
GS
[0.75 0 0 0.75 265.14169 216.33945] CT
0.851 0.325 0.098 RC
N
f-1057828618
f
GR
GS
[0.75 0 0 0.75 265.02882 215.85368] CT
0.851 0.325 0.098 RC
N
f-1057828618
f
GR
GS
[0.75 0 0 0.75 265.12786 215.11125] CT
0.851 0.325 0.098 RC
N
f-1057828618
f
GR
GS
[0.75 0 0 0.75 265.09916 214.62273] CT
0.851 0.325 0.098 RC
N
f-1057828618
f
GR
GS
[0.75 0 0 0.75 265.20433 214.07158] CT
0.851 0.325 0.098 RC
N
f-1057828618
f
GR
GS
[0.75 0 0 0.75 265.83401 213.82562] CT
0.851 0.325 0.098 RC
N
f-1057828618
f
GR
GS
[0.75 0 0 0.75 266.088 212.84873] CT
0.851 0.325 0.098 RC
N
f-1057828618
f
GR
GS
[0.75 0 0 0.75 266.088 212.84873] CT
0.851 0.325 0.098 RC
N
f-1057828618
f
GR
GS
[0.75 0 0 0.75 266.19104 212.7705] CT
0.851 0.325 0.098 RC
N
f-1057828618
f
GR
GS
[0.75 0 0 0.75 266.02535 212.53093] CT
0.851 0.325 0.098 RC
N
f-1057828618
f
GR
GS
[0.75 0 0 0.75 266.0631 212.56915] CT
0.851 0.325 0.098 RC
N
f-1057828618
f
GR
GS
[0.75 0 0 0.75 265.89844 212.3633] CT
0.851 0.325 0.098 RC
N
f-1057828618
f
GR
GS
[0.75 0 0 0.75 266.19981 212.12645] CT
0.851 0.325 0.098 RC
N
f-1057828618
f
GR
GS
[0.75 0 0 0.75 266.19981 212.12645] CT
0.851 0.325 0.098 RC
N
f-1057828618
f
GR
GS
[0.75 0 0 0.75 266.08335 211.92059] CT
0.851 0.325 0.098 RC
N
f-1057828618
f
GR
GS
[0.75 0 0 0.75 266.06618 211.60176] CT
0.851 0.325 0.098 RC
N
f-1057828618
f
GR
GS
[0.75 0 0 0.75 266.19456 211.52037] CT
0.851 0.325 0.098 RC
N
f-1057828618
f
GR
GS
[0.75 0 0 0.75 266.09271 210.98746] CT
0.851 0.325 0.098 RC
N
f-1057828618
f
GR
GS
[0.75 0 0 0.75 266.08074 210.86749] CT
0.851 0.325 0.098 RC
N
f-1057828618
f
GR
GS
[0.75 0 0 0.75 265.90546 210.52693] CT
0.851 0.325 0.098 RC
N
f-1057828618
f
GR
GS
[0.75 0 0 0.75 265.80842 210.26976] CT
0.851 0.325 0.098 RC
N
f-1057828618
f
GR
GS
[0.75 0 0 0.75 265.82016 210.16978] CT
0.851 0.325 0.098 RC
N
f-1057828618
f
GR
GS
[0.75 0 0 0.75 265.54921 210.14495] CT
0.851 0.325 0.098 RC
N
f-1057828618
f
GR
GS
[0.75 0 0 0.75 265.13475 209.90588] CT
0.851 0.325 0.098 RC
N
f-1057828618
f
GR
GS
[0.75 0 0 0.75 265.13475 209.90588] CT
0.851 0.325 0.098 RC
N
f-1057828618
f
GR
GS
[0.75 0 0 0.75 265.14922 209.81596] CT
0.851 0.325 0.098 RC
N
f-1057828618
f
GR
GS
[0.75 0 0 0.75 265.0535 209.68252] CT
0.851 0.325 0.098 RC
N
f-1057828618
f
GR
GS
[0.75 0 0 0.75 265.06114 209.42823] CT
0.851 0.325 0.098 RC
N
f-1057828618
f
GR
GS
[0.75 0 0 0.75 264.93906 208.94984] CT
0.851 0.325 0.098 RC
N
f-1057828618
f
GR
GS
[0.75 0 0 0.75 264.94778 208.4176] CT
0.851 0.325 0.098 RC
N
f-1057828618
f
GR
GS
[0.75 0 0 0.75 264.98245 207.92871] CT
0.851 0.325 0.098 RC
N
f-1057828618
f
GR
GS
[0.75 0 0 0.75 264.96073 207.10739] CT
0.851 0.325 0.098 RC
N
f-1057828618
f
GR
GS
[0.75 0 0 0.75 264.96073 207.10739] CT
0.851 0.325 0.098 RC
N
f-1057828618
f
GR
GS
[0.75 0 0 0.75 264.83681 206.83177] CT
0.851 0.325 0.098 RC
N
f-1057828618
f
GR
GS
[0.75 0 0 0.75 264.71072 206.74599] CT
0.851 0.325 0.098 RC
N
f-1057828618
f
GR
GS
[0.75 0 0 0.75 264.46751 206.2419] CT
0.851 0.325 0.098 RC
N
f-1057828618
f
GR
GS
[0.75 0 0 0.75 264.20247 205.95964] CT
0.851 0.325 0.098 RC
N
f-1057828618
f
GR
GS
[0.75 0 0 0.75 264.20247 205.95964] CT
0.851 0.325 0.098 RC
N
f-1057828618
f
GR
GS
[0.75 0 0 0.75 264.09334 205.79672] CT
0.851 0.325 0.098 RC
N
f-1057828618
f
GR
GS
[0.75 0 0 0.75 263.92733 205.76795] CT
0.851 0.325 0.098 RC
N
f-1057828618
f
GR
GS
[0.75 0 0 0.75 263.68815 205.58157] CT
0.851 0.325 0.098 RC
N
f-1057828618
f
GR
GS
[0.75 0 0 0.75 263.57366 205.46972] CT
0.851 0.325 0.098 RC
N
f-1057828618
f
GR
GS
[0.75 0 0 0.75 263.61477 205.15315] CT
0.851 0.325 0.098 RC
N
f-1057828618
f
GR
GS
[0.75 0 0 0.75 263.57554 204.62723] CT
0.851 0.325 0.098 RC
N
f-1057828618
f
GR
GS
[0.75 0 0 0.75 263.52493 204.37395] CT
0.851 0.325 0.098 RC
N
f-1057828618
f
GR
GS
[0.75 0 0 0.75 263.19452 204.1544] CT
0.851 0.325 0.098 RC
N
f-1057828618
f
GR
GS
[0.75 0 0 0.75 262.88004 204.00883] CT
0.851 0.325 0.098 RC
N
f-1057828618
f
GR
GS
[0.75 0 0 0.75 262.52177 203.94614] CT
0.851 0.325 0.098 RC
N
f-1057828618
f
GR
GS
[0.75 0 0 0.75 262.2681 203.78572] CT
0.851 0.325 0.098 RC
N
f-1057828618
f
GR
GS
[0.75 0 0 0.75 261.96233 203.6613] CT
0.851 0.325 0.098 RC
N
f-1057828618
f
GR
GS
[0.75 0 0 0.75 261.54591 203.42329] CT
0.851 0.325 0.098 RC
N
f-1057828618
f
GR
GS
[0.75 0 0 0.75 261.54591 203.42329] CT
0.851 0.325 0.098 RC
N
f-1057828618
f
GR
GS
[0.75 0 0 0.75 261.09034 203.52807] CT
0.851 0.325 0.098 RC
N
f-1057828618
f
GR
GS
[0.75 0 0 0.75 261.09034 203.52807] CT
0.851 0.325 0.098 RC
N
f-1057828618
f
GR
GS
[0.75 0 0 0.75 260.86606 203.50477] CT
0.851 0.325 0.098 RC
N
f-1057828618
f
GR
GS
[0.75 0 0 0.75 260.56744 203.41205] CT
0.851 0.325 0.098 RC
N
f-1057828618
f
GR
GS
[0.75 0 0 0.75 260.40562 203.36437] CT
0.851 0.325 0.098 RC
N
f-1057828618
f
GR
GS
[0.75 0 0 0.75 260.26916 203.31214] CT
0.851 0.325 0.098 RC
N
f-1057828618
f
GR
GS
[0.75 0 0 0.75 260.19672 203.13123] CT
0.851 0.325 0.098 RC
N
f-1057828618
f
GR
GS
[0.75 0 0 0.75 260.17989 202.88738] CT
0.851 0.325 0.098 RC
N
f-1057828618
f
GR
GS
[0.75 0 0 0.75 260.09811 202.72987] CT
0.851 0.325 0.098 RC
N
f-1057828618
f
GR
GS
[0.75 0 0 0.75 260.05378 202.56903] CT
0.851 0.325 0.098 RC
N
f-1057828618
f
GR
GS
[0.75 0 0 0.75 260.05378 202.56903] CT
0.851 0.325 0.098 RC
N
f-1057828618
f
GR
GS
[0.75 0 0 0.75 260.11173 202.54193] CT
0.851 0.325 0.098 RC
N
f-1057828618
f
GR
GS
[0.75 0 0 0.75 260.18424 202.43774] CT
0.851 0.325 0.098 RC
N
f-1057828618
f
GR
GS
[0.75 0 0 0.75 260.28992 202.46857] CT
0.851 0.325 0.098 RC
N
f-1057828618
f
GR
GS
[0.75 0 0 0.75 260.27197 202.41021] CT
0.851 0.325 0.098 RC
N
f-1057828618
f
GR
GS
[0.75 0 0 0.75 260.46037 202.53186] CT
0.851 0.325 0.098 RC
N
f-1057828618
f
GR
GS
[0.75 0 0 0.75 260.61424 202.42312] CT
0.851 0.325 0.098 RC
N
f-1057828618
f
GR
GS
[0.75 0 0 0.75 260.54697 202.55692] CT
0.851 0.325 0.098 RC
N
f-1057828618
f
GR
GS
[0.75 0 0 0.75 260.41587 202.45553] CT
0.851 0.325 0.098 RC
N
f-1057828618
f
GR
GS
[0.75 0 0 0.75 260.37302 202.30659] CT
0.851 0.325 0.098 RC
N
f-1057828618
f
GR
GS
[0.75 0 0 0.75 273.3384 204.78124] CT
0.929 0.694 0.125 RC
N
f-1057828618
f
GR
GS
[0.75 0 0 0.75 280.45667 196.79709] CT
0.929 0.694 0.125 RC
N
f-1057828618
f
GR
GS
[0.75 0 0 0.75 229.81659 157.84639] CT
0.929 0.694 0.125 RC
N
f-1057828618
f
GR
GS
[0.75 0 0 0.75 358.41376 332.12331] CT
0.929 0.694 0.125 RC
N
f-1057828618
f
GR
GS
[0.75 0 0 0.75 273.5956 288.00787] CT
0.929 0.694 0.125 RC
N
f-1057828618
f
GR
GS
[0.75 0 0 0.75 250.71162 122.10428] CT
0.929 0.694 0.125 RC
N
f-1057828618
f
GR
GS
[0.75 0 0 0.75 279.83157 86.11966] CT
0.929 0.694 0.125 RC
N
f-1057828618
f
GR
GS
[0.75 0 0 0.75 261.8568 117.57718] CT
0.929 0.694 0.125 RC
N
f-1057828618
f
GR
GS
[0.75 0 0 0.75 279.62103 351.35648] CT
0.929 0.694 0.125 RC
N
f-1057828618
f
GR
GS
[0.75 0 0 0.75 276.80766 136.10926] CT
0.929 0.694 0.125 RC
N
f-1057828618
f
GR
GS
[0.75 0 0 0.75 251.98814 188.95126] CT
0.929 0.694 0.125 RC
N
f-1057828618
f
GR
GS
[0.75 0 0 0.75 307.35294 211.86797] CT
0.929 0.694 0.125 RC
N
f-1057828618
f
GR
GS
[0.75 0 0 0.75 287.53233 198.89339] CT
0.929 0.694 0.125 RC
N
f-1057828618
f
GR
GS
[0.75 0 0 0.75 285.54131 247.34862] CT
0.929 0.694 0.125 RC
N
f-1057828618
f
GR
GS
[0.75 0 0 0.75 297.60246 259.44299] CT
0.929 0.694 0.125 RC
N
f-1057828618
f
GR
GS
[0.75 0 0 0.75 269.89785 303.27926] CT
0.929 0.694 0.125 RC
N
f-1057828618
f
GR
GS
[0.75 0 0 0.75 282.26955 304.32941] CT
0.929 0.694 0.125 RC
N
f-1057828618
f
GR
GS
[0.75 0 0 0.75 274.51474 279.28182] CT
0.929 0.694 0.125 RC
N
f-1057828618
f
GR
GS
[0.75 0 0 0.75 267.59177 252.87078] CT
0.929 0.694 0.125 RC
N
f-1057828618
f
GR
GS
[0.75 0 0 0.75 280.37215 222.1672] CT
0.929 0.694 0.125 RC
N
f-1057828618
f
GR
GS
[0.75 0 0 0.75 279.30521 217.86152] CT
0.929 0.694 0.125 RC
N
f-1057828618
f
GR
GS
[0.75 0 0 0.75 278.0937 232.49238] CT
0.929 0.694 0.125 RC
N
f-1057828618
f
GR
GS
[0.75 0 0 0.75 279.7736 205.90231] CT
0.929 0.694 0.125 RC
N
f-1057828618
f
GR
GS
[0.75 0 0 0.75 267.32398 215.76801] CT
0.929 0.694 0.125 RC
N
f-1057828618
f
GR
GS
[0.75 0 0 0.75 274.13242 213.73888] CT
0.929 0.694 0.125 RC
N
f-1057828618
f
GR
GS
[0.75 0 0 0.75 266.6153 231.56941] CT
0.929 0.694 0.125 RC
N
f-1057828618
f
GR
GS
[0.75 0 0 0.75 260.47387 238.45821] CT
0.929 0.694 0.125 RC
N
f-1057828618
f
GR
GS
[0.75 0 0 0.75 242.41047 239.8377] CT
0.929 0.694 0.125 RC
N
f-1057828618
f
GR
GS
[0.75 0 0 0.75 224.94818 234.81262] CT
0.929 0.694 0.125 RC
N
f-1057828618
f
GR
GS
[0.75 0 0 0.75 226.35807 221.44217] CT
0.929 0.694 0.125 RC
N
f-1057828618
f
GR
GS
[0.75 0 0 0.75 203.39584 259.38169] CT
0.929 0.694 0.125 RC
N
f-1057828618
f
GR
GS
[0.75 0 0 0.75 215.17847 230.66476] CT
0.929 0.694 0.125 RC
N
f-1057828618
f
GR
GS
[0.75 0 0 0.75 192.58891 225.43002] CT
0.929 0.694 0.125 RC
N
f-1057828618
f
GR
GS
[0.75 0 0 0.75 188.98997 242.28964] CT
0.929 0.694 0.125 RC
N
f-1057828618
f
GR
GS
[0.75 0 0 0.75 176.12771 268.49982] CT
0.929 0.694 0.125 RC
N
f-1057828618
f
GR
GS
[0.75 0 0 0.75 198.9968 280.3198] CT
0.929 0.694 0.125 RC
N
f-1057828618
f
GR
GS
[0.75 0 0 0.75 199.33344 298.55759] CT
0.929 0.694 0.125 RC
N
f-1057828618
f
GR
GS
[0.75 0 0 0.75 201.63393 281.43333] CT
0.929 0.694 0.125 RC
N
f-1057828618
f
GR
GS
[0.75 0 0 0.75 241.15526 351.56399] CT
0.929 0.694 0.125 RC
N
f-1057828618
f
GR
GS
[0.75 0 0 0.75 239.67888 303.88586] CT
0.929 0.694 0.125 RC
N
f-1057828618
f
GR
GS
[0.75 0 0 0.75 177.65991 276.26827] CT
0.929 0.694 0.125 RC
N
f-1057828618
f
GR
GS
[0.75 0 0 0.75 214.41591 251.72674] CT
0.929 0.694 0.125 RC
N
f-1057828618
f
GR
GS
[0.75 0 0 0.75 185.3645 283.30039] CT
0.929 0.694 0.125 RC
N
f-1057828618
f
GR
GS
[0.75 0 0 0.75 174.81228 307.52657] CT
0.929 0.694 0.125 RC
N
f-1057828618
f
GR
GS
[0.75 0 0 0.75 141.95357 320.32768] CT
0.929 0.694 0.125 RC
N
f-1057828618
f
GR
GS
[0.75 0 0 0.75 191.95687 327.57065] CT
0.929 0.694 0.125 RC
N
f-1057828618
f
GR
GS
[0.75 0 0 0.75 158.56825 320.18809] CT
0.929 0.694 0.125 RC
N
f-1057828618
f
GR
GS
[0.75 0 0 0.75 152.08698 341.51942] CT
0.929 0.694 0.125 RC
N
f-1057828618
f
GR
GS
[0.75 0 0 0.75 157.97964 357.22064] CT
0.929 0.694 0.125 RC
N
f-1057828618
f
GR
GS
[0.75 0 0 0.75 224.59497 263.54116] CT
0.929 0.694 0.125 RC
N
f-1057828618
f
GR
GS
[0.75 0 0 0.75 296.82534 213.8229] CT
0.929 0.694 0.125 RC
N
f-1057828618
f
GR
GS
[0.75 0 0 0.75 293.45821 213.33735] CT
0.929 0.694 0.125 RC
N
f-1057828618
f
GR
GS
[0.75 0 0 0.75 306.66742 168.23296] CT
0.929 0.694 0.125 RC
N
f-1057828618
f
GR
GS
[0.75 0 0 0.75 282.66673 196.89457] CT
0.929 0.694 0.125 RC
N
f-1057828618
f
GR
GS
[0.75 0 0 0.75 277.01081 179.7278] CT
0.929 0.694 0.125 RC
N
f-1057828618
f
GR
GS
[0.75 0 0 0.75 249.16335 218.13691] CT
0.929 0.694 0.125 RC
N
f-1057828618
f
GR
GS
[0.75 0 0 0.75 192.44069 273.64618] CT
0.929 0.694 0.125 RC
N
f-1057828618
f
GR
GS
[0.75 0 0 0.75 261.04935 187.21618] CT
0.929 0.694 0.125 RC
N
f-1057828618
f
GR
GS
[0.75 0 0 0.75 261.86421 215.13281] CT
0.929 0.694 0.125 RC
N
f-1057828618
f
GR
GS
[0.75 0 0 0.75 262.82059 196.7121] CT
0.929 0.694 0.125 RC
N
f-1057828618
f
GR
GS
[0.75 0 0 0.75 200.55968 245.78883] CT
0.929 0.694 0.125 RC
N
f-1057828618
f
GR
GS
[0.75 0 0 0.75 212.02245 220.00465] CT
0.929 0.694 0.125 RC
N
f-1057828618
f
GR
GS
[0.75 0 0 0.75 182.23574 245.70696] CT
0.929 0.694 0.125 RC
N
f-1057828618
f
GR
GS
[0.75 0 0 0.75 201.06157 227.23995] CT
0.929 0.694 0.125 RC
N
f-1057828618
f
GR
GS
[0.75 0 0 0.75 186.11438 226.77807] CT
0.929 0.694 0.125 RC
N
f-1057828618
f
GR
GS
[0.75 0 0 0.75 226.24191 165.60429] CT
0.929 0.694 0.125 RC
N
f-1057828618
f
GR
GS
[0.75 0 0 0.75 253.69455 158.12881] CT
0.929 0.694 0.125 RC
N
f-1057828618
f
GR
GS
[0.75 0 0 0.75 216.78889 182.99276] CT
0.929 0.694 0.125 RC
N
f-1057828618
f
GR
GS
[0.75 0 0 0.75 168.29871 259.02198] CT
0.929 0.694 0.125 RC
N
f-1057828618
f
GR
GS
[0.75 0 0 0.75 160.17846 280.25409] CT
0.929 0.694 0.125 RC
N
f-1057828618
f
GR
GS
[0.75 0 0 0.75 86.49699 324.77721] CT
0.929 0.694 0.125 RC
N
f-1057828618
f
GR
GS
[0.75 0 0 0.75 72.80231 363.98788] CT
0.929 0.694 0.125 RC
N
f-1057828618
f
GR
GS
[0.75 0 0 0.75 107.42216 324.18631] CT
0.929 0.694 0.125 RC
N
f-1057828618
f
GR
GS
[0.75 0 0 0.75 143.0716 314.46339] CT
0.929 0.694 0.125 RC
N
f-1057828618
f
GR
GS
[0.75 0 0 0.75 133.13725 297.86309] CT
0.929 0.694 0.125 RC
N
f-1057828618
f
GR
GS
[0.75 0 0 0.75 155.37426 276.14976] CT
0.929 0.694 0.125 RC
N
f-1057828618
f
GR
GS
[0.75 0 0 0.75 107.8955 296.47318] CT
0.929 0.694 0.125 RC
N
f-1057828618
f
GR
GS
[0.75 0 0 0.75 131.94398 270.0921] CT
0.929 0.694 0.125 RC
N
f-1057828618
f
GR
GS
[0.75 0 0 0.75 151.92549 249.21778] CT
0.929 0.694 0.125 RC
N
f-1057828618
f
GR
GS
[0.75 0 0 0.75 160.03828 213.51821] CT
0.929 0.694 0.125 RC
N
f-1057828618
f
GR
GS
[0.75 0 0 0.75 196.46944 201.20599] CT
0.929 0.694 0.125 RC
N
f-1057828618
f
GR
GS
[0.75 0 0 0.75 234.30299 191.34646] CT
0.929 0.694 0.125 RC
N
f-1057828618
f
GR
GS
[0.75 0 0 0.75 205.50146 181.38509] CT
0.929 0.694 0.125 RC
N
f-1057828618
f
GR
GS
[0.75 0 0 0.75 194.03206 215.02077] CT
0.929 0.694 0.125 RC
N
f-1057828618
f
GR
GS
[0.75 0 0 0.75 197.09436 210.40377] CT
0.929 0.694 0.125 RC
N
f-1057828618
f
GR
GS
[0.75 0 0 0.75 192.93954 218.61292] CT
0.929 0.694 0.125 RC
N
f-1057828618
f
GR
GS
[0.75 0 0 0.75 169.70456 245.03817] CT
0.929 0.694 0.125 RC
N
f-1057828618
f
GR
GS
[0.75 0 0 0.75 195.82587 239.46215] CT
0.929 0.694 0.125 RC
N
f-1057828618
f
GR
GS
[0.75 0 0 0.75 288.8115 95.30523] CT
0.929 0.694 0.125 RC
N
f-1057828618
f
GR
GS
[0.75 0 0 0.75 307.82723 103.73185] CT
0.929 0.694 0.125 RC
N
f-1057828618
f
GR
GS
[0.75 0 0 0.75 313.69695 268.46782] CT
0.929 0.694 0.125 RC
N
f-1057828618
f
GR
GS
[0.75 0 0 0.75 308.76112 64.61659] CT
0.929 0.694 0.125 RC
N
f-1057828618
f
GR
GS
[0.75 0 0 0.75 290.23114 261.14664] CT
0.929 0.694 0.125 RC
N
f-1057828618
f
GR
GS
[0.75 0 0 0.75 292.35784 82.13261] CT
0.929 0.694 0.125 RC
N
f-1057828618
f
GR
GS
[0.75 0 0 0.75 297.32243 119.81155] CT
0.929 0.694 0.125 RC
N
f-1057828618
f
GR
GS
[0.75 0 0 0.75 327.83723 91.22995] CT
0.929 0.694 0.125 RC
N
f-1057828618
f
GR
GS
[0.75 0 0 0.75 319.91556 91.63933] CT
0.929 0.694 0.125 RC
N
f-1057828618
f
GR
GS
[0.75 0 0 0.75 343.16359 104.876] CT
0.929 0.694 0.125 RC
N
f-1057828618
f
GR
GS
[0.75 0 0 0.75 331.12493 88.07376] CT
0.929 0.694 0.125 RC
N
f-1057828618
f
GR
GS
[0.75 0 0 0.75 340.42859 270.15997] CT
0.929 0.694 0.125 RC
N
f-1057828618
f
GR
GS
[0.75 0 0 0.75 327.69239 308.03002] CT
0.929 0.694 0.125 RC
N
f-1057828618
f
GR
GS
[0.75 0 0 0.75 315.23037 304.5957] CT
0.929 0.694 0.125 RC
N
f-1057828618
f
GR
GS
[0.75 0 0 0.75 365.57977 84.18418] CT
0.929 0.694 0.125 RC
N
f-1057828618
f
GR
GS
[0.75 0 0 0.75 334.09978 328.37885] CT
0.929 0.694 0.125 RC
N
f-1057828618
f
GR
GS
[0.75 0 0 0.75 338.69339 322.57738] CT
0.929 0.694 0.125 RC
N
f-1057828618
f
GR
GS
[0.75 0 0 0.75 319.62376 327.2642] CT
0.929 0.694 0.125 RC
N
f-1057828618
f
GR
GS
[0.75 0 0 0.75 279.29755 300.89092] CT
0.929 0.694 0.125 RC
N
f-1057828618
f
GR
GS
[0.75 0 0 0.75 297.11971 300.38839] CT
0.929 0.694 0.125 RC
N
f-1057828618
f
GR
GS
[0.75 0 0 0.75 318.49452 244.09044] CT
0.929 0.694 0.125 RC
N
f-1057828618
f
GR
GS
[0.75 0 0 0.75 253.04313 216.70702] CT
0.929 0.694 0.125 RC
N
f-1057828618
f
GR
GS
[0.75 0 0 0.75 280.01649 261.17876] CT
0.929 0.694 0.125 RC
N
f-1057828618
f
GR
GS
[0.75 0 0 0.75 316.40907 332.67041] CT
0.929 0.694 0.125 RC
N
f-1057828618
f
GR
GS
[0.75 0 0 0.75 328.3277 257.86079] CT
0.929 0.694 0.125 RC
N
f-1057828618
f
GR
GS
[0.75 0 0 0.75 320.61399 271.18806] CT
0.929 0.694 0.125 RC
N
f-1057828618
f
GR
GS
[0.75 0 0 0.75 316.09266 304.14379] CT
0.929 0.694 0.125 RC
N
f-1057828618
f
GR
GS
[0.75 0 0 0.75 313.57626 289.97749] CT
0.929 0.694 0.125 RC
N
f-1057828618
f
GR
GS
[0.75 0 0 0.75 285.04408 243.87142] CT
0.929 0.694 0.125 RC
N
f-1057828618
f
GR
GS
[0.75 0 0 0.75 295.52323 282.52741] CT
0.929 0.694 0.125 RC
N
f-1057828618
f
GR
GS
[0.75 0 0 0.75 194.72935 224.15353] CT
0.929 0.694 0.125 RC
N
f-1057828618
f
GR
GS
[0.75 0 0 0.75 161.41433 261.21263] CT
0.929 0.694 0.125 RC
N
f-1057828618
f
GR
GS
[0.75 0 0 0.75 180.29654 165.11589] CT
0.929 0.694 0.125 RC
N
f-1057828618
f
GR
GS
[0.75 0 0 0.75 177.4132 170.9529] CT
0.929 0.694 0.125 RC
N
f-1057828618
f
GR
GS
[0.75 0 0 0.75 132.28031 196.60812] CT
0.929 0.694 0.125 RC
N
f-1057828618
f
GR
GS
[0.75 0 0 0.75 127.71811 224.16522] CT
0.929 0.694 0.125 RC
N
f-1057828618
f
GR
GS
[0.75 0 0 0.75 120.9848 253.19119] CT
0.929 0.694 0.125 RC
N
f-1057828618
f
GR
GS
[0.75 0 0 0.75 116.24043 256.10728] CT
0.929 0.694 0.125 RC
N
f-1057828618
f
GR
GS
[0.75 0 0 0.75 114.28376 263.28987] CT
0.929 0.694 0.125 RC
N
f-1057828618
f
GR
GS
[0.75 0 0 0.75 146.63221 205.21287] CT
0.929 0.694 0.125 RC
N
f-1057828618
f
GR
GS
[0.75 0 0 0.75 174.39878 251.93392] CT
0.929 0.694 0.125 RC
N
f-1057828618
f
GR
GS
[0.75 0 0 0.75 145.59762 252.45923] CT
0.929 0.694 0.125 RC
N
f-1057828618
f
GR
GS
[0.75 0 0 0.75 246.55167 93.34934] CT
0.929 0.694 0.125 RC
N
f-1057828618
f
GR
GS
[0.75 0 0 0.75 273.42334 112.3376] CT
0.929 0.694 0.125 RC
N
f-1057828618
f
GR
GS
[0.75 0 0 0.75 267.87877 100.48372] CT
0.929 0.694 0.125 RC
N
f-1057828618
f
GR
GS
[0.75 0 0 0.75 271.14052 141.24795] CT
0.929 0.694 0.125 RC
N
f-1057828618
f
GR
GS
[0.75 0 0 0.75 278.72612 150.71107] CT
0.929 0.694 0.125 RC
N
f-1057828618
f
GR
GS
[0.75 0 0 0.75 259.74818 95.65138] CT
0.929 0.694 0.125 RC
N
f-1057828618
f
GR
GS
[0.75 0 0 0.75 245.48625 128.86388] CT
0.929 0.694 0.125 RC
N
f-1057828618
f
GR
GS
[0.75 0 0 0.75 226.64076 112.23056] CT
0.929 0.694 0.125 RC
N
f-1057828618
f
GR
GS
[0.75 0 0 0.75 266.37119 169.19439] CT
0.929 0.694 0.125 RC
N
f-1057828618
f
GR
GS
[0.75 0 0 0.75 204.14575 198.74103] CT
0.929 0.694 0.125 RC
N
f-1057828618
f
GR
GS
[0.75 0 0 0.75 217.39742 173.33582] CT
0.929 0.694 0.125 RC
N
f-1057828618
f
GR
GS
[0.75 0 0 0.75 213.53838 183.66741] CT
0.929 0.694 0.125 RC
N
f-1057828618
f
GR
GS
[0.75 0 0 0.75 179.15905 184.96537] CT
0.929 0.694 0.125 RC
N
f-1057828618
f
GR
GS
[0.75 0 0 0.75 197.30647 230.22233] CT
0.929 0.694 0.125 RC
N
f-1057828618
f
GR
GS
[0.75 0 0 0.75 175.25623 145.20086] CT
0.929 0.694 0.125 RC
N
f-1057828618
f
GR
GS
[0.75 0 0 0.75 196.50778 295.18236] CT
0.929 0.694 0.125 RC
N
f-1057828618
f
GR
GS
[0.75 0 0 0.75 201.25562 325.16787] CT
0.929 0.694 0.125 RC
N
f-1057828618
f
GR
GS
[0.75 0 0 0.75 177.23107 272.63235] CT
0.929 0.694 0.125 RC
N
f-1057828618
f
GR
GS
[0.75 0 0 0.75 161.28275 203.90678] CT
0.929 0.694 0.125 RC
N
f-1057828618
f
GR
GS
[0.75 0 0 0.75 231.4324 175.78667] CT
0.929 0.694 0.125 RC
N
f-1057828618
f
GR
GS
[0.75 0 0 0.75 238.04727 160.63586] CT
0.929 0.694 0.125 RC
N
f-1057828618
f
GR
GS
[0.75 0 0 0.75 245.33409 157.15343] CT
0.929 0.694 0.125 RC
N
f-1057828618
f
GR
GS
[0.75 0 0 0.75 270.16596 145.60823] CT
0.929 0.694 0.125 RC
N
f-1057828618
f
GR
GS
[0.75 0 0 0.75 283.43678 138.6869] CT
0.929 0.694 0.125 RC
N
f-1057828618
f
GR
GS
[0.75 0 0 0.75 266.57716 169.84784] CT
0.929 0.694 0.125 RC
N
f-1057828618
f
GR
GS
[0.75 0 0 0.75 271.60442 190.61522] CT
0.929 0.694 0.125 RC
N
f-1057828618
f
GR
GS
[0.75 0 0 0.75 260.06564 134.79733] CT
0.929 0.694 0.125 RC
N
f-1057828618
f
GR
GS
[0.75 0 0 0.75 272.55547 117.58876] CT
0.929 0.694 0.125 RC
N
f-1057828618
f
GR
GS
[0.75 0 0 0.75 274.69073 115.59059] CT
0.929 0.694 0.125 RC
N
f-1057828618
f
GR
GS
[0.75 0 0 0.75 297.60818 130.33012] CT
0.929 0.694 0.125 RC
N
f-1057828618
f
GR
GS
[0.75 0 0 0.75 292.10939 169.82929] CT
0.929 0.694 0.125 RC
N
f-1057828618
f
GR
GS
[0.75 0 0 0.75 287.41029 190.94704] CT
0.929 0.694 0.125 RC
N
f-1057828618
f
GR
GS
[0.75 0 0 0.75 271.93385 216.32501] CT
0.929 0.694 0.125 RC
N
f-1057828618
f
GR
GS
[0.75 0 0 0.75 288.36333 202.24729] CT
0.929 0.694 0.125 RC
N
f-1057828618
f
GR
GS
[0.75 0 0 0.75 300.81081 176.91241] CT
0.929 0.694 0.125 RC
N
f-1057828618
f
GR
GS
[0.75 0 0 0.75 198.61967 198.90477] CT
0 1 0 RC
N
4 0 M
4 -2.209 2.209 -4 0 -4 C
-2.209 -4 -4 -2.209 -4 0 C
-4 2.209 -2.209 4 0 4 C
2.209 4 4 2.209 4 0 C
cp
f
GR
GS
[0.75 0 0 0.75 198.61967 198.90477] CT
0 0.498 0 RC
10.0 ML
N
4 0 M
4 -2.209 2.209 -4 0 -4 C
-2.209 -4 -4 -2.209 -4 0 C
-4 2.209 -2.209 4 0 4 C
2.209 4 4 2.209 4 0 C
cp
S
GR
GS
[0.75 0 0 0.75 238.68205 215.39822] CT
0 1 0 RC
N
/f351177404{4 0 M
4 -2.209 2.209 -4 0 -4 C
-2.209 -4 -4 -2.209 -4 0 C
-4 2.209 -2.209 4 0 4 C
2.209 4 4 2.209 4 0 C
cp}def
f351177404
f
GR
GS
[0.75 0 0 0.75 238.68205 215.39822] CT
0 0.498 0 RC
10.0 ML
N
4 0 M
4 -2.209 2.209 -4 0 -4 C
-2.209 -4 -4 -2.209 -4 0 C
-4 2.209 -2.209 4 0 4 C
2.209 4 4 2.209 4 0 C
cp
S
GR
GS
[0.75 0 0 0.75 114.2306 259.6431] CT
0 1 0 RC
N
f351177404
f
GR
GS
[0.75 0 0 0.75 114.2306 259.6431] CT
0 0.498 0 RC
10.0 ML
N
4 0 M
4 -2.209 2.209 -4 0 -4 C
-2.209 -4 -4 -2.209 -4 0 C
-4 2.209 -2.209 4 0 4 C
2.209 4 4 2.209 4 0 C
cp
S
GR
GS
[0.75 0 0 0.75 260.49662 335.20427] CT
0 1 0 RC
N
f351177404
f
GR
GS
[0.75 0 0 0.75 260.49662 335.20427] CT
0 0.498 0 RC
10.0 ML
N
4 0 M
4 -2.209 2.209 -4 0 -4 C
-2.209 -4 -4 -2.209 -4 0 C
-4 2.209 -2.209 4 0 4 C
2.209 4 4 2.209 4 0 C
cp
S
GR
GS
[0.75 0 0 0.75 247.48082 339.14397] CT
0 1 0 RC
N
f351177404
f
GR
GS
[0.75 0 0 0.75 247.48082 339.14397] CT
0 0.498 0 RC
10.0 ML
N
4 0 M
4 -2.209 2.209 -4 0 -4 C
-2.209 -4 -4 -2.209 -4 0 C
-4 2.209 -2.209 4 0 4 C
2.209 4 4 2.209 4 0 C
cp
S
GR
GS
[0.75 0 0 0.75 302.353 198.21794] CT
0 1 0 RC
N
f351177404
f
GR
GS
[0.75 0 0 0.75 302.353 198.21794] CT
0 0.498 0 RC
10.0 ML
N
4 0 M
4 -2.209 2.209 -4 0 -4 C
-2.209 -4 -4 -2.209 -4 0 C
-4 2.209 -2.209 4 0 4 C
2.209 4 4 2.209 4 0 C
cp
S
GR
GS
[0.75 0 0 0.75 299.38513 283.8606] CT
0 1 0 RC
N
f351177404
f
GR
GS
[0.75 0 0 0.75 299.38513 283.8606] CT
0 0.498 0 RC
10.0 ML
N
4 0 M
4 -2.209 2.209 -4 0 -4 C
-2.209 -4 -4 -2.209 -4 0 C
-4 2.209 -2.209 4 0 4 C
2.209 4 4 2.209 4 0 C
cp
S
GR
GS
[0.75 0 0 0.75 313.72799 227.9119] CT
0 1 0 RC
N
f351177404
f
GR
GS
[0.75 0 0 0.75 313.72799 227.9119] CT
0 0.498 0 RC
10.0 ML
N
4 0 M
4 -2.209 2.209 -4 0 -4 C
-2.209 -4 -4 -2.209 -4 0 C
-4 2.209 -2.209 4 0 4 C
2.209 4 4 2.209 4 0 C
cp
S
GR
GS
[0.75 0 0 0.75 312.60217 266.53619] CT
0 1 0 RC
N
f351177404
f
GR
GS
[0.75 0 0 0.75 312.60217 266.53619] CT
0 0.498 0 RC
10.0 ML
N
4 0 M
4 -2.209 2.209 -4 0 -4 C
-2.209 -4 -4 -2.209 -4 0 C
-4 2.209 -2.209 4 0 4 C
2.209 4 4 2.209 4 0 C
cp
S
GR
GS
[0.75 0 0 0.75 122.00522 210.95132] CT
0 1 0 RC
N
f351177404
f
GR
GS
[0.75 0 0 0.75 122.00522 210.95132] CT
0 0.498 0 RC
10.0 ML
N
4 0 M
4 -2.209 2.209 -4 0 -4 C
-2.209 -4 -4 -2.209 -4 0 C
-4 2.209 -2.209 4 0 4 C
2.209 4 4 2.209 4 0 C
cp
S
GR
GS
[0.75 0 0 0.75 246.85863 175.94753] CT
0 1 0 RC
N
f351177404
f
GR
GS
[0.75 0 0 0.75 246.85863 175.94753] CT
0 0.498 0 RC
10.0 ML
N
4 0 M
4 -2.209 2.209 -4 0 -4 C
-2.209 -4 -4 -2.209 -4 0 C
-4 2.209 -2.209 4 0 4 C
2.209 4 4 2.209 4 0 C
cp
S
GR
GS
[0.75 0 0 0.75 232.15253 114.07467] CT
0 1 0 RC
N
f351177404
f
GR
GS
[0.75 0 0 0.75 232.15253 114.07467] CT
0 0.498 0 RC
10.0 ML
N
4 0 M
4 -2.209 2.209 -4 0 -4 C
-2.209 -4 -4 -2.209 -4 0 C
-4 2.209 -2.209 4 0 4 C
2.209 4 4 2.209 4 0 C
cp
S
GR
GS
[0.75 0 0 0.75 246.77783 204.55108] CT
0 1 0 RC
N
f351177404
f
GR
GS
[0.75 0 0 0.75 246.77783 204.55108] CT
0 0.498 0 RC
10.0 ML
N
4 0 M
4 -2.209 2.209 -4 0 -4 C
-2.209 -4 -4 -2.209 -4 0 C
-4 2.209 -2.209 4 0 4 C
2.209 4 4 2.209 4 0 C
cp
S
GR
GS
[0.75 0 0 0.75 250.69146 183.91245] CT
0 1 0 RC
N
f351177404
f
GR
GS
[0.75 0 0 0.75 250.69146 183.91245] CT
0 0.498 0 RC
10.0 ML
N
4 0 M
4 -2.209 2.209 -4 0 -4 C
-2.209 -4 -4 -2.209 -4 0 C
-4 2.209 -2.209 4 0 4 C
2.209 4 4 2.209 4 0 C
cp
S
GR
GS
[0.75 0 0 0.75 251.53221 168.58047] CT
0 1 0 RC
N
f351177404
f
GR
GS
[0.75 0 0 0.75 251.53221 168.58047] CT
0 0.498 0 RC
10.0 ML
N
4 0 M
4 -2.209 2.209 -4 0 -4 C
-2.209 -4 -4 -2.209 -4 0 C
-4 2.209 -2.209 4 0 4 C
2.209 4 4 2.209 4 0 C
cp
S
GR
GS
[0.75 0 0 0.75 269.68884 151.42335] CT
0 1 0 RC
N
f351177404
f
GR
GS
[0.75 0 0 0.75 269.68884 151.42335] CT
0 0.498 0 RC
10.0 ML
N
4 0 M
4 -2.209 2.209 -4 0 -4 C
-2.209 -4 -4 -2.209 -4 0 C
-4 2.209 -2.209 4 0 4 C
2.209 4 4 2.209 4 0 C
cp
S
GR
GS
[0.75 0 0 0.75 281.52413 160.89215] CT
0 1 0 RC
N
f351177404
f
GR
GS
[0.75 0 0 0.75 281.52413 160.89215] CT
0 0.498 0 RC
10.0 ML
N
4 0 M
4 -2.209 2.209 -4 0 -4 C
-2.209 -4 -4 -2.209 -4 0 C
-4 2.209 -2.209 4 0 4 C
2.209 4 4 2.209 4 0 C
cp
S
GR
GS
[0.75 0 0 0.75 266.08873 175.52994] CT
0 1 0 RC
N
f351177404
f
GR
GS
[0.75 0 0 0.75 266.08873 175.52994] CT
0 0.498 0 RC
10.0 ML
N
4 0 M
4 -2.209 2.209 -4 0 -4 C
-2.209 -4 -4 -2.209 -4 0 C
-4 2.209 -2.209 4 0 4 C
2.209 4 4 2.209 4 0 C
cp
S
GR
GS
[0.75 0 0 0.75 256.71732 156.20189] CT
0 1 0 RC
N
f351177404
f
GR
GS
[0.75 0 0 0.75 256.71732 156.20189] CT
0 0.498 0 RC
10.0 ML
N
4 0 M
4 -2.209 2.209 -4 0 -4 C
-2.209 -4 -4 -2.209 -4 0 C
-4 2.209 -2.209 4 0 4 C
2.209 4 4 2.209 4 0 C
cp
S
GR
GS
[0.75 0 0 0.75 283.49618 163.7072] CT
0 1 0 RC
N
f351177404
f
GR
GS
[0.75 0 0 0.75 283.49618 163.7072] CT
0 0.498 0 RC
10.0 ML
N
4 0 M
4 -2.209 2.209 -4 0 -4 C
-2.209 -4 -4 -2.209 -4 0 C
-4 2.209 -2.209 4 0 4 C
2.209 4 4 2.209 4 0 C
cp
S
GR
GS
[0.75 0 0 0.75 287.46362 181.41114] CT
0 1 0 RC
N
f351177404
f
GR
GS
[0.75 0 0 0.75 287.46362 181.41114] CT
0 0.498 0 RC
10.0 ML
N
4 0 M
4 -2.209 2.209 -4 0 -4 C
-2.209 -4 -4 -2.209 -4 0 C
-4 2.209 -2.209 4 0 4 C
2.209 4 4 2.209 4 0 C
cp
S
GR
GS
[0.75 0 0 0.75 280.78672 207.46268] CT
0 1 0 RC
N
f351177404
f
GR
GS
[0.75 0 0 0.75 280.78672 207.46268] CT
0 0.498 0 RC
10.0 ML
N
4 0 M
4 -2.209 2.209 -4 0 -4 C
-2.209 -4 -4 -2.209 -4 0 C
-4 2.209 -2.209 4 0 4 C
2.209 4 4 2.209 4 0 C
cp
S
GR
GS
[0.75 0 0 0.75 280.28982 223.08444] CT
0 1 0 RC
N
f351177404
f
GR
GS
[0.75 0 0 0.75 280.28982 223.08444] CT
0 0.498 0 RC
10.0 ML
N
4 0 M
4 -2.209 2.209 -4 0 -4 C
-2.209 -4 -4 -2.209 -4 0 C
-4 2.209 -2.209 4 0 4 C
2.209 4 4 2.209 4 0 C
cp
S
GR
GS
[0.75 0 0 0.75 263.625 211.5] CT
0.494 0.184 0.557 RC
10.0 ML
N
0 -4 M
0 4 L
-4 0 M
4 0 L
S
GR
GS
[0.75 0 0 0.75 0 0] CT
1 GC
N
/f-1430582472{239 156 M
239 55 L
99 55 L
99 156 L
cp}def
f-1430582472
f
GR
GS
[0.75 0 0 0.75 109.5 51.69828] CT
/Helvetica 18.667 F
GS
[1 0 0 1 0 0] CT
0 7 moveto 
1 -1 scale
(CP) t 
GR
GR
GS
[0.75 0 0 0.75 92.25 51.69828] CT
0 0.447 0.741 RC
N
f-1057828618
f
GR
GS
[0.75 0 0 0.75 109.5 69.98276] CT
/Helvetica 18.667 F
GS
[1 0 0 1 0 0] CT
0 7 moveto 
1 -1 scale
(Google LP) t 
GR
GR
GS
[0.75 0 0 0.75 92.25 69.98276] CT
0.851 0.325 0.098 RC
N
f-1057828618
f
GR
GS
[0.75 0 0 0.75 109.5 88.26724] CT
/Helvetica 18.667 F
GS
[1 0 0 1 0 0] CT
0 7 moveto 
1 -1 scale
(GPS) t 
GR
GR
GS
[0.75 0 0 0.75 92.25 88.26724] CT
0.929 0.694 0.125 RC
N
f-1057828618
f
GR
GS
[0.75 0 0 0.75 109.5 106.55173] CT
/Helvetica 18.667 F
GS
[1 0 0 1 0 0] CT
0 7 moveto 
1 -1 scale
(Profit) t 
GR
GR
GS
[0.75 0 0 0.75 92.25 106.55173] CT
0 1 0 RC
N
f351177404
f
GR
GS
[0.75 0 0 0.75 92.25 106.55173] CT
0 0.498 0 RC
10.0 ML
N
4 0 M
4 -2.209 2.209 -4 0 -4 C
-2.209 -4 -4 -2.209 -4 0 C
-4 2.209 -2.209 4 0 4 C
2.209 4 4 2.209 4 0 C
cp
S
GR
GS
[0.75 0 0 0.75 0 0] CT
0.149 GC
10.0 ML
0.667 LW
N
99 156 M
99 55 L
239 55 L
239 156 L
cp
S
GR
%%Trailer
%%Pages: 1
%%EOF
