%!PS-Adobe-3.0 EPSF-3.0
%%Creator: (MATLAB, The Mathworks, Inc. Version 9.5.0.944444 \(R2018b\). Operating System: Windows 10)
%%Title: (C:/Users/Alex/Documents/PhD Docs/01. GIT/my_phd_thesis/Chapter8/Figures/capsloc_res/16102019_ex01_pieCharts.eps)
%%CreationDate: 2019-10-31T17:41:51
%%Pages: (atend)
%%BoundingBox: 0 0 510 470
%%LanguageLevel: 3
%%EndComments
%%BeginProlog
%%BeginResource: procset (Apache XML Graphics Std ProcSet) 1.2 0
%%Version: 1.2 0
%%Copyright: (Copyright 2001-2003,2010 The Apache Software Foundation. License terms: http://www.apache.org/licenses/LICENSE-2.0)
/bd{bind def}bind def
/ld{load def}bd
/GR/grestore ld
/GS/gsave ld
/RM/rmoveto ld
/C/curveto ld
/t/show ld
/L/lineto ld
/ML/setmiterlimit ld
/CT/concat ld
/f/fill ld
/N/newpath ld
/S/stroke ld
/CC/setcmykcolor ld
/A/ashow ld
/cp/closepath ld
/RC/setrgbcolor ld
/LJ/setlinejoin ld
/GC/setgray ld
/LW/setlinewidth ld
/M/moveto ld
/re {4 2 roll M
1 index 0 rlineto
0 exch rlineto
neg 0 rlineto
cp } bd
/_ctm matrix def
/_tm matrix def
/BT { _ctm currentmatrix pop matrix _tm copy pop 0 0 moveto } bd
/ET { _ctm setmatrix } bd
/iTm { _ctm setmatrix _tm concat } bd
/Tm { _tm astore pop iTm 0 0 moveto } bd
/ux 0.0 def
/uy 0.0 def
/F {
  /Tp exch def
  /Tf exch def
  Tf findfont Tp scalefont setfont
  /cf Tf def  /cs Tp def
} bd
/ULS {currentpoint /uy exch def /ux exch def} bd
/ULE {
  /Tcx currentpoint pop def
  gsave
  newpath
  cf findfont cs scalefont dup
  /FontMatrix get 0 get /Ts exch def /FontInfo get dup
  /UnderlinePosition get Ts mul /To exch def
  /UnderlineThickness get Ts mul /Tt exch def
  ux uy To add moveto  Tcx uy To add lineto
  Tt setlinewidth stroke
  grestore
} bd
/OLE {
  /Tcx currentpoint pop def
  gsave
  newpath
  cf findfont cs scalefont dup
  /FontMatrix get 0 get /Ts exch def /FontInfo get dup
  /UnderlinePosition get Ts mul /To exch def
  /UnderlineThickness get Ts mul /Tt exch def
  ux uy To add cs add moveto Tcx uy To add cs add lineto
  Tt setlinewidth stroke
  grestore
} bd
/SOE {
  /Tcx currentpoint pop def
  gsave
  newpath
  cf findfont cs scalefont dup
  /FontMatrix get 0 get /Ts exch def /FontInfo get dup
  /UnderlinePosition get Ts mul /To exch def
  /UnderlineThickness get Ts mul /Tt exch def
  ux uy To add cs 10 mul 26 idiv add moveto Tcx uy To add cs 10 mul 26 idiv add lineto
  Tt setlinewidth stroke
  grestore
} bd
/QT {
/Y22 exch store
/X22 exch store
/Y21 exch store
/X21 exch store
currentpoint
/Y21 load 2 mul add 3 div exch
/X21 load 2 mul add 3 div exch
/X21 load 2 mul /X22 load add 3 div
/Y21 load 2 mul /Y22 load add 3 div
/X22 load /Y22 load curveto
} bd
/SSPD {
dup length /d exch dict def
{
/v exch def
/k exch def
currentpagedevice k known {
/cpdv currentpagedevice k get def
v cpdv ne {
/upd false def
/nullv v type /nulltype eq def
/nullcpdv cpdv type /nulltype eq def
nullv nullcpdv or
{
/upd true def
} {
/sametype v type cpdv type eq def
sametype {
v type /arraytype eq {
/vlen v length def
/cpdvlen cpdv length def
vlen cpdvlen eq {
0 1 vlen 1 sub {
/i exch def
/obj v i get def
/cpdobj cpdv i get def
obj cpdobj ne {
/upd true def
exit
} if
} for
} {
/upd true def
} ifelse
} {
v type /dicttype eq {
v {
/dv exch def
/dk exch def
/cpddv cpdv dk get def
dv cpddv ne {
/upd true def
exit
} if
} forall
} {
/upd true def
} ifelse
} ifelse
} if
} ifelse
upd true eq {
d k v put
} if
} if
} if
} forall
d length 0 gt {
d setpagedevice
} if
} bd
/RE { % /NewFontName [NewEncodingArray] /FontName RE -
  findfont dup length dict begin
  {
    1 index /FID ne
    {def} {pop pop} ifelse
  } forall
  /Encoding exch def
  /FontName 1 index def
  currentdict definefont pop
  end
} bind def
%%EndResource
%%BeginResource: procset (Apache XML Graphics EPS ProcSet) 1.0 0
%%Version: 1.0 0
%%Copyright: (Copyright 2002-2003 The Apache Software Foundation. License terms: http://www.apache.org/licenses/LICENSE-2.0)
/BeginEPSF { %def
/b4_Inc_state save def         % Save state for cleanup
/dict_count countdictstack def % Count objects on dict stack
/op_count count 1 sub def      % Count objects on operand stack
userdict begin                 % Push userdict on dict stack
/showpage { } def              % Redefine showpage, { } = null proc
0 setgray 0 setlinecap         % Prepare graphics state
1 setlinewidth 0 setlinejoin
10 setmiterlimit [ ] 0 setdash newpath
/languagelevel where           % If level not equal to 1 then
{pop languagelevel             % set strokeadjust and
1 ne                           % overprint to their defaults.
{false setstrokeadjust false setoverprint
} if
} if
} bd
/EndEPSF { %def
count op_count sub {pop} repeat            % Clean up stacks
countdictstack dict_count sub {end} repeat
b4_Inc_state restore
} bd
%%EndResource
%FOPBeginFontDict
%%IncludeResource: font Courier-Oblique
%%IncludeResource: font Courier-BoldOblique
%%IncludeResource: font Courier-Bold
%%IncludeResource: font ZapfDingbats
%%IncludeResource: font Symbol
%%IncludeResource: font Helvetica
%%IncludeResource: font Helvetica-Oblique
%%IncludeResource: font Helvetica-Bold
%%IncludeResource: font Helvetica-BoldOblique
%%IncludeResource: font Times-Roman
%%IncludeResource: font Times-Italic
%%IncludeResource: font Times-Bold
%%IncludeResource: font Times-BoldItalic
%%IncludeResource: font Courier
%FOPEndFontDict
%%BeginResource: encoding WinAnsiEncoding
/WinAnsiEncoding [
/.notdef /.notdef /.notdef /.notdef /.notdef
/.notdef /.notdef /.notdef /.notdef /.notdef
/.notdef /.notdef /.notdef /.notdef /.notdef
/.notdef /.notdef /.notdef /.notdef /.notdef
/.notdef /.notdef /.notdef /.notdef /.notdef
/.notdef /.notdef /.notdef /.notdef /.notdef
/.notdef /.notdef /space /exclam /quotedbl
/numbersign /dollar /percent /ampersand /quotesingle
/parenleft /parenright /asterisk /plus /comma
/hyphen /period /slash /zero /one
/two /three /four /five /six
/seven /eight /nine /colon /semicolon
/less /equal /greater /question /at
/A /B /C /D /E
/F /G /H /I /J
/K /L /M /N /O
/P /Q /R /S /T
/U /V /W /X /Y
/Z /bracketleft /backslash /bracketright /asciicircum
/underscore /quoteleft /a /b /c
/d /e /f /g /h
/i /j /k /l /m
/n /o /p /q /r
/s /t /u /v /w
/x /y /z /braceleft /bar
/braceright /asciitilde /bullet /Euro /bullet
/quotesinglbase /florin /quotedblbase /ellipsis /dagger
/daggerdbl /circumflex /perthousand /Scaron /guilsinglleft
/OE /bullet /Zcaron /bullet /bullet
/quoteleft /quoteright /quotedblleft /quotedblright /bullet
/endash /emdash /asciitilde /trademark /scaron
/guilsinglright /oe /bullet /zcaron /Ydieresis
/space /exclamdown /cent /sterling /currency
/yen /brokenbar /section /dieresis /copyright
/ordfeminine /guillemotleft /logicalnot /sfthyphen /registered
/macron /degree /plusminus /twosuperior /threesuperior
/acute /mu /paragraph /middot /cedilla
/onesuperior /ordmasculine /guillemotright /onequarter /onehalf
/threequarters /questiondown /Agrave /Aacute /Acircumflex
/Atilde /Adieresis /Aring /AE /Ccedilla
/Egrave /Eacute /Ecircumflex /Edieresis /Igrave
/Iacute /Icircumflex /Idieresis /Eth /Ntilde
/Ograve /Oacute /Ocircumflex /Otilde /Odieresis
/multiply /Oslash /Ugrave /Uacute /Ucircumflex
/Udieresis /Yacute /Thorn /germandbls /agrave
/aacute /acircumflex /atilde /adieresis /aring
/ae /ccedilla /egrave /eacute /ecircumflex
/edieresis /igrave /iacute /icircumflex /idieresis
/eth /ntilde /ograve /oacute /ocircumflex
/otilde /odieresis /divide /oslash /ugrave
/uacute /ucircumflex /udieresis /yacute /thorn
/ydieresis
] def
%%EndResource
%FOPBeginFontReencode
/Courier-Oblique findfont
dup length dict begin
  {1 index /FID ne {def} {pop pop} ifelse} forall
  /Encoding WinAnsiEncoding def
  currentdict
end
/Courier-Oblique exch definefont pop
/Courier-BoldOblique findfont
dup length dict begin
  {1 index /FID ne {def} {pop pop} ifelse} forall
  /Encoding WinAnsiEncoding def
  currentdict
end
/Courier-BoldOblique exch definefont pop
/Courier-Bold findfont
dup length dict begin
  {1 index /FID ne {def} {pop pop} ifelse} forall
  /Encoding WinAnsiEncoding def
  currentdict
end
/Courier-Bold exch definefont pop
/Helvetica findfont
dup length dict begin
  {1 index /FID ne {def} {pop pop} ifelse} forall
  /Encoding WinAnsiEncoding def
  currentdict
end
/Helvetica exch definefont pop
/Helvetica-Oblique findfont
dup length dict begin
  {1 index /FID ne {def} {pop pop} ifelse} forall
  /Encoding WinAnsiEncoding def
  currentdict
end
/Helvetica-Oblique exch definefont pop
/Helvetica-Bold findfont
dup length dict begin
  {1 index /FID ne {def} {pop pop} ifelse} forall
  /Encoding WinAnsiEncoding def
  currentdict
end
/Helvetica-Bold exch definefont pop
/Helvetica-BoldOblique findfont
dup length dict begin
  {1 index /FID ne {def} {pop pop} ifelse} forall
  /Encoding WinAnsiEncoding def
  currentdict
end
/Helvetica-BoldOblique exch definefont pop
/Times-Roman findfont
dup length dict begin
  {1 index /FID ne {def} {pop pop} ifelse} forall
  /Encoding WinAnsiEncoding def
  currentdict
end
/Times-Roman exch definefont pop
/Times-Italic findfont
dup length dict begin
  {1 index /FID ne {def} {pop pop} ifelse} forall
  /Encoding WinAnsiEncoding def
  currentdict
end
/Times-Italic exch definefont pop
/Times-Bold findfont
dup length dict begin
  {1 index /FID ne {def} {pop pop} ifelse} forall
  /Encoding WinAnsiEncoding def
  currentdict
end
/Times-Bold exch definefont pop
/Times-BoldItalic findfont
dup length dict begin
  {1 index /FID ne {def} {pop pop} ifelse} forall
  /Encoding WinAnsiEncoding def
  currentdict
end
/Times-BoldItalic exch definefont pop
/Courier findfont
dup length dict begin
  {1 index /FID ne {def} {pop pop} ifelse} forall
  /Encoding WinAnsiEncoding def
  currentdict
end
/Courier exch definefont pop
%FOPEndFontReencode
%%EndProlog
%%Page: 1 1
%%PageBoundingBox: 0 0 510 470
%%BeginPageSetup
[1 0 0 -1 0 470] CT
%%EndPageSetup
GS
[0.75 0 0 0.75 0 0.5] CT
1 GC
N
0 0 680 626 re
f
GR
GS
[0.75 0 0 0.75 0 0.5] CT
1 GC
N
0 0 680 626 re
f
GR
GS
[0.75 0 0 0.75 141.75014 46.77499] CT
/Helvetica-Bold 17.6 F
GS
[1 0 0 1 0 0] CT
-95 -4 moveto 
1 -1 scale
(ENU Profitability SM01) t 
GR
GR
GS
[0.75 0 0 0.75 0 0.5] CT
0.302 0.745 0.933 RC
N
153.848 80.691 M
148.616 82.821 L
187.037 169.705 L
187.037 74.705 L
181.389 74.873 L
175.762 75.376 L
170.175 76.214 L
164.647 77.381 L
159.198 78.875 L
cp
f
GR
GS
[0.75 0 0 0.75 0 0.5] CT
0.302 0.745 0.933 RC
2 setlinecap
10.0 ML
0.667 LW
N
187.037 169.705 M
187.037 74.705 L
181.389 74.873 L
175.762 75.376 L
170.175 76.214 L
164.647 77.381 L
159.198 78.875 L
153.848 80.691 L
148.616 82.821 L
187.037 169.705 L
187.037 169.705 L
S
GR
GS
[0.75 0 0 0.75 0 0.5] CT
0.094 0.749 0.71 RC
N
113.673 236.887 M
117.43 241.472 L
121.465 245.813 L
125.763 249.895 L
130.307 253.701 L
135.08 257.215 L
140.063 260.426 L
145.236 263.319 L
150.579 265.884 L
189 179 L
150.579 92.116 L
145.236 94.681 L
140.063 97.574 L
135.08 100.785 L
130.307 104.299 L
125.763 108.105 L
121.465 112.187 L
117.43 116.528 L
113.673 121.113 L
110.21 125.923 L
107.053 130.94 L
104.216 136.144 L
101.708 141.515 L
99.541 147.031 L
97.721 152.672 L
96.257 158.416 L
95.154 164.24 L
94.416 170.121 L
94.046 176.036 L
94.046 181.964 L
94.416 187.879 L
95.154 193.76 L
96.257 199.584 L
97.721 205.328 L
99.541 210.969 L
101.708 216.485 L
104.216 221.856 L
107.053 227.06 L
110.21 232.077 L
cp
f
GR
GS
[0.75 0 0 0.75 0 0.5] CT
0 0.749 0.749 RC
2 setlinecap
10.0 ML
0.667 LW
N
189 179 M
150.579 92.116 L
145.236 94.681 L
140.063 97.574 L
135.08 100.785 L
130.307 104.299 L
125.763 108.105 L
121.465 112.187 L
117.43 116.528 L
113.673 121.113 L
110.21 125.923 L
107.053 130.94 L
104.216 136.144 L
101.708 141.515 L
99.541 147.031 L
97.721 152.672 L
96.257 158.416 L
95.154 164.24 L
94.416 170.121 L
94.046 176.036 L
94.046 181.964 L
94.416 187.879 L
95.154 193.76 L
96.257 199.584 L
97.721 205.328 L
99.541 210.969 L
101.708 216.485 L
104.216 221.856 L
107.053 227.06 L
110.21 232.077 L
113.673 236.887 L
117.43 241.472 L
121.465 245.813 L
125.763 249.895 L
130.307 253.701 L
135.08 257.215 L
140.063 260.426 L
145.236 263.319 L
150.579 265.884 L
189 179 L
189 179 L
S
GR
GS
[0.75 0 0 0.75 0 0.5] CT
0 0.447 0.741 RC
N
161.697 269.992 M
167.426 271.518 L
173.239 272.683 L
179.114 273.484 L
185.027 273.917 L
190.955 273.98 L
196.876 273.673 L
202.767 272.997 L
208.603 271.955 L
214.364 270.551 L
220.025 268.791 L
225.566 266.681 L
230.964 264.229 L
236.199 261.445 L
241.25 258.341 L
246.098 254.927 L
250.723 251.217 L
255.107 247.226 L
259.235 242.97 L
263.088 238.464 L
266.653 233.726 L
269.916 228.776 L
272.863 223.631 L
275.484 218.313 L
277.768 212.842 L
279.706 207.238 L
281.291 201.525 L
282.516 195.724 L
283.377 189.858 L
283.871 183.95 L
283.995 178.022 L
283.749 172.098 L
283.134 166.201 L
282.152 160.354 L
280.808 154.58 L
279.106 148.9 L
277.052 143.338 L
274.656 137.915 L
271.927 132.652 L
268.874 127.569 L
265.51 122.687 L
261.849 118.024 L
257.903 113.598 L
253.689 109.428 L
249.223 105.528 L
244.523 101.914 L
239.606 98.601 L
234.492 95.601 L
229.201 92.925 L
223.754 90.585 L
218.171 88.589 L
212.474 86.946 L
206.686 85.661 L
200.829 84.739 L
194.926 84.185 L
189 84 L
189 179 L
150.579 265.884 L
156.074 268.112 L
cp
f
GR
GS
[0.75 0 0 0.75 0 0.5] CT
0 0.447 0.741 RC
2 setlinecap
10.0 ML
0.667 LW
N
189 179 M
150.579 265.884 L
156.074 268.112 L
161.697 269.992 L
167.426 271.518 L
173.239 272.683 L
179.114 273.484 L
185.027 273.917 L
190.955 273.98 L
196.876 273.673 L
202.767 272.997 L
208.603 271.955 L
214.364 270.551 L
220.025 268.791 L
225.566 266.681 L
230.964 264.229 L
236.199 261.445 L
241.25 258.341 L
246.098 254.927 L
250.723 251.217 L
255.107 247.226 L
259.235 242.97 L
263.088 238.464 L
266.653 233.726 L
269.916 228.776 L
272.863 223.631 L
275.484 218.313 L
277.768 212.842 L
279.706 207.238 L
281.291 201.525 L
282.516 195.724 L
283.377 189.858 L
283.871 183.95 L
283.995 178.022 L
283.749 172.098 L
283.134 166.201 L
282.152 160.354 L
280.808 154.58 L
279.106 148.9 L
277.052 143.338 L
274.656 137.915 L
271.927 132.652 L
268.874 127.569 L
265.51 122.687 L
261.849 118.024 L
257.903 113.598 L
253.689 109.428 L
249.223 105.528 L
244.523 101.914 L
239.606 98.601 L
234.492 95.601 L
229.201 92.925 L
223.754 90.585 L
218.171 88.589 L
212.474 86.946 L
206.686 85.661 L
200.829 84.739 L
194.926 84.185 L
189 84 L
189 179 L
189 179 L
S
GR
GS
[0.75 0 0 0.75 128.57909 79.59602] CT
1 GC
/Helvetica-Bold 18.667 F
GS
[1 0 0 1 0 0] CT
-13.5 -5 moveto 
1 -1 scale
(7%) t 
GR
GR
GS
[0.75 0 0 0.75 113.625 134.75] CT
1 GC
/Helvetica-Bold 18.667 F
GS
[1 0 0 1 0 0] CT
-38 7 moveto 
1 -1 scale
(37%) t 
GR
GR
GS
[0.75 0 0 0.75 165.93282 143.44835] CT
1 GC
/Helvetica-Bold 18.667 F
GS
[1 0 0 1 0 0] CT
0 7 moveto 
1 -1 scale
(57%) t 
GR
GR
GS
[0.75 0 0 0.75 0 0.5] CT
1 GC
N
544 579 M
544 551 L
139 551 L
139 579 L
cp
f
GR
GS
[0.75 0 0 0.75 139.5 424.25] CT
/Helvetica 18.667 F
GS
[1 0 0 1 0 0] CT
0 7 moveto 
1 -1 scale
(Profitable) t 
GR
GR
GS
[0.75 0 0 0.75 0 0.5] CT
0.302 0.745 0.933 RC
N
183 574 M
183 556 L
143 556 L
143 574 L
cp
f
GR
GS
[0.75 0 0 0.75 0 0.5] CT
0.302 0.745 0.933 RC
10.0 ML
0.667 LW
N
143 574 M
143 556 L
183 556 L
183 574 L
cp
S
GR
GS
[0.75 0 0 0.75 237 424.25] CT
/Helvetica 18.667 F
GS
[1 0 0 1 0 0] CT
0 7 moveto 
1 -1 scale
(Invariant) t 
GR
GR
GS
[0.75 0 0 0.75 0 0.5] CT
0.094 0.749 0.71 RC
N
313 574 M
313 556 L
273 556 L
273 574 L
cp
f
GR
GS
[0.75 0 0 0.75 0 0.5] CT
0 0.749 0.749 RC
10.0 ML
0.667 LW
N
273 574 M
273 556 L
313 556 L
313 574 L
cp
S
GR
GS
[0.75 0 0 0.75 329.25 424.25] CT
/Helvetica 18.667 F
GS
[1 0 0 1 0 0] CT
0 7 moveto 
1 -1 scale
(Unprofitable) t 
GR
GR
GS
[0.75 0 0 0.75 0 0.5] CT
0 0.447 0.741 RC
N
436 574 M
436 556 L
396 556 L
396 574 L
cp
f
GR
GS
[0.75 0 0 0.75 0 0.5] CT
0 0.447 0.741 RC
10.0 ML
0.667 LW
N
396 574 M
396 556 L
436 556 L
436 574 L
cp
S
GR
GS
[0.75 0 0 0.75 0 0.5] CT
1 GC
10.0 ML
0.667 LW
N
139 579 M
139 551 L
544 551 L
544 579 L
cp
S
GR
GS
[0.75 0 0 0.75 374.62537 47.9] CT
/Helvetica-Bold 17.6 F
GS
[1 0 0 1 0 0] CT
-88.5 -4 moveto 
1 -1 scale
(EN Profitability SM01) t 
GR
GR
GS
[0.75 0 0 0.75 0 0.5] CT
0.302 0.745 0.933 RC
N
431.304 101.973 M
427.112 106.098 L
423.185 110.474 L
495.512 171.424 L
495.512 76.84 L
489.634 77.023 L
483.779 77.571 L
477.969 78.481 L
472.228 79.751 L
466.576 81.375 L
461.036 83.347 L
455.629 85.66 L
450.377 88.304 L
445.299 91.27 L
440.415 94.545 L
435.744 98.117 L
cp
f
GR
GS
[0.75 0 0 0.75 0 0.5] CT
0.302 0.745 0.933 RC
2 setlinecap
10.0 ML
0.667 LW
N
495.512 171.424 M
495.512 76.84 L
489.634 77.023 L
483.779 77.571 L
477.969 78.481 L
472.228 79.751 L
466.576 81.375 L
461.036 83.347 L
455.629 85.66 L
450.377 88.304 L
445.299 91.27 L
440.415 94.545 L
435.744 98.117 L
431.304 101.973 L
427.112 106.098 L
423.185 110.474 L
495.512 171.424 L
495.512 171.424 L
S
GR
GS
[0.75 0 0 0.75 0 0.5] CT
0.094 0.749 0.71 RC
N
447.926 259.285 M
452.999 262.363 L
458.256 265.117 L
463.675 267.536 L
469.235 269.61 L
474.914 271.332 L
480.69 272.694 L
486.54 273.691 L
492.441 274.32 L
498.37 274.577 L
504.303 274.461 L
510.217 273.974 L
499.5 180 L
427.173 119.051 L
423.493 123.706 L
420.113 128.584 L
417.044 133.663 L
414.301 138.925 L
411.893 144.349 L
409.829 149.913 L
408.119 155.596 L
406.769 161.374 L
405.783 167.226 L
405.167 173.129 L
404.921 179.058 L
405.048 184.991 L
405.547 190.904 L
406.416 196.775 L
407.651 202.579 L
409.248 208.294 L
411.2 213.899 L
413.5 219.369 L
416.138 224.685 L
419.104 229.825 L
422.387 234.768 L
425.973 239.496 L
429.849 243.99 L
433.999 248.232 L
438.407 252.205 L
443.055 255.895 L
cp
f
GR
GS
[0.75 0 0 0.75 0 0.5] CT
0 0.749 0.749 RC
2 setlinecap
10.0 ML
0.667 LW
N
499.5 180 M
427.173 119.051 L
423.493 123.706 L
420.113 128.584 L
417.044 133.663 L
414.301 138.925 L
411.893 144.349 L
409.829 149.913 L
408.119 155.596 L
406.769 161.374 L
405.783 167.226 L
405.167 173.129 L
404.921 179.058 L
405.048 184.991 L
405.547 190.904 L
406.416 196.775 L
407.651 202.579 L
409.248 208.294 L
411.2 213.899 L
413.5 219.369 L
416.138 224.685 L
419.104 229.825 L
422.387 234.768 L
425.973 239.496 L
429.849 243.99 L
433.999 248.232 L
438.407 252.205 L
443.055 255.895 L
447.926 259.285 L
452.999 262.363 L
458.256 265.117 L
463.675 267.536 L
469.235 269.61 L
474.914 271.332 L
480.69 272.694 L
486.54 273.691 L
492.441 274.32 L
498.37 274.577 L
504.303 274.461 L
510.217 273.974 L
499.5 180 L
499.5 180 L
S
GR
GS
[0.75 0 0 0.75 0 0.5] CT
0 0.447 0.741 RC
N
521.72 271.936 M
527.356 270.388 L
532.885 268.496 L
538.286 266.265 L
543.54 263.705 L
548.625 260.825 L
553.523 257.637 L
558.214 254.153 L
562.682 250.385 L
566.908 246.349 L
570.877 242.059 L
574.573 237.533 L
577.983 232.787 L
581.093 227.839 L
583.892 222.709 L
586.368 217.415 L
588.513 211.979 L
590.318 206.421 L
591.777 200.762 L
592.883 195.023 L
593.632 189.228 L
594.022 183.397 L
594.052 177.553 L
593.72 171.718 L
593.029 165.915 L
591.98 160.166 L
590.579 154.492 L
588.83 148.916 L
586.74 143.459 L
584.316 138.141 L
581.569 132.983 L
578.509 128.004 L
575.147 123.224 L
571.496 118.661 L
567.571 114.331 L
563.385 110.253 L
558.956 106.441 L
554.3 102.909 L
549.434 99.672 L
544.378 96.742 L
539.15 94.129 L
533.772 91.844 L
528.262 89.896 L
522.642 88.292 L
516.935 87.037 L
511.16 86.138 L
505.341 85.597 L
499.5 85.417 L
499.5 180 L
510.217 273.974 L
516 273.133 L
cp
f
GR
GS
[0.75 0 0 0.75 0 0.5] CT
0 0.447 0.741 RC
2 setlinecap
10.0 ML
0.667 LW
N
499.5 180 M
510.217 273.974 L
516 273.133 L
521.72 271.936 L
527.356 270.388 L
532.885 268.496 L
538.286 266.265 L
543.54 263.705 L
548.625 260.825 L
553.523 257.637 L
558.214 254.153 L
562.682 250.385 L
566.908 246.349 L
570.877 242.059 L
574.573 237.533 L
577.983 232.787 L
581.093 227.839 L
583.892 222.709 L
586.368 217.415 L
588.513 211.979 L
590.318 206.421 L
591.777 200.762 L
592.883 195.023 L
593.632 189.228 L
594.022 183.397 L
594.052 177.553 L
593.72 171.718 L
593.029 165.915 L
591.98 160.166 L
590.579 154.492 L
588.83 148.916 L
586.74 143.459 L
584.316 138.141 L
581.569 132.983 L
578.509 128.004 L
575.147 123.224 L
571.496 118.661 L
567.571 114.331 L
563.385 110.253 L
558.956 106.441 L
554.3 102.909 L
549.434 99.672 L
544.378 96.742 L
539.15 94.129 L
533.772 91.844 L
528.262 89.896 L
522.642 88.292 L
516.935 87.037 L
511.16 86.138 L
505.341 85.597 L
499.5 85.417 L
499.5 180 L
499.5 180 L
S
GR
GS
[0.75 0 0 0.75 364.98077 93.56277] CT
1 GC
/Helvetica-Bold 18.667 F
GS
[1 0 0 1 0 0] CT
-38 -5 moveto 
1 -1 scale
(14%) t 
GR
GR
GS
[0.75 0 0 0.75 357.60114 146.86505] CT
1 GC
/Helvetica-Bold 18.667 F
GS
[1 0 0 1 0 0] CT
-38 19 moveto 
1 -1 scale
(38%) t 
GR
GR
GS
[0.75 0 0 0.75 400.78052 135.5721] CT
1 GC
/Helvetica-Bold 18.667 F
GS
[1 0 0 1 0 0] CT
0 7 moveto 
1 -1 scale
(48%) t 
GR
GR
GS
[0.75 0 0 0.75 142.50014 234.27499] CT
/Helvetica-Bold 17.6 F
GS
[1 0 0 1 0 0] CT
-95 -4 moveto 
1 -1 scale
(ENU Profitability SM02) t 
GR
GR
GS
[0.75 0 0 0.75 0 0.5] CT
0.302 0.745 0.933 RC
N
105.922 484.898 M
109.687 489.429 L
113.726 493.719 L
118.023 497.75 L
122.561 501.507 L
127.324 504.975 L
132.293 508.142 L
180.84 426.483 L
180.84 331.483 L
174.951 331.665 L
169.084 332.213 L
163.263 333.123 L
157.51 334.392 L
151.846 336.015 L
146.294 337.986 L
140.874 340.298 L
135.609 342.941 L
130.517 345.906 L
125.619 349.18 L
120.933 352.752 L
116.478 356.607 L
112.27 360.732 L
108.326 365.109 L
104.661 369.722 L
101.289 374.553 L
98.223 379.584 L
95.474 384.796 L
93.054 390.168 L
90.972 395.679 L
89.236 401.309 L
87.851 407.036 L
86.825 412.838 L
86.16 418.692 L
85.859 424.576 L
85.923 430.468 L
86.353 436.344 L
87.146 442.182 L
88.299 447.96 L
89.809 453.655 L
91.668 459.246 L
93.87 464.711 L
96.407 470.028 L
99.269 475.178 L
102.445 480.141 L
cp
f
GR
GS
[0.75 0 0 0.75 0 0.5] CT
0.302 0.745 0.933 RC
2 setlinecap
10.0 ML
0.667 LW
N
180.84 426.483 M
180.84 331.483 L
174.951 331.665 L
169.084 332.213 L
163.263 333.123 L
157.51 334.392 L
151.846 336.015 L
146.294 337.986 L
140.874 340.298 L
135.609 342.941 L
130.517 345.906 L
125.619 349.18 L
120.933 352.752 L
116.478 356.607 L
112.27 360.732 L
108.326 365.109 L
104.661 369.722 L
101.289 374.553 L
98.223 379.584 L
95.474 384.796 L
93.054 390.168 L
90.972 395.679 L
89.236 401.309 L
87.851 407.036 L
86.825 412.838 L
86.16 418.692 L
85.859 424.576 L
85.923 430.468 L
86.353 436.344 L
87.146 442.182 L
88.299 447.96 L
89.809 453.655 L
91.668 459.246 L
93.87 464.711 L
96.407 470.028 L
99.269 475.178 L
102.445 480.141 L
105.922 484.898 L
109.687 489.429 L
113.726 493.719 L
118.023 497.75 L
122.561 501.507 L
127.324 504.975 L
132.293 508.142 L
180.84 426.483 L
180.84 426.483 L
S
GR
GS
[0.75 0 0 0.75 0 0.5] CT
0.094 0.749 0.71 RC
N
157.426 518.241 M
163.03 520.091 L
168.737 521.59 L
174.527 522.731 L
180.376 523.511 L
186.263 523.926 L
192.164 523.975 L
198.057 523.658 L
203.918 522.975 L
209.726 521.929 L
215.458 520.525 L
221.091 518.768 L
226.605 516.665 L
231.977 514.223 L
237.187 511.452 L
242.216 508.363 L
247.042 504.968 L
251.649 501.28 L
256.018 497.313 L
260.132 493.082 L
263.975 488.604 L
267.533 483.896 L
270.792 478.977 L
273.739 473.864 L
276.363 468.578 L
278.654 463.14 L
280.602 457.57 L
282.201 451.889 L
283.445 446.121 L
284.327 440.286 L
284.846 434.407 L
284.999 428.508 L
284.785 422.611 L
284.205 416.738 L
283.262 410.913 L
190 429 L
141.453 510.659 L
146.617 513.516 L
151.948 516.046 L
cp
f
GR
GS
[0.75 0 0 0.75 0 0.5] CT
0 0.749 0.749 RC
2 setlinecap
10.0 ML
0.667 LW
N
190 429 M
141.453 510.659 L
146.617 513.516 L
151.948 516.046 L
157.426 518.241 L
163.03 520.091 L
168.737 521.59 L
174.527 522.731 L
180.376 523.511 L
186.263 523.926 L
192.164 523.975 L
198.057 523.658 L
203.918 522.975 L
209.726 521.929 L
215.458 520.525 L
221.091 518.768 L
226.605 516.665 L
231.977 514.223 L
237.187 511.452 L
242.216 508.363 L
247.042 504.968 L
251.649 501.28 L
256.018 497.313 L
260.132 493.082 L
263.975 488.604 L
267.533 483.896 L
270.792 478.977 L
273.739 473.864 L
276.363 468.578 L
278.654 463.14 L
280.602 457.57 L
282.201 451.889 L
283.445 446.121 L
284.327 440.286 L
284.846 434.407 L
284.999 428.508 L
284.785 422.611 L
284.205 416.738 L
283.262 410.913 L
190 429 L
190 429 L
S
GR
GS
[0.75 0 0 0.75 0 0.5] CT
0 0.447 0.741 RC
N
190 334 M
190 429 L
283.262 410.913 L
281.946 405.105 L
280.268 399.392 L
278.236 393.794 L
275.857 388.336 L
273.141 383.036 L
270.097 377.918 L
266.74 373 L
263.081 368.302 L
259.134 363.843 L
254.916 359.639 L
250.443 355.709 L
245.732 352.066 L
240.803 348.725 L
235.674 345.7 L
230.365 343.002 L
224.898 340.642 L
219.294 338.629 L
213.574 336.971 L
207.762 335.675 L
201.88 334.746 L
195.952 334.187 L
cp
f
GR
GS
[0.75 0 0 0.75 0 0.5] CT
0 0.447 0.741 RC
2 setlinecap
10.0 ML
0.667 LW
N
190 429 M
283.262 410.913 L
281.946 405.105 L
280.268 399.392 L
278.236 393.794 L
275.857 388.336 L
273.141 383.036 L
270.097 377.918 L
266.74 373 L
263.081 368.302 L
259.134 363.843 L
254.916 359.639 L
250.443 355.709 L
245.732 352.066 L
240.803 348.725 L
235.674 345.7 L
230.365 343.002 L
224.898 340.642 L
219.294 338.629 L
213.574 336.971 L
207.762 335.675 L
201.88 334.746 L
195.952 334.187 L
190 334 L
190 429 L
190 429 L
S
GR
GS
[0.75 0 0 0.75 114.05633 305.59409] CT
1 GC
/Helvetica-Bold 18.667 F
GS
[1 0 0 1 0 0] CT
-38 7 moveto 
1 -1 scale
(41%) t 
GR
GR
GS
[0.75 0 0 0.75 153.8406 336.10522] CT
1 GC
/Helvetica-Bold 18.667 F
GS
[1 0 0 1 0 0] CT
0 19 moveto 
1 -1 scale
(37%) t 
GR
GR
GS
[0.75 0 0 0.75 160.8655 294.03455] CT
1 GC
/Helvetica-Bold 18.667 F
GS
[1 0 0 1 0 0] CT
0 -5 moveto 
1 -1 scale
(22%) t 
GR
GR
GS
[0.75 0 0 0.75 375.37537 233.90001] CT
/Helvetica-Bold 17.6 F
GS
[1 0 0 1 0 0] CT
-88.5 -4 moveto 
1 -1 scale
(EN Profitability SM02) t 
GR
GR
GS
[0.75 0 0 0.75 0 0.5] CT
0.302 0.745 0.933 RC
N
410.17 475.195 M
413.359 480.132 L
416.848 484.862 L
420.624 489.366 L
424.673 493.627 L
428.978 497.628 L
433.523 501.354 L
438.292 504.791 L
443.264 507.924 L
448.421 510.743 L
453.744 513.236 L
459.211 515.394 L
491.182 426.377 L
491.182 331.794 L
485.307 331.977 L
479.455 332.524 L
473.649 333.433 L
467.91 334.702 L
462.261 336.324 L
456.723 338.294 L
451.319 340.605 L
446.068 343.246 L
440.992 346.209 L
436.11 349.481 L
431.44 353.05 L
427.001 356.902 L
422.81 361.023 L
418.882 365.396 L
415.234 370.004 L
411.88 374.83 L
408.831 379.855 L
406.1 385.06 L
403.698 390.424 L
401.634 395.927 L
399.916 401.548 L
398.55 407.264 L
397.542 413.054 L
396.895 418.896 L
396.612 424.767 L
396.695 430.644 L
397.142 436.504 L
397.953 442.326 L
399.123 448.085 L
400.649 453.761 L
402.525 459.331 L
404.743 464.774 L
407.295 470.069 L
cp
f
GR
GS
[0.75 0 0 0.75 0 0.5] CT
0.302 0.745 0.933 RC
2 setlinecap
10.0 ML
0.667 LW
N
491.182 426.377 M
491.182 331.794 L
485.307 331.977 L
479.455 332.524 L
473.649 333.433 L
467.91 334.702 L
462.261 336.324 L
456.723 338.294 L
451.319 340.605 L
446.068 343.246 L
440.992 346.209 L
436.11 349.481 L
431.44 353.05 L
427.001 356.902 L
422.81 361.023 L
418.882 365.396 L
415.234 370.004 L
411.88 374.83 L
408.831 379.855 L
406.1 385.06 L
403.698 390.424 L
401.634 395.927 L
399.916 401.548 L
398.55 407.264 L
397.542 413.054 L
396.895 418.896 L
396.612 424.767 L
396.695 430.644 L
397.142 436.504 L
397.953 442.326 L
399.123 448.085 L
400.649 453.761 L
402.525 459.331 L
404.743 464.774 L
407.295 470.069 L
410.17 475.195 L
413.359 480.132 L
416.848 484.862 L
420.624 489.366 L
424.673 493.627 L
428.978 497.628 L
433.523 501.354 L
438.292 504.791 L
443.264 507.924 L
448.421 510.743 L
453.744 513.236 L
459.211 515.394 L
491.182 426.377 L
491.182 426.377 L
S
GR
GS
[0.75 0 0 0.75 0 0.5] CT
0.094 0.749 0.71 RC
N
491.406 522.145 M
497.269 522.528 L
503.144 522.546 L
509.009 522.2 L
514.841 521.49 L
520.618 520.419 L
526.317 518.992 L
531.917 517.213 L
537.396 515.09 L
542.732 512.632 L
547.905 509.846 L
552.895 506.745 L
557.683 503.34 L
562.25 499.644 L
566.579 495.672 L
570.654 491.439 L
574.457 486.961 L
577.975 482.255 L
581.194 477.34 L
584.102 472.235 L
586.687 466.959 L
588.94 461.533 L
590.851 455.977 L
592.414 450.313 L
593.622 444.564 L
594.47 438.75 L
594.957 432.895 L
595.078 427.021 L
594.835 421.15 L
594.228 415.307 L
593.259 409.512 L
591.932 403.788 L
590.252 398.158 L
588.226 392.643 L
500.5 428 L
468.529 517.016 L
474.118 518.829 L
479.808 520.292 L
485.578 521.399 L
cp
f
GR
GS
[0.75 0 0 0.75 0 0.5] CT
0 0.749 0.749 RC
2 setlinecap
10.0 ML
0.667 LW
N
500.5 428 M
468.529 517.016 L
474.118 518.829 L
479.808 520.292 L
485.578 521.399 L
491.406 522.145 L
497.269 522.528 L
503.144 522.546 L
509.009 522.2 L
514.841 521.49 L
520.618 520.419 L
526.317 518.992 L
531.917 517.213 L
537.396 515.09 L
542.732 512.632 L
547.905 509.846 L
552.895 506.745 L
557.683 503.34 L
562.25 499.644 L
566.579 495.672 L
570.654 491.439 L
574.457 486.961 L
577.975 482.255 L
581.194 477.34 L
584.102 472.235 L
586.687 466.959 L
588.94 461.533 L
590.851 455.977 L
592.414 450.313 L
593.622 444.564 L
594.47 438.75 L
594.957 432.895 L
595.078 427.021 L
594.835 421.15 L
594.228 415.307 L
593.259 409.512 L
591.932 403.788 L
590.252 398.158 L
588.226 392.643 L
500.5 428 L
500.5 428 L
S
GR
GS
[0.75 0 0 0.75 0 0.5] CT
0 0.447 0.741 RC
N
500.5 333.417 M
500.5 428 L
588.226 392.643 L
585.846 387.232 L
583.133 381.98 L
580.097 376.908 L
576.75 372.036 L
573.105 367.382 L
569.176 362.965 L
564.979 358.802 L
560.531 354.909 L
555.848 351.302 L
550.948 347.994 L
545.852 344.999 L
540.578 342.328 L
535.148 339.991 L
529.583 337.999 L
523.904 336.358 L
518.133 335.075 L
512.294 334.155 L
506.408 333.601 L
cp
f
GR
GS
[0.75 0 0 0.75 0 0.5] CT
0 0.447 0.741 RC
2 setlinecap
10.0 ML
0.667 LW
N
500.5 428 M
588.226 392.643 L
585.846 387.232 L
583.133 381.98 L
580.097 376.908 L
576.75 372.036 L
573.105 367.382 L
569.176 362.965 L
564.979 358.802 L
560.531 354.909 L
555.848 351.302 L
550.948 347.994 L
545.852 344.999 L
540.578 342.328 L
535.148 339.991 L
529.583 337.999 L
523.904 336.358 L
518.133 335.075 L
512.294 334.155 L
506.408 333.601 L
500.5 333.417 L
500.5 428 L
500.5 428 L
S
GR
GS
[0.75 0 0 0.75 347.76196 310.64668] CT
1 GC
/Helvetica-Bold 18.667 F
GS
[1 0 0 1 0 0] CT
-38 7 moveto 
1 -1 scale
(45%) t 
GR
GR
GS
[0.75 0 0 0.75 391.84822 338.85941] CT
1 GC
/Helvetica-Bold 18.667 F
GS
[1 0 0 1 0 0] CT
0 19 moveto 
1 -1 scale
( 37%) t 
GR
GR
GS
[0.75 0 0 0.75 389.78705 289.07774] CT
1 GC
/Helvetica-Bold 18.667 F
GS
[1 0 0 1 0 0] CT
0 -5 moveto 
1 -1 scale
(19%) t 
GR
GR
%%Trailer
%%Pages: 1
%%EOF
