%!PS-Adobe-3.0 EPSF-3.0
%%Creator: (MATLAB, The Mathworks, Inc. Version 9.5.0.944444 \(R2018b\). Operating System: Windows 10)
%%Title: C:/Users/navsas/Dropbox/simSkyplot.eps
%%CreationDate: 2019-06-20T15:24:33
%%Pages: (atend)
%%BoundingBox: 0 0 801 447
%%LanguageLevel: 3
%%EndComments
%%BeginProlog
%%BeginResource: procset (Apache XML Graphics Std ProcSet) 1.2 0
%%Version: 1.2 0
%%Copyright: (Copyright 2001-2003,2010 The Apache Software Foundation. License terms: http://www.apache.org/licenses/LICENSE-2.0)
/bd{bind def}bind def
/ld{load def}bd
/GR/grestore ld
/GS/gsave ld
/RM/rmoveto ld
/C/curveto ld
/t/show ld
/L/lineto ld
/ML/setmiterlimit ld
/CT/concat ld
/f/fill ld
/N/newpath ld
/S/stroke ld
/CC/setcmykcolor ld
/A/ashow ld
/cp/closepath ld
/RC/setrgbcolor ld
/LJ/setlinejoin ld
/GC/setgray ld
/LW/setlinewidth ld
/M/moveto ld
/re {4 2 roll M
1 index 0 rlineto
0 exch rlineto
neg 0 rlineto
cp } bd
/_ctm matrix def
/_tm matrix def
/BT { _ctm currentmatrix pop matrix _tm copy pop 0 0 moveto } bd
/ET { _ctm setmatrix } bd
/iTm { _ctm setmatrix _tm concat } bd
/Tm { _tm astore pop iTm 0 0 moveto } bd
/ux 0.0 def
/uy 0.0 def
/F {
  /Tp exch def
  /Tf exch def
  Tf findfont Tp scalefont setfont
  /cf Tf def  /cs Tp def
} bd
/ULS {currentpoint /uy exch def /ux exch def} bd
/ULE {
  /Tcx currentpoint pop def
  gsave
  newpath
  cf findfont cs scalefont dup
  /FontMatrix get 0 get /Ts exch def /FontInfo get dup
  /UnderlinePosition get Ts mul /To exch def
  /UnderlineThickness get Ts mul /Tt exch def
  ux uy To add moveto  Tcx uy To add lineto
  Tt setlinewidth stroke
  grestore
} bd
/OLE {
  /Tcx currentpoint pop def
  gsave
  newpath
  cf findfont cs scalefont dup
  /FontMatrix get 0 get /Ts exch def /FontInfo get dup
  /UnderlinePosition get Ts mul /To exch def
  /UnderlineThickness get Ts mul /Tt exch def
  ux uy To add cs add moveto Tcx uy To add cs add lineto
  Tt setlinewidth stroke
  grestore
} bd
/SOE {
  /Tcx currentpoint pop def
  gsave
  newpath
  cf findfont cs scalefont dup
  /FontMatrix get 0 get /Ts exch def /FontInfo get dup
  /UnderlinePosition get Ts mul /To exch def
  /UnderlineThickness get Ts mul /Tt exch def
  ux uy To add cs 10 mul 26 idiv add moveto Tcx uy To add cs 10 mul 26 idiv add lineto
  Tt setlinewidth stroke
  grestore
} bd
/QT {
/Y22 exch store
/X22 exch store
/Y21 exch store
/X21 exch store
currentpoint
/Y21 load 2 mul add 3 div exch
/X21 load 2 mul add 3 div exch
/X21 load 2 mul /X22 load add 3 div
/Y21 load 2 mul /Y22 load add 3 div
/X22 load /Y22 load curveto
} bd
/SSPD {
dup length /d exch dict def
{
/v exch def
/k exch def
currentpagedevice k known {
/cpdv currentpagedevice k get def
v cpdv ne {
/upd false def
/nullv v type /nulltype eq def
/nullcpdv cpdv type /nulltype eq def
nullv nullcpdv or
{
/upd true def
} {
/sametype v type cpdv type eq def
sametype {
v type /arraytype eq {
/vlen v length def
/cpdvlen cpdv length def
vlen cpdvlen eq {
0 1 vlen 1 sub {
/i exch def
/obj v i get def
/cpdobj cpdv i get def
obj cpdobj ne {
/upd true def
exit
} if
} for
} {
/upd true def
} ifelse
} {
v type /dicttype eq {
v {
/dv exch def
/dk exch def
/cpddv cpdv dk get def
dv cpddv ne {
/upd true def
exit
} if
} forall
} {
/upd true def
} ifelse
} ifelse
} if
} ifelse
upd true eq {
d k v put
} if
} if
} if
} forall
d length 0 gt {
d setpagedevice
} if
} bd
/RE { % /NewFontName [NewEncodingArray] /FontName RE -
  findfont dup length dict begin
  {
    1 index /FID ne
    {def} {pop pop} ifelse
  } forall
  /Encoding exch def
  /FontName 1 index def
  currentdict definefont pop
  end
} bind def
%%EndResource
%%BeginResource: procset (Apache XML Graphics EPS ProcSet) 1.0 0
%%Version: 1.0 0
%%Copyright: (Copyright 2002-2003 The Apache Software Foundation. License terms: http://www.apache.org/licenses/LICENSE-2.0)
/BeginEPSF { %def
/b4_Inc_state save def         % Save state for cleanup
/dict_count countdictstack def % Count objects on dict stack
/op_count count 1 sub def      % Count objects on operand stack
userdict begin                 % Push userdict on dict stack
/showpage { } def              % Redefine showpage, { } = null proc
0 setgray 0 setlinecap         % Prepare graphics state
1 setlinewidth 0 setlinejoin
10 setmiterlimit [ ] 0 setdash newpath
/languagelevel where           % If level not equal to 1 then
{pop languagelevel             % set strokeadjust and
1 ne                           % overprint to their defaults.
{false setstrokeadjust false setoverprint
} if
} if
} bd
/EndEPSF { %def
count op_count sub {pop} repeat            % Clean up stacks
countdictstack dict_count sub {end} repeat
b4_Inc_state restore
} bd
%%EndResource
%FOPBeginFontDict
%%IncludeResource: font Courier-Oblique
%%IncludeResource: font Courier-BoldOblique
%%IncludeResource: font Courier-Bold
%%IncludeResource: font ZapfDingbats
%%IncludeResource: font Symbol
%%IncludeResource: font Helvetica
%%IncludeResource: font Helvetica-Oblique
%%IncludeResource: font Helvetica-Bold
%%IncludeResource: font Helvetica-BoldOblique
%%IncludeResource: font Times-Roman
%%IncludeResource: font Times-Italic
%%IncludeResource: font Times-Bold
%%IncludeResource: font Times-BoldItalic
%%IncludeResource: font Courier
%FOPEndFontDict
%%BeginResource: encoding WinAnsiEncoding
/WinAnsiEncoding [
/.notdef /.notdef /.notdef /.notdef /.notdef
/.notdef /.notdef /.notdef /.notdef /.notdef
/.notdef /.notdef /.notdef /.notdef /.notdef
/.notdef /.notdef /.notdef /.notdef /.notdef
/.notdef /.notdef /.notdef /.notdef /.notdef
/.notdef /.notdef /.notdef /.notdef /.notdef
/.notdef /.notdef /space /exclam /quotedbl
/numbersign /dollar /percent /ampersand /quotesingle
/parenleft /parenright /asterisk /plus /comma
/hyphen /period /slash /zero /one
/two /three /four /five /six
/seven /eight /nine /colon /semicolon
/less /equal /greater /question /at
/A /B /C /D /E
/F /G /H /I /J
/K /L /M /N /O
/P /Q /R /S /T
/U /V /W /X /Y
/Z /bracketleft /backslash /bracketright /asciicircum
/underscore /quoteleft /a /b /c
/d /e /f /g /h
/i /j /k /l /m
/n /o /p /q /r
/s /t /u /v /w
/x /y /z /braceleft /bar
/braceright /asciitilde /bullet /Euro /bullet
/quotesinglbase /florin /quotedblbase /ellipsis /dagger
/daggerdbl /circumflex /perthousand /Scaron /guilsinglleft
/OE /bullet /Zcaron /bullet /bullet
/quoteleft /quoteright /quotedblleft /quotedblright /bullet
/endash /emdash /asciitilde /trademark /scaron
/guilsinglright /oe /bullet /zcaron /Ydieresis
/space /exclamdown /cent /sterling /currency
/yen /brokenbar /section /dieresis /copyright
/ordfeminine /guillemotleft /logicalnot /sfthyphen /registered
/macron /degree /plusminus /twosuperior /threesuperior
/acute /mu /paragraph /middot /cedilla
/onesuperior /ordmasculine /guillemotright /onequarter /onehalf
/threequarters /questiondown /Agrave /Aacute /Acircumflex
/Atilde /Adieresis /Aring /AE /Ccedilla
/Egrave /Eacute /Ecircumflex /Edieresis /Igrave
/Iacute /Icircumflex /Idieresis /Eth /Ntilde
/Ograve /Oacute /Ocircumflex /Otilde /Odieresis
/multiply /Oslash /Ugrave /Uacute /Ucircumflex
/Udieresis /Yacute /Thorn /germandbls /agrave
/aacute /acircumflex /atilde /adieresis /aring
/ae /ccedilla /egrave /eacute /ecircumflex
/edieresis /igrave /iacute /icircumflex /idieresis
/eth /ntilde /ograve /oacute /ocircumflex
/otilde /odieresis /divide /oslash /ugrave
/uacute /ucircumflex /udieresis /yacute /thorn
/ydieresis
] def
%%EndResource
%FOPBeginFontReencode
/Courier-Oblique findfont
dup length dict begin
  {1 index /FID ne {def} {pop pop} ifelse} forall
  /Encoding WinAnsiEncoding def
  currentdict
end
/Courier-Oblique exch definefont pop
/Courier-BoldOblique findfont
dup length dict begin
  {1 index /FID ne {def} {pop pop} ifelse} forall
  /Encoding WinAnsiEncoding def
  currentdict
end
/Courier-BoldOblique exch definefont pop
/Courier-Bold findfont
dup length dict begin
  {1 index /FID ne {def} {pop pop} ifelse} forall
  /Encoding WinAnsiEncoding def
  currentdict
end
/Courier-Bold exch definefont pop
/Helvetica findfont
dup length dict begin
  {1 index /FID ne {def} {pop pop} ifelse} forall
  /Encoding WinAnsiEncoding def
  currentdict
end
/Helvetica exch definefont pop
/Helvetica-Oblique findfont
dup length dict begin
  {1 index /FID ne {def} {pop pop} ifelse} forall
  /Encoding WinAnsiEncoding def
  currentdict
end
/Helvetica-Oblique exch definefont pop
/Helvetica-Bold findfont
dup length dict begin
  {1 index /FID ne {def} {pop pop} ifelse} forall
  /Encoding WinAnsiEncoding def
  currentdict
end
/Helvetica-Bold exch definefont pop
/Helvetica-BoldOblique findfont
dup length dict begin
  {1 index /FID ne {def} {pop pop} ifelse} forall
  /Encoding WinAnsiEncoding def
  currentdict
end
/Helvetica-BoldOblique exch definefont pop
/Times-Roman findfont
dup length dict begin
  {1 index /FID ne {def} {pop pop} ifelse} forall
  /Encoding WinAnsiEncoding def
  currentdict
end
/Times-Roman exch definefont pop
/Times-Italic findfont
dup length dict begin
  {1 index /FID ne {def} {pop pop} ifelse} forall
  /Encoding WinAnsiEncoding def
  currentdict
end
/Times-Italic exch definefont pop
/Times-Bold findfont
dup length dict begin
  {1 index /FID ne {def} {pop pop} ifelse} forall
  /Encoding WinAnsiEncoding def
  currentdict
end
/Times-Bold exch definefont pop
/Times-BoldItalic findfont
dup length dict begin
  {1 index /FID ne {def} {pop pop} ifelse} forall
  /Encoding WinAnsiEncoding def
  currentdict
end
/Times-BoldItalic exch definefont pop
/Courier findfont
dup length dict begin
  {1 index /FID ne {def} {pop pop} ifelse} forall
  /Encoding WinAnsiEncoding def
  currentdict
end
/Courier exch definefont pop
%FOPEndFontReencode
%%EndProlog
%%Page: 1 1
%%PageBoundingBox: 0 0 801 447
%%BeginPageSetup
[1 0 0 -1 0 447] CT
%%EndPageSetup
GS
[0.75 0 0 0.75 0 0] CT
1 GC
N
0 0 1068 596 re
f
GR
GS
[0.75 0 0 0.75 0 0] CT
1 GC
N
0 0 1068 596 re
f
GR
GS
[0.75 0 0 0.75 0 0] CT
1 GC
N
303.283 303.283 M
303.783 318.569 L
305.282 333.789 L
307.774 348.879 L
311.246 363.773 L
315.686 378.409 L
321.073 392.722 L
327.385 406.653 L
334.595 420.141 L
342.671 433.129 L
351.58 445.561 L
361.282 457.383 L
371.737 468.546 L
382.9 479.001 L
394.722 488.703 L
407.154 497.612 L
420.141 505.688 L
433.629 512.897 L
447.56 519.209 L
461.874 524.597 L
476.51 529.036 L
491.404 532.509 L
506.494 535 L
521.714 536.5 L
537 537 L
552.286 536.5 L
567.506 535 L
582.596 532.509 L
597.49 529.036 L
612.126 524.597 L
626.44 519.209 L
640.37 512.897 L
653.859 505.688 L
666.846 497.612 L
679.278 488.703 L
691.101 479.001 L
702.263 468.546 L
712.718 457.383 L
722.42 445.561 L
731.329 433.129 L
739.405 420.141 L
746.615 406.653 L
752.927 392.722 L
758.314 378.409 L
762.754 363.773 L
766.226 348.879 L
768.718 333.789 L
770.217 318.569 L
770.717 303.283 L
770.217 287.997 L
768.718 272.776 L
766.226 257.687 L
762.754 242.792 L
758.314 228.157 L
752.927 213.843 L
746.615 199.912 L
739.405 186.424 L
731.329 173.436 L
722.42 161.005 L
712.718 149.182 L
702.263 138.02 L
691.101 127.565 L
679.278 117.862 L
666.846 108.954 L
653.859 100.878 L
640.37 93.668 L
626.44 87.356 L
612.126 81.969 L
597.49 77.529 L
582.596 74.056 L
567.506 71.565 L
552.286 70.066 L
537 69.565 L
521.714 70.066 L
506.494 71.565 L
491.404 74.056 L
476.51 77.529 L
461.874 81.969 L
447.56 87.356 L
433.629 93.668 L
420.141 100.878 L
407.154 108.954 L
394.722 117.862 L
382.9 127.565 L
371.737 138.02 L
361.282 149.182 L
351.58 161.005 L
342.671 173.436 L
334.595 186.424 L
327.385 199.912 L
321.073 213.843 L
315.686 228.157 L
311.246 242.792 L
307.774 257.687 L
305.282 272.776 L
303.783 287.997 L
cp
f
GR
GS
[0.75 0 0 0.75 0 0] CT
0.149 GC
1 LJ
0.667 LW
N
303.283 303.283 M
303.783 318.569 L
305.282 333.789 L
307.774 348.879 L
311.246 363.773 L
315.686 378.409 L
321.073 392.722 L
327.385 406.653 L
334.595 420.141 L
342.671 433.129 L
351.58 445.561 L
361.282 457.383 L
371.737 468.546 L
382.9 479.001 L
394.722 488.703 L
407.154 497.612 L
420.141 505.688 L
433.629 512.897 L
447.56 519.209 L
461.874 524.597 L
476.51 529.036 L
491.404 532.509 L
506.494 535 L
521.714 536.5 L
537 537 L
537 537 L
552.286 536.5 L
567.506 535 L
582.596 532.509 L
597.49 529.036 L
612.126 524.597 L
626.44 519.209 L
640.37 512.897 L
653.859 505.688 L
666.846 497.612 L
679.278 488.703 L
691.101 479.001 L
702.263 468.546 L
712.718 457.383 L
722.42 445.561 L
731.329 433.129 L
739.405 420.141 L
746.615 406.653 L
752.927 392.722 L
758.314 378.409 L
762.754 363.773 L
766.226 348.879 L
768.718 333.789 L
770.217 318.569 L
770.717 303.283 L
770.717 303.283 L
770.217 287.997 L
768.718 272.776 L
766.226 257.687 L
762.754 242.792 L
758.314 228.157 L
752.927 213.843 L
746.615 199.912 L
739.405 186.424 L
731.329 173.436 L
722.42 161.005 L
712.718 149.182 L
702.263 138.02 L
691.101 127.565 L
679.278 117.862 L
666.846 108.954 L
653.859 100.878 L
640.37 93.668 L
626.44 87.356 L
612.126 81.969 L
597.49 77.529 L
582.596 74.056 L
567.506 71.565 L
552.286 70.066 L
537 69.565 L
537 69.565 L
521.714 70.066 L
506.494 71.565 L
491.404 74.056 L
476.51 77.529 L
461.874 81.969 L
447.56 87.356 L
433.629 93.668 L
420.141 100.878 L
407.154 108.954 L
394.722 117.862 L
382.9 127.565 L
371.737 138.02 L
361.282 149.182 L
351.58 161.005 L
342.671 173.436 L
334.595 186.424 L
327.385 199.912 L
321.073 213.843 L
315.686 228.157 L
311.246 242.792 L
307.774 257.687 L
305.282 272.776 L
303.783 287.997 L
303.283 303.283 L
cp
S
GR
GS
[0.75 0 0 0.75 0 0] CT
0.149 GC
[1 3] 0 setdash
2 LJ
0.667 LW
N
653.859 100.878 M
420.141 505.688 L
S
GR
GS
[0.75 0 0 0.75 0 0] CT
0.149 GC
[1 3] 0 setdash
2 LJ
0.667 LW
N
739.405 186.424 M
334.595 420.141 L
S
GR
GS
[0.75 0 0 0.75 0 0] CT
0.149 GC
[1 3] 0 setdash
2 LJ
0.667 LW
N
770.717 303.283 M
303.283 303.283 L
S
GR
GS
[0.75 0 0 0.75 0 0] CT
0.149 GC
[1 3] 0 setdash
2 LJ
0.667 LW
N
739.405 420.141 M
334.595 186.424 L
S
GR
GS
[0.75 0 0 0.75 0 0] CT
0.149 GC
[1 3] 0 setdash
2 LJ
0.667 LW
N
653.859 505.688 M
420.141 100.878 L
S
GR
GS
[0.75 0 0 0.75 0 0] CT
0.149 GC
[1 3] 0 setdash
2 LJ
0.667 LW
N
537 537 M
537 69.565 L
S
GR
GS
[0.75 0 0 0.75 499.15837 60.47784] CT
/Helvetica 18.667 F
GS
[1 0 0 1 0 0] CT
-10.5 7 moveto 
1 -1 scale
(30) t 
GR
GR
GS
[0.75 0 0 0.75 306.34163 394.44626] CT
/Helvetica 18.667 F
GS
[1 0 0 1 0 0] CT
-16 7 moveto 
1 -1 scale
(210) t 
GR
GR
GS
[0.75 0 0 0.75 569.73422 131.05367] CT
/Helvetica 18.667 F
GS
[1 0 0 1 0 0] CT
-10.5 7 moveto 
1 -1 scale
(60) t 
GR
GR
GS
[0.75 0 0 0.75 235.7658 323.87043] CT
/Helvetica 18.667 F
GS
[1 0 0 1 0 0] CT
-16 7 moveto 
1 -1 scale
(240) t 
GR
GR
GS
[0.75 0 0 0.75 595.56674 227.46204] CT
/Helvetica 18.667 F
GS
[1 0 0 1 0 0] CT
-10.5 7 moveto 
1 -1 scale
(90) t 
GR
GR
GS
[0.75 0 0 0.75 209.93324 227.46204] CT
/Helvetica 18.667 F
GS
[1 0 0 1 0 0] CT
-16 7 moveto 
1 -1 scale
(270) t 
GR
GR
GS
[0.75 0 0 0.75 569.73422 323.87043] CT
/Helvetica 18.667 F
GS
[1 0 0 1 0 0] CT
-16 7 moveto 
1 -1 scale
(120) t 
GR
GR
GS
[0.75 0 0 0.75 235.7658 131.05367] CT
/Helvetica 18.667 F
GS
[1 0 0 1 0 0] CT
-16 7 moveto 
1 -1 scale
(300) t 
GR
GR
GS
[0.75 0 0 0.75 499.15837 394.44626] CT
/Helvetica 18.667 F
GS
[1 0 0 1 0 0] CT
-16 7 moveto 
1 -1 scale
(150) t 
GR
GR
GS
[0.75 0 0 0.75 306.34163 60.47784] CT
/Helvetica 18.667 F
GS
[1 0 0 1 0 0] CT
-16 7 moveto 
1 -1 scale
(330) t 
GR
GR
GS
[0.75 0 0 0.75 402.75 420.27878] CT
/Helvetica 18.667 F
GS
[1 0 0 1 0 0] CT
-16 7 moveto 
1 -1 scale
(180) t 
GR
GR
GS
[0.75 0 0 0.75 402.75 34.64529] CT
/Helvetica 18.667 F
GS
[1 0 0 1 0 0] CT
-5.5 7 moveto 
1 -1 scale
(0) t 
GR
GR
GS
[0.75 0 0 0.75 0 0] CT
0.149 GC
[1 3] 0 setdash
2 LJ
0.667 LW
N
537 69.565 M
551.675 70.027 L
566.293 71.408 L
580.794 73.705 L
595.123 76.908 L
609.223 81.004 L
623.037 85.978 L
636.512 91.809 L
649.594 98.475 L
662.232 105.949 L
674.376 114.201 L
685.977 123.2 L
696.99 132.91 L
707.373 143.292 L
717.082 154.306 L
726.081 165.907 L
734.334 178.051 L
741.808 190.689 L
748.474 203.771 L
754.305 217.246 L
759.278 231.06 L
763.375 245.16 L
766.578 259.488 L
768.874 273.99 L
770.256 288.607 L
770.717 303.283 L
770.256 317.958 L
768.874 332.575 L
766.578 347.077 L
763.375 361.406 L
759.278 375.505 L
754.305 389.32 L
748.474 402.795 L
741.808 415.877 L
734.334 428.515 L
726.081 440.658 L
717.082 452.26 L
707.373 463.273 L
696.99 473.655 L
685.977 483.365 L
674.376 492.364 L
662.232 500.617 L
649.594 508.091 L
636.512 514.756 L
623.037 520.588 L
609.223 525.561 L
595.123 529.657 L
580.794 532.86 L
566.293 535.157 L
551.675 536.539 L
537 537 L
522.325 536.539 L
507.707 535.157 L
493.206 532.86 L
478.877 529.657 L
464.777 525.561 L
450.963 520.588 L
437.488 514.756 L
424.406 508.091 L
411.768 500.617 L
399.624 492.364 L
388.023 483.365 L
377.01 473.655 L
366.627 463.273 L
356.918 452.26 L
347.919 440.658 L
339.666 428.515 L
332.192 415.877 L
325.526 402.795 L
319.695 389.32 L
314.722 375.505 L
310.625 361.406 L
307.422 347.077 L
305.126 332.575 L
303.744 317.958 L
303.283 303.283 L
303.744 288.607 L
305.126 273.99 L
307.422 259.488 L
310.625 245.16 L
314.722 231.06 L
319.695 217.246 L
325.526 203.771 L
332.192 190.689 L
339.666 178.051 L
347.919 165.907 L
356.918 154.306 L
366.627 143.292 L
377.01 132.91 L
388.023 123.2 L
399.624 114.201 L
411.768 105.949 L
424.406 98.475 L
437.488 91.809 L
450.963 85.978 L
464.777 81.004 L
478.877 76.908 L
493.206 73.705 L
507.707 71.408 L
522.325 70.027 L
537 69.565 L
S
GR
GS
[0.75 0 0 0.75 0 0] CT
0.149 GC
[1 3] 0 setdash
2 LJ
0.667 LW
N
537 77.529 M
551.175 77.975 L
565.294 79.309 L
579.302 81.528 L
593.143 84.622 L
606.762 88.578 L
620.105 93.382 L
633.121 99.015 L
645.758 105.453 L
657.965 112.673 L
669.695 120.644 L
680.901 129.337 L
691.539 138.715 L
701.567 148.744 L
710.946 159.382 L
719.638 170.588 L
727.61 182.318 L
734.829 194.525 L
741.268 207.162 L
746.9 220.177 L
751.704 233.521 L
755.661 247.14 L
758.755 260.981 L
760.973 274.988 L
762.308 289.108 L
762.754 303.283 L
762.308 317.458 L
760.973 331.577 L
758.755 345.585 L
755.661 359.425 L
751.704 373.044 L
746.9 386.388 L
741.268 399.404 L
734.829 412.04 L
727.61 424.248 L
719.638 435.977 L
710.946 447.183 L
701.567 457.822 L
691.539 467.85 L
680.901 477.229 L
669.695 485.921 L
657.965 493.893 L
645.758 501.112 L
633.121 507.551 L
620.105 513.183 L
606.762 517.987 L
593.143 521.944 L
579.302 525.038 L
565.294 527.256 L
551.175 528.591 L
537 529.036 L
522.825 528.591 L
508.706 527.256 L
494.698 525.038 L
480.857 521.944 L
467.238 517.987 L
453.895 513.183 L
440.879 507.551 L
428.242 501.112 L
416.035 493.893 L
404.305 485.921 L
393.099 477.229 L
382.461 467.85 L
372.433 457.822 L
363.054 447.183 L
354.362 435.977 L
346.39 424.248 L
339.171 412.04 L
332.732 399.404 L
327.1 386.388 L
322.296 373.044 L
318.339 359.425 L
315.245 345.585 L
313.027 331.577 L
311.692 317.458 L
311.246 303.283 L
311.692 289.108 L
313.027 274.988 L
315.245 260.981 L
318.339 247.14 L
322.296 233.521 L
327.1 220.177 L
332.732 207.162 L
339.171 194.525 L
346.39 182.318 L
354.362 170.588 L
363.054 159.382 L
372.433 148.744 L
382.461 138.715 L
393.099 129.337 L
404.305 120.644 L
416.035 112.673 L
428.242 105.453 L
440.879 99.015 L
453.895 93.382 L
467.238 88.578 L
480.857 84.622 L
494.698 81.528 L
508.706 79.309 L
522.825 77.975 L
537 77.529 L
S
GR
GS
[0.75 0 0 0.75 0 0] CT
1 GC
N
524 100.029 M
550 100.029 L
550 71.029 L
524 71.029 L
cp
f
GR
GS
[0.75 0 0 0.75 402.75 64.14688] CT
/Helvetica 16 F
GS
[1 0 0 1 0 0] CT
-9 6.5 moveto 
1 -1 scale
(15) t 
GR
GR
GS
[0.75 0 0 0.75 0 0] CT
0.149 GC
[1 3] 0 setdash
2 LJ
0.667 LW
N
537 100.878 M
549.709 101.277 L
562.368 102.474 L
574.927 104.463 L
587.336 107.237 L
599.547 110.784 L
611.51 115.091 L
623.18 120.141 L
634.509 125.914 L
645.454 132.386 L
655.971 139.534 L
666.018 147.327 L
675.556 155.736 L
684.547 164.727 L
692.956 174.265 L
700.749 184.312 L
707.896 194.829 L
714.369 205.773 L
720.142 217.103 L
725.191 228.772 L
729.499 240.736 L
733.046 252.947 L
735.82 265.356 L
737.809 277.915 L
739.006 290.574 L
739.405 303.283 L
739.006 315.992 L
737.809 328.651 L
735.82 341.21 L
733.046 353.619 L
729.499 365.829 L
725.191 377.793 L
720.142 389.463 L
714.369 400.792 L
707.896 411.737 L
700.749 422.253 L
692.956 432.301 L
684.547 441.839 L
675.556 450.83 L
666.018 459.239 L
655.971 467.032 L
645.454 474.179 L
634.509 480.652 L
623.18 486.424 L
611.51 491.474 L
599.547 495.781 L
587.336 499.329 L
574.927 502.103 L
562.368 504.092 L
549.709 505.288 L
537 505.688 L
524.291 505.288 L
511.632 504.092 L
499.073 502.103 L
486.664 499.329 L
474.453 495.781 L
462.49 491.474 L
450.82 486.424 L
439.491 480.652 L
428.546 474.179 L
418.029 467.032 L
407.982 459.239 L
398.444 450.83 L
389.453 441.839 L
381.044 432.301 L
373.251 422.253 L
366.104 411.737 L
359.631 400.792 L
353.858 389.463 L
348.809 377.793 L
344.501 365.829 L
340.954 353.619 L
338.18 341.21 L
336.191 328.651 L
334.994 315.992 L
334.595 303.283 L
334.994 290.574 L
336.191 277.915 L
338.18 265.356 L
340.954 252.947 L
344.501 240.736 L
348.809 228.772 L
353.858 217.103 L
359.631 205.773 L
366.104 194.829 L
373.251 184.312 L
381.044 174.265 L
389.453 164.727 L
398.444 155.736 L
407.982 147.327 L
418.029 139.534 L
428.546 132.386 L
439.491 125.914 L
450.82 120.141 L
462.49 115.091 L
474.453 110.784 L
486.664 107.237 L
499.073 104.463 L
511.632 102.474 L
524.291 101.277 L
537 100.878 L
S
GR
GS
[0.75 0 0 0.75 0 0] CT
1 GC
N
524 125.378 M
550 125.378 L
550 96.378 L
524 96.378 L
cp
f
GR
GS
[0.75 0 0 0.75 402.75 83.15822] CT
/Helvetica 16 F
GS
[1 0 0 1 0 0] CT
-9 6.5 moveto 
1 -1 scale
(30) t 
GR
GR
GS
[0.75 0 0 0.75 0 0] CT
0.149 GC
[1 3] 0 setdash
2 LJ
0.667 LW
N
537 138.02 M
547.377 138.346 L
557.713 139.323 L
567.967 140.947 L
578.099 143.212 L
588.069 146.108 L
597.837 149.625 L
607.366 153.748 L
616.616 158.462 L
625.552 163.746 L
634.139 169.582 L
642.343 175.945 L
650.13 182.811 L
657.472 190.152 L
664.337 197.94 L
670.701 206.144 L
676.536 214.73 L
681.821 223.667 L
686.534 232.917 L
690.658 242.445 L
694.174 252.214 L
697.071 262.183 L
699.336 272.316 L
700.96 282.57 L
701.937 292.906 L
702.263 303.283 L
701.937 313.66 L
700.96 323.996 L
699.336 334.25 L
697.071 344.382 L
694.174 354.352 L
690.658 364.12 L
686.534 373.648 L
681.821 382.899 L
676.536 391.835 L
670.701 400.422 L
664.337 408.625 L
657.472 416.413 L
650.13 423.754 L
642.343 430.62 L
634.139 436.983 L
625.552 442.819 L
616.616 448.104 L
607.366 452.817 L
597.837 456.94 L
588.069 460.457 L
578.099 463.354 L
567.967 465.619 L
557.713 467.243 L
547.377 468.22 L
537 468.546 L
526.623 468.22 L
516.287 467.243 L
506.033 465.619 L
495.901 463.354 L
485.931 460.457 L
476.163 456.94 L
466.634 452.817 L
457.384 448.104 L
448.448 442.819 L
439.861 436.983 L
431.657 430.62 L
423.87 423.754 L
416.528 416.413 L
409.663 408.625 L
403.299 400.422 L
397.464 391.835 L
392.179 382.899 L
387.466 373.648 L
383.342 364.12 L
379.825 354.352 L
376.929 344.382 L
374.664 334.25 L
373.04 323.996 L
372.063 313.66 L
371.737 303.283 L
372.063 292.906 L
373.04 282.57 L
374.664 272.316 L
376.929 262.183 L
379.825 252.214 L
383.342 242.445 L
387.466 232.917 L
392.179 223.667 L
397.464 214.73 L
403.299 206.144 L
409.663 197.94 L
416.528 190.152 L
423.87 182.811 L
431.657 175.945 L
439.861 169.582 L
448.448 163.746 L
457.384 158.462 L
466.634 153.748 L
476.163 149.625 L
485.931 146.108 L
495.901 143.212 L
506.033 140.947 L
516.287 139.323 L
526.623 138.346 L
537 138.02 L
S
GR
GS
[0.75 0 0 0.75 0 0] CT
1 GC
N
524 152.52 M
550 152.52 L
550 123.52 L
524 123.52 L
cp
f
GR
GS
[0.75 0 0 0.75 402.75 103.51474] CT
/Helvetica 16 F
GS
[1 0 0 1 0 0] CT
-9 6.5 moveto 
1 -1 scale
(45) t 
GR
GR
GS
[0.75 0 0 0.75 0 0] CT
0.149 GC
[1 3] 0 setdash
2 LJ
0.667 LW
N
537 186.424 M
544.338 186.655 L
551.646 187.346 L
558.897 188.494 L
566.062 190.095 L
573.111 192.144 L
580.019 194.63 L
586.756 197.546 L
593.297 200.879 L
599.616 204.616 L
605.688 208.742 L
611.489 213.242 L
616.995 218.096 L
622.186 223.287 L
627.041 228.794 L
631.541 234.595 L
635.667 240.667 L
639.404 246.986 L
642.737 253.527 L
645.652 260.264 L
648.139 267.171 L
650.187 274.221 L
651.789 281.386 L
652.937 288.636 L
653.628 295.945 L
653.859 303.283 L
653.628 310.62 L
652.937 317.929 L
651.789 325.18 L
650.187 332.344 L
648.139 339.394 L
645.652 346.301 L
642.737 353.039 L
639.404 359.58 L
635.667 365.899 L
631.541 371.971 L
627.041 377.771 L
622.186 383.278 L
616.995 388.469 L
611.489 393.324 L
605.688 397.823 L
599.616 401.95 L
593.297 405.687 L
586.756 409.02 L
580.019 411.935 L
573.111 414.422 L
566.062 416.47 L
558.897 418.071 L
551.646 419.22 L
544.338 419.911 L
537 420.141 L
529.662 419.911 L
522.354 419.22 L
515.103 418.071 L
507.938 416.47 L
500.889 414.422 L
493.981 411.935 L
487.244 409.02 L
480.703 405.687 L
474.384 401.95 L
468.312 397.823 L
462.512 393.324 L
457.005 388.469 L
451.814 383.278 L
446.959 377.771 L
442.459 371.971 L
438.333 365.899 L
434.596 359.58 L
431.263 353.039 L
428.348 346.301 L
425.861 339.394 L
423.813 332.344 L
422.211 325.18 L
421.063 317.929 L
420.372 310.62 L
420.141 303.283 L
420.372 295.945 L
421.063 288.636 L
422.211 281.386 L
423.813 274.221 L
425.861 267.171 L
428.348 260.264 L
431.263 253.527 L
434.596 246.986 L
438.333 240.667 L
442.459 234.595 L
446.959 228.794 L
451.814 223.287 L
457.005 218.096 L
462.512 213.242 L
468.312 208.742 L
474.384 204.616 L
480.703 200.879 L
487.244 197.546 L
493.981 194.63 L
500.889 192.144 L
507.938 190.095 L
515.103 188.494 L
522.354 187.346 L
529.662 186.655 L
537 186.424 L
S
GR
GS
[0.75 0 0 0.75 0 0] CT
1 GC
N
524 200.924 M
550 200.924 L
550 171.924 L
524 171.924 L
cp
f
GR
GS
[0.75 0 0 0.75 402.75 139.81807] CT
/Helvetica 16 F
GS
[1 0 0 1 0 0] CT
-9 6.5 moveto 
1 -1 scale
(60) t 
GR
GR
GS
[0.75 0 0 0.75 0 0] CT
0.149 GC
[1 3] 0 setdash
2 LJ
0.667 LW
N
537 242.792 M
540.798 242.912 L
544.581 243.269 L
548.335 243.864 L
552.043 244.693 L
555.693 245.753 L
559.268 247.04 L
562.756 248.549 L
566.142 250.275 L
569.412 252.209 L
572.555 254.345 L
575.558 256.674 L
578.409 259.187 L
581.096 261.874 L
583.609 264.725 L
585.938 267.727 L
588.074 270.87 L
590.008 274.141 L
591.733 277.527 L
593.243 281.015 L
594.53 284.59 L
595.59 288.239 L
596.419 291.948 L
597.013 295.701 L
597.371 299.484 L
597.49 303.283 L
597.371 307.081 L
597.013 310.864 L
596.419 314.618 L
595.59 318.326 L
594.53 321.975 L
593.243 325.551 L
591.733 329.038 L
590.008 332.424 L
588.074 335.695 L
585.938 338.838 L
583.609 341.841 L
581.096 344.691 L
578.409 347.378 L
575.558 349.891 L
572.555 352.221 L
569.412 354.357 L
566.142 356.291 L
562.756 358.016 L
559.268 359.525 L
555.693 360.813 L
552.043 361.873 L
548.335 362.702 L
544.581 363.296 L
540.798 363.654 L
537 363.773 L
533.202 363.654 L
529.419 363.296 L
525.665 362.702 L
521.957 361.873 L
518.307 360.813 L
514.732 359.525 L
511.244 358.016 L
507.858 356.291 L
504.588 354.357 L
501.445 352.221 L
498.442 349.891 L
495.591 347.378 L
492.904 344.691 L
490.391 341.841 L
488.062 338.838 L
485.926 335.695 L
483.992 332.424 L
482.267 329.038 L
480.757 325.551 L
479.47 321.975 L
478.41 318.326 L
477.581 314.618 L
476.987 310.864 L
476.629 307.081 L
476.51 303.283 L
476.629 299.484 L
476.987 295.701 L
477.581 291.948 L
478.41 288.239 L
479.47 284.59 L
480.757 281.015 L
482.267 277.527 L
483.992 274.141 L
485.926 270.87 L
488.062 267.727 L
490.391 264.725 L
492.904 261.874 L
495.591 259.187 L
498.442 256.674 L
501.445 254.345 L
504.588 252.209 L
507.858 250.275 L
511.244 248.549 L
514.732 247.04 L
518.307 245.753 L
521.957 244.693 L
525.665 243.864 L
529.419 243.269 L
533.202 242.912 L
537 242.792 L
S
GR
GS
[0.75 0 0 0.75 0 0] CT
1 GC
N
524 257.292 M
550 257.292 L
550 228.292 L
524 228.292 L
cp
f
GR
GS
[0.75 0 0 0.75 402.75 182.09418] CT
/Helvetica 16 F
GS
[1 0 0 1 0 0] CT
-9 6.5 moveto 
1 -1 scale
(75) t 
GR
GR
GS
[0.75 0 0 0.75 0 0] CT
0.149 GC
[1 3] 0 setdash
2 LJ
0.667 LW
N
537 303.283 M
537 303.283 L
537 303.283 L
537 303.283 L
537 303.283 L
537 303.283 L
537 303.283 L
537 303.283 L
537 303.283 L
537 303.283 L
537 303.283 L
537 303.283 L
537 303.283 L
537 303.283 L
537 303.283 L
537 303.283 L
537 303.283 L
537 303.283 L
537 303.283 L
537 303.283 L
537 303.283 L
537 303.283 L
537 303.283 L
537 303.283 L
537 303.283 L
537 303.283 L
537 303.283 L
537 303.283 L
537 303.283 L
537 303.283 L
537 303.283 L
537 303.283 L
537 303.283 L
537 303.283 L
537 303.283 L
537 303.283 L
537 303.283 L
537 303.283 L
537 303.283 L
537 303.283 L
537 303.283 L
537 303.283 L
537 303.283 L
537 303.283 L
537 303.283 L
537 303.283 L
537 303.283 L
537 303.283 L
537 303.283 L
537 303.283 L
537 303.283 L
537 303.283 L
537 303.283 L
537 303.283 L
537 303.283 L
537 303.283 L
537 303.283 L
537 303.283 L
537 303.283 L
537 303.283 L
537 303.283 L
537 303.283 L
537 303.283 L
537 303.283 L
537 303.283 L
537 303.283 L
537 303.283 L
537 303.283 L
537 303.283 L
537 303.283 L
537 303.283 L
537 303.283 L
537 303.283 L
537 303.283 L
537 303.283 L
537 303.283 L
537 303.283 L
537 303.283 L
537 303.283 L
537 303.283 L
537 303.283 L
537 303.283 L
537 303.283 L
537 303.283 L
537 303.283 L
537 303.283 L
537 303.283 L
537 303.283 L
537 303.283 L
537 303.283 L
537 303.283 L
537 303.283 L
537 303.283 L
537 303.283 L
537 303.283 L
537 303.283 L
537 303.283 L
537 303.283 L
537 303.283 L
537 303.283 L
537 303.283 L
S
GR
GS
[0.75 0 0 0.75 0 0] CT
1 GC
N
524 317.783 M
550 317.783 L
550 288.783 L
524 288.783 L
cp
f
GR
GS
[0.75 0 0 0.75 402.75 227.46204] CT
/Helvetica 16 F
GS
[1 0 0 1 0 0] CT
-9 6.5 moveto 
1 -1 scale
(90) t 
GR
GR
GS
[0.75 0 0 0.75 266.22157 127.51978] CT
1 GC
N
13.333 0 M
13.333 -7.364 7.364 -13.333 0 -13.333 C
-7.364 -13.333 -13.333 -7.364 -13.333 0 C
-13.333 7.364 -7.364 13.333 0 13.333 C
7.364 13.333 13.333 7.364 13.333 0 C
cp
f
GR
GS
[0.75 0 0 0.75 266.22157 127.51978] CT
10.0 ML
2.667 LW
N
13.333 0 M
13.333 -7.364 7.364 -13.333 0 -13.333 C
-7.364 -13.333 -13.333 -7.364 -13.333 0 C
-13.333 7.364 -7.364 13.333 0 13.333 C
7.364 13.333 13.333 7.364 13.333 0 C
cp
S
GR
GS
[0.75 0 0 0.75 302.577 172.72839] CT
1 GC
N
/f671709145{13.333 0 M
13.333 -7.364 7.364 -13.333 0 -13.333 C
-7.364 -13.333 -13.333 -7.364 -13.333 0 C
-13.333 7.364 -7.364 13.333 0 13.333 C
7.364 13.333 13.333 7.364 13.333 0 C
cp}def
f671709145
f
GR
GS
[0.75 0 0 0.75 302.577 172.72839] CT
10.0 ML
2.667 LW
N
13.333 0 M
13.333 -7.364 7.364 -13.333 0 -13.333 C
-7.364 -13.333 -13.333 -7.364 -13.333 0 C
-13.333 7.364 -7.364 13.333 0 13.333 C
7.364 13.333 13.333 7.364 13.333 0 C
cp
S
GR
GS
[0.75 0 0 0.75 481.17902 382.6986] CT
1 GC
N
f671709145
f
GR
GS
[0.75 0 0 0.75 481.17902 382.6986] CT
10.0 ML
2.667 LW
N
13.333 0 M
13.333 -7.364 7.364 -13.333 0 -13.333 C
-7.364 -13.333 -13.333 -7.364 -13.333 0 C
-13.333 7.364 -7.364 13.333 0 13.333 C
7.364 13.333 13.333 7.364 13.333 0 C
cp
S
GR
GS
[0.75 0 0 0.75 544.25803 242.31693] CT
1 GC
N
f671709145
f
GR
GS
[0.75 0 0 0.75 544.25803 242.31693] CT
10.0 ML
2.667 LW
N
13.333 0 M
13.333 -7.364 7.364 -13.333 0 -13.333 C
-7.364 -13.333 -13.333 -7.364 -13.333 0 C
-13.333 7.364 -7.364 13.333 0 13.333 C
7.364 13.333 13.333 7.364 13.333 0 C
cp
S
GR
GS
[0.75 0 0 0.75 492.61006 306.36102] CT
1 GC
N
f671709145
f
GR
GS
[0.75 0 0 0.75 492.61006 306.36102] CT
10.0 ML
2.667 LW
N
13.333 0 M
13.333 -7.364 7.364 -13.333 0 -13.333 C
-7.364 -13.333 -13.333 -7.364 -13.333 0 C
-13.333 7.364 -7.364 13.333 0 13.333 C
7.364 13.333 13.333 7.364 13.333 0 C
cp
S
GR
GS
[0.75 0 0 0.75 341.44647 253.75104] CT
1 GC
N
f671709145
f
GR
GS
[0.75 0 0 0.75 341.44647 253.75104] CT
10.0 ML
2.667 LW
N
13.333 0 M
13.333 -7.364 7.364 -13.333 0 -13.333 C
-7.364 -13.333 -13.333 -7.364 -13.333 0 C
-13.333 7.364 -7.364 13.333 0 13.333 C
7.364 13.333 13.333 7.364 13.333 0 C
cp
S
GR
GS
[0.75 0 0 0.75 469.00987 177.12379] CT
1 GC
N
f671709145
f
GR
GS
[0.75 0 0 0.75 469.00987 177.12379] CT
10.0 ML
2.667 LW
N
13.333 0 M
13.333 -7.364 7.364 -13.333 0 -13.333 C
-7.364 -13.333 -13.333 -7.364 -13.333 0 C
-13.333 7.364 -7.364 13.333 0 13.333 C
7.364 13.333 13.333 7.364 13.333 0 C
cp
S
GR
GS
[0.75 0 0 0.75 279.50787 347.93408] CT
1 GC
N
f671709145
f
GR
GS
[0.75 0 0 0.75 279.50787 347.93408] CT
10.0 ML
2.667 LW
N
13.333 0 M
13.333 -7.364 7.364 -13.333 0 -13.333 C
-7.364 -13.333 -13.333 -7.364 -13.333 0 C
-13.333 7.364 -7.364 13.333 0 13.333 C
7.364 13.333 13.333 7.364 13.333 0 C
cp
S
GR
GS
[0.75 0 0 0.75 270.20272 309.65593] CT
1 GC
N
f671709145
f
GR
GS
[0.75 0 0 0.75 270.20272 309.65593] CT
10.0 ML
2.667 LW
N
13.333 0 M
13.333 -7.364 7.364 -13.333 0 -13.333 C
-7.364 -13.333 -13.333 -7.364 -13.333 0 C
-13.333 7.364 -7.364 13.333 0 13.333 C
7.364 13.333 13.333 7.364 13.333 0 C
cp
S
GR
GS
[0.75 0 0 0.75 505.32541 90.04963] CT
1 GC
N
f671709145
f
GR
GS
[0.75 0 0 0.75 505.32541 90.04963] CT
10.0 ML
2.667 LW
N
13.333 0 M
13.333 -7.364 7.364 -13.333 0 -13.333 C
-7.364 -13.333 -13.333 -7.364 -13.333 0 C
-13.333 7.364 -7.364 13.333 0 13.333 C
7.364 13.333 13.333 7.364 13.333 0 C
cp
S
GR
GS
[0.75 0 0 0.75 249.72157 127.51978] CT
/Helvetica 18.667 F
GS
[1 0 0 1 0 0] CT
0 7 moveto 
1 -1 scale
(  27) t 
GR
GR
GS
[0.75 0 0 0.75 291.327 172.72839] CT
/Helvetica 18.667 F
GS
[1 0 0 1 0 0] CT
0 7 moveto 
1 -1 scale
(  7) t 
GR
GR
GS
[0.75 0 0 0.75 469.17902 382.6986] CT
/Helvetica 18.667 F
GS
[1 0 0 1 0 0] CT
0 7 moveto 
1 -1 scale
(  4) t 
GR
GR
GS
[0.75 0 0 0.75 532.25803 242.31693] CT
/Helvetica 18.667 F
GS
[1 0 0 1 0 0] CT
0 7 moveto 
1 -1 scale
(  8) t 
GR
GR
GS
[0.75 0 0 0.75 476.11006 306.36102] CT
/Helvetica 18.667 F
GS
[1 0 0 1 0 0] CT
0 7 moveto 
1 -1 scale
(  16) t 
GR
GR
GS
[0.75 0 0 0.75 330.19647 253.75104] CT
/Helvetica 18.667 F
GS
[1 0 0 1 0 0] CT
0 7 moveto 
1 -1 scale
(  3) t 
GR
GR
GS
[0.75 0 0 0.75 452.50987 177.12379] CT
/Helvetica 18.667 F
GS
[1 0 0 1 0 0] CT
0 7 moveto 
1 -1 scale
(  12) t 
GR
GR
GS
[0.75 0 0 0.75 263.00787 347.93408] CT
/Helvetica 18.667 F
GS
[1 0 0 1 0 0] CT
0 7 moveto 
1 -1 scale
(  28) t 
GR
GR
GS
[0.75 0 0 0.75 254.45272 308.90595] CT
/Helvetica 18.667 F
GS
[1 0 0 1 0 0] CT
0 7 moveto 
1 -1 scale
(  11) t 
GR
GR
GS
[0.75 0 0 0.75 488.82541 90.04963] CT
/Helvetica 18.667 F
GS
[1 0 0 1 0 0] CT
0 7 moveto 
1 -1 scale
(  17) t 
GR
GR
%%Trailer
%%Pages: 1
%%EOF
