%!PS-Adobe-3.0 EPSF-3.0
%%Creator: (MATLAB, The Mathworks, Inc. Version 9.5.0.944444 \(R2018b\). Operating System: Windows 10)
%%Title: (X:/[ALEX_ANDREA]_dataCollections_scenario01_varSatNum_April/valuable RESULTS/Figures/correctPercentilesLowDynamics.eps)
%%CreationDate: 2019-05-02T17:28:49
%%Pages: (atend)
%%BoundingBox: 0 0 996 368
%%LanguageLevel: 3
%%EndComments
%%BeginProlog
%%BeginResource: procset (Apache XML Graphics Std ProcSet) 1.2 0
%%Version: 1.2 0
%%Copyright: (Copyright 2001-2003,2010 The Apache Software Foundation. License terms: http://www.apache.org/licenses/LICENSE-2.0)
/bd{bind def}bind def
/ld{load def}bd
/GR/grestore ld
/GS/gsave ld
/RM/rmoveto ld
/C/curveto ld
/t/show ld
/L/lineto ld
/ML/setmiterlimit ld
/CT/concat ld
/f/fill ld
/N/newpath ld
/S/stroke ld
/CC/setcmykcolor ld
/A/ashow ld
/cp/closepath ld
/RC/setrgbcolor ld
/LJ/setlinejoin ld
/GC/setgray ld
/LW/setlinewidth ld
/M/moveto ld
/re {4 2 roll M
1 index 0 rlineto
0 exch rlineto
neg 0 rlineto
cp } bd
/_ctm matrix def
/_tm matrix def
/BT { _ctm currentmatrix pop matrix _tm copy pop 0 0 moveto } bd
/ET { _ctm setmatrix } bd
/iTm { _ctm setmatrix _tm concat } bd
/Tm { _tm astore pop iTm 0 0 moveto } bd
/ux 0.0 def
/uy 0.0 def
/F {
  /Tp exch def
  /Tf exch def
  Tf findfont Tp scalefont setfont
  /cf Tf def  /cs Tp def
} bd
/ULS {currentpoint /uy exch def /ux exch def} bd
/ULE {
  /Tcx currentpoint pop def
  gsave
  newpath
  cf findfont cs scalefont dup
  /FontMatrix get 0 get /Ts exch def /FontInfo get dup
  /UnderlinePosition get Ts mul /To exch def
  /UnderlineThickness get Ts mul /Tt exch def
  ux uy To add moveto  Tcx uy To add lineto
  Tt setlinewidth stroke
  grestore
} bd
/OLE {
  /Tcx currentpoint pop def
  gsave
  newpath
  cf findfont cs scalefont dup
  /FontMatrix get 0 get /Ts exch def /FontInfo get dup
  /UnderlinePosition get Ts mul /To exch def
  /UnderlineThickness get Ts mul /Tt exch def
  ux uy To add cs add moveto Tcx uy To add cs add lineto
  Tt setlinewidth stroke
  grestore
} bd
/SOE {
  /Tcx currentpoint pop def
  gsave
  newpath
  cf findfont cs scalefont dup
  /FontMatrix get 0 get /Ts exch def /FontInfo get dup
  /UnderlinePosition get Ts mul /To exch def
  /UnderlineThickness get Ts mul /Tt exch def
  ux uy To add cs 10 mul 26 idiv add moveto Tcx uy To add cs 10 mul 26 idiv add lineto
  Tt setlinewidth stroke
  grestore
} bd
/QT {
/Y22 exch store
/X22 exch store
/Y21 exch store
/X21 exch store
currentpoint
/Y21 load 2 mul add 3 div exch
/X21 load 2 mul add 3 div exch
/X21 load 2 mul /X22 load add 3 div
/Y21 load 2 mul /Y22 load add 3 div
/X22 load /Y22 load curveto
} bd
/SSPD {
dup length /d exch dict def
{
/v exch def
/k exch def
currentpagedevice k known {
/cpdv currentpagedevice k get def
v cpdv ne {
/upd false def
/nullv v type /nulltype eq def
/nullcpdv cpdv type /nulltype eq def
nullv nullcpdv or
{
/upd true def
} {
/sametype v type cpdv type eq def
sametype {
v type /arraytype eq {
/vlen v length def
/cpdvlen cpdv length def
vlen cpdvlen eq {
0 1 vlen 1 sub {
/i exch def
/obj v i get def
/cpdobj cpdv i get def
obj cpdobj ne {
/upd true def
exit
} if
} for
} {
/upd true def
} ifelse
} {
v type /dicttype eq {
v {
/dv exch def
/dk exch def
/cpddv cpdv dk get def
dv cpddv ne {
/upd true def
exit
} if
} forall
} {
/upd true def
} ifelse
} ifelse
} if
} ifelse
upd true eq {
d k v put
} if
} if
} if
} forall
d length 0 gt {
d setpagedevice
} if
} bd
/RE { % /NewFontName [NewEncodingArray] /FontName RE -
  findfont dup length dict begin
  {
    1 index /FID ne
    {def} {pop pop} ifelse
  } forall
  /Encoding exch def
  /FontName 1 index def
  currentdict definefont pop
  end
} bind def
%%EndResource
%%BeginResource: procset (Apache XML Graphics EPS ProcSet) 1.0 0
%%Version: 1.0 0
%%Copyright: (Copyright 2002-2003 The Apache Software Foundation. License terms: http://www.apache.org/licenses/LICENSE-2.0)
/BeginEPSF { %def
/b4_Inc_state save def         % Save state for cleanup
/dict_count countdictstack def % Count objects on dict stack
/op_count count 1 sub def      % Count objects on operand stack
userdict begin                 % Push userdict on dict stack
/showpage { } def              % Redefine showpage, { } = null proc
0 setgray 0 setlinecap         % Prepare graphics state
1 setlinewidth 0 setlinejoin
10 setmiterlimit [ ] 0 setdash newpath
/languagelevel where           % If level not equal to 1 then
{pop languagelevel             % set strokeadjust and
1 ne                           % overprint to their defaults.
{false setstrokeadjust false setoverprint
} if
} if
} bd
/EndEPSF { %def
count op_count sub {pop} repeat            % Clean up stacks
countdictstack dict_count sub {end} repeat
b4_Inc_state restore
} bd
%%EndResource
%FOPBeginFontDict
%%IncludeResource: font Courier-Oblique
%%IncludeResource: font Courier-BoldOblique
%%IncludeResource: font Courier-Bold
%%IncludeResource: font ZapfDingbats
%%IncludeResource: font Symbol
%%IncludeResource: font Helvetica
%%IncludeResource: font Helvetica-Oblique
%%IncludeResource: font Helvetica-Bold
%%IncludeResource: font Helvetica-BoldOblique
%%IncludeResource: font Times-Roman
%%IncludeResource: font Times-Italic
%%IncludeResource: font Times-Bold
%%IncludeResource: font Times-BoldItalic
%%IncludeResource: font Courier
%FOPEndFontDict
%%BeginResource: encoding WinAnsiEncoding
/WinAnsiEncoding [
/.notdef /.notdef /.notdef /.notdef /.notdef
/.notdef /.notdef /.notdef /.notdef /.notdef
/.notdef /.notdef /.notdef /.notdef /.notdef
/.notdef /.notdef /.notdef /.notdef /.notdef
/.notdef /.notdef /.notdef /.notdef /.notdef
/.notdef /.notdef /.notdef /.notdef /.notdef
/.notdef /.notdef /space /exclam /quotedbl
/numbersign /dollar /percent /ampersand /quotesingle
/parenleft /parenright /asterisk /plus /comma
/hyphen /period /slash /zero /one
/two /three /four /five /six
/seven /eight /nine /colon /semicolon
/less /equal /greater /question /at
/A /B /C /D /E
/F /G /H /I /J
/K /L /M /N /O
/P /Q /R /S /T
/U /V /W /X /Y
/Z /bracketleft /backslash /bracketright /asciicircum
/underscore /quoteleft /a /b /c
/d /e /f /g /h
/i /j /k /l /m
/n /o /p /q /r
/s /t /u /v /w
/x /y /z /braceleft /bar
/braceright /asciitilde /bullet /Euro /bullet
/quotesinglbase /florin /quotedblbase /ellipsis /dagger
/daggerdbl /circumflex /perthousand /Scaron /guilsinglleft
/OE /bullet /Zcaron /bullet /bullet
/quoteleft /quoteright /quotedblleft /quotedblright /bullet
/endash /emdash /asciitilde /trademark /scaron
/guilsinglright /oe /bullet /zcaron /Ydieresis
/space /exclamdown /cent /sterling /currency
/yen /brokenbar /section /dieresis /copyright
/ordfeminine /guillemotleft /logicalnot /sfthyphen /registered
/macron /degree /plusminus /twosuperior /threesuperior
/acute /mu /paragraph /middot /cedilla
/onesuperior /ordmasculine /guillemotright /onequarter /onehalf
/threequarters /questiondown /Agrave /Aacute /Acircumflex
/Atilde /Adieresis /Aring /AE /Ccedilla
/Egrave /Eacute /Ecircumflex /Edieresis /Igrave
/Iacute /Icircumflex /Idieresis /Eth /Ntilde
/Ograve /Oacute /Ocircumflex /Otilde /Odieresis
/multiply /Oslash /Ugrave /Uacute /Ucircumflex
/Udieresis /Yacute /Thorn /germandbls /agrave
/aacute /acircumflex /atilde /adieresis /aring
/ae /ccedilla /egrave /eacute /ecircumflex
/edieresis /igrave /iacute /icircumflex /idieresis
/eth /ntilde /ograve /oacute /ocircumflex
/otilde /odieresis /divide /oslash /ugrave
/uacute /ucircumflex /udieresis /yacute /thorn
/ydieresis
] def
%%EndResource
%FOPBeginFontReencode
/Courier-Oblique findfont
dup length dict begin
  {1 index /FID ne {def} {pop pop} ifelse} forall
  /Encoding WinAnsiEncoding def
  currentdict
end
/Courier-Oblique exch definefont pop
/Courier-BoldOblique findfont
dup length dict begin
  {1 index /FID ne {def} {pop pop} ifelse} forall
  /Encoding WinAnsiEncoding def
  currentdict
end
/Courier-BoldOblique exch definefont pop
/Courier-Bold findfont
dup length dict begin
  {1 index /FID ne {def} {pop pop} ifelse} forall
  /Encoding WinAnsiEncoding def
  currentdict
end
/Courier-Bold exch definefont pop
/Helvetica findfont
dup length dict begin
  {1 index /FID ne {def} {pop pop} ifelse} forall
  /Encoding WinAnsiEncoding def
  currentdict
end
/Helvetica exch definefont pop
/Helvetica-Oblique findfont
dup length dict begin
  {1 index /FID ne {def} {pop pop} ifelse} forall
  /Encoding WinAnsiEncoding def
  currentdict
end
/Helvetica-Oblique exch definefont pop
/Helvetica-Bold findfont
dup length dict begin
  {1 index /FID ne {def} {pop pop} ifelse} forall
  /Encoding WinAnsiEncoding def
  currentdict
end
/Helvetica-Bold exch definefont pop
/Helvetica-BoldOblique findfont
dup length dict begin
  {1 index /FID ne {def} {pop pop} ifelse} forall
  /Encoding WinAnsiEncoding def
  currentdict
end
/Helvetica-BoldOblique exch definefont pop
/Times-Roman findfont
dup length dict begin
  {1 index /FID ne {def} {pop pop} ifelse} forall
  /Encoding WinAnsiEncoding def
  currentdict
end
/Times-Roman exch definefont pop
/Times-Italic findfont
dup length dict begin
  {1 index /FID ne {def} {pop pop} ifelse} forall
  /Encoding WinAnsiEncoding def
  currentdict
end
/Times-Italic exch definefont pop
/Times-Bold findfont
dup length dict begin
  {1 index /FID ne {def} {pop pop} ifelse} forall
  /Encoding WinAnsiEncoding def
  currentdict
end
/Times-Bold exch definefont pop
/Times-BoldItalic findfont
dup length dict begin
  {1 index /FID ne {def} {pop pop} ifelse} forall
  /Encoding WinAnsiEncoding def
  currentdict
end
/Times-BoldItalic exch definefont pop
/Courier findfont
dup length dict begin
  {1 index /FID ne {def} {pop pop} ifelse} forall
  /Encoding WinAnsiEncoding def
  currentdict
end
/Courier exch definefont pop
%FOPEndFontReencode
%%EndProlog
%%Page: 1 1
%%PageBoundingBox: 0 0 996 368
%%BeginPageSetup
[1 0 0 -1 0 368] CT
%%EndPageSetup
GS
[0.75 0 0 0.75 0 0.5] CT
N
0 0 M
1328 0 L
1328 490 L
0 490 L
0 0 L
cp
clip
1 GC
N
0 0 1328 490 re
f
GR
GS
[0.75 0 0 0.75 0 0.5] CT
1 GC
N
0 0 1328 490 re
f
GR
GS
[0.75 0 0 0.75 0 0.5] CT
1 GC
N
173 392 M
394 392 L
394 37 L
173 37 L
cp
f
GR
GS
[0.75 0 0 0.75 0 0.5] CT
0.873 GC
1 LJ
0.667 LW
N
394 392 M
173 392 L
S
GR
GS
[0.75 0 0 0.75 0 0.5] CT
0.873 GC
1 LJ
0.667 LW
N
394 321 M
173 321 L
S
GR
GS
[0.75 0 0 0.75 0 0.5] CT
0.873 GC
1 LJ
0.667 LW
N
394 250 M
173 250 L
S
GR
GS
[0.75 0 0 0.75 0 0.5] CT
0.873 GC
1 LJ
0.667 LW
N
394 179 M
173 179 L
S
GR
GS
[0.75 0 0 0.75 0 0.5] CT
0.873 GC
1 LJ
0.667 LW
N
394 108 M
173 108 L
S
GR
GS
[0.75 0 0 0.75 0 0.5] CT
0.873 GC
1 LJ
0.667 LW
N
394 37 M
173 37 L
S
GR
GS
[0.75 0 0 0.75 212.62521 25.3625] CT
/Helvetica 20.533 F
GS
[1 0 0 1 0 0] CT
-58 -5 moveto 
1 -1 scale
(10 Channels) t 
GR
GR
GS
[0.75 0 0 0.75 0 0.5] CT
0.149 GC
1 LJ
0.667 LW
N
173 392 M
394 392 L
S
GR
GS
[0.75 0 0 0.75 0 0.5] CT
0.635 0.078 0.184 RC
N
193.296 392 M
193.296 315.223 L
182.02 315.223 L
182.02 392 L
cp
266.587 392 M
266.587 279.015 L
255.311 279.015 L
255.311 392 L
cp
339.878 392 M
339.878 103.738 L
328.602 103.738 L
328.602 392 L
cp
f
GR
GS
[0.75 0 0 0.75 0 0.5] CT
10.0 ML
0.667 LW
N
182.02 392 M
182.02 315.223 L
193.296 315.223 L
193.296 392 L
cp
S
GR
GS
[0.75 0 0 0.75 0 0.5] CT
10.0 ML
0.667 LW
N
255.311 392 M
255.311 279.015 L
266.587 279.015 L
266.587 392 L
cp
S
GR
GS
[0.75 0 0 0.75 0 0.5] CT
10.0 ML
0.667 LW
N
328.602 392 M
328.602 103.738 L
339.878 103.738 L
339.878 392 L
cp
S
GR
GS
[0.75 0 0 0.75 0 0.5] CT
0.851 0.325 0.098 RC
N
204.571 392 M
204.571 314.682 L
193.296 314.682 L
193.296 392 L
cp
277.862 392 M
277.862 278.107 L
266.587 278.107 L
266.587 392 L
cp
351.153 392 M
351.153 122.473 L
339.878 122.473 L
339.878 392 L
cp
f
GR
GS
[0.75 0 0 0.75 0 0.5] CT
10.0 ML
0.667 LW
N
193.296 392 M
193.296 314.682 L
204.571 314.682 L
204.571 392 L
cp
S
GR
GS
[0.75 0 0 0.75 0 0.5] CT
10.0 ML
0.667 LW
N
266.587 392 M
266.587 278.107 L
277.862 278.107 L
277.862 392 L
cp
S
GR
GS
[0.75 0 0 0.75 0 0.5] CT
10.0 ML
0.667 LW
N
339.878 392 M
339.878 122.473 L
351.153 122.473 L
351.153 392 L
cp
S
GR
GS
[0.75 0 0 0.75 0 0.5] CT
0.929 0.694 0.125 RC
N
215.847 392 M
215.847 317.637 L
204.571 317.637 L
204.571 392 L
cp
289.138 392 M
289.138 280.978 L
277.862 280.978 L
277.862 392 L
cp
362.429 392 M
362.429 147.085 L
351.153 147.085 L
351.153 392 L
cp
f
GR
GS
[0.75 0 0 0.75 0 0.5] CT
10.0 ML
0.667 LW
N
204.571 392 M
204.571 317.637 L
215.847 317.637 L
215.847 392 L
cp
S
GR
GS
[0.75 0 0 0.75 0 0.5] CT
10.0 ML
0.667 LW
N
277.862 392 M
277.862 280.978 L
289.138 280.978 L
289.138 392 L
cp
S
GR
GS
[0.75 0 0 0.75 0 0.5] CT
10.0 ML
0.667 LW
N
351.153 392 M
351.153 147.085 L
362.429 147.085 L
362.429 392 L
cp
S
GR
GS
[0.75 0 0 0.75 0 0.5] CT
1 0.843 0 RC
N
227.122 392 M
227.122 318.416 L
215.847 318.416 L
215.847 392 L
cp
300.413 392 M
300.413 282.18 L
289.138 282.18 L
289.138 392 L
cp
373.704 392 M
373.704 152.382 L
362.429 152.382 L
362.429 392 L
cp
f
GR
GS
[0.75 0 0 0.75 0 0.5] CT
10.0 ML
0.667 LW
N
215.847 392 M
215.847 318.416 L
227.122 318.416 L
227.122 392 L
cp
S
GR
GS
[0.75 0 0 0.75 0 0.5] CT
10.0 ML
0.667 LW
N
289.138 392 M
289.138 282.18 L
300.413 282.18 L
300.413 392 L
cp
S
GR
GS
[0.75 0 0 0.75 0 0.5] CT
10.0 ML
0.667 LW
N
362.429 392 M
362.429 152.382 L
373.704 152.382 L
373.704 392 L
cp
S
GR
GS
[0.75 0 0 0.75 0 0.5] CT
0.953 0.871 0.733 RC
N
238.398 392 M
238.398 319.143 L
227.122 319.143 L
227.122 392 L
cp
311.689 392 M
311.689 282.479 L
300.413 282.479 L
300.413 392 L
cp
384.98 392 M
384.98 152.588 L
373.704 152.588 L
373.704 392 L
cp
f
GR
GS
[0.75 0 0 0.75 0 0.5] CT
10.0 ML
0.667 LW
N
227.122 392 M
227.122 319.143 L
238.398 319.143 L
238.398 392 L
cp
S
GR
GS
[0.75 0 0 0.75 0 0.5] CT
10.0 ML
0.667 LW
N
300.413 392 M
300.413 282.479 L
311.689 282.479 L
311.689 392 L
cp
S
GR
GS
[0.75 0 0 0.75 0 0.5] CT
10.0 ML
0.667 LW
N
373.704 392 M
373.704 152.588 L
384.98 152.588 L
384.98 392 L
cp
S
GR
GS
[0.75 0 0 0.75 0 0.5] CT
0.149 GC
2 setlinecap
1 LJ
0.667 LW
N
173 392 M
394 392 L
S
GR
GS
[0.75 0 0 0.75 0 0.5] CT
0.149 GC
2 setlinecap
1 LJ
0.667 LW
N
173 37 M
394 37 L
S
GR
GS
[0.75 0 0 0.75 0 0.5] CT
0.149 GC
2 setlinecap
1 LJ
0.667 LW
N
210.209 392 M
210.209 388.45 L
S
GR
GS
[0.75 0 0 0.75 0 0.5] CT
0.149 GC
2 setlinecap
1 LJ
0.667 LW
N
283.5 392 M
283.5 388.45 L
S
GR
GS
[0.75 0 0 0.75 0 0.5] CT
0.149 GC
2 setlinecap
1 LJ
0.667 LW
N
356.791 392 M
356.791 388.45 L
S
GR
GS
[0.75 0 0 0.75 0 0.5] CT
0.149 GC
2 setlinecap
1 LJ
0.667 LW
N
210.209 37 M
210.209 40.55 L
S
GR
GS
[0.75 0 0 0.75 0 0.5] CT
0.149 GC
2 setlinecap
1 LJ
0.667 LW
N
283.5 37 M
283.5 40.55 L
S
GR
GS
[0.75 0 0 0.75 0 0.5] CT
0.149 GC
2 setlinecap
1 LJ
0.667 LW
N
356.791 37 M
356.791 40.55 L
S
GR
GS
[0.75 0 0 0.75 157.65689 299.3] CT
0.149 GC
/Helvetica 18.667 F
GS
[1 0 0 1 0 0] CT
-24 19 moveto 
1 -1 scale
(50 % ) t 
GR
GR
GS
[0.75 0 0 0.75 212.625 299.3] CT
0.149 GC
/Helvetica 18.667 F
GS
[1 0 0 1 0 0] CT
-21.5 19 moveto 
1 -1 scale
(75 %) t 
GR
GR
GS
[0.75 0 0 0.75 267.5931 299.3] CT
0.149 GC
/Helvetica 18.667 F
GS
[1 0 0 1 0 0] CT
-21.5 19 moveto 
1 -1 scale
(95 %) t 
GR
GR
GS
[0.75 0 0 0.75 0 0.5] CT
0.149 GC
2 setlinecap
1 LJ
0.667 LW
N
173 392 M
173 37 L
S
GR
GS
[0.75 0 0 0.75 0 0.5] CT
0.149 GC
2 setlinecap
1 LJ
0.667 LW
N
394 392 M
394 37 L
S
GR
GS
[0.75 0 0 0.75 0 0.5] CT
0.149 GC
2 setlinecap
1 LJ
0.667 LW
N
173 392 M
176.55 392 L
S
GR
GS
[0.75 0 0 0.75 0 0.5] CT
0.149 GC
2 setlinecap
1 LJ
0.667 LW
N
173 321 M
176.55 321 L
S
GR
GS
[0.75 0 0 0.75 0 0.5] CT
0.149 GC
2 setlinecap
1 LJ
0.667 LW
N
173 250 M
176.55 250 L
S
GR
GS
[0.75 0 0 0.75 0 0.5] CT
0.149 GC
2 setlinecap
1 LJ
0.667 LW
N
173 179 M
176.55 179 L
S
GR
GS
[0.75 0 0 0.75 0 0.5] CT
0.149 GC
2 setlinecap
1 LJ
0.667 LW
N
173 108 M
176.55 108 L
S
GR
GS
[0.75 0 0 0.75 0 0.5] CT
0.149 GC
2 setlinecap
1 LJ
0.667 LW
N
173 37 M
176.55 37 L
S
GR
GS
[0.75 0 0 0.75 0 0.5] CT
0.149 GC
2 setlinecap
1 LJ
0.667 LW
N
394 392 M
390.45 392 L
S
GR
GS
[0.75 0 0 0.75 0 0.5] CT
0.149 GC
2 setlinecap
1 LJ
0.667 LW
N
394 321 M
390.45 321 L
S
GR
GS
[0.75 0 0 0.75 0 0.5] CT
0.149 GC
2 setlinecap
1 LJ
0.667 LW
N
394 250 M
390.45 250 L
S
GR
GS
[0.75 0 0 0.75 0 0.5] CT
0.149 GC
2 setlinecap
1 LJ
0.667 LW
N
394 179 M
390.45 179 L
S
GR
GS
[0.75 0 0 0.75 0 0.5] CT
0.149 GC
2 setlinecap
1 LJ
0.667 LW
N
394 108 M
390.45 108 L
S
GR
GS
[0.75 0 0 0.75 0 0.5] CT
0.149 GC
2 setlinecap
1 LJ
0.667 LW
N
394 37 M
390.45 37 L
S
GR
GS
[0.75 0 0 0.75 124.95 294.5] CT
0.149 GC
/Helvetica 18.667 F
GS
[1 0 0 1 0 0] CT
-11 7 moveto 
1 -1 scale
(0) t 
GR
GR
GS
[0.75 0 0 0.75 124.95 241.25] CT
0.149 GC
/Helvetica 18.667 F
GS
[1 0 0 1 0 0] CT
-11 7 moveto 
1 -1 scale
(2) t 
GR
GR
GS
[0.75 0 0 0.75 124.95 188] CT
0.149 GC
/Helvetica 18.667 F
GS
[1 0 0 1 0 0] CT
-11 7 moveto 
1 -1 scale
(4) t 
GR
GR
GS
[0.75 0 0 0.75 124.95 134.75] CT
0.149 GC
/Helvetica 18.667 F
GS
[1 0 0 1 0 0] CT
-11 7 moveto 
1 -1 scale
(6) t 
GR
GR
GS
[0.75 0 0 0.75 124.95 81.5] CT
0.149 GC
/Helvetica 18.667 F
GS
[1 0 0 1 0 0] CT
-11 7 moveto 
1 -1 scale
(8) t 
GR
GR
GS
[0.75 0 0 0.75 124.95 28.25] CT
0.149 GC
/Helvetica 18.667 F
GS
[1 0 0 1 0 0] CT
-21 7 moveto 
1 -1 scale
(10) t 
GR
GR
GS
[0 -0.75 0.75 0 106.2 161.37487] CT
0.149 GC
/Helvetica 20.533 F
GS
[1 0 0 1 0 0] CT
-64 -5 moveto 
1 -1 scale
(3D RMSE \(m\)) t 
GR
GR
GS
[0.75 0 0 0.75 0 0.5] CT
1 GC
N
436 391 M
654 391 L
654 37 L
436 37 L
cp
f
GR
GS
[0.75 0 0 0.75 0 0.5] CT
0.873 GC
1 LJ
0.667 LW
N
654 391 M
436 391 L
S
GR
GS
[0.75 0 0 0.75 0 0.5] CT
0.873 GC
1 LJ
0.667 LW
N
654 320.2 M
436 320.2 L
S
GR
GS
[0.75 0 0 0.75 0 0.5] CT
0.873 GC
1 LJ
0.667 LW
N
654 249.4 M
436 249.4 L
S
GR
GS
[0.75 0 0 0.75 0 0.5] CT
0.873 GC
1 LJ
0.667 LW
N
654 178.6 M
436 178.6 L
S
GR
GS
[0.75 0 0 0.75 0 0.5] CT
0.873 GC
1 LJ
0.667 LW
N
654 107.8 M
436 107.8 L
S
GR
GS
[0.75 0 0 0.75 0 0.5] CT
0.873 GC
1 LJ
0.667 LW
N
654 37 M
436 37 L
S
GR
GS
[0.75 0 0 0.75 408.75037 25.3625] CT
/Helvetica 20.533 F
GS
[1 0 0 1 0 0] CT
-52 -5 moveto 
1 -1 scale
(8 Channels) t 
GR
GR
GS
[0.75 0 0 0.75 0 0.5] CT
0.149 GC
1 LJ
0.667 LW
N
436 391 M
654 391 L
S
GR
GS
[0.75 0 0 0.75 0 0.5] CT
0.635 0.078 0.184 RC
N
456.02 391 M
456.02 302.032 L
444.898 302.032 L
444.898 391 L
cp
528.316 391 M
528.316 248.005 L
517.194 248.005 L
517.194 391 L
cp
600.612 391 M
600.612 55.703 L
589.49 55.703 L
589.49 391 L
cp
f
GR
GS
[0.75 0 0 0.75 0 0.5] CT
10.0 ML
0.667 LW
N
444.898 391 M
444.898 302.032 L
456.02 302.032 L
456.02 391 L
cp
S
GR
GS
[0.75 0 0 0.75 0 0.5] CT
10.0 ML
0.667 LW
N
517.194 391 M
517.194 248.005 L
528.316 248.005 L
528.316 391 L
cp
S
GR
GS
[0.75 0 0 0.75 0 0.5] CT
10.0 ML
0.667 LW
N
589.49 391 M
589.49 55.703 L
600.612 55.703 L
600.612 391 L
cp
S
GR
GS
[0.75 0 0 0.75 0 0.5] CT
0.851 0.325 0.098 RC
N
467.143 391 M
467.143 306.304 L
456.02 306.304 L
456.02 391 L
cp
539.439 391 M
539.439 254.862 L
528.316 254.862 L
528.316 391 L
cp
611.735 391 M
611.735 87.937 L
600.612 87.937 L
600.612 391 L
cp
f
GR
GS
[0.75 0 0 0.75 0 0.5] CT
10.0 ML
0.667 LW
N
456.02 391 M
456.02 306.304 L
467.143 306.304 L
467.143 391 L
cp
S
GR
GS
[0.75 0 0 0.75 0 0.5] CT
10.0 ML
0.667 LW
N
528.316 391 M
528.316 254.862 L
539.439 254.862 L
539.439 391 L
cp
S
GR
GS
[0.75 0 0 0.75 0 0.5] CT
10.0 ML
0.667 LW
N
600.612 391 M
600.612 87.937 L
611.735 87.937 L
611.735 391 L
cp
S
GR
GS
[0.75 0 0 0.75 0 0.5] CT
0.929 0.694 0.125 RC
N
478.265 391 M
478.265 308.796 L
467.143 308.796 L
467.143 391 L
cp
550.561 391 M
550.561 262.357 L
539.439 262.357 L
539.439 391 L
cp
622.857 391 M
622.857 114.038 L
611.735 114.038 L
611.735 391 L
cp
f
GR
GS
[0.75 0 0 0.75 0 0.5] CT
10.0 ML
0.667 LW
N
467.143 391 M
467.143 308.796 L
478.265 308.796 L
478.265 391 L
cp
S
GR
GS
[0.75 0 0 0.75 0 0.5] CT
10.0 ML
0.667 LW
N
539.439 391 M
539.439 262.357 L
550.561 262.357 L
550.561 391 L
cp
S
GR
GS
[0.75 0 0 0.75 0 0.5] CT
10.0 ML
0.667 LW
N
611.735 391 M
611.735 114.038 L
622.857 114.038 L
622.857 391 L
cp
S
GR
GS
[0.75 0 0 0.75 0 0.5] CT
1 0.843 0 RC
N
489.388 391 M
489.388 310.236 L
478.265 310.236 L
478.265 391 L
cp
561.684 391 M
561.684 262.466 L
550.561 262.466 L
550.561 391 L
cp
633.98 391 M
633.98 122.209 L
622.857 122.209 L
622.857 391 L
cp
f
GR
GS
[0.75 0 0 0.75 0 0.5] CT
10.0 ML
0.667 LW
N
478.265 391 M
478.265 310.236 L
489.388 310.236 L
489.388 391 L
cp
S
GR
GS
[0.75 0 0 0.75 0 0.5] CT
10.0 ML
0.667 LW
N
550.561 391 M
550.561 262.466 L
561.684 262.466 L
561.684 391 L
cp
S
GR
GS
[0.75 0 0 0.75 0 0.5] CT
10.0 ML
0.667 LW
N
622.857 391 M
622.857 122.209 L
633.98 122.209 L
633.98 391 L
cp
S
GR
GS
[0.75 0 0 0.75 0 0.5] CT
0.953 0.871 0.733 RC
N
500.51 391 M
500.51 309.787 L
489.388 309.787 L
489.388 391 L
cp
572.806 391 M
572.806 265.11 L
561.684 265.11 L
561.684 391 L
cp
645.102 391 M
645.102 122.658 L
633.98 122.658 L
633.98 391 L
cp
f
GR
GS
[0.75 0 0 0.75 0 0.5] CT
10.0 ML
0.667 LW
N
489.388 391 M
489.388 309.787 L
500.51 309.787 L
500.51 391 L
cp
S
GR
GS
[0.75 0 0 0.75 0 0.5] CT
10.0 ML
0.667 LW
N
561.684 391 M
561.684 265.11 L
572.806 265.11 L
572.806 391 L
cp
S
GR
GS
[0.75 0 0 0.75 0 0.5] CT
10.0 ML
0.667 LW
N
633.98 391 M
633.98 122.658 L
645.102 122.658 L
645.102 391 L
cp
S
GR
GS
[0.75 0 0 0.75 0 0.5] CT
0.149 GC
2 setlinecap
1 LJ
0.667 LW
N
436 391 M
654 391 L
S
GR
GS
[0.75 0 0 0.75 0 0.5] CT
0.149 GC
2 setlinecap
1 LJ
0.667 LW
N
436 37 M
654 37 L
S
GR
GS
[0.75 0 0 0.75 0 0.5] CT
0.149 GC
2 setlinecap
1 LJ
0.667 LW
N
472.704 391 M
472.704 387.46 L
S
GR
GS
[0.75 0 0 0.75 0 0.5] CT
0.149 GC
2 setlinecap
1 LJ
0.667 LW
N
545 391 M
545 387.46 L
S
GR
GS
[0.75 0 0 0.75 0 0.5] CT
0.149 GC
2 setlinecap
1 LJ
0.667 LW
N
617.296 391 M
617.296 387.46 L
S
GR
GS
[0.75 0 0 0.75 0 0.5] CT
0.149 GC
2 setlinecap
1 LJ
0.667 LW
N
472.704 37 M
472.704 40.54 L
S
GR
GS
[0.75 0 0 0.75 0 0.5] CT
0.149 GC
2 setlinecap
1 LJ
0.667 LW
N
545 37 M
545 40.54 L
S
GR
GS
[0.75 0 0 0.75 0 0.5] CT
0.149 GC
2 setlinecap
1 LJ
0.667 LW
N
617.296 37 M
617.296 40.54 L
S
GR
GS
[0.75 0 0 0.75 354.52805 298.55] CT
0.149 GC
/Helvetica 18.667 F
GS
[1 0 0 1 0 0] CT
-24 19 moveto 
1 -1 scale
(50 % ) t 
GR
GR
GS
[0.75 0 0 0.75 408.75 298.55] CT
0.149 GC
/Helvetica 18.667 F
GS
[1 0 0 1 0 0] CT
-21.5 19 moveto 
1 -1 scale
(75 %) t 
GR
GR
GS
[0.75 0 0 0.75 462.97192 298.55] CT
0.149 GC
/Helvetica 18.667 F
GS
[1 0 0 1 0 0] CT
-21.5 19 moveto 
1 -1 scale
(95 %) t 
GR
GR
GS
[0.75 0 0 0.75 0 0.5] CT
0.149 GC
2 setlinecap
1 LJ
0.667 LW
N
436 391 M
436 37 L
S
GR
GS
[0.75 0 0 0.75 0 0.5] CT
0.149 GC
2 setlinecap
1 LJ
0.667 LW
N
654 391 M
654 37 L
S
GR
GS
[0.75 0 0 0.75 0 0.5] CT
0.149 GC
2 setlinecap
1 LJ
0.667 LW
N
436 391 M
439.54 391 L
S
GR
GS
[0.75 0 0 0.75 0 0.5] CT
0.149 GC
2 setlinecap
1 LJ
0.667 LW
N
436 320.2 M
439.54 320.2 L
S
GR
GS
[0.75 0 0 0.75 0 0.5] CT
0.149 GC
2 setlinecap
1 LJ
0.667 LW
N
436 249.4 M
439.54 249.4 L
S
GR
GS
[0.75 0 0 0.75 0 0.5] CT
0.149 GC
2 setlinecap
1 LJ
0.667 LW
N
436 178.6 M
439.54 178.6 L
S
GR
GS
[0.75 0 0 0.75 0 0.5] CT
0.149 GC
2 setlinecap
1 LJ
0.667 LW
N
436 107.8 M
439.54 107.8 L
S
GR
GS
[0.75 0 0 0.75 0 0.5] CT
0.149 GC
2 setlinecap
1 LJ
0.667 LW
N
436 37 M
439.54 37 L
S
GR
GS
[0.75 0 0 0.75 0 0.5] CT
0.149 GC
2 setlinecap
1 LJ
0.667 LW
N
654 391 M
650.46 391 L
S
GR
GS
[0.75 0 0 0.75 0 0.5] CT
0.149 GC
2 setlinecap
1 LJ
0.667 LW
N
654 320.2 M
650.46 320.2 L
S
GR
GS
[0.75 0 0 0.75 0 0.5] CT
0.149 GC
2 setlinecap
1 LJ
0.667 LW
N
654 249.4 M
650.46 249.4 L
S
GR
GS
[0.75 0 0 0.75 0 0.5] CT
0.149 GC
2 setlinecap
1 LJ
0.667 LW
N
654 178.6 M
650.46 178.6 L
S
GR
GS
[0.75 0 0 0.75 0 0.5] CT
0.149 GC
2 setlinecap
1 LJ
0.667 LW
N
654 107.8 M
650.46 107.8 L
S
GR
GS
[0.75 0 0 0.75 0 0.5] CT
0.149 GC
2 setlinecap
1 LJ
0.667 LW
N
654 37 M
650.46 37 L
S
GR
GS
[0.75 0 0 0.75 322.2 293.75] CT
0.149 GC
/Helvetica 18.667 F
GS
[1 0 0 1 0 0] CT
-11 7 moveto 
1 -1 scale
(0) t 
GR
GR
GS
[0.75 0 0 0.75 322.2 240.65001] CT
0.149 GC
/Helvetica 18.667 F
GS
[1 0 0 1 0 0] CT
-11 7 moveto 
1 -1 scale
(2) t 
GR
GR
GS
[0.75 0 0 0.75 322.2 187.55] CT
0.149 GC
/Helvetica 18.667 F
GS
[1 0 0 1 0 0] CT
-11 7 moveto 
1 -1 scale
(4) t 
GR
GR
GS
[0.75 0 0 0.75 322.2 134.45] CT
0.149 GC
/Helvetica 18.667 F
GS
[1 0 0 1 0 0] CT
-11 7 moveto 
1 -1 scale
(6) t 
GR
GR
GS
[0.75 0 0 0.75 322.2 81.35] CT
0.149 GC
/Helvetica 18.667 F
GS
[1 0 0 1 0 0] CT
-11 7 moveto 
1 -1 scale
(8) t 
GR
GR
GS
[0.75 0 0 0.75 322.2 28.25] CT
0.149 GC
/Helvetica 18.667 F
GS
[1 0 0 1 0 0] CT
-21 7 moveto 
1 -1 scale
(10) t 
GR
GR
GS
[0.75 0 0 0.75 0 0.5] CT
1 GC
N
700 389 M
925 389 L
925 37 L
700 37 L
cp
f
GR
GS
[0.75 0 0 0.75 0 0.5] CT
0.873 GC
1 LJ
0.667 LW
N
925 389 M
700 389 L
S
GR
GS
[0.75 0 0 0.75 0 0.5] CT
0.873 GC
1 LJ
0.667 LW
N
925 318.6 M
700 318.6 L
S
GR
GS
[0.75 0 0 0.75 0 0.5] CT
0.873 GC
1 LJ
0.667 LW
N
925 248.2 M
700 248.2 L
S
GR
GS
[0.75 0 0 0.75 0 0.5] CT
0.873 GC
1 LJ
0.667 LW
N
925 177.8 M
700 177.8 L
S
GR
GS
[0.75 0 0 0.75 0 0.5] CT
0.873 GC
1 LJ
0.667 LW
N
925 107.4 M
700 107.4 L
S
GR
GS
[0.75 0 0 0.75 0 0.5] CT
0.873 GC
1 LJ
0.667 LW
N
925 37 M
700 37 L
S
GR
GS
[0.75 0 0 0.75 609.3756 25.3625] CT
/Helvetica 20.533 F
GS
[1 0 0 1 0 0] CT
-52 -5 moveto 
1 -1 scale
(6 Channels) t 
GR
GR
GS
[0.75 0 0 0.75 0 0.5] CT
0.149 GC
1 LJ
0.667 LW
N
700 389 M
925 389 L
S
GR
GS
[0.75 0 0 0.75 0 0.5] CT
0.635 0.078 0.184 RC
N
720.663 389 M
720.663 266.702 L
709.184 266.702 L
709.184 389 L
cp
795.281 389 M
795.281 212.592 L
783.801 212.592 L
783.801 389 L
cp
869.898 389 M
869.898 43.873 L
858.418 43.873 L
858.418 389 L
cp
f
GR
GS
[0.75 0 0 0.75 0 0.5] CT
10.0 ML
0.667 LW
N
709.184 389 M
709.184 266.702 L
720.663 266.702 L
720.663 389 L
cp
S
GR
GS
[0.75 0 0 0.75 0 0.5] CT
10.0 ML
0.667 LW
N
783.801 389 M
783.801 212.592 L
795.281 212.592 L
795.281 389 L
cp
S
GR
GS
[0.75 0 0 0.75 0 0.5] CT
10.0 ML
0.667 LW
N
858.418 389 M
858.418 43.873 L
869.898 43.873 L
869.898 389 L
cp
S
GR
GS
[0.75 0 0 0.75 0 0.5] CT
0.851 0.325 0.098 RC
N
732.143 389 M
732.143 264.038 L
720.663 264.038 L
720.663 389 L
cp
806.76 389 M
806.76 214.441 L
795.281 214.441 L
795.281 389 L
cp
881.378 389 M
881.378 87.646 L
869.898 87.646 L
869.898 389 L
cp
f
GR
GS
[0.75 0 0 0.75 0 0.5] CT
10.0 ML
0.667 LW
N
720.663 389 M
720.663 264.038 L
732.143 264.038 L
732.143 389 L
cp
S
GR
GS
[0.75 0 0 0.75 0 0.5] CT
10.0 ML
0.667 LW
N
795.281 389 M
795.281 214.441 L
806.76 214.441 L
806.76 389 L
cp
S
GR
GS
[0.75 0 0 0.75 0 0.5] CT
10.0 ML
0.667 LW
N
869.898 389 M
869.898 87.646 L
881.378 87.646 L
881.378 389 L
cp
S
GR
GS
[0.75 0 0 0.75 0 0.5] CT
0.929 0.694 0.125 RC
N
743.622 389 M
743.622 270.452 L
732.143 270.452 L
732.143 389 L
cp
818.24 389 M
818.24 221.779 L
806.76 221.779 L
806.76 389 L
cp
892.857 389 M
892.857 122.253 L
881.378 122.253 L
881.378 389 L
cp
f
GR
GS
[0.75 0 0 0.75 0 0.5] CT
10.0 ML
0.667 LW
N
732.143 389 M
732.143 270.452 L
743.622 270.452 L
743.622 389 L
cp
S
GR
GS
[0.75 0 0 0.75 0 0.5] CT
10.0 ML
0.667 LW
N
806.76 389 M
806.76 221.779 L
818.24 221.779 L
818.24 389 L
cp
S
GR
GS
[0.75 0 0 0.75 0 0.5] CT
10.0 ML
0.667 LW
N
881.378 389 M
881.378 122.253 L
892.857 122.253 L
892.857 389 L
cp
S
GR
GS
[0.75 0 0 0.75 0 0.5] CT
1 0.843 0 RC
N
755.102 389 M
755.102 269.007 L
743.622 269.007 L
743.622 389 L
cp
829.719 389 M
829.719 224.557 L
818.24 224.557 L
818.24 389 L
cp
904.337 389 M
904.337 128.304 L
892.857 128.304 L
892.857 389 L
cp
f
GR
GS
[0.75 0 0 0.75 0 0.5] CT
10.0 ML
0.667 LW
N
743.622 389 M
743.622 269.007 L
755.102 269.007 L
755.102 389 L
cp
S
GR
GS
[0.75 0 0 0.75 0 0.5] CT
10.0 ML
0.667 LW
N
818.24 389 M
818.24 224.557 L
829.719 224.557 L
829.719 389 L
cp
S
GR
GS
[0.75 0 0 0.75 0 0.5] CT
10.0 ML
0.667 LW
N
892.857 389 M
892.857 128.304 L
904.337 128.304 L
904.337 389 L
cp
S
GR
GS
[0.75 0 0 0.75 0 0.5] CT
0.953 0.871 0.733 RC
N
766.582 389 M
766.582 269.982 L
755.102 269.982 L
755.102 389 L
cp
841.199 389 M
841.199 223.473 L
829.719 223.473 L
829.719 389 L
cp
915.816 389 M
915.816 130.441 L
904.337 130.441 L
904.337 389 L
cp
f
GR
GS
[0.75 0 0 0.75 0 0.5] CT
10.0 ML
0.667 LW
N
755.102 389 M
755.102 269.982 L
766.582 269.982 L
766.582 389 L
cp
S
GR
GS
[0.75 0 0 0.75 0 0.5] CT
10.0 ML
0.667 LW
N
829.719 389 M
829.719 223.473 L
841.199 223.473 L
841.199 389 L
cp
S
GR
GS
[0.75 0 0 0.75 0 0.5] CT
10.0 ML
0.667 LW
N
904.337 389 M
904.337 130.441 L
915.816 130.441 L
915.816 389 L
cp
S
GR
GS
[0.75 0 0 0.75 0 0.5] CT
0.149 GC
2 setlinecap
1 LJ
0.667 LW
N
700 389 M
925 389 L
S
GR
GS
[0.75 0 0 0.75 0 0.5] CT
0.149 GC
2 setlinecap
1 LJ
0.667 LW
N
700 37 M
925 37 L
S
GR
GS
[0.75 0 0 0.75 0 0.5] CT
0.149 GC
2 setlinecap
1 LJ
0.667 LW
N
737.883 389 M
737.883 385.48 L
S
GR
GS
[0.75 0 0 0.75 0 0.5] CT
0.149 GC
2 setlinecap
1 LJ
0.667 LW
N
812.5 389 M
812.5 385.48 L
S
GR
GS
[0.75 0 0 0.75 0 0.5] CT
0.149 GC
2 setlinecap
1 LJ
0.667 LW
N
887.117 389 M
887.117 385.48 L
S
GR
GS
[0.75 0 0 0.75 0 0.5] CT
0.149 GC
2 setlinecap
1 LJ
0.667 LW
N
737.883 37 M
737.883 40.52 L
S
GR
GS
[0.75 0 0 0.75 0 0.5] CT
0.149 GC
2 setlinecap
1 LJ
0.667 LW
N
812.5 37 M
812.5 40.52 L
S
GR
GS
[0.75 0 0 0.75 0 0.5] CT
0.149 GC
2 setlinecap
1 LJ
0.667 LW
N
887.117 37 M
887.117 40.52 L
S
GR
GS
[0.75 0 0 0.75 553.41197 297.05] CT
0.149 GC
/Helvetica 18.667 F
GS
[1 0 0 1 0 0] CT
-24 19 moveto 
1 -1 scale
(50 % ) t 
GR
GR
GS
[0.75 0 0 0.75 609.375 297.05] CT
0.149 GC
/Helvetica 18.667 F
GS
[1 0 0 1 0 0] CT
-21.5 19 moveto 
1 -1 scale
(75 %) t 
GR
GR
GS
[0.75 0 0 0.75 665.33803 297.05] CT
0.149 GC
/Helvetica 18.667 F
GS
[1 0 0 1 0 0] CT
-21.5 19 moveto 
1 -1 scale
(95 %) t 
GR
GR
GS
[0.75 0 0 0.75 507.12268 321.8926] CT
0.149 GC
/Helvetica 20.533 F
GS
[1 0 0 1 0 0] CT
-103.5 21 moveto 
1 -1 scale
(Error CDF Percentiles ) t 
GR
GR
GS
[0.75 0 0 0.75 0 0.5] CT
0.149 GC
2 setlinecap
1 LJ
0.667 LW
N
700 389 M
700 37 L
S
GR
GS
[0.75 0 0 0.75 0 0.5] CT
0.149 GC
2 setlinecap
1 LJ
0.667 LW
N
925 389 M
925 37 L
S
GR
GS
[0.75 0 0 0.75 0 0.5] CT
0.149 GC
2 setlinecap
1 LJ
0.667 LW
N
700 389 M
703.52 389 L
S
GR
GS
[0.75 0 0 0.75 0 0.5] CT
0.149 GC
2 setlinecap
1 LJ
0.667 LW
N
700 318.6 M
703.52 318.6 L
S
GR
GS
[0.75 0 0 0.75 0 0.5] CT
0.149 GC
2 setlinecap
1 LJ
0.667 LW
N
700 248.2 M
703.52 248.2 L
S
GR
GS
[0.75 0 0 0.75 0 0.5] CT
0.149 GC
2 setlinecap
1 LJ
0.667 LW
N
700 177.8 M
703.52 177.8 L
S
GR
GS
[0.75 0 0 0.75 0 0.5] CT
0.149 GC
2 setlinecap
1 LJ
0.667 LW
N
700 107.4 M
703.52 107.4 L
S
GR
GS
[0.75 0 0 0.75 0 0.5] CT
0.149 GC
2 setlinecap
1 LJ
0.667 LW
N
700 37 M
703.52 37 L
S
GR
GS
[0.75 0 0 0.75 0 0.5] CT
0.149 GC
2 setlinecap
1 LJ
0.667 LW
N
925 389 M
921.48 389 L
S
GR
GS
[0.75 0 0 0.75 0 0.5] CT
0.149 GC
2 setlinecap
1 LJ
0.667 LW
N
925 318.6 M
921.48 318.6 L
S
GR
GS
[0.75 0 0 0.75 0 0.5] CT
0.149 GC
2 setlinecap
1 LJ
0.667 LW
N
925 248.2 M
921.48 248.2 L
S
GR
GS
[0.75 0 0 0.75 0 0.5] CT
0.149 GC
2 setlinecap
1 LJ
0.667 LW
N
925 177.8 M
921.48 177.8 L
S
GR
GS
[0.75 0 0 0.75 0 0.5] CT
0.149 GC
2 setlinecap
1 LJ
0.667 LW
N
925 107.4 M
921.48 107.4 L
S
GR
GS
[0.75 0 0 0.75 0 0.5] CT
0.149 GC
2 setlinecap
1 LJ
0.667 LW
N
925 37 M
921.48 37 L
S
GR
GS
[0.75 0 0 0.75 520.19998 292.25] CT
0.149 GC
/Helvetica 18.667 F
GS
[1 0 0 1 0 0] CT
-11 7 moveto 
1 -1 scale
(0) t 
GR
GR
GS
[0.75 0 0 0.75 520.19998 239.45] CT
0.149 GC
/Helvetica 18.667 F
GS
[1 0 0 1 0 0] CT
-11 7 moveto 
1 -1 scale
(2) t 
GR
GR
GS
[0.75 0 0 0.75 520.19998 186.65] CT
0.149 GC
/Helvetica 18.667 F
GS
[1 0 0 1 0 0] CT
-11 7 moveto 
1 -1 scale
(4) t 
GR
GR
GS
[0.75 0 0 0.75 520.19998 133.85] CT
0.149 GC
/Helvetica 18.667 F
GS
[1 0 0 1 0 0] CT
-11 7 moveto 
1 -1 scale
(6) t 
GR
GR
GS
[0.75 0 0 0.75 520.19998 81.05] CT
0.149 GC
/Helvetica 18.667 F
GS
[1 0 0 1 0 0] CT
-11 7 moveto 
1 -1 scale
(8) t 
GR
GR
GS
[0.75 0 0 0.75 520.19998 28.25] CT
0.149 GC
/Helvetica 18.667 F
GS
[1 0 0 1 0 0] CT
-21 7 moveto 
1 -1 scale
(10) t 
GR
GR
GS
[0.75 0 0 0.75 0 0.5] CT
1 GC
N
971 387 M
1202 387 L
1202 37 L
971 37 L
cp
f
GR
GS
[0.75 0 0 0.75 0 0.5] CT
0.873 GC
1 LJ
0.667 LW
N
1202 387 M
971 387 L
S
GR
GS
[0.75 0 0 0.75 0 0.5] CT
0.873 GC
1 LJ
0.667 LW
N
1202 317 M
971 317 L
S
GR
GS
[0.75 0 0 0.75 0 0.5] CT
0.873 GC
1 LJ
0.667 LW
N
1202 247 M
971 247 L
S
GR
GS
[0.75 0 0 0.75 0 0.5] CT
0.873 GC
1 LJ
0.667 LW
N
1202 177 M
971 177 L
S
GR
GS
[0.75 0 0 0.75 0 0.5] CT
0.873 GC
1 LJ
0.667 LW
N
1202 107 M
971 107 L
S
GR
GS
[0.75 0 0 0.75 0 0.5] CT
0.873 GC
1 LJ
0.667 LW
N
1202 37 M
971 37 L
S
GR
GS
[0.75 0 0 0.75 814.87582 25.36251] CT
/Helvetica 20.533 F
GS
[1 0 0 1 0 0] CT
-52 -5 moveto 
1 -1 scale
(4 Channels) t 
GR
GR
GS
[0.75 0 0 0.75 0 0.5] CT
0.149 GC
1 LJ
0.667 LW
N
971 387 M
1202 387 L
S
GR
GS
[0.75 0 0 0.75 0 0.5] CT
0.635 0.078 0.184 RC
N
992.214 387 M
992.214 299.122 L
980.429 299.122 L
980.429 387 L
cp
1068.821 387 M
1068.821 219.331 L
1057.036 219.331 L
1057.036 387 L
cp
1145.429 387 M
1145.429 94.754 L
1133.643 94.754 L
1133.643 387 L
cp
f
GR
GS
[0.75 0 0 0.75 0 0.5] CT
10.0 ML
0.667 LW
N
980.429 387 M
980.429 299.122 L
992.214 299.122 L
992.214 387 L
cp
S
GR
GS
[0.75 0 0 0.75 0 0.5] CT
10.0 ML
0.667 LW
N
1057.036 387 M
1057.036 219.331 L
1068.821 219.331 L
1068.821 387 L
cp
S
GR
GS
[0.75 0 0 0.75 0 0.5] CT
10.0 ML
0.667 LW
N
1133.643 387 M
1133.643 94.754 L
1145.429 94.754 L
1145.429 387 L
cp
S
GR
GS
[0.75 0 0 0.75 0 0.5] CT
0.851 0.325 0.098 RC
N
1004 387 M
1004 287.371 L
992.214 287.371 L
992.214 387 L
cp
1080.607 387 M
1080.607 248.918 L
1068.821 248.918 L
1068.821 387 L
cp
1157.214 387 M
1157.214 180.389 L
1145.429 180.389 L
1145.429 387 L
cp
f
GR
GS
[0.75 0 0 0.75 0 0.5] CT
10.0 ML
0.667 LW
N
992.214 387 M
992.214 287.371 L
1004 287.371 L
1004 387 L
cp
S
GR
GS
[0.75 0 0 0.75 0 0.5] CT
10.0 ML
0.667 LW
N
1068.821 387 M
1068.821 248.918 L
1080.607 248.918 L
1080.607 387 L
cp
S
GR
GS
[0.75 0 0 0.75 0 0.5] CT
10.0 ML
0.667 LW
N
1145.429 387 M
1145.429 180.389 L
1157.214 180.389 L
1157.214 387 L
cp
S
GR
GS
[0.75 0 0 0.75 0 0.5] CT
0.929 0.694 0.125 RC
N
1015.786 387 M
1015.786 290.115 L
1004 290.115 L
1004 387 L
cp
1092.393 387 M
1092.393 268.973 L
1080.607 268.973 L
1080.607 387 L
cp
1169 387 M
1169 202.217 L
1157.214 202.217 L
1157.214 387 L
cp
f
GR
GS
[0.75 0 0 0.75 0 0.5] CT
10.0 ML
0.667 LW
N
1004 387 M
1004 290.115 L
1015.786 290.115 L
1015.786 387 L
cp
S
GR
GS
[0.75 0 0 0.75 0 0.5] CT
10.0 ML
0.667 LW
N
1080.607 387 M
1080.607 268.973 L
1092.393 268.973 L
1092.393 387 L
cp
S
GR
GS
[0.75 0 0 0.75 0 0.5] CT
10.0 ML
0.667 LW
N
1157.214 387 M
1157.214 202.217 L
1169 202.217 L
1169 387 L
cp
S
GR
GS
[0.75 0 0 0.75 0 0.5] CT
1 0.843 0 RC
N
1027.571 387 M
1027.571 277.799 L
1015.786 277.799 L
1015.786 387 L
cp
1104.179 387 M
1104.179 248.798 L
1092.393 248.798 L
1092.393 387 L
cp
1180.786 387 M
1180.786 169.033 L
1169 169.033 L
1169 387 L
cp
f
GR
GS
[0.75 0 0 0.75 0 0.5] CT
10.0 ML
0.667 LW
N
1015.786 387 M
1015.786 277.799 L
1027.571 277.799 L
1027.571 387 L
cp
S
GR
GS
[0.75 0 0 0.75 0 0.5] CT
10.0 ML
0.667 LW
N
1092.393 387 M
1092.393 248.798 L
1104.179 248.798 L
1104.179 387 L
cp
S
GR
GS
[0.75 0 0 0.75 0 0.5] CT
10.0 ML
0.667 LW
N
1169 387 M
1169 169.033 L
1180.786 169.033 L
1180.786 387 L
cp
S
GR
GS
[0.75 0 0 0.75 0 0.5] CT
0.953 0.871 0.733 RC
N
1039.357 387 M
1039.357 277.966 L
1027.571 277.966 L
1027.571 387 L
cp
1115.964 387 M
1115.964 250.775 L
1104.179 250.775 L
1104.179 387 L
cp
1192.571 387 M
1192.571 184.455 L
1180.786 184.455 L
1180.786 387 L
cp
f
GR
GS
[0.75 0 0 0.75 0 0.5] CT
10.0 ML
0.667 LW
N
1027.571 387 M
1027.571 277.966 L
1039.357 277.966 L
1039.357 387 L
cp
S
GR
GS
[0.75 0 0 0.75 0 0.5] CT
10.0 ML
0.667 LW
N
1104.179 387 M
1104.179 250.775 L
1115.964 250.775 L
1115.964 387 L
cp
S
GR
GS
[0.75 0 0 0.75 0 0.5] CT
10.0 ML
0.667 LW
N
1180.786 387 M
1180.786 184.455 L
1192.571 184.455 L
1192.571 387 L
cp
S
GR
GS
[0.75 0 0 0.75 0 0.5] CT
0.149 GC
2 setlinecap
1 LJ
0.667 LW
N
971 387 M
1202 387 L
S
GR
GS
[0.75 0 0 0.75 0 0.5] CT
0.149 GC
2 setlinecap
1 LJ
0.667 LW
N
971 37 M
1202 37 L
S
GR
GS
[0.75 0 0 0.75 0 0.5] CT
0.149 GC
2 setlinecap
1 LJ
0.667 LW
N
1009.893 387 M
1009.893 383.5 L
S
GR
GS
[0.75 0 0 0.75 0 0.5] CT
0.149 GC
2 setlinecap
1 LJ
0.667 LW
N
1086.5 387 M
1086.5 383.5 L
S
GR
GS
[0.75 0 0 0.75 0 0.5] CT
0.149 GC
2 setlinecap
1 LJ
0.667 LW
N
1163.107 387 M
1163.107 383.5 L
S
GR
GS
[0.75 0 0 0.75 0 0.5] CT
0.149 GC
2 setlinecap
1 LJ
0.667 LW
N
1009.893 37 M
1009.893 40.5 L
S
GR
GS
[0.75 0 0 0.75 0 0.5] CT
0.149 GC
2 setlinecap
1 LJ
0.667 LW
N
1086.5 37 M
1086.5 40.5 L
S
GR
GS
[0.75 0 0 0.75 0 0.5] CT
0.149 GC
2 setlinecap
1 LJ
0.667 LW
N
1163.107 37 M
1163.107 40.5 L
S
GR
GS
[0.75 0 0 0.75 757.41966 295.55] CT
0.149 GC
/Helvetica 18.667 F
GS
[1 0 0 1 0 0] CT
-24 19 moveto 
1 -1 scale
(50 % ) t 
GR
GR
GS
[0.75 0 0 0.75 814.875 295.55] CT
0.149 GC
/Helvetica 18.667 F
GS
[1 0 0 1 0 0] CT
-21.5 19 moveto 
1 -1 scale
(75 %) t 
GR
GR
GS
[0.75 0 0 0.75 872.33038 295.55] CT
0.149 GC
/Helvetica 18.667 F
GS
[1 0 0 1 0 0] CT
-21.5 19 moveto 
1 -1 scale
(95 %) t 
GR
GR
GS
[0.75 0 0 0.75 0 0.5] CT
0.149 GC
2 setlinecap
1 LJ
0.667 LW
N
971 387 M
971 37 L
S
GR
GS
[0.75 0 0 0.75 0 0.5] CT
0.149 GC
2 setlinecap
1 LJ
0.667 LW
N
1202 387 M
1202 37 L
S
GR
GS
[0.75 0 0 0.75 0 0.5] CT
0.149 GC
2 setlinecap
1 LJ
0.667 LW
N
971 387 M
974.5 387 L
S
GR
GS
[0.75 0 0 0.75 0 0.5] CT
0.149 GC
2 setlinecap
1 LJ
0.667 LW
N
971 317 M
974.5 317 L
S
GR
GS
[0.75 0 0 0.75 0 0.5] CT
0.149 GC
2 setlinecap
1 LJ
0.667 LW
N
971 247 M
974.5 247 L
S
GR
GS
[0.75 0 0 0.75 0 0.5] CT
0.149 GC
2 setlinecap
1 LJ
0.667 LW
N
971 177 M
974.5 177 L
S
GR
GS
[0.75 0 0 0.75 0 0.5] CT
0.149 GC
2 setlinecap
1 LJ
0.667 LW
N
971 107 M
974.5 107 L
S
GR
GS
[0.75 0 0 0.75 0 0.5] CT
0.149 GC
2 setlinecap
1 LJ
0.667 LW
N
971 37 M
974.5 37 L
S
GR
GS
[0.75 0 0 0.75 0 0.5] CT
0.149 GC
2 setlinecap
1 LJ
0.667 LW
N
1202 387 M
1198.5 387 L
S
GR
GS
[0.75 0 0 0.75 0 0.5] CT
0.149 GC
2 setlinecap
1 LJ
0.667 LW
N
1202 317 M
1198.5 317 L
S
GR
GS
[0.75 0 0 0.75 0 0.5] CT
0.149 GC
2 setlinecap
1 LJ
0.667 LW
N
1202 247 M
1198.5 247 L
S
GR
GS
[0.75 0 0 0.75 0 0.5] CT
0.149 GC
2 setlinecap
1 LJ
0.667 LW
N
1202 177 M
1198.5 177 L
S
GR
GS
[0.75 0 0 0.75 0 0.5] CT
0.149 GC
2 setlinecap
1 LJ
0.667 LW
N
1202 107 M
1198.5 107 L
S
GR
GS
[0.75 0 0 0.75 0 0.5] CT
0.149 GC
2 setlinecap
1 LJ
0.667 LW
N
1202 37 M
1198.5 37 L
S
GR
GS
[0.75 0 0 0.75 723.44998 290.75] CT
0.149 GC
/Helvetica 18.667 F
GS
[1 0 0 1 0 0] CT
-11 7 moveto 
1 -1 scale
(0) t 
GR
GR
GS
[0.75 0 0 0.75 723.44998 238.25] CT
0.149 GC
/Helvetica 18.667 F
GS
[1 0 0 1 0 0] CT
-11 7 moveto 
1 -1 scale
(2) t 
GR
GR
GS
[0.75 0 0 0.75 723.44998 185.75] CT
0.149 GC
/Helvetica 18.667 F
GS
[1 0 0 1 0 0] CT
-11 7 moveto 
1 -1 scale
(4) t 
GR
GR
GS
[0.75 0 0 0.75 723.44998 133.25] CT
0.149 GC
/Helvetica 18.667 F
GS
[1 0 0 1 0 0] CT
-11 7 moveto 
1 -1 scale
(6) t 
GR
GR
GS
[0.75 0 0 0.75 723.44998 80.75] CT
0.149 GC
/Helvetica 18.667 F
GS
[1 0 0 1 0 0] CT
-11 7 moveto 
1 -1 scale
(8) t 
GR
GR
GS
[0.75 0 0 0.75 723.44998 28.25] CT
0.149 GC
/Helvetica 18.667 F
GS
[1 0 0 1 0 0] CT
-21 7 moveto 
1 -1 scale
(10) t 
GR
GR
%%Trailer
%%Pages: 1
%%EOF
