%!PS-Adobe-3.0 EPSF-3.0
%%Creator: (MATLAB, The Mathworks, Inc. Version 9.5.0.944444 \(R2018b\). Operating System: Windows 10)
%%Title: (C:/Users/navsas/Dropbox/Paper IAR - Official/fig/newFormulaPerformance_veryLongBaseline.eps)
%%CreationDate: 2018-10-25T15:34:46
%%Pages: (atend)
%%BoundingBox: 0 0 815 244
%%LanguageLevel: 3
%%EndComments
%%BeginProlog
%%BeginResource: procset (Apache XML Graphics Std ProcSet) 1.2 0
%%Version: 1.2 0
%%Copyright: (Copyright 2001-2003,2010 The Apache Software Foundation. License terms: http://www.apache.org/licenses/LICENSE-2.0)
/bd{bind def}bind def
/ld{load def}bd
/GR/grestore ld
/GS/gsave ld
/RM/rmoveto ld
/C/curveto ld
/t/show ld
/L/lineto ld
/ML/setmiterlimit ld
/CT/concat ld
/f/fill ld
/N/newpath ld
/S/stroke ld
/CC/setcmykcolor ld
/A/ashow ld
/cp/closepath ld
/RC/setrgbcolor ld
/LJ/setlinejoin ld
/GC/setgray ld
/LW/setlinewidth ld
/M/moveto ld
/re {4 2 roll M
1 index 0 rlineto
0 exch rlineto
neg 0 rlineto
cp } bd
/_ctm matrix def
/_tm matrix def
/BT { _ctm currentmatrix pop matrix _tm copy pop 0 0 moveto } bd
/ET { _ctm setmatrix } bd
/iTm { _ctm setmatrix _tm concat } bd
/Tm { _tm astore pop iTm 0 0 moveto } bd
/ux 0.0 def
/uy 0.0 def
/F {
  /Tp exch def
  /Tf exch def
  Tf findfont Tp scalefont setfont
  /cf Tf def  /cs Tp def
} bd
/ULS {currentpoint /uy exch def /ux exch def} bd
/ULE {
  /Tcx currentpoint pop def
  gsave
  newpath
  cf findfont cs scalefont dup
  /FontMatrix get 0 get /Ts exch def /FontInfo get dup
  /UnderlinePosition get Ts mul /To exch def
  /UnderlineThickness get Ts mul /Tt exch def
  ux uy To add moveto  Tcx uy To add lineto
  Tt setlinewidth stroke
  grestore
} bd
/OLE {
  /Tcx currentpoint pop def
  gsave
  newpath
  cf findfont cs scalefont dup
  /FontMatrix get 0 get /Ts exch def /FontInfo get dup
  /UnderlinePosition get Ts mul /To exch def
  /UnderlineThickness get Ts mul /Tt exch def
  ux uy To add cs add moveto Tcx uy To add cs add lineto
  Tt setlinewidth stroke
  grestore
} bd
/SOE {
  /Tcx currentpoint pop def
  gsave
  newpath
  cf findfont cs scalefont dup
  /FontMatrix get 0 get /Ts exch def /FontInfo get dup
  /UnderlinePosition get Ts mul /To exch def
  /UnderlineThickness get Ts mul /Tt exch def
  ux uy To add cs 10 mul 26 idiv add moveto Tcx uy To add cs 10 mul 26 idiv add lineto
  Tt setlinewidth stroke
  grestore
} bd
/QT {
/Y22 exch store
/X22 exch store
/Y21 exch store
/X21 exch store
currentpoint
/Y21 load 2 mul add 3 div exch
/X21 load 2 mul add 3 div exch
/X21 load 2 mul /X22 load add 3 div
/Y21 load 2 mul /Y22 load add 3 div
/X22 load /Y22 load curveto
} bd
/SSPD {
dup length /d exch dict def
{
/v exch def
/k exch def
currentpagedevice k known {
/cpdv currentpagedevice k get def
v cpdv ne {
/upd false def
/nullv v type /nulltype eq def
/nullcpdv cpdv type /nulltype eq def
nullv nullcpdv or
{
/upd true def
} {
/sametype v type cpdv type eq def
sametype {
v type /arraytype eq {
/vlen v length def
/cpdvlen cpdv length def
vlen cpdvlen eq {
0 1 vlen 1 sub {
/i exch def
/obj v i get def
/cpdobj cpdv i get def
obj cpdobj ne {
/upd true def
exit
} if
} for
} {
/upd true def
} ifelse
} {
v type /dicttype eq {
v {
/dv exch def
/dk exch def
/cpddv cpdv dk get def
dv cpddv ne {
/upd true def
exit
} if
} forall
} {
/upd true def
} ifelse
} ifelse
} if
} ifelse
upd true eq {
d k v put
} if
} if
} if
} forall
d length 0 gt {
d setpagedevice
} if
} bd
/RE { % /NewFontName [NewEncodingArray] /FontName RE -
  findfont dup length dict begin
  {
    1 index /FID ne
    {def} {pop pop} ifelse
  } forall
  /Encoding exch def
  /FontName 1 index def
  currentdict definefont pop
  end
} bind def
%%EndResource
%%BeginResource: procset (Apache XML Graphics EPS ProcSet) 1.0 0
%%Version: 1.0 0
%%Copyright: (Copyright 2002-2003 The Apache Software Foundation. License terms: http://www.apache.org/licenses/LICENSE-2.0)
/BeginEPSF { %def
/b4_Inc_state save def         % Save state for cleanup
/dict_count countdictstack def % Count objects on dict stack
/op_count count 1 sub def      % Count objects on operand stack
userdict begin                 % Push userdict on dict stack
/showpage { } def              % Redefine showpage, { } = null proc
0 setgray 0 setlinecap         % Prepare graphics state
1 setlinewidth 0 setlinejoin
10 setmiterlimit [ ] 0 setdash newpath
/languagelevel where           % If level not equal to 1 then
{pop languagelevel             % set strokeadjust and
1 ne                           % overprint to their defaults.
{false setstrokeadjust false setoverprint
} if
} if
} bd
/EndEPSF { %def
count op_count sub {pop} repeat            % Clean up stacks
countdictstack dict_count sub {end} repeat
b4_Inc_state restore
} bd
%%EndResource
%FOPBeginFontDict
%%IncludeResource: font Courier-Oblique
%%IncludeResource: font Courier-BoldOblique
%%IncludeResource: font Courier-Bold
%%IncludeResource: font ZapfDingbats
%%IncludeResource: font Symbol
%%IncludeResource: font Helvetica
%%IncludeResource: font Helvetica-Oblique
%%IncludeResource: font Helvetica-Bold
%%IncludeResource: font Helvetica-BoldOblique
%%IncludeResource: font Times-Roman
%%IncludeResource: font Times-Italic
%%IncludeResource: font Times-Bold
%%IncludeResource: font Times-BoldItalic
%%IncludeResource: font Courier
%FOPEndFontDict
%%BeginResource: encoding WinAnsiEncoding
/WinAnsiEncoding [
/.notdef /.notdef /.notdef /.notdef /.notdef
/.notdef /.notdef /.notdef /.notdef /.notdef
/.notdef /.notdef /.notdef /.notdef /.notdef
/.notdef /.notdef /.notdef /.notdef /.notdef
/.notdef /.notdef /.notdef /.notdef /.notdef
/.notdef /.notdef /.notdef /.notdef /.notdef
/.notdef /.notdef /space /exclam /quotedbl
/numbersign /dollar /percent /ampersand /quotesingle
/parenleft /parenright /asterisk /plus /comma
/hyphen /period /slash /zero /one
/two /three /four /five /six
/seven /eight /nine /colon /semicolon
/less /equal /greater /question /at
/A /B /C /D /E
/F /G /H /I /J
/K /L /M /N /O
/P /Q /R /S /T
/U /V /W /X /Y
/Z /bracketleft /backslash /bracketright /asciicircum
/underscore /quoteleft /a /b /c
/d /e /f /g /h
/i /j /k /l /m
/n /o /p /q /r
/s /t /u /v /w
/x /y /z /braceleft /bar
/braceright /asciitilde /bullet /Euro /bullet
/quotesinglbase /florin /quotedblbase /ellipsis /dagger
/daggerdbl /circumflex /perthousand /Scaron /guilsinglleft
/OE /bullet /Zcaron /bullet /bullet
/quoteleft /quoteright /quotedblleft /quotedblright /bullet
/endash /emdash /asciitilde /trademark /scaron
/guilsinglright /oe /bullet /zcaron /Ydieresis
/space /exclamdown /cent /sterling /currency
/yen /brokenbar /section /dieresis /copyright
/ordfeminine /guillemotleft /logicalnot /sfthyphen /registered
/macron /degree /plusminus /twosuperior /threesuperior
/acute /mu /paragraph /middot /cedilla
/onesuperior /ordmasculine /guillemotright /onequarter /onehalf
/threequarters /questiondown /Agrave /Aacute /Acircumflex
/Atilde /Adieresis /Aring /AE /Ccedilla
/Egrave /Eacute /Ecircumflex /Edieresis /Igrave
/Iacute /Icircumflex /Idieresis /Eth /Ntilde
/Ograve /Oacute /Ocircumflex /Otilde /Odieresis
/multiply /Oslash /Ugrave /Uacute /Ucircumflex
/Udieresis /Yacute /Thorn /germandbls /agrave
/aacute /acircumflex /atilde /adieresis /aring
/ae /ccedilla /egrave /eacute /ecircumflex
/edieresis /igrave /iacute /icircumflex /idieresis
/eth /ntilde /ograve /oacute /ocircumflex
/otilde /odieresis /divide /oslash /ugrave
/uacute /ucircumflex /udieresis /yacute /thorn
/ydieresis
] def
%%EndResource
%FOPBeginFontReencode
/Courier-Oblique findfont
dup length dict begin
  {1 index /FID ne {def} {pop pop} ifelse} forall
  /Encoding WinAnsiEncoding def
  currentdict
end
/Courier-Oblique exch definefont pop
/Courier-BoldOblique findfont
dup length dict begin
  {1 index /FID ne {def} {pop pop} ifelse} forall
  /Encoding WinAnsiEncoding def
  currentdict
end
/Courier-BoldOblique exch definefont pop
/Courier-Bold findfont
dup length dict begin
  {1 index /FID ne {def} {pop pop} ifelse} forall
  /Encoding WinAnsiEncoding def
  currentdict
end
/Courier-Bold exch definefont pop
/Helvetica findfont
dup length dict begin
  {1 index /FID ne {def} {pop pop} ifelse} forall
  /Encoding WinAnsiEncoding def
  currentdict
end
/Helvetica exch definefont pop
/Helvetica-Oblique findfont
dup length dict begin
  {1 index /FID ne {def} {pop pop} ifelse} forall
  /Encoding WinAnsiEncoding def
  currentdict
end
/Helvetica-Oblique exch definefont pop
/Helvetica-Bold findfont
dup length dict begin
  {1 index /FID ne {def} {pop pop} ifelse} forall
  /Encoding WinAnsiEncoding def
  currentdict
end
/Helvetica-Bold exch definefont pop
/Helvetica-BoldOblique findfont
dup length dict begin
  {1 index /FID ne {def} {pop pop} ifelse} forall
  /Encoding WinAnsiEncoding def
  currentdict
end
/Helvetica-BoldOblique exch definefont pop
/Times-Roman findfont
dup length dict begin
  {1 index /FID ne {def} {pop pop} ifelse} forall
  /Encoding WinAnsiEncoding def
  currentdict
end
/Times-Roman exch definefont pop
/Times-Italic findfont
dup length dict begin
  {1 index /FID ne {def} {pop pop} ifelse} forall
  /Encoding WinAnsiEncoding def
  currentdict
end
/Times-Italic exch definefont pop
/Times-Bold findfont
dup length dict begin
  {1 index /FID ne {def} {pop pop} ifelse} forall
  /Encoding WinAnsiEncoding def
  currentdict
end
/Times-Bold exch definefont pop
/Times-BoldItalic findfont
dup length dict begin
  {1 index /FID ne {def} {pop pop} ifelse} forall
  /Encoding WinAnsiEncoding def
  currentdict
end
/Times-BoldItalic exch definefont pop
/Courier findfont
dup length dict begin
  {1 index /FID ne {def} {pop pop} ifelse} forall
  /Encoding WinAnsiEncoding def
  currentdict
end
/Courier exch definefont pop
%FOPEndFontReencode
%%EndProlog
%%Page: 1 1
%%PageBoundingBox: 0 0 815 244
%%BeginPageSetup
[1 0 0 -1 0 244] CT
%%EndPageSetup
GS
[0.75 0 0 0.75 0 0.25] CT
1 GC
N
0 0 1086 325 re
f
GR
GS
[0.75 0 0 0.75 0 0.25] CT
1 GC
N
0 0 1086 325 re
f
GR
GS
[0.75 0 0 0.75 0 0.25] CT
1 GC
N
141 273 M
983 273 L
983 56 L
141 56 L
cp
f
GR
GS
[0.75 0 0 0.75 0 0.25] CT
0.149 GC
2 setlinecap
1 LJ
0.667 LW
N
141 273 M
983 273 L
S
GR
GS
[0.75 0 0 0.75 0 0.25] CT
0.149 GC
2 setlinecap
1 LJ
0.667 LW
N
141 56 M
983 56 L
S
GR
GS
[0.75 0 0 0.75 0 0.25] CT
0.149 GC
2 setlinecap
1 LJ
0.667 LW
N
141 273 M
141 264.58 L
S
GR
GS
[0.75 0 0 0.75 0 0.25] CT
0.149 GC
2 setlinecap
1 LJ
0.667 LW
N
234.556 273 M
234.556 264.58 L
S
GR
GS
[0.75 0 0 0.75 0 0.25] CT
0.149 GC
2 setlinecap
1 LJ
0.667 LW
N
328.111 273 M
328.111 264.58 L
S
GR
GS
[0.75 0 0 0.75 0 0.25] CT
0.149 GC
2 setlinecap
1 LJ
0.667 LW
N
421.667 273 M
421.667 264.58 L
S
GR
GS
[0.75 0 0 0.75 0 0.25] CT
0.149 GC
2 setlinecap
1 LJ
0.667 LW
N
515.222 273 M
515.222 264.58 L
S
GR
GS
[0.75 0 0 0.75 0 0.25] CT
0.149 GC
2 setlinecap
1 LJ
0.667 LW
N
608.778 273 M
608.778 264.58 L
S
GR
GS
[0.75 0 0 0.75 0 0.25] CT
0.149 GC
2 setlinecap
1 LJ
0.667 LW
N
702.333 273 M
702.333 264.58 L
S
GR
GS
[0.75 0 0 0.75 0 0.25] CT
0.149 GC
2 setlinecap
1 LJ
0.667 LW
N
795.889 273 M
795.889 264.58 L
S
GR
GS
[0.75 0 0 0.75 0 0.25] CT
0.149 GC
2 setlinecap
1 LJ
0.667 LW
N
889.444 273 M
889.444 264.58 L
S
GR
GS
[0.75 0 0 0.75 0 0.25] CT
0.149 GC
2 setlinecap
1 LJ
0.667 LW
N
983 273 M
983 264.58 L
S
GR
GS
[0.75 0 0 0.75 0 0.25] CT
0.149 GC
2 setlinecap
1 LJ
0.667 LW
N
141 56 M
141 64.42 L
S
GR
GS
[0.75 0 0 0.75 0 0.25] CT
0.149 GC
2 setlinecap
1 LJ
0.667 LW
N
234.556 56 M
234.556 64.42 L
S
GR
GS
[0.75 0 0 0.75 0 0.25] CT
0.149 GC
2 setlinecap
1 LJ
0.667 LW
N
328.111 56 M
328.111 64.42 L
S
GR
GS
[0.75 0 0 0.75 0 0.25] CT
0.149 GC
2 setlinecap
1 LJ
0.667 LW
N
421.667 56 M
421.667 64.42 L
S
GR
GS
[0.75 0 0 0.75 0 0.25] CT
0.149 GC
2 setlinecap
1 LJ
0.667 LW
N
515.222 56 M
515.222 64.42 L
S
GR
GS
[0.75 0 0 0.75 0 0.25] CT
0.149 GC
2 setlinecap
1 LJ
0.667 LW
N
608.778 56 M
608.778 64.42 L
S
GR
GS
[0.75 0 0 0.75 0 0.25] CT
0.149 GC
2 setlinecap
1 LJ
0.667 LW
N
702.333 56 M
702.333 64.42 L
S
GR
GS
[0.75 0 0 0.75 0 0.25] CT
0.149 GC
2 setlinecap
1 LJ
0.667 LW
N
795.889 56 M
795.889 64.42 L
S
GR
GS
[0.75 0 0 0.75 0 0.25] CT
0.149 GC
2 setlinecap
1 LJ
0.667 LW
N
889.444 56 M
889.444 64.42 L
S
GR
GS
[0.75 0 0 0.75 0 0.25] CT
0.149 GC
2 setlinecap
1 LJ
0.667 LW
N
983 56 M
983 64.42 L
S
GR
GS
[0.75 0 0 0.75 105.75 209.8] CT
0.149 GC
N
-12.234 15.68 M
-12.234 15.008 L
-9.859 15.008 -9.859 14.414 QT
-9.859 4.43 L
-10.844 4.914 -12.344 4.914 QT
-12.344 4.242 L
-10.016 4.242 -8.828 3.024 QT
-8.563 3.024 L
-8.5 3.024 -8.438 3.078 QT
-8.375 3.133 -8.375 3.196 QT
-8.375 14.414 L
-8.375 15.008 -6 15.008 QT
-6 15.68 L
-12.234 15.68 L
cp
f
GR
GS
[0.75 0 0 0.75 105.75 209.8] CT
0.149 GC
N
0.083 16.102 M
-2.245 16.102 -3.081 14.18 QT
-3.917 12.258 -3.917 9.617 QT
-3.917 7.977 -3.62 6.516 QT
-3.323 5.055 -2.424 4.039 QT
-1.526 3.024 0.083 3.024 QT
1.333 3.024 2.13 3.633 QT
2.927 4.242 3.349 5.219 QT
3.771 6.196 3.919 7.297 QT
4.068 8.399 4.068 9.617 QT
4.068 11.258 3.771 12.68 QT
3.474 14.102 2.591 15.102 QT
1.708 16.102 0.083 16.102 QT
cp
0.083 15.602 M
1.146 15.602 1.661 14.516 QT
2.177 13.43 2.302 12.117 QT
2.427 10.805 2.427 9.321 QT
2.427 7.883 2.302 6.68 QT
2.177 5.477 1.661 4.5 QT
1.146 3.524 0.083 3.524 QT
-0.995 3.524 -1.51 4.5 QT
-2.026 5.477 -2.151 6.68 QT
-2.276 7.883 -2.276 9.321 QT
-2.276 10.367 -2.221 11.305 QT
-2.167 12.242 -1.948 13.242 QT
-1.729 14.242 -1.229 14.922 QT
-0.729 15.602 0.083 15.602 QT
cp
f
GR
GS
[0.75 0 0 0.75 105.75 209.8] CT
0.149 GC
N
9.417 16.102 M
7.089 16.102 6.253 14.18 QT
5.417 12.258 5.417 9.617 QT
5.417 7.977 5.714 6.516 QT
6.01 5.055 6.909 4.039 QT
7.807 3.024 9.417 3.024 QT
10.667 3.024 11.464 3.633 QT
12.26 4.242 12.682 5.219 QT
13.104 6.196 13.253 7.297 QT
13.401 8.399 13.401 9.617 QT
13.401 11.258 13.104 12.68 QT
12.807 14.102 11.925 15.102 QT
11.042 16.102 9.417 16.102 QT
cp
9.417 15.602 M
10.479 15.602 10.995 14.516 QT
11.51 13.43 11.635 12.117 QT
11.76 10.805 11.76 9.321 QT
11.76 7.883 11.635 6.68 QT
11.51 5.477 10.995 4.5 QT
10.479 3.524 9.417 3.524 QT
8.339 3.524 7.823 4.5 QT
7.307 5.477 7.182 6.68 QT
7.057 7.883 7.057 9.321 QT
7.057 10.367 7.112 11.305 QT
7.167 12.242 7.385 13.242 QT
7.604 14.242 8.104 14.922 QT
8.604 15.602 9.417 15.602 QT
cp
f
GR
GS
[0.75 0 0 0.75 175.91667 209.8] CT
0.149 GC
N
-13.047 15.68 M
-13.047 15.164 L
-13.047 15.117 -13.016 15.071 QT
-10.063 11.805 L
-9.391 11.071 -8.977 10.586 QT
-8.563 10.102 -8.156 9.461 QT
-7.75 8.821 -7.516 8.156 QT
-7.281 7.492 -7.281 6.742 QT
-7.281 5.961 -7.563 5.25 QT
-7.844 4.539 -8.414 4.117 QT
-8.984 3.696 -9.797 3.696 QT
-10.625 3.696 -11.281 4.188 QT
-11.938 4.68 -12.203 5.477 QT
-12.141 5.461 -12 5.461 QT
-11.578 5.461 -11.273 5.742 QT
-10.969 6.024 -10.969 6.492 QT
-10.969 6.914 -11.273 7.219 QT
-11.578 7.524 -12 7.524 QT
-12.453 7.524 -12.75 7.211 QT
-13.047 6.899 -13.047 6.492 QT
-13.047 5.774 -12.781 5.149 QT
-12.516 4.524 -12.008 4.031 QT
-11.5 3.539 -10.867 3.281 QT
-10.234 3.024 -9.516 3.024 QT
-8.438 3.024 -7.5 3.485 QT
-6.563 3.946 -6.016 4.781 QT
-5.469 5.617 -5.469 6.742 QT
-5.469 7.571 -5.828 8.313 QT
-6.188 9.055 -6.75 9.664 QT
-7.313 10.274 -8.195 11.039 QT
-9.078 11.805 -9.359 12.071 QT
-11.516 14.133 L
-9.688 14.133 L
-8.344 14.133 -7.438 14.11 QT
-6.531 14.086 -6.469 14.039 QT
-6.25 13.805 -6.016 12.289 QT
-5.469 12.289 L
-6 15.68 L
-13.047 15.68 L
cp
f
GR
GS
[0.75 0 0 0.75 175.91667 209.8] CT
0.149 GC
N
/f-1042494437{0.083 16.102 M
-2.245 16.102 -3.081 14.18 QT
-3.917 12.258 -3.917 9.617 QT
-3.917 7.977 -3.62 6.516 QT
-3.323 5.055 -2.424 4.039 QT
-1.526 3.024 0.083 3.024 QT
1.333 3.024 2.13 3.633 QT
2.927 4.242 3.349 5.219 QT
3.771 6.196 3.919 7.297 QT
4.068 8.399 4.068 9.617 QT
4.068 11.258 3.771 12.68 QT
3.474 14.102 2.591 15.102 QT
1.708 16.102 0.083 16.102 QT
cp
0.083 15.602 M
1.146 15.602 1.661 14.516 QT
2.177 13.43 2.302 12.117 QT
2.427 10.805 2.427 9.321 QT
2.427 7.883 2.302 6.68 QT
2.177 5.477 1.661 4.5 QT
1.146 3.524 0.083 3.524 QT
-0.995 3.524 -1.51 4.5 QT
-2.026 5.477 -2.151 6.68 QT
-2.276 7.883 -2.276 9.321 QT
-2.276 10.367 -2.221 11.305 QT
-2.167 12.242 -1.948 13.242 QT
-1.729 14.242 -1.229 14.922 QT
-0.729 15.602 0.083 15.602 QT
cp}def
f-1042494437
f
GR
GS
[0.75 0 0 0.75 175.91667 209.8] CT
0.149 GC
N
/f1861641624{9.417 16.102 M
7.089 16.102 6.253 14.18 QT
5.417 12.258 5.417 9.617 QT
5.417 7.977 5.714 6.516 QT
6.01 5.055 6.909 4.039 QT
7.807 3.024 9.417 3.024 QT
10.667 3.024 11.464 3.633 QT
12.26 4.242 12.682 5.219 QT
13.104 6.196 13.253 7.297 QT
13.401 8.399 13.401 9.617 QT
13.401 11.258 13.104 12.68 QT
12.807 14.102 11.925 15.102 QT
11.042 16.102 9.417 16.102 QT
cp
9.417 15.602 M
10.479 15.602 10.995 14.516 QT
11.51 13.43 11.635 12.117 QT
11.76 10.805 11.76 9.321 QT
11.76 7.883 11.635 6.68 QT
11.51 5.477 10.995 4.5 QT
10.479 3.524 9.417 3.524 QT
8.339 3.524 7.823 4.5 QT
7.307 5.477 7.182 6.68 QT
7.057 7.883 7.057 9.321 QT
7.057 10.367 7.112 11.305 QT
7.167 12.242 7.385 13.242 QT
7.604 14.242 8.104 14.922 QT
8.604 15.602 9.417 15.602 QT
cp}def
f1861641624
f
GR
GS
[0.75 0 0 0.75 246.08334 209.8] CT
0.149 GC
N
/f-1792458872{-12.188 14.211 M
-11.75 14.867 -11 15.18 QT
-10.25 15.492 -9.375 15.492 QT
-8.281 15.492 -7.813 14.555 QT
-7.344 13.617 -7.344 12.414 QT
-7.344 11.883 -7.445 11.344 QT
-7.547 10.805 -7.773 10.336 QT
-8 9.867 -8.406 9.594 QT
-8.813 9.321 -9.391 9.321 QT
-10.656 9.321 L
-10.828 9.321 -10.828 9.133 QT
-10.828 8.977 L
-10.828 8.821 -10.656 8.821 QT
-9.609 8.742 L
-8.938 8.742 -8.5 8.242 QT
-8.063 7.742 -7.859 7.024 QT
-7.656 6.305 -7.656 5.649 QT
-7.656 4.742 -8.078 4.156 QT
-8.5 3.571 -9.375 3.571 QT
-10.109 3.571 -10.766 3.844 QT
-11.422 4.117 -11.813 4.68 QT
-11.766 4.664 -11.742 4.664 QT
-11.719 4.664 -11.688 4.664 QT
-11.25 4.664 -10.961 4.961 QT
-10.672 5.258 -10.672 5.664 QT
-10.672 6.071 -10.961 6.367 QT
-11.25 6.664 -11.688 6.664 QT
-12.094 6.664 -12.391 6.367 QT
-12.688 6.071 -12.688 5.664 QT
-12.688 4.852 -12.195 4.25 QT
-11.703 3.649 -10.93 3.336 QT
-10.156 3.024 -9.375 3.024 QT
-8.797 3.024 -8.164 3.196 QT
-7.531 3.367 -7.008 3.688 QT
-6.484 4.008 -6.156 4.508 QT
-5.828 5.008 -5.828 5.649 QT
-5.828 6.446 -6.188 7.125 QT
-6.547 7.805 -7.164 8.297 QT
-7.781 8.789 -8.531 9.024 QT
-7.703 9.18 -6.961 9.649 QT
-6.219 10.117 -5.766 10.836 QT
-5.313 11.555 -5.313 12.399 QT
-5.313 13.446 -5.891 14.297 QT
-6.469 15.149 -7.406 15.625 QT
-8.344 16.102 -9.375 16.102 QT
-10.266 16.102 -11.164 15.758 QT
-12.063 15.414 -12.633 14.742 QT
-13.203 14.071 -13.203 13.117 QT
-13.203 12.649 -12.891 12.328 QT
-12.578 12.008 -12.094 12.008 QT
-11.797 12.008 -11.539 12.156 QT
-11.281 12.305 -11.141 12.563 QT
-11 12.821 -11 13.117 QT
-11 13.586 -11.32 13.899 QT
-11.641 14.211 -12.094 14.211 QT
-12.188 14.211 L
cp}def
f-1792458872
f
GR
GS
[0.75 0 0 0.75 246.08334 209.8] CT
0.149 GC
N
f-1042494437
f
GR
GS
[0.75 0 0 0.75 246.08334 209.8] CT
0.149 GC
N
f1861641624
f
GR
GS
[0.75 0 0 0.75 316.24999 209.8] CT
0.149 GC
N
/f-355302530{-13.469 12.539 M
-13.469 11.883 L
-7.594 3.117 L
-7.531 3.024 -7.406 3.024 QT
-7.125 3.024 L
-6.906 3.024 -6.906 3.242 QT
-6.906 11.883 L
-5.047 11.883 L
-5.047 12.539 L
-6.906 12.539 L
-6.906 14.414 L
-6.906 14.805 -6.352 14.906 QT
-5.797 15.008 -5.063 15.008 QT
-5.063 15.68 L
-10.297 15.68 L
-10.297 15.008 L
-9.563 15.008 -9.008 14.906 QT
-8.453 14.805 -8.453 14.414 QT
-8.453 12.539 L
-13.469 12.539 L
cp
-12.844 11.883 M
-8.344 11.883 L
-8.344 5.149 L
-12.844 11.883 L
cp}def
f-355302530
f
GR
GS
[0.75 0 0 0.75 316.24999 209.8] CT
0.149 GC
N
f-1042494437
f
GR
GS
[0.75 0 0 0.75 316.24999 209.8] CT
0.149 GC
N
f1861641624
f
GR
GS
[0.75 0 0 0.75 386.41667 209.8] CT
0.149 GC
N
/f-191326911{-12.344 13.524 M
-12.156 14.071 -11.75 14.524 QT
-11.344 14.977 -10.797 15.235 QT
-10.25 15.492 -9.656 15.492 QT
-8.281 15.492 -7.758 14.43 QT
-7.234 13.367 -7.234 11.836 QT
-7.234 11.18 -7.258 10.727 QT
-7.281 10.274 -7.391 9.867 QT
-7.563 9.196 -8 8.696 QT
-8.438 8.196 -9.078 8.196 QT
-9.719 8.196 -10.18 8.391 QT
-10.641 8.586 -10.93 8.844 QT
-11.219 9.102 -11.438 9.391 QT
-11.656 9.68 -11.719 9.696 QT
-11.938 9.696 L
-11.984 9.696 -12.047 9.633 QT
-12.109 9.571 -12.109 9.524 QT
-12.109 3.18 L
-12.109 3.133 -12.055 3.078 QT
-12 3.024 -11.938 3.024 QT
-11.875 3.024 L
-10.594 3.633 -9.156 3.633 QT
-7.75 3.633 -6.438 3.024 QT
-6.391 3.024 L
-6.313 3.024 -6.258 3.071 QT
-6.203 3.117 -6.203 3.18 QT
-6.203 3.352 L
-6.203 3.446 -6.25 3.446 QT
-6.891 4.305 -7.867 4.789 QT
-8.844 5.274 -9.906 5.274 QT
-10.656 5.274 -11.453 5.055 QT
-11.453 8.649 L
-10.828 8.133 -10.328 7.914 QT
-9.828 7.696 -9.063 7.696 QT
-8.016 7.696 -7.188 8.305 QT
-6.359 8.914 -5.914 9.883 QT
-5.469 10.852 -5.469 11.852 QT
-5.469 12.992 -6.031 13.969 QT
-6.594 14.946 -7.555 15.524 QT
-8.516 16.102 -9.656 16.102 QT
-10.578 16.102 -11.367 15.617 QT
-12.156 15.133 -12.602 14.313 QT
-13.047 13.492 -13.047 12.586 QT
-13.047 12.149 -12.773 11.883 QT
-12.5 11.617 -12.078 11.617 QT
-11.656 11.617 -11.375 11.891 QT
-11.094 12.164 -11.094 12.586 QT
-11.094 12.992 -11.375 13.274 QT
-11.656 13.555 -12.078 13.555 QT
-12.141 13.555 -12.227 13.539 QT
-12.313 13.524 -12.344 13.524 QT
cp}def
f-191326911
f
GR
GS
[0.75 0 0 0.75 386.41667 209.8] CT
0.149 GC
N
f-1042494437
f
GR
GS
[0.75 0 0 0.75 386.41667 209.8] CT
0.149 GC
N
f1861641624
f
GR
GS
[0.75 0 0 0.75 456.58333 209.8] CT
0.149 GC
N
/f-1635914812{-9.25 16.102 M
-10.422 16.102 -11.211 15.477 QT
-12 14.852 -12.438 13.852 QT
-12.875 12.852 -13.039 11.758 QT
-13.203 10.664 -13.203 9.539 QT
-13.203 8.039 -12.617 6.524 QT
-12.031 5.008 -10.898 4.016 QT
-9.766 3.024 -8.203 3.024 QT
-7.547 3.024 -6.984 3.274 QT
-6.422 3.524 -6.109 4 QT
-5.797 4.477 -5.797 5.149 QT
-5.797 5.539 -6.055 5.805 QT
-6.313 6.071 -6.703 6.071 QT
-7.078 6.071 -7.344 5.797 QT
-7.609 5.524 -7.609 5.149 QT
-7.609 4.774 -7.344 4.508 QT
-7.078 4.242 -6.703 4.242 QT
-6.609 4.242 L
-6.844 3.899 -7.289 3.735 QT
-7.734 3.571 -8.203 3.571 QT
-8.781 3.571 -9.266 3.821 QT
-9.75 4.071 -10.141 4.5 QT
-10.531 4.93 -10.789 5.446 QT
-11.047 5.961 -11.195 6.617 QT
-11.344 7.274 -11.375 7.852 QT
-11.406 8.43 -11.406 9.289 QT
-11.078 8.524 -10.469 8.024 QT
-9.859 7.524 -9.078 7.524 QT
-8.234 7.524 -7.539 7.867 QT
-6.844 8.211 -6.344 8.821 QT
-5.844 9.43 -5.578 10.211 QT
-5.313 10.992 -5.313 11.789 QT
-5.313 12.899 -5.813 13.906 QT
-6.313 14.914 -7.211 15.508 QT
-8.109 16.102 -9.25 16.102 QT
cp
-9.25 15.492 M
-8.516 15.492 -8.07 15.156 QT
-7.625 14.821 -7.414 14.274 QT
-7.203 13.727 -7.156 13.164 QT
-7.109 12.602 -7.109 11.789 QT
-7.109 10.711 -7.211 9.946 QT
-7.313 9.18 -7.766 8.602 QT
-8.219 8.024 -9.156 8.024 QT
-9.922 8.024 -10.422 8.547 QT
-10.922 9.071 -11.148 9.86 QT
-11.375 10.649 -11.375 11.383 QT
-11.375 11.633 -11.359 11.758 QT
-11.359 11.789 -11.359 11.813 QT
-11.359 11.836 -11.375 11.852 QT
-11.375 12.68 -11.211 13.508 QT
-11.047 14.336 -10.57 14.914 QT
-10.094 15.492 -9.25 15.492 QT
cp}def
f-1635914812
f
GR
GS
[0.75 0 0 0.75 456.58333 209.8] CT
0.149 GC
N
f-1042494437
f
GR
GS
[0.75 0 0 0.75 456.58333 209.8] CT
0.149 GC
N
f1861641624
f
GR
GS
[0.75 0 0 0.75 526.74998 209.8] CT
0.149 GC
N
/f-722372330{-10.703 15.196 M
-10.703 14.133 -10.516 13.117 QT
-10.328 12.102 -9.969 11.117 QT
-9.609 10.133 -9.102 9.18 QT
-8.594 8.227 -8 7.399 QT
-6.266 4.977 L
-8.438 4.977 L
-11.813 4.977 -11.906 5.071 QT
-12.156 5.383 -12.391 6.836 QT
-12.938 6.836 L
-12.313 2.836 L
-11.75 2.836 L
-11.75 2.899 L
-11.75 3.242 -10.594 3.344 QT
-9.438 3.446 -8.328 3.446 QT
-4.781 3.446 L
-4.781 3.93 L
-4.781 3.946 -4.789 3.961 QT
-4.797 3.977 -4.813 3.992 QT
-7.422 7.664 L
-8.391 9.086 -8.633 10.836 QT
-8.875 12.586 -8.875 15.196 QT
-8.875 15.555 -9.141 15.828 QT
-9.406 16.102 -9.781 16.102 QT
-10.156 16.102 -10.43 15.828 QT
-10.703 15.555 -10.703 15.196 QT
cp}def
f-722372330
f
GR
GS
[0.75 0 0 0.75 526.74998 209.8] CT
0.149 GC
N
f-1042494437
f
GR
GS
[0.75 0 0 0.75 526.74998 209.8] CT
0.149 GC
N
f1861641624
f
GR
GS
[0.75 0 0 0.75 596.91669 209.8] CT
0.149 GC
N
/f-1952379826{-13.203 12.789 M
-13.203 11.649 -12.453 10.774 QT
-11.703 9.899 -10.516 9.321 QT
-11.219 8.867 L
-11.875 8.43 -12.281 7.719 QT
-12.688 7.008 -12.688 6.242 QT
-12.688 5.321 -12.211 4.594 QT
-11.734 3.867 -10.945 3.446 QT
-10.156 3.024 -9.25 3.024 QT
-8.406 3.024 -7.625 3.367 QT
-6.844 3.711 -6.336 4.352 QT
-5.828 4.992 -5.828 5.867 QT
-5.828 6.508 -6.125 7.055 QT
-6.422 7.602 -6.953 8.039 QT
-7.484 8.477 -8.078 8.789 QT
-6.984 9.477 L
-6.234 9.977 -5.773 10.774 QT
-5.313 11.571 -5.313 12.446 QT
-5.313 13.477 -5.867 14.321 QT
-6.422 15.164 -7.328 15.633 QT
-8.234 16.102 -9.25 16.102 QT
-10.234 16.102 -11.148 15.703 QT
-12.063 15.305 -12.633 14.547 QT
-13.203 13.789 -13.203 12.789 QT
cp
-12.172 12.789 M
-12.172 13.539 -11.758 14.164 QT
-11.344 14.789 -10.664 15.141 QT
-9.984 15.492 -9.25 15.492 QT
-8.141 15.492 -7.242 14.852 QT
-6.344 14.211 -6.344 13.133 QT
-6.344 12.774 -6.492 12.414 QT
-6.641 12.055 -6.891 11.766 QT
-7.141 11.477 -7.453 11.289 QT
-10.016 9.633 L
-10.609 9.961 -11.102 10.438 QT
-11.594 10.914 -11.883 11.524 QT
-12.172 12.133 -12.172 12.789 QT
cp
-10.859 6.992 M
-8.563 8.477 L
-7.766 8.024 -7.258 7.36 QT
-6.75 6.696 -6.75 5.867 QT
-6.75 5.227 -7.102 4.696 QT
-7.453 4.164 -8.031 3.867 QT
-8.609 3.571 -9.266 3.571 QT
-9.844 3.571 -10.43 3.797 QT
-11.016 4.024 -11.391 4.461 QT
-11.766 4.899 -11.766 5.492 QT
-11.766 6.383 -10.859 6.992 QT
cp}def
f-1952379826
f
GR
GS
[0.75 0 0 0.75 596.91669 209.8] CT
0.149 GC
N
f-1042494437
f
GR
GS
[0.75 0 0 0.75 596.91669 209.8] CT
0.149 GC
N
f1861641624
f
GR
GS
[0.75 0 0 0.75 667.08334 209.8] CT
0.149 GC
N
/f1396718688{-11.859 14.883 M
-11.344 15.492 -10.047 15.492 QT
-9.328 15.492 -8.703 15 QT
-8.078 14.508 -7.734 13.789 QT
-7.328 12.992 -7.219 12.078 QT
-7.109 11.164 -7.109 9.805 QT
-7.438 10.571 -8.039 11.063 QT
-8.641 11.555 -9.438 11.555 QT
-10.547 11.555 -11.414 10.961 QT
-12.281 10.367 -12.742 9.383 QT
-13.203 8.399 -13.203 7.305 QT
-13.203 6.164 -12.68 5.172 QT
-12.156 4.18 -11.242 3.602 QT
-10.328 3.024 -9.156 3.024 QT
-8 3.024 -7.227 3.649 QT
-6.453 4.274 -6.047 5.266 QT
-5.641 6.258 -5.477 7.36 QT
-5.313 8.461 -5.313 9.539 QT
-5.313 11.008 -5.852 12.531 QT
-6.391 14.055 -7.461 15.078 QT
-8.531 16.102 -10.047 16.102 QT
-11.172 16.102 -11.953 15.571 QT
-12.734 15.039 -12.734 13.977 QT
-12.734 13.586 -12.469 13.321 QT
-12.203 13.055 -11.813 13.055 QT
-11.438 13.055 -11.172 13.321 QT
-10.906 13.586 -10.906 13.977 QT
-10.906 14.336 -11.172 14.61 QT
-11.438 14.883 -11.813 14.883 QT
-11.859 14.883 L
cp
-9.359 11.055 M
-8.578 11.055 -8.086 10.531 QT
-7.594 10.008 -7.367 9.227 QT
-7.141 8.446 -7.141 7.68 QT
-7.141 7.321 L
-7.141 7.242 L
-7.141 5.821 -7.563 4.696 QT
-7.984 3.571 -9.156 3.571 QT
-9.906 3.571 -10.375 3.899 QT
-10.844 4.227 -11.07 4.774 QT
-11.297 5.321 -11.352 5.946 QT
-11.406 6.571 -11.406 7.305 QT
-11.406 8.383 -11.305 9.141 QT
-11.203 9.899 -10.75 10.477 QT
-10.297 11.055 -9.359 11.055 QT
cp}def
f1396718688
f
GR
GS
[0.75 0 0 0.75 667.08334 209.8] CT
0.149 GC
N
f-1042494437
f
GR
GS
[0.75 0 0 0.75 667.08334 209.8] CT
0.149 GC
N
f1861641624
f
GR
GS
[0.75 0 0 0.75 737.25 209.8] CT
0.149 GC
N
/f-2016873157{-16.901 15.68 M
-16.901 15.008 L
-14.526 15.008 -14.526 14.414 QT
-14.526 4.43 L
-15.51 4.914 -17.01 4.914 QT
-17.01 4.242 L
-14.682 4.242 -13.495 3.024 QT
-13.229 3.024 L
-13.167 3.024 -13.104 3.078 QT
-13.042 3.133 -13.042 3.196 QT
-13.042 14.414 L
-13.042 15.008 -10.667 15.008 QT
-10.667 15.68 L
-16.901 15.68 L
cp}def
f-2016873157
f
GR
GS
[0.75 0 0 0.75 737.25 209.8] CT
0.149 GC
N
/f1189041138{-4.583 16.102 M
-6.911 16.102 -7.747 14.18 QT
-8.583 12.258 -8.583 9.617 QT
-8.583 7.977 -8.286 6.516 QT
-7.99 5.055 -7.091 4.039 QT
-6.193 3.024 -4.583 3.024 QT
-3.333 3.024 -2.536 3.633 QT
-1.74 4.242 -1.318 5.219 QT
-0.896 6.196 -0.747 7.297 QT
-0.599 8.399 -0.599 9.617 QT
-0.599 11.258 -0.896 12.68 QT
-1.193 14.102 -2.076 15.102 QT
-2.958 16.102 -4.583 16.102 QT
cp
-4.583 15.602 M
-3.521 15.602 -3.005 14.516 QT
-2.49 13.43 -2.365 12.117 QT
-2.24 10.805 -2.24 9.321 QT
-2.24 7.883 -2.365 6.68 QT
-2.49 5.477 -3.005 4.5 QT
-3.521 3.524 -4.583 3.524 QT
-5.661 3.524 -6.177 4.5 QT
-6.693 5.477 -6.818 6.68 QT
-6.943 7.883 -6.943 9.321 QT
-6.943 10.367 -6.888 11.305 QT
-6.833 12.242 -6.615 13.242 QT
-6.396 14.242 -5.896 14.922 QT
-5.396 15.602 -4.583 15.602 QT
cp}def
f1189041138
f
GR
GS
[0.75 0 0 0.75 737.25 209.8] CT
0.149 GC
N
/f1101070870{4.75 16.102 M
2.422 16.102 1.586 14.18 QT
0.75 12.258 0.75 9.617 QT
0.75 7.977 1.047 6.516 QT
1.344 5.055 2.242 4.039 QT
3.141 3.024 4.75 3.024 QT
6 3.024 6.797 3.633 QT
7.594 4.242 8.016 5.219 QT
8.438 6.196 8.586 7.297 QT
8.734 8.399 8.734 9.617 QT
8.734 11.258 8.438 12.68 QT
8.141 14.102 7.258 15.102 QT
6.375 16.102 4.75 16.102 QT
cp
4.75 15.602 M
5.813 15.602 6.328 14.516 QT
6.844 13.43 6.969 12.117 QT
7.094 10.805 7.094 9.321 QT
7.094 7.883 6.969 6.68 QT
6.844 5.477 6.328 4.5 QT
5.813 3.524 4.75 3.524 QT
3.672 3.524 3.156 4.5 QT
2.641 5.477 2.516 6.68 QT
2.391 7.883 2.391 9.321 QT
2.391 10.367 2.445 11.305 QT
2.5 12.242 2.719 13.242 QT
2.938 14.242 3.438 14.922 QT
3.938 15.602 4.75 15.602 QT
cp}def
f1101070870
f
GR
GS
[0.75 0 0 0.75 737.25 209.8] CT
0.149 GC
N
/f1548062913{14.083 16.102 M
11.755 16.102 10.919 14.18 QT
10.083 12.258 10.083 9.617 QT
10.083 7.977 10.38 6.516 QT
10.677 5.055 11.576 4.039 QT
12.474 3.024 14.083 3.024 QT
15.333 3.024 16.13 3.633 QT
16.927 4.242 17.349 5.219 QT
17.771 6.196 17.919 7.297 QT
18.068 8.399 18.068 9.617 QT
18.068 11.258 17.771 12.68 QT
17.474 14.102 16.591 15.102 QT
15.708 16.102 14.083 16.102 QT
cp
14.083 15.602 M
15.146 15.602 15.661 14.516 QT
16.177 13.43 16.302 12.117 QT
16.427 10.805 16.427 9.321 QT
16.427 7.883 16.302 6.68 QT
16.177 5.477 15.661 4.5 QT
15.146 3.524 14.083 3.524 QT
13.005 3.524 12.49 4.5 QT
11.974 5.477 11.849 6.68 QT
11.724 7.883 11.724 9.321 QT
11.724 10.367 11.779 11.305 QT
11.833 12.242 12.052 13.242 QT
12.271 14.242 12.771 14.922 QT
13.271 15.602 14.083 15.602 QT
cp}def
f1548062913
f
GR
GS
[0.75 0 0 0.75 421.50032 227.6] CT
0.149 GC
N
/f-245395128{-31.529 15.133 M
-31.529 14.977 -31.435 14.867 QT
-27.482 10.93 L
-31.435 6.977 L
-31.529 6.883 -31.529 6.727 QT
-31.529 6.586 -31.42 6.469 QT
-31.31 6.352 -31.154 6.352 QT
-31.029 6.352 -30.873 6.461 QT
-26.935 10.399 L
-23.013 6.461 L
-22.857 6.352 -22.732 6.352 QT
-22.576 6.352 -22.467 6.461 QT
-22.357 6.571 -22.357 6.727 QT
-22.357 6.883 -22.451 6.977 QT
-26.404 10.93 L
-22.451 14.867 L
-22.357 14.977 -22.357 15.133 QT
-22.357 15.289 -22.467 15.399 QT
-22.576 15.508 -22.732 15.508 QT
-22.873 15.508 -23.013 15.367 QT
-26.935 11.461 L
-30.873 15.367 L
-30.998 15.508 -31.154 15.508 QT
-31.31 15.508 -31.42 15.391 QT
-31.529 15.274 -31.529 15.133 QT
cp}def
f-245395128
f
GR
GS
[0.75 0 0 0.75 421.50032 227.6] CT
0.149 GC
N
/f44069533{-18.042 15.68 M
-18.042 15.008 L
-15.667 15.008 -15.667 14.414 QT
-15.667 4.43 L
-16.651 4.914 -18.151 4.914 QT
-18.151 4.242 L
-15.823 4.242 -14.636 3.024 QT
-14.37 3.024 L
-14.307 3.024 -14.245 3.078 QT
-14.182 3.133 -14.182 3.196 QT
-14.182 14.414 L
-14.182 15.008 -11.807 15.008 QT
-11.807 15.68 L
-18.042 15.68 L
cp}def
f44069533
f
GR
GS
[0.75 0 0 0.75 421.50032 227.6] CT
0.149 GC
N
/f-1451136477{-5.724 16.102 M
-8.052 16.102 -8.888 14.18 QT
-9.724 12.258 -9.724 9.617 QT
-9.724 7.977 -9.427 6.516 QT
-9.13 5.055 -8.232 4.039 QT
-7.333 3.024 -5.724 3.024 QT
-4.474 3.024 -3.677 3.633 QT
-2.88 4.242 -2.458 5.219 QT
-2.037 6.196 -1.888 7.297 QT
-1.74 8.399 -1.74 9.617 QT
-1.74 11.258 -2.037 12.68 QT
-2.333 14.102 -3.216 15.102 QT
-4.099 16.102 -5.724 16.102 QT
cp
-5.724 15.602 M
-4.662 15.602 -4.146 14.516 QT
-3.63 13.43 -3.505 12.117 QT
-3.38 10.805 -3.38 9.321 QT
-3.38 7.883 -3.505 6.68 QT
-3.63 5.477 -4.146 4.5 QT
-4.662 3.524 -5.724 3.524 QT
-6.802 3.524 -7.318 4.5 QT
-7.833 5.477 -7.958 6.68 QT
-8.083 7.883 -8.083 9.321 QT
-8.083 10.367 -8.029 11.305 QT
-7.974 12.242 -7.755 13.242 QT
-7.537 14.242 -7.037 14.922 QT
-6.537 15.602 -5.724 15.602 QT
cp}def
f-1451136477
f
GR
GS
[0.75 0 0 0.75 421.50032 227.6] CT
0.149 GC
N
/f-14577490{0.094 7.906 M
0.406 8.343 0.922 8.562 QT
1.437 8.781 2.016 8.781 QT
2.781 8.781 3.094 8.133 QT
3.406 7.484 3.406 6.672 QT
3.406 6.297 3.344 5.929 QT
3.281 5.562 3.117 5.25 QT
2.953 4.937 2.68 4.742 QT
2.406 4.547 2.016 4.547 QT
1.141 4.547 L
1.031 4.547 1.031 4.437 QT
1.031 4.312 L
1.031 4.218 1.141 4.218 QT
1.859 4.156 L
2.312 4.156 2.617 3.812 QT
2.922 3.468 3.062 2.976 QT
3.203 2.484 3.203 2.047 QT
3.203 1.422 2.914 1.023 QT
2.625 0.625 2.016 0.625 QT
1.531 0.625 1.078 0.812 QT
0.625 1 0.359 1.375 QT
0.391 1.375 0.406 1.367 QT
0.422 1.359 0.453 1.359 QT
0.734 1.359 0.93 1.562 QT
1.125 1.765 1.125 2.062 QT
1.125 2.343 0.93 2.547 QT
0.734 2.75 0.453 2.75 QT
0.156 2.75 -0.047 2.547 QT
-0.25 2.343 -0.25 2.062 QT
-0.25 1.5 0.086 1.086 QT
0.422 0.672 0.953 0.461 QT
1.484 0.25 2.016 0.25 QT
2.422 0.25 2.859 0.367 QT
3.297 0.484 3.648 0.703 QT
4 0.922 4.226 1.265 QT
4.453 1.609 4.453 2.047 QT
4.453 2.593 4.211 3.054 QT
3.969 3.515 3.539 3.851 QT
3.109 4.187 2.609 4.359 QT
3.172 4.468 3.68 4.781 QT
4.187 5.093 4.492 5.593 QT
4.797 6.093 4.797 6.656 QT
4.797 7.375 4.406 7.953 QT
4.016 8.531 3.375 8.859 QT
2.734 9.187 2.016 9.187 QT
1.406 9.187 0.797 8.961 QT
0.187 8.734 -0.203 8.265 QT
-0.594 7.797 -0.594 7.156 QT
-0.594 6.828 -0.375 6.617 QT
-0.156 6.406 0.156 6.406 QT
0.375 6.406 0.547 6.5 QT
0.719 6.593 0.82 6.773 QT
0.922 6.953 0.922 7.156 QT
0.922 7.468 0.695 7.687 QT
0.469 7.906 0.156 7.906 QT
0.094 7.906 L
cp}def
f-14577490
f
GR
GS
[0.75 0 0 0.75 421.50032 227.6] CT
0.149 GC
N
/f1598484207{13.111 15.68 M
13.111 15.008 L
13.767 15.008 14.181 14.906 QT
14.595 14.805 14.595 14.414 QT
14.595 9.227 L
14.595 8.711 14.447 8.485 QT
14.298 8.258 14.009 8.203 QT
13.72 8.149 13.111 8.149 QT
13.111 7.492 L
15.876 7.289 L
15.876 9.133 L
16.251 8.321 17.001 7.805 QT
17.751 7.289 18.626 7.289 QT
20.814 7.289 21.189 9.071 QT
21.579 8.274 22.314 7.781 QT
23.048 7.289 23.908 7.289 QT
24.783 7.289 25.369 7.563 QT
25.954 7.836 26.251 8.406 QT
26.548 8.977 26.548 9.852 QT
26.548 14.414 L
26.548 14.805 26.97 14.906 QT
27.392 15.008 28.033 15.008 QT
28.033 15.68 L
23.689 15.68 L
23.689 15.008 L
24.329 15.008 24.751 14.906 QT
25.173 14.805 25.173 14.414 QT
25.173 9.899 L
25.173 8.946 24.9 8.36 QT
24.626 7.774 23.798 7.774 QT
22.704 7.774 21.986 8.656 QT
21.267 9.539 21.267 10.664 QT
21.267 14.414 L
21.267 14.805 21.689 14.906 QT
22.111 15.008 22.751 15.008 QT
22.751 15.68 L
18.408 15.68 L
18.408 15.008 L
19.048 15.008 19.47 14.906 QT
19.892 14.805 19.892 14.414 QT
19.892 9.899 L
19.892 8.977 19.619 8.375 QT
19.345 7.774 18.517 7.774 QT
17.408 7.774 16.697 8.656 QT
15.986 9.539 15.986 10.664 QT
15.986 14.414 L
15.986 14.805 16.408 14.906 QT
16.829 15.008 17.47 15.008 QT
17.47 15.68 L
13.111 15.68 L
cp}def
f1598484207
f
GR
GS
[0.75 0 0 0.75 0 0.25] CT
0.149 GC
2 setlinecap
1 LJ
0.667 LW
N
141 273 M
141 56 L
S
GR
GS
[0.75 0 0 0.75 0 0.25] CT
0.149 GC
2 setlinecap
1 LJ
0.667 LW
N
983 273 M
983 56 L
S
GR
GS
[0.75 0 0 0.75 0 0.25] CT
0.149 GC
2 setlinecap
1 LJ
0.667 LW
N
141 273 M
149.42 273 L
S
GR
GS
[0.75 0 0 0.75 0 0.25] CT
0.149 GC
2 setlinecap
1 LJ
0.667 LW
N
141 200.667 M
149.42 200.667 L
S
GR
GS
[0.75 0 0 0.75 0 0.25] CT
0.149 GC
2 setlinecap
1 LJ
0.667 LW
N
141 128.333 M
149.42 128.333 L
S
GR
GS
[0.75 0 0 0.75 0 0.25] CT
0.149 GC
2 setlinecap
1 LJ
0.667 LW
N
141 56 M
149.42 56 L
S
GR
GS
[0.75 0 0 0.75 0 0.25] CT
0.149 GC
2 setlinecap
1 LJ
0.667 LW
N
983 273 M
974.58 273 L
S
GR
GS
[0.75 0 0 0.75 0 0.25] CT
0.149 GC
2 setlinecap
1 LJ
0.667 LW
N
983 200.667 M
974.58 200.667 L
S
GR
GS
[0.75 0 0 0.75 0 0.25] CT
0.149 GC
2 setlinecap
1 LJ
0.667 LW
N
983 128.333 M
974.58 128.333 L
S
GR
GS
[0.75 0 0 0.75 0 0.25] CT
0.149 GC
2 setlinecap
1 LJ
0.667 LW
N
983 56 M
974.58 56 L
S
GR
GS
[0.75 0 0 0.75 100.95 205] CT
0.149 GC
N
/f-373173538{-4.583 4.902 M
-6.911 4.902 -7.747 2.98 QT
-8.583 1.058 -8.583 -1.583 QT
-8.583 -3.223 -8.286 -4.684 QT
-7.99 -6.145 -7.091 -7.161 QT
-6.193 -8.176 -4.583 -8.176 QT
-3.333 -8.176 -2.536 -7.567 QT
-1.74 -6.958 -1.318 -5.981 QT
-0.896 -5.004 -0.747 -3.903 QT
-0.599 -2.801 -0.599 -1.583 QT
-0.599 0.058 -0.896 1.48 QT
-1.193 2.902 -2.076 3.902 QT
-2.958 4.902 -4.583 4.902 QT
cp
-4.583 4.402 M
-3.521 4.402 -3.005 3.316 QT
-2.49 2.23 -2.365 0.917 QT
-2.24 -0.395 -2.24 -1.879 QT
-2.24 -3.317 -2.365 -4.52 QT
-2.49 -5.723 -3.005 -6.7 QT
-3.521 -7.676 -4.583 -7.676 QT
-5.661 -7.676 -6.177 -6.7 QT
-6.693 -5.723 -6.818 -4.52 QT
-6.943 -3.317 -6.943 -1.879 QT
-6.943 -0.833 -6.888 0.105 QT
-6.833 1.042 -6.615 2.042 QT
-6.396 3.042 -5.896 3.722 QT
-5.396 4.402 -4.583 4.402 QT
cp}def
f-373173538
f
GR
GS
[0.75 0 0 0.75 100.95 150.75] CT
0.149 GC
N
/f-678916455{-28.435 4.902 M
-30.763 4.902 -31.599 2.98 QT
-32.435 1.058 -32.435 -1.583 QT
-32.435 -3.223 -32.138 -4.684 QT
-31.842 -6.145 -30.943 -7.161 QT
-30.045 -8.176 -28.435 -8.176 QT
-27.185 -8.176 -26.388 -7.567 QT
-25.592 -6.958 -25.17 -5.981 QT
-24.748 -5.004 -24.599 -3.903 QT
-24.451 -2.801 -24.451 -1.583 QT
-24.451 0.058 -24.748 1.48 QT
-25.045 2.902 -25.927 3.902 QT
-26.81 4.902 -28.435 4.902 QT
cp
-28.435 4.402 M
-27.373 4.402 -26.857 3.316 QT
-26.342 2.23 -26.217 0.917 QT
-26.092 -0.395 -26.092 -1.879 QT
-26.092 -3.317 -26.217 -4.52 QT
-26.342 -5.723 -26.857 -6.7 QT
-27.373 -7.676 -28.435 -7.676 QT
-29.513 -7.676 -30.029 -6.7 QT
-30.545 -5.723 -30.67 -4.52 QT
-30.795 -3.317 -30.795 -1.879 QT
-30.795 -0.833 -30.74 0.105 QT
-30.685 1.042 -30.467 2.042 QT
-30.248 3.042 -29.748 3.722 QT
-29.248 4.402 -28.435 4.402 QT
cp}def
f-678916455
f
GR
GS
[0.75 0 0 0.75 100.95 150.75] CT
0.149 GC
N
/f-1316819350{-22.258 3.433 M
-22.258 3.011 -21.938 2.699 QT
-21.618 2.386 -21.211 2.386 QT
-20.946 2.386 -20.696 2.527 QT
-20.446 2.667 -20.305 2.917 QT
-20.164 3.167 -20.164 3.433 QT
-20.164 3.855 -20.469 4.167 QT
-20.774 4.48 -21.211 4.48 QT
-21.618 4.48 -21.938 4.167 QT
-22.258 3.855 -22.258 3.433 QT
cp}def
f-1316819350
f
GR
GS
[0.75 0 0 0.75 100.95 150.75] CT
0.149 GC
N
/f1423227454{-13.917 4.902 M
-16.245 4.902 -17.081 2.98 QT
-17.917 1.058 -17.917 -1.583 QT
-17.917 -3.223 -17.62 -4.684 QT
-17.323 -6.145 -16.425 -7.161 QT
-15.526 -8.176 -13.917 -8.176 QT
-12.667 -8.176 -11.87 -7.567 QT
-11.073 -6.958 -10.651 -5.981 QT
-10.229 -5.004 -10.081 -3.903 QT
-9.932 -2.801 -9.932 -1.583 QT
-9.932 0.058 -10.229 1.48 QT
-10.526 2.902 -11.409 3.902 QT
-12.292 4.902 -13.917 4.902 QT
cp
-13.917 4.402 M
-12.854 4.402 -12.339 3.316 QT
-11.823 2.23 -11.698 0.917 QT
-11.573 -0.395 -11.573 -1.879 QT
-11.573 -3.317 -11.698 -4.52 QT
-11.823 -5.723 -12.339 -6.7 QT
-12.854 -7.676 -13.917 -7.676 QT
-14.995 -7.676 -15.51 -6.7 QT
-16.026 -5.723 -16.151 -4.52 QT
-16.276 -3.317 -16.276 -1.879 QT
-16.276 -0.833 -16.221 0.105 QT
-16.167 1.042 -15.948 2.042 QT
-15.729 3.042 -15.229 3.722 QT
-14.729 4.402 -13.917 4.402 QT
cp}def
f1423227454
f
GR
GS
[0.75 0 0 0.75 100.95 150.75] CT
0.149 GC
N
/f-344800598{-7.568 4.48 M
-7.568 3.808 L
-5.193 3.808 -5.193 3.214 QT
-5.193 -6.77 L
-6.177 -6.286 -7.677 -6.286 QT
-7.677 -6.958 L
-5.349 -6.958 -4.161 -8.176 QT
-3.896 -8.176 L
-3.833 -8.176 -3.771 -8.122 QT
-3.708 -8.067 -3.708 -8.004 QT
-3.708 3.214 L
-3.708 3.808 -1.333 3.808 QT
-1.333 4.48 L
-7.568 4.48 L
cp}def
f-344800598
f
GR
GS
[0.75 0 0 0.75 100.95 96.50001] CT
0.149 GC
N
f-678916455
f
GR
GS
[0.75 0 0 0.75 100.95 96.50001] CT
0.149 GC
N
f-1316819350
f
GR
GS
[0.75 0 0 0.75 100.95 96.50001] CT
0.149 GC
N
f1423227454
f
GR
GS
[0.75 0 0 0.75 100.95 96.50001] CT
0.149 GC
N
/f221929001{-8.38 4.48 M
-8.38 3.964 L
-8.38 3.917 -8.349 3.871 QT
-5.396 0.605 L
-4.724 -0.129 -4.31 -0.614 QT
-3.896 -1.098 -3.49 -1.739 QT
-3.083 -2.379 -2.849 -3.044 QT
-2.615 -3.708 -2.615 -4.458 QT
-2.615 -5.239 -2.896 -5.95 QT
-3.177 -6.661 -3.747 -7.083 QT
-4.318 -7.504 -5.13 -7.504 QT
-5.958 -7.504 -6.615 -7.012 QT
-7.271 -6.52 -7.536 -5.723 QT
-7.474 -5.739 -7.333 -5.739 QT
-6.911 -5.739 -6.607 -5.458 QT
-6.302 -5.176 -6.302 -4.708 QT
-6.302 -4.286 -6.607 -3.981 QT
-6.911 -3.676 -7.333 -3.676 QT
-7.786 -3.676 -8.083 -3.989 QT
-8.38 -4.301 -8.38 -4.708 QT
-8.38 -5.426 -8.115 -6.051 QT
-7.849 -6.676 -7.341 -7.169 QT
-6.833 -7.661 -6.201 -7.919 QT
-5.568 -8.176 -4.849 -8.176 QT
-3.771 -8.176 -2.833 -7.715 QT
-1.896 -7.254 -1.349 -6.419 QT
-0.802 -5.583 -0.802 -4.458 QT
-0.802 -3.629 -1.161 -2.887 QT
-1.521 -2.145 -2.083 -1.536 QT
-2.646 -0.926 -3.529 -0.161 QT
-4.411 0.605 -4.693 0.871 QT
-6.849 2.933 L
-5.021 2.933 L
-3.677 2.933 -2.771 2.91 QT
-1.865 2.886 -1.802 2.839 QT
-1.583 2.605 -1.349 1.089 QT
-0.802 1.089 L
-1.333 4.48 L
-8.38 4.48 L
cp}def
f221929001
f
GR
GS
[0.75 0 0 0.75 100.95 42.25] CT
0.149 GC
N
f-678916455
f
GR
GS
[0.75 0 0 0.75 100.95 42.25] CT
0.149 GC
N
f-1316819350
f
GR
GS
[0.75 0 0 0.75 100.95 42.25] CT
0.149 GC
N
f1423227454
f
GR
GS
[0.75 0 0 0.75 100.95 42.25] CT
0.149 GC
N
/f1211359623{-7.521 3.011 M
-7.083 3.667 -6.333 3.98 QT
-5.583 4.292 -4.708 4.292 QT
-3.615 4.292 -3.146 3.355 QT
-2.677 2.417 -2.677 1.214 QT
-2.677 0.683 -2.779 0.144 QT
-2.88 -0.395 -3.107 -0.864 QT
-3.333 -1.333 -3.74 -1.606 QT
-4.146 -1.879 -4.724 -1.879 QT
-5.99 -1.879 L
-6.161 -1.879 -6.161 -2.067 QT
-6.161 -2.223 L
-6.161 -2.379 -5.99 -2.379 QT
-4.943 -2.458 L
-4.271 -2.458 -3.833 -2.958 QT
-3.396 -3.458 -3.193 -4.176 QT
-2.99 -4.895 -2.99 -5.551 QT
-2.99 -6.458 -3.411 -7.044 QT
-3.833 -7.629 -4.708 -7.629 QT
-5.443 -7.629 -6.099 -7.356 QT
-6.755 -7.083 -7.146 -6.52 QT
-7.099 -6.536 -7.076 -6.536 QT
-7.052 -6.536 -7.021 -6.536 QT
-6.583 -6.536 -6.294 -6.239 QT
-6.005 -5.942 -6.005 -5.536 QT
-6.005 -5.129 -6.294 -4.833 QT
-6.583 -4.536 -7.021 -4.536 QT
-7.427 -4.536 -7.724 -4.833 QT
-8.021 -5.129 -8.021 -5.536 QT
-8.021 -6.348 -7.529 -6.95 QT
-7.036 -7.551 -6.263 -7.864 QT
-5.49 -8.176 -4.708 -8.176 QT
-4.13 -8.176 -3.497 -8.004 QT
-2.865 -7.833 -2.341 -7.512 QT
-1.818 -7.192 -1.49 -6.692 QT
-1.161 -6.192 -1.161 -5.551 QT
-1.161 -4.754 -1.521 -4.075 QT
-1.88 -3.395 -2.497 -2.903 QT
-3.115 -2.411 -3.865 -2.176 QT
-3.036 -2.02 -2.294 -1.551 QT
-1.552 -1.083 -1.099 -0.364 QT
-0.646 0.355 -0.646 1.199 QT
-0.646 2.246 -1.224 3.097 QT
-1.802 3.949 -2.74 4.425 QT
-3.677 4.902 -4.708 4.902 QT
-5.599 4.902 -6.497 4.558 QT
-7.396 4.214 -7.966 3.542 QT
-8.536 2.871 -8.536 1.917 QT
-8.536 1.449 -8.224 1.128 QT
-7.911 0.808 -7.427 0.808 QT
-7.13 0.808 -6.872 0.956 QT
-6.615 1.105 -6.474 1.363 QT
-6.333 1.621 -6.333 1.917 QT
-6.333 2.386 -6.654 2.699 QT
-6.974 3.011 -7.427 3.011 QT
-7.521 3.011 L
cp}def
f1211359623
f
GR
GS
[0 -0.75 0.75 0 73.06103 123.62493] CT
0.149 GC
N
/f-1873144472{-37.481 -6.72 M
-37.481 -7.392 L
-35.512 -7.392 -35.512 -7.986 QT
-35.512 -18.423 L
-35.512 -19.033 -37.481 -19.033 QT
-37.481 -19.704 L
-26.731 -19.704 L
-26.2 -15.345 L
-26.747 -15.345 L
-26.95 -16.986 -27.317 -17.728 QT
-27.684 -18.47 -28.489 -18.751 QT
-29.294 -19.033 -30.919 -19.033 QT
-32.778 -19.033 L
-33.122 -19.033 -33.309 -19.001 QT
-33.497 -18.97 -33.622 -18.837 QT
-33.747 -18.704 -33.747 -18.423 QT
-33.747 -13.783 L
-32.341 -13.783 L
-31.372 -13.783 -30.895 -13.947 QT
-30.419 -14.111 -30.239 -14.572 QT
-30.059 -15.033 -30.059 -16.001 QT
-29.512 -16.001 L
-29.512 -10.908 L
-30.059 -10.908 L
-30.059 -11.876 -30.239 -12.337 QT
-30.419 -12.798 -30.895 -12.962 QT
-31.372 -13.126 -32.341 -13.126 QT
-33.747 -13.126 L
-33.747 -7.986 L
-33.747 -7.579 -33.512 -7.486 QT
-33.278 -7.392 -32.778 -7.392 QT
-30.762 -7.392 L
-29.45 -7.392 -28.637 -7.595 QT
-27.825 -7.798 -27.372 -8.29 QT
-26.919 -8.783 -26.677 -9.556 QT
-26.434 -10.329 -26.216 -11.704 QT
-25.669 -11.704 L
-26.466 -6.72 L
-37.481 -6.72 L
cp}def
f-1873144472
f
GR
GS
[0 -0.75 0.75 0 73.06103 123.62493] CT
0.149 GC
N
/f338623899{-24.871 -6.72 M
-24.871 -7.392 L
-24.215 -7.392 -23.801 -7.494 QT
-23.387 -7.595 -23.387 -7.986 QT
-23.387 -13.173 L
-23.387 -13.689 -23.535 -13.915 QT
-23.684 -14.142 -23.973 -14.197 QT
-24.262 -14.251 -24.871 -14.251 QT
-24.871 -14.908 L
-22.152 -15.111 L
-22.152 -13.267 L
-21.84 -14.079 -21.277 -14.595 QT
-20.715 -15.111 -19.902 -15.111 QT
-19.34 -15.111 -18.895 -14.783 QT
-18.449 -14.454 -18.449 -13.908 QT
-18.449 -13.564 -18.692 -13.306 QT
-18.934 -13.048 -19.293 -13.048 QT
-19.652 -13.048 -19.902 -13.298 QT
-20.152 -13.548 -20.152 -13.908 QT
-20.152 -14.408 -19.793 -14.626 QT
-19.902 -14.626 L
-20.668 -14.626 -21.152 -14.072 QT
-21.637 -13.517 -21.848 -12.689 QT
-22.059 -11.861 -22.059 -11.111 QT
-22.059 -7.986 L
-22.059 -7.392 -20.199 -7.392 QT
-20.199 -6.72 L
-24.871 -6.72 L
cp}def
f338623899
f
GR
GS
[0 -0.75 0.75 0 73.06103 123.62493] CT
0.149 GC
N
/f1053144195{-17.56 -6.72 M
-17.56 -7.392 L
-16.904 -7.392 -16.49 -7.494 QT
-16.076 -7.595 -16.076 -7.986 QT
-16.076 -13.173 L
-16.076 -13.689 -16.224 -13.915 QT
-16.373 -14.142 -16.662 -14.197 QT
-16.951 -14.251 -17.56 -14.251 QT
-17.56 -14.908 L
-14.841 -15.111 L
-14.841 -13.267 L
-14.529 -14.079 -13.966 -14.595 QT
-13.404 -15.111 -12.591 -15.111 QT
-12.029 -15.111 -11.584 -14.783 QT
-11.138 -14.454 -11.138 -13.908 QT
-11.138 -13.564 -11.38 -13.306 QT
-11.623 -13.048 -11.982 -13.048 QT
-12.341 -13.048 -12.591 -13.298 QT
-12.841 -13.548 -12.841 -13.908 QT
-12.841 -14.408 -12.482 -14.626 QT
-12.591 -14.626 L
-13.357 -14.626 -13.841 -14.072 QT
-14.326 -13.517 -14.537 -12.689 QT
-14.748 -11.861 -14.748 -11.111 QT
-14.748 -7.986 L
-14.748 -7.392 -12.888 -7.392 QT
-12.888 -6.72 L
-17.56 -6.72 L
cp}def
f1053144195
f
GR
GS
[0 -0.75 0.75 0 73.06103 123.62493] CT
0.149 GC
N
/f-288142368{-5.983 -6.501 M
-7.124 -6.501 -8.101 -7.087 QT
-9.077 -7.673 -9.64 -8.642 QT
-10.202 -9.611 -10.202 -10.767 QT
-10.202 -11.642 -9.89 -12.447 QT
-9.577 -13.251 -8.999 -13.884 QT
-8.421 -14.517 -7.655 -14.876 QT
-6.89 -15.236 -5.983 -15.236 QT
-4.811 -15.236 -3.851 -14.619 QT
-2.89 -14.001 -2.335 -12.97 QT
-1.78 -11.939 -1.78 -10.767 QT
-1.78 -9.626 -2.343 -8.65 QT
-2.905 -7.673 -3.882 -7.087 QT
-4.858 -6.501 -5.983 -6.501 QT
cp
-5.983 -7.064 M
-4.468 -7.064 -3.952 -8.165 QT
-3.436 -9.267 -3.436 -10.986 QT
-3.436 -11.939 -3.538 -12.564 QT
-3.64 -13.189 -3.983 -13.704 QT
-4.202 -14.017 -4.53 -14.251 QT
-4.858 -14.486 -5.226 -14.611 QT
-5.593 -14.736 -5.983 -14.736 QT
-6.577 -14.736 -7.108 -14.47 QT
-7.64 -14.204 -7.999 -13.704 QT
-8.343 -13.158 -8.444 -12.517 QT
-8.546 -11.876 -8.546 -10.986 QT
-8.546 -9.908 -8.358 -9.064 QT
-8.171 -8.22 -7.608 -7.642 QT
-7.046 -7.064 -5.983 -7.064 QT
cp}def
f-288142368
f
GR
GS
[0 -0.75 0.75 0 73.06103 123.62493] CT
0.149 GC
N
/f-1104219119{-0.916 -6.72 M
-0.916 -7.392 L
-0.259 -7.392 0.155 -7.494 QT
0.569 -7.595 0.569 -7.986 QT
0.569 -13.173 L
0.569 -13.689 0.42 -13.915 QT
0.272 -14.142 -0.017 -14.197 QT
-0.306 -14.251 -0.916 -14.251 QT
-0.916 -14.908 L
1.803 -15.111 L
1.803 -13.267 L
2.116 -14.079 2.678 -14.595 QT
3.241 -15.111 4.053 -15.111 QT
4.616 -15.111 5.061 -14.783 QT
5.506 -14.454 5.506 -13.908 QT
5.506 -13.564 5.264 -13.306 QT
5.022 -13.048 4.662 -13.048 QT
4.303 -13.048 4.053 -13.298 QT
3.803 -13.548 3.803 -13.908 QT
3.803 -14.408 4.162 -14.626 QT
4.053 -14.626 L
3.287 -14.626 2.803 -14.072 QT
2.319 -13.517 2.108 -12.689 QT
1.897 -11.861 1.897 -11.111 QT
1.897 -7.986 L
1.897 -7.392 3.756 -7.392 QT
3.756 -6.72 L
-0.916 -6.72 L
cp}def
f-1104219119
f
GR
GS
[0 -0.75 0.75 0 73.06103 123.62493] CT
0.149 GC
N
/f-1892279341{14.383 -1.97 M
14.383 -20.97 L
16.977 -20.97 L
16.977 -20.204 L
15.133 -20.204 L
15.133 -2.736 L
16.977 -2.736 L
16.977 -1.97 L
14.383 -1.97 L
cp}def
f-1892279341
f
GR
GS
[0 -0.75 0.75 0 73.06103 123.62493] CT
0.149 GC
N
/f-932443045{17.881 -6.72 M
17.881 -7.392 L
18.537 -7.392 18.951 -7.494 QT
19.365 -7.595 19.365 -7.986 QT
19.365 -13.173 L
19.365 -13.689 19.217 -13.915 QT
19.069 -14.142 18.779 -14.197 QT
18.49 -14.251 17.881 -14.251 QT
17.881 -14.908 L
20.647 -15.111 L
20.647 -13.267 L
21.022 -14.079 21.772 -14.595 QT
22.522 -15.111 23.397 -15.111 QT
25.584 -15.111 25.959 -13.329 QT
26.35 -14.126 27.084 -14.619 QT
27.819 -15.111 28.678 -15.111 QT
29.553 -15.111 30.139 -14.837 QT
30.725 -14.564 31.022 -13.994 QT
31.319 -13.423 31.319 -12.548 QT
31.319 -7.986 L
31.319 -7.595 31.74 -7.494 QT
32.162 -7.392 32.803 -7.392 QT
32.803 -6.72 L
28.459 -6.72 L
28.459 -7.392 L
29.1 -7.392 29.522 -7.494 QT
29.944 -7.595 29.944 -7.986 QT
29.944 -12.501 L
29.944 -13.454 29.67 -14.04 QT
29.397 -14.626 28.569 -14.626 QT
27.475 -14.626 26.756 -13.744 QT
26.037 -12.861 26.037 -11.736 QT
26.037 -7.986 L
26.037 -7.595 26.459 -7.494 QT
26.881 -7.392 27.522 -7.392 QT
27.522 -6.72 L
23.178 -6.72 L
23.178 -7.392 L
23.819 -7.392 24.24 -7.494 QT
24.662 -7.595 24.662 -7.986 QT
24.662 -12.501 L
24.662 -13.423 24.389 -14.025 QT
24.115 -14.626 23.287 -14.626 QT
22.178 -14.626 21.467 -13.744 QT
20.756 -12.861 20.756 -11.736 QT
20.756 -7.986 L
20.756 -7.595 21.178 -7.494 QT
21.6 -7.392 22.24 -7.392 QT
22.24 -6.72 L
17.881 -6.72 L
cp}def
f-932443045
f
GR
GS
[0 -0.75 0.75 0 73.06103 123.62493] CT
0.149 GC
N
/f395337855{33.296 -1.97 M
33.296 -2.736 L
35.14 -2.736 L
35.14 -20.204 L
33.296 -20.204 L
33.296 -20.97 L
35.905 -20.97 L
35.905 -1.97 L
33.296 -1.97 L
cp}def
f395337855
f
GR
GS
[0.75 0 0 0.75 421.50041 39.3625] CT
N
/f-1852004673{-170.538 -7.095 M
-170.538 -12.001 L
-170.538 -12.158 -170.351 -12.158 QT
-170.085 -12.158 L
-170.023 -12.158 -169.976 -12.111 QT
-169.929 -12.064 -169.929 -12.001 QT
-169.929 -9.939 -168.648 -8.806 QT
-167.367 -7.673 -165.304 -7.673 QT
-164.57 -7.673 -163.953 -8.095 QT
-163.335 -8.517 -162.999 -9.197 QT
-162.663 -9.876 -162.663 -10.595 QT
-162.663 -11.236 -162.913 -11.837 QT
-163.163 -12.439 -163.648 -12.876 QT
-164.132 -13.314 -164.742 -13.47 QT
-167.46 -14.126 L
-168.82 -14.486 -169.679 -15.603 QT
-170.538 -16.72 -170.538 -18.095 QT
-170.538 -19.189 -169.984 -20.142 QT
-169.429 -21.095 -168.492 -21.65 QT
-167.554 -22.205 -166.46 -22.205 QT
-164.351 -22.205 -163.117 -20.767 QT
-162.257 -22.142 L
-162.195 -22.205 -162.117 -22.205 QT
-161.976 -22.205 L
-161.913 -22.205 -161.851 -22.158 QT
-161.788 -22.111 -161.788 -22.017 QT
-161.788 -17.158 L
-161.788 -16.97 -161.976 -16.97 QT
-162.21 -16.97 L
-162.413 -16.97 -162.413 -17.158 QT
-162.413 -17.689 -162.593 -18.322 QT
-162.773 -18.955 -163.085 -19.541 QT
-163.398 -20.126 -163.773 -20.501 QT
-164.788 -21.517 -166.46 -21.517 QT
-167.179 -21.517 -167.781 -21.158 QT
-168.382 -20.798 -168.742 -20.173 QT
-169.101 -19.548 -169.101 -18.861 QT
-169.101 -17.955 -168.546 -17.22 QT
-167.992 -16.486 -167.085 -16.251 QT
-164.351 -15.58 L
-163.679 -15.423 -163.078 -14.994 QT
-162.476 -14.564 -162.078 -14.001 QT
-161.679 -13.439 -161.453 -12.751 QT
-161.226 -12.064 -161.226 -11.314 QT
-161.226 -10.189 -161.749 -9.173 QT
-162.273 -8.158 -163.226 -7.541 QT
-164.179 -6.923 -165.304 -6.923 QT
-165.992 -6.923 -166.726 -7.08 QT
-167.46 -7.236 -168.07 -7.556 QT
-168.679 -7.876 -169.195 -8.376 QT
-170.07 -6.986 L
-170.132 -6.923 -170.226 -6.923 QT
-170.351 -6.923 L
-170.538 -6.923 -170.538 -7.095 QT
cp}def
f-1852004673
f
GR
GS
[0.75 0 0 0.75 421.50041 39.3625] CT
N
/f1754110607{-158.162 -9.908 M
-158.162 -15.705 L
-159.897 -15.705 L
-159.897 -16.251 L
-158.522 -16.251 -157.881 -17.533 QT
-157.24 -18.814 -157.24 -20.314 QT
-156.631 -20.314 L
-156.631 -16.439 L
-153.662 -16.439 L
-153.662 -15.705 L
-156.631 -15.705 L
-156.631 -9.955 L
-156.631 -9.08 -156.342 -8.423 QT
-156.053 -7.767 -155.287 -7.767 QT
-154.569 -7.767 -154.248 -8.462 QT
-153.928 -9.158 -153.928 -9.955 QT
-153.928 -11.189 L
-153.334 -11.189 L
-153.334 -9.908 L
-153.334 -9.251 -153.576 -8.611 QT
-153.819 -7.97 -154.287 -7.564 QT
-154.756 -7.158 -155.428 -7.158 QT
-156.694 -7.158 -157.428 -7.908 QT
-158.162 -8.658 -158.162 -9.908 QT
cp}def
f1754110607
f
GR
GS
[0.75 0 0 0.75 421.50041 39.3625] CT
N
/f2027263470{-151.474 -9.455 M
-151.474 -10.705 -150.49 -11.486 QT
-149.505 -12.267 -148.13 -12.595 QT
-146.755 -12.923 -145.505 -12.923 QT
-145.505 -13.783 L
-145.505 -14.392 -145.771 -14.955 QT
-146.036 -15.517 -146.544 -15.884 QT
-147.052 -16.251 -147.646 -16.251 QT
-149.052 -16.251 -149.771 -15.626 QT
-149.38 -15.626 -149.115 -15.322 QT
-148.849 -15.017 -148.849 -14.626 QT
-148.849 -14.205 -149.146 -13.908 QT
-149.443 -13.611 -149.849 -13.611 QT
-150.271 -13.611 -150.568 -13.908 QT
-150.865 -14.205 -150.865 -14.626 QT
-150.865 -15.736 -149.865 -16.267 QT
-148.865 -16.798 -147.646 -16.798 QT
-146.802 -16.798 -145.943 -16.439 QT
-145.083 -16.08 -144.529 -15.4 QT
-143.974 -14.72 -143.974 -13.814 QT
-143.974 -9.095 L
-143.974 -8.689 -143.802 -8.345 QT
-143.63 -8.001 -143.271 -8.001 QT
-142.911 -8.001 -142.747 -8.345 QT
-142.583 -8.689 -142.583 -9.095 QT
-142.583 -10.439 L
-141.958 -10.439 L
-141.958 -9.095 L
-141.958 -8.626 -142.208 -8.197 QT
-142.458 -7.767 -142.872 -7.517 QT
-143.286 -7.267 -143.771 -7.267 QT
-144.38 -7.267 -144.826 -7.744 QT
-145.271 -8.22 -145.318 -8.876 QT
-145.708 -8.095 -146.466 -7.626 QT
-147.224 -7.158 -148.099 -7.158 QT
-148.896 -7.158 -149.669 -7.392 QT
-150.443 -7.626 -150.958 -8.134 QT
-151.474 -8.642 -151.474 -9.455 QT
cp
-149.771 -9.455 M
-149.771 -8.72 -149.232 -8.212 QT
-148.693 -7.705 -147.943 -7.705 QT
-147.271 -7.705 -146.716 -8.048 QT
-146.161 -8.392 -145.833 -8.97 QT
-145.505 -9.548 -145.505 -10.205 QT
-145.505 -12.392 L
-146.458 -12.392 -147.458 -12.08 QT
-148.458 -11.767 -149.115 -11.095 QT
-149.771 -10.423 -149.771 -9.455 QT
cp}def
f2027263470
f
GR
GS
[0.75 0 0 0.75 421.50041 39.3625] CT
N
/f-544445688{-141.426 -7.392 M
-141.426 -8.126 L
-140.707 -8.126 -140.246 -8.244 QT
-139.785 -8.361 -139.785 -8.798 QT
-139.785 -14.533 L
-139.785 -15.095 -139.957 -15.345 QT
-140.129 -15.595 -140.442 -15.65 QT
-140.754 -15.705 -141.426 -15.705 QT
-141.426 -16.439 L
-138.379 -16.673 L
-138.379 -14.626 L
-137.957 -15.517 -137.129 -16.095 QT
-136.301 -16.673 -135.332 -16.673 QT
-133.879 -16.673 -133.145 -15.978 QT
-132.41 -15.283 -132.41 -13.845 QT
-132.41 -8.798 L
-132.41 -8.361 -131.949 -8.244 QT
-131.489 -8.126 -130.77 -8.126 QT
-130.77 -7.392 L
-135.582 -7.392 L
-135.582 -8.126 L
-134.864 -8.126 -134.403 -8.244 QT
-133.942 -8.361 -133.942 -8.798 QT
-133.942 -13.783 L
-133.942 -14.798 -134.239 -15.462 QT
-134.535 -16.126 -135.457 -16.126 QT
-136.676 -16.126 -137.465 -15.15 QT
-138.254 -14.173 -138.254 -12.939 QT
-138.254 -8.798 L
-138.254 -8.361 -137.785 -8.244 QT
-137.317 -8.126 -136.614 -8.126 QT
-136.614 -7.392 L
-141.426 -7.392 L
cp}def
f-544445688
f
GR
GS
[0.75 0 0 0.75 421.50041 39.3625] CT
N
/f928587463{-125.519 -7.158 M
-126.753 -7.158 -127.784 -7.83 QT
-128.815 -8.501 -129.378 -9.595 QT
-129.94 -10.689 -129.94 -11.923 QT
-129.94 -13.189 -129.323 -14.283 QT
-128.706 -15.376 -127.636 -16.025 QT
-126.565 -16.673 -125.284 -16.673 QT
-124.519 -16.673 -123.831 -16.353 QT
-123.144 -16.033 -122.644 -15.455 QT
-122.644 -19.814 L
-122.644 -20.376 -122.815 -20.634 QT
-122.987 -20.892 -123.3 -20.947 QT
-123.612 -21.001 -124.269 -21.001 QT
-124.269 -21.736 L
-121.175 -21.97 L
-121.175 -9.298 L
-121.175 -8.751 -121.003 -8.494 QT
-120.831 -8.236 -120.519 -8.181 QT
-120.206 -8.126 -119.534 -8.126 QT
-119.534 -7.392 L
-122.706 -7.158 L
-122.706 -8.486 L
-123.253 -7.861 -124.003 -7.509 QT
-124.753 -7.158 -125.519 -7.158 QT
cp
-127.659 -9.22 M
-127.3 -8.533 -126.698 -8.119 QT
-126.097 -7.705 -125.394 -7.705 QT
-124.519 -7.705 -123.792 -8.212 QT
-123.065 -8.72 -122.706 -9.517 QT
-122.706 -14.548 L
-122.956 -15.017 -123.331 -15.376 QT
-123.706 -15.736 -124.167 -15.931 QT
-124.628 -16.126 -125.159 -16.126 QT
-126.253 -16.126 -126.917 -15.509 QT
-127.581 -14.892 -127.855 -13.923 QT
-128.128 -12.955 -128.128 -11.908 QT
-128.128 -11.064 -128.034 -10.439 QT
-127.94 -9.814 -127.659 -9.22 QT
cp}def
f928587463
f
GR
GS
[0.75 0 0 0.75 421.50041 39.3625] CT
N
/f-285524450{-118.392 -9.455 M
-118.392 -10.705 -117.408 -11.486 QT
-116.424 -12.267 -115.049 -12.595 QT
-113.674 -12.923 -112.424 -12.923 QT
-112.424 -13.783 L
-112.424 -14.392 -112.689 -14.955 QT
-112.955 -15.517 -113.463 -15.884 QT
-113.971 -16.251 -114.564 -16.251 QT
-115.971 -16.251 -116.689 -15.626 QT
-116.299 -15.626 -116.033 -15.322 QT
-115.767 -15.017 -115.767 -14.626 QT
-115.767 -14.205 -116.064 -13.908 QT
-116.361 -13.611 -116.767 -13.611 QT
-117.189 -13.611 -117.486 -13.908 QT
-117.783 -14.205 -117.783 -14.626 QT
-117.783 -15.736 -116.783 -16.267 QT
-115.783 -16.798 -114.564 -16.798 QT
-113.721 -16.798 -112.861 -16.439 QT
-112.002 -16.08 -111.447 -15.4 QT
-110.892 -14.72 -110.892 -13.814 QT
-110.892 -9.095 L
-110.892 -8.689 -110.721 -8.345 QT
-110.549 -8.001 -110.189 -8.001 QT
-109.83 -8.001 -109.666 -8.345 QT
-109.502 -8.689 -109.502 -9.095 QT
-109.502 -10.439 L
-108.877 -10.439 L
-108.877 -9.095 L
-108.877 -8.626 -109.127 -8.197 QT
-109.377 -7.767 -109.791 -7.517 QT
-110.205 -7.267 -110.689 -7.267 QT
-111.299 -7.267 -111.744 -7.744 QT
-112.189 -8.22 -112.236 -8.876 QT
-112.627 -8.095 -113.385 -7.626 QT
-114.142 -7.158 -115.017 -7.158 QT
-115.814 -7.158 -116.588 -7.392 QT
-117.361 -7.626 -117.877 -8.134 QT
-118.392 -8.642 -118.392 -9.455 QT
cp
-116.689 -9.455 M
-116.689 -8.72 -116.15 -8.212 QT
-115.611 -7.705 -114.861 -7.705 QT
-114.189 -7.705 -113.635 -8.048 QT
-113.08 -8.392 -112.752 -8.97 QT
-112.424 -9.548 -112.424 -10.205 QT
-112.424 -12.392 L
-113.377 -12.392 -114.377 -12.08 QT
-115.377 -11.767 -116.033 -11.095 QT
-116.689 -10.423 -116.689 -9.455 QT
cp}def
f-285524450
f
GR
GS
[0.75 0 0 0.75 421.50041 39.3625] CT
N
/f1498637464{-108.423 -7.392 M
-108.423 -8.126 L
-107.704 -8.126 -107.243 -8.244 QT
-106.782 -8.361 -106.782 -8.798 QT
-106.782 -14.533 L
-106.782 -15.095 -106.954 -15.345 QT
-107.126 -15.595 -107.446 -15.65 QT
-107.766 -15.705 -108.423 -15.705 QT
-108.423 -16.439 L
-105.423 -16.673 L
-105.423 -14.626 L
-105.079 -15.533 -104.454 -16.103 QT
-103.829 -16.673 -102.938 -16.673 QT
-102.313 -16.673 -101.821 -16.306 QT
-101.329 -15.939 -101.329 -15.33 QT
-101.329 -14.955 -101.602 -14.673 QT
-101.876 -14.392 -102.266 -14.392 QT
-102.657 -14.392 -102.938 -14.666 QT
-103.219 -14.939 -103.219 -15.33 QT
-103.219 -15.892 -102.813 -16.126 QT
-102.938 -16.126 L
-103.798 -16.126 -104.329 -15.509 QT
-104.86 -14.892 -105.087 -13.986 QT
-105.313 -13.08 -105.313 -12.236 QT
-105.313 -8.798 L
-105.313 -8.126 -103.282 -8.126 QT
-103.282 -7.392 L
-108.423 -7.392 L
cp}def
f1498637464
f
GR
GS
[0.75 0 0 0.75 421.50041 39.3625] CT
N
/f-67903793{-95.802 -7.158 M
-97.037 -7.158 -98.068 -7.83 QT
-99.099 -8.501 -99.662 -9.595 QT
-100.224 -10.689 -100.224 -11.923 QT
-100.224 -13.189 -99.607 -14.283 QT
-98.99 -15.376 -97.919 -16.025 QT
-96.849 -16.673 -95.568 -16.673 QT
-94.802 -16.673 -94.115 -16.353 QT
-93.427 -16.033 -92.927 -15.455 QT
-92.927 -19.814 L
-92.927 -20.376 -93.099 -20.634 QT
-93.271 -20.892 -93.583 -20.947 QT
-93.896 -21.001 -94.552 -21.001 QT
-94.552 -21.736 L
-91.458 -21.97 L
-91.458 -9.298 L
-91.458 -8.751 -91.287 -8.494 QT
-91.115 -8.236 -90.802 -8.181 QT
-90.49 -8.126 -89.818 -8.126 QT
-89.818 -7.392 L
-92.99 -7.158 L
-92.99 -8.486 L
-93.537 -7.861 -94.287 -7.509 QT
-95.037 -7.158 -95.802 -7.158 QT
cp
-97.943 -9.22 M
-97.583 -8.533 -96.982 -8.119 QT
-96.38 -7.705 -95.677 -7.705 QT
-94.802 -7.705 -94.076 -8.212 QT
-93.349 -8.72 -92.99 -9.517 QT
-92.99 -14.548 L
-93.24 -15.017 -93.615 -15.376 QT
-93.99 -15.736 -94.451 -15.931 QT
-94.912 -16.126 -95.443 -16.126 QT
-96.537 -16.126 -97.201 -15.509 QT
-97.865 -14.892 -98.138 -13.923 QT
-98.412 -12.955 -98.412 -11.908 QT
-98.412 -11.064 -98.318 -10.439 QT
-98.224 -9.814 -97.943 -9.22 QT
cp}def
f-67903793
f
GR
GS
[0.75 0 0 0.75 421.50041 39.3625] CT
N
/f470325036{-81.972 -7.392 M
-81.972 -8.126 L
-79.816 -8.126 -79.816 -8.798 QT
-79.816 -20.33 L
-79.816 -21.001 -81.972 -21.001 QT
-81.972 -21.736 L
-74.238 -21.736 L
-72.8 -21.736 -71.613 -21.119 QT
-70.425 -20.501 -69.582 -19.462 QT
-68.738 -18.423 -68.285 -17.111 QT
-67.832 -15.798 -67.832 -14.423 QT
-67.832 -13.095 -68.293 -11.837 QT
-68.753 -10.58 -69.621 -9.572 QT
-70.488 -8.564 -71.668 -7.978 QT
-72.847 -7.392 -74.238 -7.392 QT
-81.972 -7.392 L
cp
-77.925 -8.798 M
-77.925 -8.345 -77.668 -8.236 QT
-77.41 -8.126 -76.863 -8.126 QT
-74.785 -8.126 L
-73.707 -8.126 -72.738 -8.595 QT
-71.769 -9.064 -71.128 -9.892 QT
-70.457 -10.783 -70.238 -11.869 QT
-70.019 -12.955 -70.019 -14.423 QT
-70.019 -15.955 -70.238 -17.103 QT
-70.457 -18.251 -71.128 -19.158 QT
-71.753 -20.048 -72.714 -20.525 QT
-73.675 -21.001 -74.785 -21.001 QT
-76.863 -21.001 L
-77.238 -21.001 -77.449 -20.97 QT
-77.66 -20.939 -77.793 -20.791 QT
-77.925 -20.642 -77.925 -20.33 QT
-77.925 -8.798 L
cp}def
f470325036
f
GR
GS
[0.75 0 0 0.75 421.50041 39.3625] CT
N
/f1844920995{-61.756 -7.158 M
-63.037 -7.158 -64.107 -7.83 QT
-65.178 -8.501 -65.795 -9.626 QT
-66.412 -10.751 -66.412 -12.001 QT
-66.412 -13.22 -65.849 -14.33 QT
-65.287 -15.439 -64.287 -16.119 QT
-63.287 -16.798 -62.053 -16.798 QT
-61.099 -16.798 -60.381 -16.478 QT
-59.662 -16.158 -59.201 -15.587 QT
-58.74 -15.017 -58.506 -14.236 QT
-58.271 -13.455 -58.271 -12.517 QT
-58.271 -12.236 -58.49 -12.236 QT
-64.568 -12.236 L
-64.568 -12.017 L
-64.568 -10.267 -63.865 -9.017 QT
-63.162 -7.767 -61.568 -7.767 QT
-60.928 -7.767 -60.381 -8.056 QT
-59.834 -8.345 -59.428 -8.861 QT
-59.021 -9.376 -58.881 -9.955 QT
-58.865 -10.033 -58.803 -10.087 QT
-58.74 -10.142 -58.678 -10.142 QT
-58.49 -10.142 L
-58.271 -10.142 -58.271 -9.876 QT
-58.568 -8.689 -59.553 -7.923 QT
-60.537 -7.158 -61.756 -7.158 QT
cp
-64.553 -12.767 M
-59.756 -12.767 L
-59.756 -13.548 -59.982 -14.361 QT
-60.209 -15.173 -60.717 -15.712 QT
-61.224 -16.251 -62.053 -16.251 QT
-63.24 -16.251 -63.896 -15.142 QT
-64.553 -14.033 -64.553 -12.767 QT
cp}def
f1844920995
f
GR
GS
[0.75 0 0 0.75 421.50041 39.3625] CT
N
/f-470337{-52.739 -7.392 M
-55.802 -15.111 L
-56.005 -15.486 -56.403 -15.595 QT
-56.802 -15.705 -57.458 -15.705 QT
-57.458 -16.439 L
-53.052 -16.439 L
-53.052 -15.705 L
-54.239 -15.705 -54.239 -15.205 QT
-54.239 -15.126 -54.208 -15.08 QT
-51.849 -9.158 L
-49.739 -14.501 L
-49.677 -14.673 -49.677 -14.845 QT
-49.677 -15.251 -49.974 -15.478 QT
-50.27 -15.705 -50.692 -15.705 QT
-50.692 -16.439 L
-47.192 -16.439 L
-47.192 -15.705 L
-47.849 -15.705 -48.333 -15.408 QT
-48.817 -15.111 -49.083 -14.533 QT
-51.911 -7.392 L
-52.005 -7.158 -52.255 -7.158 QT
-52.411 -7.158 L
-52.661 -7.158 -52.739 -7.392 QT
cp}def
f-470337
f
GR
GS
[0.75 0 0 0.75 421.50041 39.3625] CT
N
/f1397374404{-46.386 -7.392 M
-46.386 -8.126 L
-45.668 -8.126 -45.207 -8.244 QT
-44.746 -8.361 -44.746 -8.798 QT
-44.746 -14.533 L
-44.746 -15.345 -45.058 -15.525 QT
-45.371 -15.705 -46.293 -15.705 QT
-46.293 -16.439 L
-43.261 -16.673 L
-43.261 -8.798 L
-43.261 -8.361 -42.863 -8.244 QT
-42.465 -8.126 -41.793 -8.126 QT
-41.793 -7.392 L
-46.386 -7.392 L
cp
-45.496 -20.283 M
-45.496 -20.736 -45.144 -21.087 QT
-44.793 -21.439 -44.34 -21.439 QT
-44.043 -21.439 -43.769 -21.283 QT
-43.496 -21.126 -43.34 -20.853 QT
-43.183 -20.58 -43.183 -20.283 QT
-43.183 -19.83 -43.535 -19.478 QT
-43.886 -19.126 -44.34 -19.126 QT
-44.793 -19.126 -45.144 -19.478 QT
-45.496 -19.83 -45.496 -20.283 QT
cp}def
f1397374404
f
GR
GS
[0.75 0 0 0.75 421.50041 39.3625] CT
N
/f-555881484{-40.48 -9.455 M
-40.48 -10.705 -39.495 -11.486 QT
-38.511 -12.267 -37.136 -12.595 QT
-35.761 -12.923 -34.511 -12.923 QT
-34.511 -13.783 L
-34.511 -14.392 -34.777 -14.955 QT
-35.042 -15.517 -35.55 -15.884 QT
-36.058 -16.251 -36.652 -16.251 QT
-38.058 -16.251 -38.777 -15.626 QT
-38.386 -15.626 -38.12 -15.322 QT
-37.855 -15.017 -37.855 -14.626 QT
-37.855 -14.205 -38.152 -13.908 QT
-38.448 -13.611 -38.855 -13.611 QT
-39.277 -13.611 -39.573 -13.908 QT
-39.87 -14.205 -39.87 -14.626 QT
-39.87 -15.736 -38.87 -16.267 QT
-37.87 -16.798 -36.652 -16.798 QT
-35.808 -16.798 -34.948 -16.439 QT
-34.089 -16.08 -33.534 -15.4 QT
-32.98 -14.72 -32.98 -13.814 QT
-32.98 -9.095 L
-32.98 -8.689 -32.808 -8.345 QT
-32.636 -8.001 -32.277 -8.001 QT
-31.917 -8.001 -31.753 -8.345 QT
-31.589 -8.689 -31.589 -9.095 QT
-31.589 -10.439 L
-30.964 -10.439 L
-30.964 -9.095 L
-30.964 -8.626 -31.214 -8.197 QT
-31.464 -7.767 -31.878 -7.517 QT
-32.292 -7.267 -32.777 -7.267 QT
-33.386 -7.267 -33.831 -7.744 QT
-34.277 -8.22 -34.323 -8.876 QT
-34.714 -8.095 -35.472 -7.626 QT
-36.23 -7.158 -37.105 -7.158 QT
-37.902 -7.158 -38.675 -7.392 QT
-39.448 -7.626 -39.964 -8.134 QT
-40.48 -8.642 -40.48 -9.455 QT
cp
-38.777 -9.455 M
-38.777 -8.72 -38.237 -8.212 QT
-37.698 -7.705 -36.948 -7.705 QT
-36.277 -7.705 -35.722 -8.048 QT
-35.167 -8.392 -34.839 -8.97 QT
-34.511 -9.548 -34.511 -10.205 QT
-34.511 -12.392 L
-35.464 -12.392 -36.464 -12.08 QT
-37.464 -11.767 -38.12 -11.095 QT
-38.777 -10.423 -38.777 -9.455 QT
cp}def
f-555881484
f
GR
GS
[0.75 0 0 0.75 421.50041 39.3625] CT
N
/f-1971741556{-28.916 -9.908 M
-28.916 -15.705 L
-30.65 -15.705 L
-30.65 -16.251 L
-29.275 -16.251 -28.635 -17.533 QT
-27.994 -18.814 -27.994 -20.314 QT
-27.385 -20.314 L
-27.385 -16.439 L
-24.416 -16.439 L
-24.416 -15.705 L
-27.385 -15.705 L
-27.385 -9.955 L
-27.385 -9.08 -27.096 -8.423 QT
-26.807 -7.767 -26.041 -7.767 QT
-25.322 -7.767 -25.002 -8.462 QT
-24.682 -9.158 -24.682 -9.955 QT
-24.682 -11.189 L
-24.088 -11.189 L
-24.088 -9.908 L
-24.088 -9.251 -24.33 -8.611 QT
-24.572 -7.97 -25.041 -7.564 QT
-25.51 -7.158 -26.182 -7.158 QT
-27.447 -7.158 -28.182 -7.908 QT
-28.916 -8.658 -28.916 -9.908 QT
cp}def
f-1971741556
f
GR
GS
[0.75 0 0 0.75 421.50041 39.3625] CT
N
/f154649803{-22.431 -7.392 M
-22.431 -8.126 L
-21.712 -8.126 -21.251 -8.244 QT
-20.79 -8.361 -20.79 -8.798 QT
-20.79 -14.533 L
-20.79 -15.345 -21.103 -15.525 QT
-21.415 -15.705 -22.337 -15.705 QT
-22.337 -16.439 L
-19.306 -16.673 L
-19.306 -8.798 L
-19.306 -8.361 -18.907 -8.244 QT
-18.509 -8.126 -17.837 -8.126 QT
-17.837 -7.392 L
-22.431 -7.392 L
cp
-21.54 -20.283 M
-21.54 -20.736 -21.189 -21.087 QT
-20.837 -21.439 -20.384 -21.439 QT
-20.087 -21.439 -19.814 -21.283 QT
-19.54 -21.126 -19.384 -20.853 QT
-19.228 -20.58 -19.228 -20.283 QT
-19.228 -19.83 -19.579 -19.478 QT
-19.931 -19.126 -20.384 -19.126 QT
-20.837 -19.126 -21.189 -19.478 QT
-21.54 -19.83 -21.54 -20.283 QT
cp}def
f154649803
f
GR
GS
[0.75 0 0 0.75 421.50041 39.3625] CT
N
/f527255191{-12.118 -7.158 M
-13.383 -7.158 -14.462 -7.798 QT
-15.54 -8.439 -16.165 -9.517 QT
-16.79 -10.595 -16.79 -11.861 QT
-16.79 -12.83 -16.446 -13.72 QT
-16.102 -14.611 -15.462 -15.314 QT
-14.821 -16.017 -13.969 -16.408 QT
-13.118 -16.798 -12.118 -16.798 QT
-10.821 -16.798 -9.758 -16.119 QT
-8.696 -15.439 -8.087 -14.298 QT
-7.477 -13.158 -7.477 -11.861 QT
-7.477 -10.595 -8.102 -9.517 QT
-8.727 -8.439 -9.797 -7.798 QT
-10.868 -7.158 -12.118 -7.158 QT
cp
-12.118 -7.767 M
-10.43 -7.767 -9.868 -8.986 QT
-9.305 -10.205 -9.305 -12.095 QT
-9.305 -13.158 -9.422 -13.845 QT
-9.54 -14.533 -9.915 -15.111 QT
-10.149 -15.455 -10.516 -15.712 QT
-10.883 -15.97 -11.282 -16.111 QT
-11.68 -16.251 -12.118 -16.251 QT
-12.774 -16.251 -13.36 -15.955 QT
-13.946 -15.658 -14.337 -15.111 QT
-14.727 -14.501 -14.837 -13.791 QT
-14.946 -13.08 -14.946 -12.095 QT
-14.946 -10.923 -14.743 -9.986 QT
-14.54 -9.048 -13.915 -8.408 QT
-13.29 -7.767 -12.118 -7.767 QT
cp}def
f527255191
f
GR
GS
[0.75 0 0 0.75 421.50041 39.3625] CT
N
/f-2144984353{-6.476 -7.392 M
-6.476 -8.126 L
-5.757 -8.126 -5.296 -8.244 QT
-4.835 -8.361 -4.835 -8.798 QT
-4.835 -14.533 L
-4.835 -15.095 -5.007 -15.345 QT
-5.179 -15.595 -5.492 -15.65 QT
-5.804 -15.705 -6.476 -15.705 QT
-6.476 -16.439 L
-3.429 -16.673 L
-3.429 -14.626 L
-3.007 -15.517 -2.179 -16.095 QT
-1.351 -16.673 -0.382 -16.673 QT
1.071 -16.673 1.805 -15.978 QT
2.54 -15.283 2.54 -13.845 QT
2.54 -8.798 L
2.54 -8.361 3 -8.244 QT
3.461 -8.126 4.18 -8.126 QT
4.18 -7.392 L
-0.632 -7.392 L
-0.632 -8.126 L
0.086 -8.126 0.547 -8.244 QT
1.008 -8.361 1.008 -8.798 QT
1.008 -13.783 L
1.008 -14.798 0.711 -15.462 QT
0.415 -16.126 -0.507 -16.126 QT
-1.726 -16.126 -2.515 -15.15 QT
-3.304 -14.173 -3.304 -12.939 QT
-3.304 -8.798 L
-3.304 -8.361 -2.835 -8.244 QT
-2.367 -8.126 -1.664 -8.126 QT
-1.664 -7.392 L
-6.476 -7.392 L
cp}def
f-2144984353
f
GR
GS
[0.75 0 0 0.75 421.50041 39.3625] CT
N
/f-1586889101{11.791 -7.392 M
11.791 -8.126 L
13.963 -8.126 13.963 -8.798 QT
13.963 -20.33 L
13.963 -21.001 11.791 -21.001 QT
11.791 -21.736 L
23.666 -21.736 L
24.26 -16.923 L
23.651 -16.923 L
23.432 -18.736 23.026 -19.556 QT
22.62 -20.376 21.729 -20.689 QT
20.838 -21.001 19.041 -21.001 QT
16.979 -21.001 L
16.604 -21.001 16.393 -20.97 QT
16.182 -20.939 16.049 -20.791 QT
15.916 -20.642 15.916 -20.33 QT
15.916 -15.205 L
17.463 -15.205 L
18.541 -15.205 19.065 -15.384 QT
19.588 -15.564 19.791 -16.072 QT
19.995 -16.58 19.995 -17.658 QT
20.604 -17.658 L
20.604 -12.017 L
19.995 -12.017 L
19.995 -13.08 19.791 -13.595 QT
19.588 -14.111 19.065 -14.291 QT
18.541 -14.47 17.463 -14.47 QT
15.916 -14.47 L
15.916 -8.798 L
15.916 -8.345 16.174 -8.236 QT
16.432 -8.126 16.979 -8.126 QT
19.213 -8.126 L
20.666 -8.126 21.565 -8.361 QT
22.463 -8.595 22.963 -9.134 QT
23.463 -9.673 23.729 -10.525 QT
23.995 -11.376 24.229 -12.892 QT
24.838 -12.892 L
23.963 -7.392 L
11.791 -7.392 L
cp}def
f-1586889101
f
GR
GS
[0.75 0 0 0.75 421.50041 39.3625] CT
N
/f-1564064723{25.828 -7.33 M
25.828 -10.751 L
25.828 -10.923 26 -10.923 QT
26.266 -10.923 L
26.391 -10.923 26.422 -10.751 QT
27.016 -7.705 29.25 -7.705 QT
30.25 -7.705 30.922 -8.158 QT
31.594 -8.611 31.594 -9.548 QT
31.594 -10.236 31.07 -10.712 QT
30.547 -11.189 29.828 -11.361 QT
28.422 -11.642 L
27.719 -11.798 27.141 -12.111 QT
26.562 -12.423 26.195 -12.955 QT
25.828 -13.486 25.828 -14.173 QT
25.828 -15.111 26.312 -15.697 QT
26.797 -16.283 27.578 -16.541 QT
28.359 -16.798 29.25 -16.798 QT
30.328 -16.798 31.141 -16.236 QT
31.734 -16.751 L
31.734 -16.798 31.844 -16.798 QT
32 -16.798 L
32.062 -16.798 32.109 -16.744 QT
32.156 -16.689 32.156 -16.626 QT
32.156 -13.876 L
32.156 -13.689 32 -13.689 QT
31.734 -13.689 L
31.547 -13.689 31.547 -13.876 QT
31.547 -14.986 30.937 -15.65 QT
30.328 -16.314 29.234 -16.314 QT
28.297 -16.314 27.601 -15.962 QT
26.906 -15.611 26.906 -14.767 QT
26.906 -14.173 27.406 -13.806 QT
27.906 -13.439 28.578 -13.267 QT
30 -13.001 L
30.719 -12.83 31.336 -12.447 QT
31.953 -12.064 32.32 -11.462 QT
32.687 -10.861 32.687 -10.126 QT
32.687 -9.361 32.422 -8.798 QT
32.156 -8.236 31.687 -7.869 QT
31.219 -7.501 30.586 -7.33 QT
29.953 -7.158 29.25 -7.158 QT
27.937 -7.158 27.016 -8.033 QT
26.25 -7.205 L
26.25 -7.158 26.125 -7.158 QT
26 -7.158 L
25.828 -7.158 25.828 -7.33 QT
cp}def
f-1564064723
f
GR
GS
[0.75 0 0 0.75 421.50041 39.3625] CT
N
/f-1931236069{35.365 -9.908 M
35.365 -15.705 L
33.63 -15.705 L
33.63 -16.251 L
35.005 -16.251 35.646 -17.533 QT
36.287 -18.814 36.287 -20.314 QT
36.896 -20.314 L
36.896 -16.439 L
39.865 -16.439 L
39.865 -15.705 L
36.896 -15.705 L
36.896 -9.955 L
36.896 -9.08 37.185 -8.423 QT
37.474 -7.767 38.24 -7.767 QT
38.959 -7.767 39.279 -8.462 QT
39.599 -9.158 39.599 -9.955 QT
39.599 -11.189 L
40.193 -11.189 L
40.193 -9.908 L
40.193 -9.251 39.951 -8.611 QT
39.709 -7.97 39.24 -7.564 QT
38.771 -7.158 38.099 -7.158 QT
36.834 -7.158 36.099 -7.908 QT
35.365 -8.658 35.365 -9.908 QT
cp}def
f-1931236069
f
GR
GS
[0.75 0 0 0.75 421.50041 39.3625] CT
N
/f1472508733{41.85 -7.392 M
41.85 -8.126 L
42.569 -8.126 43.03 -8.244 QT
43.491 -8.361 43.491 -8.798 QT
43.491 -14.533 L
43.491 -15.345 43.178 -15.525 QT
42.866 -15.705 41.944 -15.705 QT
41.944 -16.439 L
44.975 -16.673 L
44.975 -8.798 L
44.975 -8.361 45.373 -8.244 QT
45.772 -8.126 46.444 -8.126 QT
46.444 -7.392 L
41.85 -7.392 L
cp
42.741 -20.283 M
42.741 -20.736 43.092 -21.087 QT
43.444 -21.439 43.897 -21.439 QT
44.194 -21.439 44.467 -21.283 QT
44.741 -21.126 44.897 -20.853 QT
45.053 -20.58 45.053 -20.283 QT
45.053 -19.83 44.702 -19.478 QT
44.35 -19.126 43.897 -19.126 QT
43.444 -19.126 43.092 -19.478 QT
42.741 -19.83 42.741 -20.283 QT
cp}def
f1472508733
f
GR
GS
[0.75 0 0 0.75 421.50041 39.3625] CT
N
/f-107099849{47.538 -7.392 M
47.538 -8.126 L
48.257 -8.126 48.718 -8.244 QT
49.179 -8.361 49.179 -8.798 QT
49.179 -14.533 L
49.179 -15.095 49.007 -15.345 QT
48.835 -15.595 48.522 -15.65 QT
48.21 -15.705 47.538 -15.705 QT
47.538 -16.439 L
50.585 -16.673 L
50.585 -14.626 L
51.007 -15.517 51.835 -16.095 QT
52.663 -16.673 53.632 -16.673 QT
56.054 -16.673 56.476 -14.705 QT
56.897 -15.58 57.702 -16.126 QT
58.507 -16.673 59.476 -16.673 QT
60.429 -16.673 61.077 -16.369 QT
61.726 -16.064 62.054 -15.431 QT
62.382 -14.798 62.382 -13.845 QT
62.382 -8.798 L
62.382 -8.361 62.851 -8.244 QT
63.319 -8.126 64.022 -8.126 QT
64.022 -7.392 L
59.226 -7.392 L
59.226 -8.126 L
59.929 -8.126 60.397 -8.244 QT
60.866 -8.361 60.866 -8.798 QT
60.866 -13.783 L
60.866 -14.83 60.562 -15.478 QT
60.257 -16.126 59.335 -16.126 QT
58.132 -16.126 57.343 -15.15 QT
56.554 -14.173 56.554 -12.939 QT
56.554 -8.798 L
56.554 -8.361 57.015 -8.244 QT
57.476 -8.126 58.194 -8.126 QT
58.194 -7.392 L
53.382 -7.392 L
53.382 -8.126 L
54.101 -8.126 54.562 -8.244 QT
55.022 -8.361 55.022 -8.798 QT
55.022 -13.783 L
55.022 -14.798 54.726 -15.462 QT
54.429 -16.126 53.507 -16.126 QT
52.288 -16.126 51.499 -15.15 QT
50.71 -14.173 50.71 -12.939 QT
50.71 -8.798 L
50.71 -8.361 51.179 -8.244 QT
51.647 -8.126 52.351 -8.126 QT
52.351 -7.392 L
47.538 -7.392 L
cp}def
f-107099849
f
GR
GS
[0.75 0 0 0.75 421.50041 39.3625] CT
N
/f-660967563{64.868 -9.455 M
64.868 -10.705 65.852 -11.486 QT
66.837 -12.267 68.212 -12.595 QT
69.587 -12.923 70.837 -12.923 QT
70.837 -13.783 L
70.837 -14.392 70.571 -14.955 QT
70.306 -15.517 69.798 -15.884 QT
69.29 -16.251 68.696 -16.251 QT
67.29 -16.251 66.571 -15.626 QT
66.962 -15.626 67.227 -15.322 QT
67.493 -15.017 67.493 -14.626 QT
67.493 -14.205 67.196 -13.908 QT
66.899 -13.611 66.493 -13.611 QT
66.071 -13.611 65.774 -13.908 QT
65.477 -14.205 65.477 -14.626 QT
65.477 -15.736 66.477 -16.267 QT
67.477 -16.798 68.696 -16.798 QT
69.54 -16.798 70.399 -16.439 QT
71.259 -16.08 71.813 -15.4 QT
72.368 -14.72 72.368 -13.814 QT
72.368 -9.095 L
72.368 -8.689 72.54 -8.345 QT
72.712 -8.001 73.071 -8.001 QT
73.431 -8.001 73.595 -8.345 QT
73.759 -8.689 73.759 -9.095 QT
73.759 -10.439 L
74.384 -10.439 L
74.384 -9.095 L
74.384 -8.626 74.134 -8.197 QT
73.884 -7.767 73.47 -7.517 QT
73.056 -7.267 72.571 -7.267 QT
71.962 -7.267 71.516 -7.744 QT
71.071 -8.22 71.024 -8.876 QT
70.634 -8.095 69.876 -7.626 QT
69.118 -7.158 68.243 -7.158 QT
67.446 -7.158 66.673 -7.392 QT
65.899 -7.626 65.384 -8.134 QT
64.868 -8.642 64.868 -9.455 QT
cp
66.571 -9.455 M
66.571 -8.72 67.11 -8.212 QT
67.649 -7.705 68.399 -7.705 QT
69.071 -7.705 69.626 -8.048 QT
70.181 -8.392 70.509 -8.97 QT
70.837 -9.548 70.837 -10.205 QT
70.837 -12.392 L
69.884 -12.392 68.884 -12.08 QT
67.884 -11.767 67.227 -11.095 QT
66.571 -10.423 66.571 -9.455 QT
cp}def
f-660967563
f
GR
GS
[0.75 0 0 0.75 421.50041 39.3625] CT
N
/f-1924700272{76.432 -9.908 M
76.432 -15.705 L
74.697 -15.705 L
74.697 -16.251 L
76.072 -16.251 76.713 -17.533 QT
77.353 -18.814 77.353 -20.314 QT
77.963 -20.314 L
77.963 -16.439 L
80.932 -16.439 L
80.932 -15.705 L
77.963 -15.705 L
77.963 -9.955 L
77.963 -9.08 78.252 -8.423 QT
78.541 -7.767 79.307 -7.767 QT
80.025 -7.767 80.346 -8.462 QT
80.666 -9.158 80.666 -9.955 QT
80.666 -11.189 L
81.26 -11.189 L
81.26 -9.908 L
81.26 -9.251 81.018 -8.611 QT
80.775 -7.97 80.307 -7.564 QT
79.838 -7.158 79.166 -7.158 QT
77.9 -7.158 77.166 -7.908 QT
76.432 -8.658 76.432 -9.908 QT
cp}def
f-1924700272
f
GR
GS
[0.75 0 0 0.75 421.50041 39.3625] CT
N
/f-677908256{82.917 -7.392 M
82.917 -8.126 L
83.636 -8.126 84.096 -8.244 QT
84.557 -8.361 84.557 -8.798 QT
84.557 -14.533 L
84.557 -15.345 84.245 -15.525 QT
83.932 -15.705 83.011 -15.705 QT
83.011 -16.439 L
86.042 -16.673 L
86.042 -8.798 L
86.042 -8.361 86.44 -8.244 QT
86.839 -8.126 87.511 -8.126 QT
87.511 -7.392 L
82.917 -7.392 L
cp
83.807 -20.283 M
83.807 -20.736 84.159 -21.087 QT
84.511 -21.439 84.964 -21.439 QT
85.261 -21.439 85.534 -21.283 QT
85.807 -21.126 85.964 -20.853 QT
86.12 -20.58 86.12 -20.283 QT
86.12 -19.83 85.768 -19.478 QT
85.417 -19.126 84.964 -19.126 QT
84.511 -19.126 84.159 -19.478 QT
83.807 -19.83 83.807 -20.283 QT
cp}def
f-677908256
f
GR
GS
[0.75 0 0 0.75 421.50041 39.3625] CT
N
/f-1382835322{93.23 -7.158 M
91.964 -7.158 90.886 -7.798 QT
89.808 -8.439 89.183 -9.517 QT
88.558 -10.595 88.558 -11.861 QT
88.558 -12.83 88.902 -13.72 QT
89.246 -14.611 89.886 -15.314 QT
90.527 -16.017 91.378 -16.408 QT
92.23 -16.798 93.23 -16.798 QT
94.527 -16.798 95.589 -16.119 QT
96.652 -15.439 97.261 -14.298 QT
97.871 -13.158 97.871 -11.861 QT
97.871 -10.595 97.246 -9.517 QT
96.621 -8.439 95.55 -7.798 QT
94.48 -7.158 93.23 -7.158 QT
cp
93.23 -7.767 M
94.917 -7.767 95.48 -8.986 QT
96.042 -10.205 96.042 -12.095 QT
96.042 -13.158 95.925 -13.845 QT
95.808 -14.533 95.433 -15.111 QT
95.199 -15.455 94.831 -15.712 QT
94.464 -15.97 94.066 -16.111 QT
93.667 -16.251 93.23 -16.251 QT
92.574 -16.251 91.988 -15.955 QT
91.402 -15.658 91.011 -15.111 QT
90.621 -14.501 90.511 -13.791 QT
90.402 -13.08 90.402 -12.095 QT
90.402 -10.923 90.605 -9.986 QT
90.808 -9.048 91.433 -8.408 QT
92.058 -7.767 93.23 -7.767 QT
cp}def
f-1382835322
f
GR
GS
[0.75 0 0 0.75 421.50041 39.3625] CT
N
/f-1948281372{98.872 -7.392 M
98.872 -8.126 L
99.59 -8.126 100.051 -8.244 QT
100.512 -8.361 100.512 -8.798 QT
100.512 -14.533 L
100.512 -15.095 100.34 -15.345 QT
100.168 -15.595 99.856 -15.65 QT
99.543 -15.705 98.872 -15.705 QT
98.872 -16.439 L
101.918 -16.673 L
101.918 -14.626 L
102.34 -15.517 103.168 -16.095 QT
103.997 -16.673 104.965 -16.673 QT
106.418 -16.673 107.153 -15.978 QT
107.887 -15.283 107.887 -13.845 QT
107.887 -8.798 L
107.887 -8.361 108.348 -8.244 QT
108.809 -8.126 109.528 -8.126 QT
109.528 -7.392 L
104.715 -7.392 L
104.715 -8.126 L
105.434 -8.126 105.895 -8.244 QT
106.356 -8.361 106.356 -8.798 QT
106.356 -13.783 L
106.356 -14.798 106.059 -15.462 QT
105.762 -16.126 104.84 -16.126 QT
103.622 -16.126 102.833 -15.15 QT
102.043 -14.173 102.043 -12.939 QT
102.043 -8.798 L
102.043 -8.361 102.512 -8.244 QT
102.981 -8.126 103.684 -8.126 QT
103.684 -7.392 L
98.872 -7.392 L
cp}def
f-1948281372
f
GR
GS
[0.75 0 0 0.75 421.50041 39.3625] CT
N
/f511378098{117.139 -7.392 M
117.139 -8.126 L
119.311 -8.126 119.311 -8.798 QT
119.311 -20.33 L
119.311 -21.001 117.139 -21.001 QT
117.139 -21.736 L
129.014 -21.736 L
129.608 -16.923 L
128.998 -16.923 L
128.78 -18.736 128.373 -19.556 QT
127.967 -20.376 127.077 -20.689 QT
126.186 -21.001 124.389 -21.001 QT
122.327 -21.001 L
121.952 -21.001 121.741 -20.97 QT
121.53 -20.939 121.397 -20.791 QT
121.264 -20.642 121.264 -20.33 QT
121.264 -15.205 L
122.811 -15.205 L
123.889 -15.205 124.413 -15.384 QT
124.936 -15.564 125.139 -16.072 QT
125.342 -16.58 125.342 -17.658 QT
125.952 -17.658 L
125.952 -12.017 L
125.342 -12.017 L
125.342 -13.08 125.139 -13.595 QT
124.936 -14.111 124.413 -14.291 QT
123.889 -14.47 122.811 -14.47 QT
121.264 -14.47 L
121.264 -8.798 L
121.264 -8.345 121.522 -8.236 QT
121.78 -8.126 122.327 -8.126 QT
124.561 -8.126 L
126.014 -8.126 126.913 -8.361 QT
127.811 -8.595 128.311 -9.134 QT
128.811 -9.673 129.077 -10.525 QT
129.342 -11.376 129.577 -12.892 QT
130.186 -12.892 L
129.311 -7.392 L
117.139 -7.392 L
cp}def
f511378098
f
GR
GS
[0.75 0 0 0.75 421.50041 39.3625] CT
N
/f2054823347{131.019 -7.392 M
131.019 -8.126 L
131.738 -8.126 132.199 -8.244 QT
132.66 -8.361 132.66 -8.798 QT
132.66 -14.533 L
132.66 -15.095 132.488 -15.345 QT
132.316 -15.595 131.996 -15.65 QT
131.676 -15.705 131.019 -15.705 QT
131.019 -16.439 L
134.019 -16.673 L
134.019 -14.626 L
134.363 -15.533 134.988 -16.103 QT
135.613 -16.673 136.504 -16.673 QT
137.129 -16.673 137.621 -16.306 QT
138.113 -15.939 138.113 -15.33 QT
138.113 -14.955 137.84 -14.673 QT
137.566 -14.392 137.176 -14.392 QT
136.785 -14.392 136.504 -14.666 QT
136.223 -14.939 136.223 -15.33 QT
136.223 -15.892 136.629 -16.126 QT
136.504 -16.126 L
135.644 -16.126 135.113 -15.509 QT
134.582 -14.892 134.355 -13.986 QT
134.129 -13.08 134.129 -12.236 QT
134.129 -8.798 L
134.129 -8.126 136.16 -8.126 QT
136.16 -7.392 L
131.019 -7.392 L
cp}def
f2054823347
f
GR
GS
[0.75 0 0 0.75 421.50041 39.3625] CT
N
/f1489861266{139.062 -7.392 M
139.062 -8.126 L
139.78 -8.126 140.241 -8.244 QT
140.702 -8.361 140.702 -8.798 QT
140.702 -14.533 L
140.702 -15.095 140.53 -15.345 QT
140.359 -15.595 140.038 -15.65 QT
139.718 -15.705 139.062 -15.705 QT
139.062 -16.439 L
142.062 -16.673 L
142.062 -14.626 L
142.405 -15.533 143.03 -16.103 QT
143.655 -16.673 144.546 -16.673 QT
145.171 -16.673 145.663 -16.306 QT
146.155 -15.939 146.155 -15.33 QT
146.155 -14.955 145.882 -14.673 QT
145.609 -14.392 145.218 -14.392 QT
144.827 -14.392 144.546 -14.666 QT
144.265 -14.939 144.265 -15.33 QT
144.265 -15.892 144.671 -16.126 QT
144.546 -16.126 L
143.687 -16.126 143.155 -15.509 QT
142.624 -14.892 142.398 -13.986 QT
142.171 -13.08 142.171 -12.236 QT
142.171 -8.798 L
142.171 -8.126 144.202 -8.126 QT
144.202 -7.392 L
139.062 -7.392 L
cp}def
f1489861266
f
GR
GS
[0.75 0 0 0.75 421.50041 39.3625] CT
N
/f1310162960{151.807 -7.158 M
150.541 -7.158 149.463 -7.798 QT
148.385 -8.439 147.76 -9.517 QT
147.135 -10.595 147.135 -11.861 QT
147.135 -12.83 147.479 -13.72 QT
147.823 -14.611 148.463 -15.314 QT
149.104 -16.017 149.955 -16.408 QT
150.807 -16.798 151.807 -16.798 QT
153.104 -16.798 154.166 -16.119 QT
155.229 -15.439 155.838 -14.298 QT
156.448 -13.158 156.448 -11.861 QT
156.448 -10.595 155.823 -9.517 QT
155.198 -8.439 154.127 -7.798 QT
153.057 -7.158 151.807 -7.158 QT
cp
151.807 -7.767 M
153.495 -7.767 154.057 -8.986 QT
154.62 -10.205 154.62 -12.095 QT
154.62 -13.158 154.502 -13.845 QT
154.385 -14.533 154.01 -15.111 QT
153.776 -15.455 153.409 -15.712 QT
153.041 -15.97 152.643 -16.111 QT
152.245 -16.251 151.807 -16.251 QT
151.151 -16.251 150.565 -15.955 QT
149.979 -15.658 149.588 -15.111 QT
149.198 -14.501 149.088 -13.791 QT
148.979 -13.08 148.979 -12.095 QT
148.979 -10.923 149.182 -9.986 QT
149.385 -9.048 150.01 -8.408 QT
150.635 -7.767 151.807 -7.767 QT
cp}def
f1310162960
f
GR
GS
[0.75 0 0 0.75 421.50041 39.3625] CT
N
/f-199278912{157.371 -7.392 M
157.371 -8.126 L
158.089 -8.126 158.55 -8.244 QT
159.011 -8.361 159.011 -8.798 QT
159.011 -14.533 L
159.011 -15.095 158.839 -15.345 QT
158.667 -15.595 158.347 -15.65 QT
158.027 -15.705 157.371 -15.705 QT
157.371 -16.439 L
160.371 -16.673 L
160.371 -14.626 L
160.714 -15.533 161.339 -16.103 QT
161.964 -16.673 162.855 -16.673 QT
163.48 -16.673 163.972 -16.306 QT
164.464 -15.939 164.464 -15.33 QT
164.464 -14.955 164.191 -14.673 QT
163.917 -14.392 163.527 -14.392 QT
163.136 -14.392 162.855 -14.666 QT
162.574 -14.939 162.574 -15.33 QT
162.574 -15.892 162.98 -16.126 QT
162.855 -16.126 L
161.996 -16.126 161.464 -15.509 QT
160.933 -14.892 160.707 -13.986 QT
160.48 -13.08 160.48 -12.236 QT
160.48 -8.798 L
160.48 -8.126 162.511 -8.126 QT
162.511 -7.392 L
157.371 -7.392 L
cp}def
f-199278912
f
GR
GS
[0.75 0 0 0.75 0 0.25] CT
1 LJ
1.333 LW
N
141 241.406 M
234.556 244.771 L
328.111 246.859 L
421.667 243.692 L
515.222 244.664 L
608.778 241.074 L
702.333 245.588 L
795.889 242.441 L
889.444 247.464 L
983 243.622 L
S
GR
GS
[0.75 0 0 0.75 0 0.25] CT
[10 6] 0 setdash
2 LJ
1.333 LW
N
141 241.41 M
234.556 241.338 L
328.111 235.875 L
421.667 219.59 L
515.222 207.06 L
608.778 182.488 L
702.333 165.024 L
795.889 131.66 L
889.444 96.051 L
983 58.932 L
S
GR
%%Trailer
%%Pages: 1
%%EOF
