\boolfalse {citerequest}\boolfalse {citetracker}\boolfalse {pagetracker}\boolfalse {backtracker}\relax 
\babel@toc {italian}{}
\babel@toc {italian}{}
\babel@toc {italian}{}
\babel@toc {english}{}
\addvspace {10\p@ }
\contentsline {figure}{\numberline {1.1}{\ignorespaces {\relax \fontsize {10}{12}\selectfont \abovedisplayskip 10\p@ plus2\p@ minus5\p@ \abovedisplayshortskip \z@ plus3\p@ \belowdisplayshortskip 6\p@ plus3\p@ minus3\p@ \def \leftmargin \leftmargini \parsep 4.5\p@ plus2\p@ minus\p@ \topsep 9\p@ plus3\p@ minus5\p@ \itemsep 4.5\p@ plus2\p@ minus\p@ {\leftmargin \leftmargini \topsep 6\p@ plus2\p@ minus2\p@ \parsep 3\p@ plus2\p@ minus\p@ \itemsep \parsep }\belowdisplayskip \abovedisplayskip Reference architecture of a modern positioning system providing data channel for positioning applications.}\relax }}{3}{figure.caption.6}% 
\addvspace {10\p@ }
\contentsline {figure}{\numberline {2.1}{\ignorespaces {Hyperbolic positioning solution using three transmitter and \ac {TDoA} measurements.}\relax }}{9}{figure.caption.7}% 
\contentsline {figure}{\numberline {2.2}{\ignorespaces {Triangulated positioning solution using two asynchronous transmitter and \ac {DoA} measurements.}\relax }}{10}{figure.caption.8}% 
\contentsline {figure}{\numberline {2.3}{\ignorespaces {Trilaterated positioning solution using three transmitters and \ac {ToA} measurements with synchronous transmitters and receivers.}\relax }}{10}{figure.caption.9}% 
\contentsline {figure}{\numberline {2.4}{\ignorespaces {\relax \fontsize {10}{12}\selectfont \abovedisplayskip 10\p@ plus2\p@ minus5\p@ \abovedisplayshortskip \z@ plus3\p@ \belowdisplayshortskip 6\p@ plus3\p@ minus3\p@ \def \leftmargin \leftmargini \parsep 4.5\p@ plus2\p@ minus\p@ \topsep 9\p@ plus3\p@ minus5\p@ \itemsep 4.5\p@ plus2\p@ minus\p@ {\leftmargin \leftmargini \topsep 6\p@ plus2\p@ minus2\p@ \parsep 3\p@ plus2\p@ minus\p@ \itemsep \parsep }\belowdisplayskip \abovedisplayskip Trilateration in \ac {GNSS} position and time solution based on pseudorange measurements. Size and distances are not scaled to real ratio. }\relax }}{15}{figure.caption.11}% 
\addvspace {10\p@ }
\contentsline {figure}{\numberline {3.1}{\ignorespaces {\relax \fontsize {10}{12}\selectfont \abovedisplayskip 10\p@ plus2\p@ minus5\p@ \abovedisplayshortskip \z@ plus3\p@ \belowdisplayshortskip 6\p@ plus3\p@ minus3\p@ \def \leftmargin \leftmargini \parsep 4.5\p@ plus2\p@ minus\p@ \topsep 9\p@ plus3\p@ minus5\p@ \itemsep 4.5\p@ plus2\p@ minus\p@ {\leftmargin \leftmargini \topsep 6\p@ plus2\p@ minus2\p@ \parsep 3\p@ plus2\p@ minus\p@ \itemsep \parsep }\belowdisplayskip \abovedisplayskip \ac {GPS} navigation signal components: \ac {RF} carrier signal (top), subcarrier(second), spreading code (third), navigation data (bottom). The signals are not in scale.}\relax }}{22}{figure.caption.12}% 
\contentsline {figure}{\numberline {3.2}{\ignorespaces {\relax \fontsize {10}{12}\selectfont \abovedisplayskip 10\p@ plus2\p@ minus5\p@ \abovedisplayshortskip \z@ plus3\p@ \belowdisplayshortskip 6\p@ plus3\p@ minus3\p@ \def \leftmargin \leftmargini \parsep 4.5\p@ plus2\p@ minus\p@ \topsep 9\p@ plus3\p@ minus5\p@ \itemsep 4.5\p@ plus2\p@ minus\p@ {\leftmargin \leftmargini \topsep 6\p@ plus2\p@ minus2\p@ \parsep 3\p@ plus2\p@ minus\p@ \itemsep \parsep }\belowdisplayskip \abovedisplayskip Galielo and \ac {GPS} frequency plan fitting the bands reserved to \ac {RNSS}. Reproduced from \cite {galileo2008galileo}.}\relax }}{23}{figure.caption.13}% 
\contentsline {figure}{\numberline {3.3}{\ignorespaces Front-end architecture for the Analog-to-digital conversion of \ac {GNSS} \ac {RF} signals.\relax }}{27}{figure.caption.16}% 
\contentsline {figure}{\numberline {3.4}{\ignorespaces Simplistic scheme of search space for the rough estimation of Doppler shift and code delay in the acquisition stage.\relax }}{29}{figure.caption.17}% 
\contentsline {figure}{\numberline {3.5}{\ignorespaces Example of \ac {CAF} over the search space evaluated on a Galileo \ac {PRN}$12$ (left) and for \ac {PRN}$21$ (right) realistic signal. Image taken from \cite {cristodaro2019advanced}.\relax }}{29}{figure.caption.18}% 
\contentsline {figure}{\numberline {3.6}{\ignorespaces Generic tracking loop (\ac {DLL}/\ac {PLL}) architecture.\relax }}{30}{figure.caption.19}% 
\contentsline {figure}{\numberline {3.7}{\ignorespaces Block diagram describing the architecture of a generic code and carrier tracking loop for \ac {GNSS} receivers.\relax }}{31}{figure.caption.20}% 
\contentsline {figure}{\numberline {3.8}{\ignorespaces Example of code correlation phases: (a) replica code 1/2-chip early, (b) replica code 1/4-chip early, (c) replica code aligned, and (d) replica code 1/4-chip late. Figure taken from \cite {kaplan2005understanding}.\relax }}{32}{figure.caption.21}% 
\contentsline {figure}{\numberline {3.9}{\ignorespaces I, Q phasor diagram\cite {kaplan2005understanding}.\relax }}{33}{figure.caption.22}% 
\contentsline {figure}{\numberline {3.10}{\ignorespaces \relax \fontsize {10}{12}\selectfont \abovedisplayskip 10\p@ plus2\p@ minus5\p@ \abovedisplayshortskip \z@ plus3\p@ \belowdisplayshortskip 6\p@ plus3\p@ minus3\p@ \def \leftmargin \leftmargini \parsep 4.5\p@ plus2\p@ minus\p@ \topsep 9\p@ plus3\p@ minus5\p@ \itemsep 4.5\p@ plus2\p@ minus\p@ {\leftmargin \leftmargini \topsep 6\p@ plus2\p@ minus2\p@ \parsep 3\p@ plus2\p@ minus\p@ \itemsep \parsep }\belowdisplayskip \abovedisplayskip {Structure of the navigation message included in the \ac {GPS} civil signal, transmitted on L1 frequency.}\relax }}{34}{figure.caption.23}% 
\contentsline {figure}{\numberline {3.11}{\ignorespaces {\relax \fontsize {10}{12}\selectfont \abovedisplayskip 10\p@ plus2\p@ minus5\p@ \abovedisplayshortskip \z@ plus3\p@ \belowdisplayshortskip 6\p@ plus3\p@ minus3\p@ \def \leftmargin \leftmargini \parsep 4.5\p@ plus2\p@ minus\p@ \topsep 9\p@ plus3\p@ minus5\p@ \itemsep 4.5\p@ plus2\p@ minus\p@ {\leftmargin \leftmargini \topsep 6\p@ plus2\p@ minus2\p@ \parsep 3\p@ plus2\p@ minus\p@ \itemsep \parsep }\belowdisplayskip \abovedisplayskip Common reception time diagram.}\relax }}{36}{figure.caption.24}% 
\contentsline {figure}{\numberline {3.12}{\ignorespaces {\relax \fontsize {10}{12}\selectfont \abovedisplayskip 10\p@ plus2\p@ minus5\p@ \abovedisplayshortskip \z@ plus3\p@ \belowdisplayshortskip 6\p@ plus3\p@ minus3\p@ \def \leftmargin \leftmargini \parsep 4.5\p@ plus2\p@ minus\p@ \topsep 9\p@ plus3\p@ minus5\p@ \itemsep 4.5\p@ plus2\p@ minus\p@ {\leftmargin \leftmargini \topsep 6\p@ plus2\p@ minus2\p@ \parsep 3\p@ plus2\p@ minus\p@ \itemsep \parsep }\belowdisplayskip \abovedisplayskip Pseudorange correction scheme reproduced from the GPS ICD \cite {navstar1993icd}.}\relax }}{38}{figure.caption.25}% 
\contentsline {figure}{\numberline {3.13}{\ignorespaces {\relax \fontsize {10}{12}\selectfont \abovedisplayskip 10\p@ plus2\p@ minus5\p@ \abovedisplayshortskip \z@ plus3\p@ \belowdisplayshortskip 6\p@ plus3\p@ minus3\p@ \def \leftmargin \leftmargini \parsep 4.5\p@ plus2\p@ minus\p@ \topsep 9\p@ plus3\p@ minus5\p@ \itemsep 4.5\p@ plus2\p@ minus\p@ {\leftmargin \leftmargini \topsep 6\p@ plus2\p@ minus2\p@ \parsep 3\p@ plus2\p@ minus\p@ \itemsep \parsep }\belowdisplayskip \abovedisplayskip High-level scheme of the concept of a networked \ac {GNSS} receiver with a PVT stage aided by auxiliary measurements retrieved from collaborating receivers.}\relax }}{39}{figure.caption.26}% 
\contentsline {figure}{\numberline {3.14}{\ignorespaces {\relax \fontsize {10}{12}\selectfont \abovedisplayskip 10\p@ plus2\p@ minus5\p@ \abovedisplayshortskip \z@ plus3\p@ \belowdisplayshortskip 6\p@ plus3\p@ minus3\p@ \def \leftmargin \leftmargini \parsep 4.5\p@ plus2\p@ minus\p@ \topsep 9\p@ plus3\p@ minus5\p@ \itemsep 4.5\p@ plus2\p@ minus\p@ {\leftmargin \leftmargini \topsep 6\p@ plus2\p@ minus2\p@ \parsep 3\p@ plus2\p@ minus\p@ \itemsep \parsep }\belowdisplayskip \abovedisplayskip Asynchronous measurements and \ac {PVT} epochs in \ac {GNSS} independent receivers.}\relax }}{40}{figure.caption.27}% 
\addvspace {10\p@ }
\contentsline {figure}{\numberline {4.1}{\ignorespaces Baseline vectors shown in different 2D Cartesian reference frames.\relax }}{42}{figure.caption.28}% 
\contentsline {figure}{\numberline {4.2}{\ignorespaces Geometrical effect of the network delay on the baseline estimation in dynamic scenario. \relax }}{44}{figure.caption.29}% 
\contentsline {figure}{\numberline {4.3}{\ignorespaces Example of bivariate Gaussian distributed \ac {PVT} solutions (Horizontal positioning solution) with a graphical visualization of the error covariance matrices in terms of 95\% and 99\% confidence intervals.\relax }}{45}{figure.caption.30}% 
\contentsline {figure}{\numberline {4.4}{\ignorespaces \ac {APD} distribution approaching Gaussian distribution with the same mean and variance with the increase of $D_\text {\relax \fontsize {6}{7}\selectfont $B$}$.\relax }}{47}{figure.caption.31}% 
\contentsline {figure}{\numberline {4.5}{\ignorespaces {\relax \fontsize {10}{12}\selectfont \abovedisplayskip 10\p@ plus2\p@ minus5\p@ \abovedisplayshortskip \z@ plus3\p@ \belowdisplayshortskip 6\p@ plus3\p@ minus3\p@ \def \leftmargin \leftmargini \parsep 4.5\p@ plus2\p@ minus\p@ \topsep 9\p@ plus3\p@ minus5\p@ \itemsep 4.5\p@ plus2\p@ minus\p@ {\leftmargin \leftmargini \topsep 6\p@ plus2\p@ minus2\p@ \parsep 3\p@ plus2\p@ minus\p@ \itemsep \parsep }\belowdisplayskip \abovedisplayskip GNSS-based ranging: open sky scenarios characterized by the full common visibility of the satellites (\ref {fig:sce_a}) and urban scenario with a single satellite in common view (\ref {fig:sce_b})}.\relax }}{48}{figure.caption.32}% 
\contentsline {figure}{\numberline {4.6}{\ignorespaces {\relax \fontsize {10}{12}\selectfont \abovedisplayskip 10\p@ plus2\p@ minus5\p@ \abovedisplayshortskip \z@ plus3\p@ \belowdisplayshortskip 6\p@ plus3\p@ minus3\p@ \def \leftmargin \leftmargini \parsep 4.5\p@ plus2\p@ minus\p@ \topsep 9\p@ plus3\p@ minus5\p@ \itemsep 4.5\p@ plus2\p@ minus\p@ {\leftmargin \leftmargini \topsep 6\p@ plus2\p@ minus2\p@ \parsep 3\p@ plus2\p@ minus\p@ \itemsep \parsep }\belowdisplayskip \abovedisplayskip Single Difference principle applied to two \ac {GPS} receivers. Image taken from \cite {differentialGEOSPATIAL}. }\relax }}{50}{figure.caption.33}% 
\contentsline {figure}{\numberline {4.7}{\ignorespaces {\relax \fontsize {10}{12}\selectfont \abovedisplayskip 10\p@ plus2\p@ minus5\p@ \abovedisplayshortskip \z@ plus3\p@ \belowdisplayshortskip 6\p@ plus3\p@ minus3\p@ \def \leftmargin \leftmargini \parsep 4.5\p@ plus2\p@ minus\p@ \topsep 9\p@ plus3\p@ minus5\p@ \itemsep 4.5\p@ plus2\p@ minus\p@ {\leftmargin \leftmargini \topsep 6\p@ plus2\p@ minus2\p@ \parsep 3\p@ plus2\p@ minus\p@ \itemsep \parsep }\belowdisplayskip \abovedisplayskip Single Difference principle applied between two \ac {GPS} receivers.}\relax }}{52}{figure.caption.34}% 
\contentsline {figure}{\numberline {4.8}{\ignorespaces {\relax \fontsize {10}{12}\selectfont \abovedisplayskip 10\p@ plus2\p@ minus5\p@ \abovedisplayshortskip \z@ plus3\p@ \belowdisplayshortskip 6\p@ plus3\p@ minus3\p@ \def \leftmargin \leftmargini \parsep 4.5\p@ plus2\p@ minus\p@ \topsep 9\p@ plus3\p@ minus5\p@ \itemsep 4.5\p@ plus2\p@ minus\p@ {\leftmargin \leftmargini \topsep 6\p@ plus2\p@ minus2\p@ \parsep 3\p@ plus2\p@ minus\p@ \itemsep \parsep }\belowdisplayskip \abovedisplayskip Timing of the exchange of navigation data for the computation of collaborative measurements between agents retrieving asynchronous measurements and \ac {PVT} solutions.}\relax }}{54}{figure.caption.35}% 
\contentsline {figure}{\numberline {4.9}{\ignorespaces \relax \fontsize {10}{12}\selectfont \abovedisplayskip 10\p@ plus2\p@ minus5\p@ \abovedisplayshortskip \z@ plus3\p@ \belowdisplayshortskip 6\p@ plus3\p@ minus3\p@ \def \leftmargin \leftmargini \parsep 4.5\p@ plus2\p@ minus\p@ \topsep 9\p@ plus3\p@ minus5\p@ \itemsep 4.5\p@ plus2\p@ minus\p@ {\leftmargin \leftmargini \topsep 6\p@ plus2\p@ minus2\p@ \parsep 3\p@ plus2\p@ minus\p@ \itemsep \parsep }\belowdisplayskip \abovedisplayskip \ac {IAR} geometrical scenario. Ranging description with highlighted \textit {ambiguity circumference} and \textit {ambiguity line}.\relax }}{55}{figure.caption.36}% 
\contentsline {figure}{\numberline {4.10}{\ignorespaces Triangular geometry emphasizing the limiting conditions of \ac {IAR} implementation: $a\simeq b$ and $\gamma \simeq 0$.\relax }}{56}{figure.caption.37}% 
\contentsline {figure}{\numberline {4.11}{\ignorespaces {\relax \fontsize {10}{12}\selectfont \abovedisplayskip 10\p@ plus2\p@ minus5\p@ \abovedisplayshortskip \z@ plus3\p@ \belowdisplayshortskip 6\p@ plus3\p@ minus3\p@ \def \leftmargin \leftmargini \parsep 4.5\p@ plus2\p@ minus\p@ \topsep 9\p@ plus3\p@ minus5\p@ \itemsep 4.5\p@ plus2\p@ minus\p@ {\leftmargin \leftmargini \topsep 6\p@ plus2\p@ minus2\p@ \parsep 3\p@ plus2\p@ minus\p@ \itemsep \parsep }\belowdisplayskip \abovedisplayskip Example of simultaneous \ac {GNSS} satellites visibility for two agents following an experimental trajectory in urban environment (upper) and practicability of GNSS-only ranging methods along the time (bottom).}\relax }}{60}{figure.caption.38}% 
\addvspace {10\p@ }
\contentsline {figure}{\numberline {5.1}{\ignorespaces {\relax \fontsize {10}{12}\selectfont \abovedisplayskip 10\p@ plus2\p@ minus5\p@ \abovedisplayshortskip \z@ plus3\p@ \belowdisplayshortskip 6\p@ plus3\p@ minus3\p@ \def \leftmargin \leftmargini \parsep 4.5\p@ plus2\p@ minus\p@ \topsep 9\p@ plus3\p@ minus5\p@ \itemsep 4.5\p@ plus2\p@ minus\p@ {\leftmargin \leftmargini \topsep 6\p@ plus2\p@ minus2\p@ \parsep 3\p@ plus2\p@ minus\p@ \itemsep \parsep }\belowdisplayskip \abovedisplayskip \added [id=1]{H}emispherical cap lying on the \ac {LTP} centered in $\mathbf {x}_T$.}\relax }}{64}{figure.caption.39}% 
\contentsline {figure}{\numberline {5.2}{\ignorespaces \relax \fontsize {10}{12}\selectfont \abovedisplayskip 10\p@ plus2\p@ minus5\p@ \abovedisplayshortskip \z@ plus3\p@ \belowdisplayshortskip 6\p@ plus3\p@ minus3\p@ \def \leftmargin \leftmargini \parsep 4.5\p@ plus2\p@ minus\p@ \topsep 9\p@ plus3\p@ minus5\p@ \itemsep 4.5\p@ plus2\p@ minus\p@ {\leftmargin \leftmargini \topsep 6\p@ plus2\p@ minus2\p@ \parsep 3\p@ plus2\p@ minus\p@ \itemsep \parsep }\belowdisplayskip \abovedisplayskip {Simulated evaluation of the bias of the \ac {IAR} measurements according to the position of the shared satellite and varying the magnitude of $\sigma _{\mathaccentV {hat}05E{\gamma }}$ in $[0, 1\cdot 10^{-7}, 5\cdot 10^{-7}]$, $d=100$ m, $\sigma _i=\sigma _j=7.03$ m.}\relax }}{65}{figure.caption.40}% 
\contentsline {figure}{\numberline {5.3}{\ignorespaces Analytic evaluation of $\sigma _{\mathaccentV {hat}05E{d}}$ according to the position of the shared satellite and varying the magnitude of $\sigma _{\mathaccentV {hat}05E{\gamma }}$ in $[0, 1\cdot 10^{-7}, 5\cdot 10^{-6}]$, $d=100$ m,$\sigma _i=\sigma _j=7.03$ m.\relax }}{65}{figure.caption.41}% 
\contentsline {figure}{\numberline {5.4}{\ignorespaces \relax \fontsize {10}{12}\selectfont \abovedisplayskip 10\p@ plus2\p@ minus5\p@ \abovedisplayshortskip \z@ plus3\p@ \belowdisplayshortskip 6\p@ plus3\p@ minus3\p@ \def \leftmargin \leftmargini \parsep 4.5\p@ plus2\p@ minus\p@ \topsep 9\p@ plus3\p@ minus5\p@ \itemsep 4.5\p@ plus2\p@ minus\p@ {\leftmargin \leftmargini \topsep 6\p@ plus2\p@ minus2\p@ \parsep 3\p@ plus2\p@ minus\p@ \itemsep \parsep }\belowdisplayskip \abovedisplayskip Analytic evaluation of $\sigma _{\mathaccentV {hat}05E{d}}$ varying the azimuth of the aiding agent $j$, w.r.t. the aided agent $i$. Parameters: $\sigma _{\mathaccentV {hat}05E{\gamma }}=0.5\cdot 10^{-6}$ $d=100$ m, $\sigma _i=\sigma _j=7.03$ m.\relax }}{66}{figure.caption.42}% 
\contentsline {figure}{\numberline {5.5}{\ignorespaces \relax \fontsize {10}{12}\selectfont \abovedisplayskip 10\p@ plus2\p@ minus5\p@ \abovedisplayshortskip \z@ plus3\p@ \belowdisplayshortskip 6\p@ plus3\p@ minus3\p@ \def \leftmargin \leftmargini \parsep 4.5\p@ plus2\p@ minus\p@ \topsep 9\p@ plus3\p@ minus5\p@ \itemsep 4.5\p@ plus2\p@ minus\p@ {\leftmargin \leftmargini \topsep 6\p@ plus2\p@ minus2\p@ \parsep 3\p@ plus2\p@ minus\p@ \itemsep \parsep }\belowdisplayskip \abovedisplayskip Analytic evaluation of $\sigma _{\mathaccentV {hat}05E{d}}$ both the azimuth and elevation angle of the aiding agent $j$, w.r.t. the aided agent $i$. Parameters: $\sigma _{\mathaccentV {hat}05E{\gamma }}=0.5\cdot 10^{-6}$ $d=100$ m, $\sigma _i=\sigma _j=7.03$ m.\relax }}{66}{figure.caption.43}% 
\contentsline {figure}{\numberline {5.6}{\ignorespaces \relax \fontsize {10}{12}\selectfont \abovedisplayskip 10\p@ plus2\p@ minus5\p@ \abovedisplayshortskip \z@ plus3\p@ \belowdisplayshortskip 6\p@ plus3\p@ minus3\p@ \def \leftmargin \leftmargini \parsep 4.5\p@ plus2\p@ minus\p@ \topsep 9\p@ plus3\p@ minus5\p@ \itemsep 4.5\p@ plus2\p@ minus\p@ {\leftmargin \leftmargini \topsep 6\p@ plus2\p@ minus2\p@ \parsep 3\p@ plus2\p@ minus\p@ \itemsep \parsep }\belowdisplayskip \abovedisplayskip {Analytic evaluation of $\sigma _{\mathaccentV {hat}05E{d}}$ according to the position of the shared satellite and varying the magnitude of $\sigma _{\mathaccentV {hat}05E{\gamma }} \in [0, 1\cdot 10^{-7}, 5\cdot 10^{-6}]$, $d=100$ m,$\sigma _i=\sigma _j=7.03$ m.}\relax }}{67}{figure.caption.44}% 
\contentsline {figure}{\numberline {5.7}{\ignorespaces {\relax \fontsize {10}{12}\selectfont \abovedisplayskip 10\p@ plus2\p@ minus5\p@ \abovedisplayshortskip \z@ plus3\p@ \belowdisplayshortskip 6\p@ plus3\p@ minus3\p@ \def \leftmargin \leftmargini \parsep 4.5\p@ plus2\p@ minus\p@ \topsep 9\p@ plus3\p@ minus5\p@ \itemsep 4.5\p@ plus2\p@ minus\p@ {\leftmargin \leftmargini \topsep 6\p@ plus2\p@ minus2\p@ \parsep 3\p@ plus2\p@ minus\p@ \itemsep \parsep }\belowdisplayskip \abovedisplayskip Simulation test-bench for \ac {IAR} performance assessment processing realistic \ac {RF} signals.}\relax }}{68}{figure.caption.45}% 
\contentsline {figure}{\numberline {5.8}{\ignorespaces \relax \fontsize {10}{12}\selectfont \abovedisplayskip 10\p@ plus2\p@ minus5\p@ \abovedisplayshortskip \z@ plus3\p@ \belowdisplayshortskip 6\p@ plus3\p@ minus3\p@ \def \leftmargin \leftmargini \parsep 4.5\p@ plus2\p@ minus\p@ \topsep 9\p@ plus3\p@ minus5\p@ \itemsep 4.5\p@ plus2\p@ minus\p@ {\leftmargin \leftmargini \topsep 6\p@ plus2\p@ minus2\p@ \parsep 3\p@ plus2\p@ minus\p@ \itemsep \parsep }\belowdisplayskip \abovedisplayskip {$\sigma ^2$ skyplot with superposition of satellites azimuth and elevation observed within experimental simulation.}\relax }}{69}{figure.caption.48}% 
\contentsline {figure}{\numberline {5.9}{\ignorespaces \relax \fontsize {10}{12}\selectfont \abovedisplayskip 10\p@ plus2\p@ minus5\p@ \abovedisplayshortskip \z@ plus3\p@ \belowdisplayshortskip 6\p@ plus3\p@ minus3\p@ \def \leftmargin \leftmargini \parsep 4.5\p@ plus2\p@ minus\p@ \topsep 9\p@ plus3\p@ minus5\p@ \itemsep 4.5\p@ plus2\p@ minus\p@ {\leftmargin \leftmargini \topsep 6\p@ plus2\p@ minus2\p@ \parsep 3\p@ plus2\p@ minus\p@ \itemsep \parsep }\belowdisplayskip \abovedisplayskip {Ranking plot of all the shareable satellites based on the \ac {STD} experimentally observed and the interpolation of the analytic model.}\relax }}{69}{figure.caption.49}% 
\contentsline {figure}{\numberline {5.10}{\ignorespaces {\relax \fontsize {10}{12}\selectfont \abovedisplayskip 10\p@ plus2\p@ minus5\p@ \abovedisplayshortskip \z@ plus3\p@ \belowdisplayshortskip 6\p@ plus3\p@ minus3\p@ \def \leftmargin \leftmargini \parsep 4.5\p@ plus2\p@ minus\p@ \topsep 9\p@ plus3\p@ minus5\p@ \itemsep 4.5\p@ plus2\p@ minus\p@ {\leftmargin \leftmargini \topsep 6\p@ plus2\p@ minus2\p@ \parsep 3\p@ plus2\p@ minus\p@ \itemsep \parsep }\belowdisplayskip \abovedisplayskip Simulation test-bench for performance assessment of GNSS-based ranging methods in real environment.}\relax }}{70}{figure.caption.50}% 
\contentsline {figure}{\numberline {5.11}{\ignorespaces {\relax \fontsize {10}{12}\selectfont \abovedisplayskip 10\p@ plus2\p@ minus5\p@ \abovedisplayshortskip \z@ plus3\p@ \belowdisplayshortskip 6\p@ plus3\p@ minus3\p@ \def \leftmargin \leftmargini \parsep 4.5\p@ plus2\p@ minus\p@ \topsep 9\p@ plus3\p@ minus5\p@ \itemsep 4.5\p@ plus2\p@ minus\p@ {\leftmargin \leftmargini \topsep 6\p@ plus2\p@ minus2\p@ \parsep 3\p@ plus2\p@ minus\p@ \itemsep \parsep }\belowdisplayskip \abovedisplayskip Inter-Agent Range standard deviation estimated from experimental data compared to theoretical formulas.}\relax }}{72}{figure.caption.53}% 
\contentsline {figure}{\numberline {5.12}{\ignorespaces {\relax \fontsize {10}{12}\selectfont \abovedisplayskip 10\p@ plus2\p@ minus5\p@ \abovedisplayshortskip \z@ plus3\p@ \belowdisplayshortskip 6\p@ plus3\p@ minus3\p@ \def \leftmargin \leftmargini \parsep 4.5\p@ plus2\p@ minus\p@ \topsep 9\p@ plus3\p@ minus5\p@ \itemsep 4.5\p@ plus2\p@ minus\p@ {\leftmargin \leftmargini \topsep 6\p@ plus2\p@ minus2\p@ \parsep 3\p@ plus2\p@ minus\p@ \itemsep \parsep }\belowdisplayskip \abovedisplayskip Baseline length estimation in simulated vehicular scenario in close proximity assumption.}\relax }}{74}{figure.caption.55}% 
\contentsline {figure}{\numberline {5.13}{\ignorespaces {\relax \fontsize {10}{12}\selectfont \abovedisplayskip 10\p@ plus2\p@ minus5\p@ \abovedisplayshortskip \z@ plus3\p@ \belowdisplayshortskip 6\p@ plus3\p@ minus3\p@ \def \leftmargin \leftmargini \parsep 4.5\p@ plus2\p@ minus\p@ \topsep 9\p@ plus3\p@ minus5\p@ \itemsep 4.5\p@ plus2\p@ minus\p@ {\leftmargin \leftmargini \topsep 6\p@ plus2\p@ minus2\p@ \parsep 3\p@ plus2\p@ minus\p@ \itemsep \parsep }\belowdisplayskip \abovedisplayskip Example of satellite and aiding agent visibility experienced by a dynamic agent travelling on a predefined trajectory.}\relax }}{74}{figure.caption.56}% 
\contentsline {figure}{\numberline {5.14}{\ignorespaces {\relax \fontsize {10}{12}\selectfont \abovedisplayskip 10\p@ plus2\p@ minus5\p@ \abovedisplayshortskip \z@ plus3\p@ \belowdisplayshortskip 6\p@ plus3\p@ minus3\p@ \def \leftmargin \leftmargini \parsep 4.5\p@ plus2\p@ minus\p@ \topsep 9\p@ plus3\p@ minus5\p@ \itemsep 4.5\p@ plus2\p@ minus\p@ {\leftmargin \leftmargini \topsep 6\p@ plus2\p@ minus2\p@ \parsep 3\p@ plus2\p@ minus\p@ \itemsep \parsep }\belowdisplayskip \abovedisplayskip Example of a path based on a Bernoullian lemniscate of \si {1046.7}{m} travelled at an average speed of \si {26.15}{m/s}. The dashed lines depict the collaborative range measurements retrieved at different time instants.}\relax }}{75}{figure.caption.57}% 
\contentsline {figure}{\numberline {5.15}{\ignorespaces {\relax \fontsize {10}{12}\selectfont \abovedisplayskip 10\p@ plus2\p@ minus5\p@ \abovedisplayshortskip \z@ plus3\p@ \belowdisplayshortskip 6\p@ plus3\p@ minus3\p@ \def \leftmargin \leftmargini \parsep 4.5\p@ plus2\p@ minus\p@ \topsep 9\p@ plus3\p@ minus5\p@ \itemsep 4.5\p@ plus2\p@ minus\p@ {\leftmargin \leftmargini \topsep 6\p@ plus2\p@ minus2\p@ \parsep 3\p@ plus2\p@ minus\p@ \itemsep \parsep }\belowdisplayskip \abovedisplayskip Correlation matrix of a set of 10 measurements (5 Inter-agent distances and 5 Normally-distributed pseudorange measurements).}\relax }}{76}{figure.caption.58}% 
\contentsline {figure}{\numberline {5.16}{\ignorespaces {\relax \fontsize {10}{12}\selectfont \abovedisplayskip 10\p@ plus2\p@ minus5\p@ \abovedisplayshortskip \z@ plus3\p@ \belowdisplayshortskip 6\p@ plus3\p@ minus3\p@ \def \leftmargin \leftmargini \parsep 4.5\p@ plus2\p@ minus\p@ \topsep 9\p@ plus3\p@ minus5\p@ \itemsep 4.5\p@ plus2\p@ minus\p@ {\leftmargin \leftmargini \topsep 6\p@ plus2\p@ minus2\p@ \parsep 3\p@ plus2\p@ minus\p@ \itemsep \parsep }\belowdisplayskip \abovedisplayskip \ac {PCC} plot scheme for hybridized measurement vector (Compact representation of the correlation matrix).}\relax }}{77}{figure.caption.59}% 
\contentsline {figure}{\numberline {5.17}{\ignorespaces {\relax \fontsize {10}{12}\selectfont \abovedisplayskip 10\p@ plus2\p@ minus5\p@ \abovedisplayshortskip \z@ plus3\p@ \belowdisplayshortskip 6\p@ plus3\p@ minus3\p@ \def \leftmargin \leftmargini \parsep 4.5\p@ plus2\p@ minus\p@ \topsep 9\p@ plus3\p@ minus5\p@ \itemsep 4.5\p@ plus2\p@ minus\p@ {\leftmargin \leftmargini \topsep 6\p@ plus2\p@ minus2\p@ \parsep 3\p@ plus2\p@ minus\p@ \itemsep \parsep }\belowdisplayskip \abovedisplayskip Sample \ac {PCC} matrix time series scheme for hybridized measurement vector including 5 \ac {IAR} and 4 satellites. Colorscale black (0) - white (1).}\relax }}{78}{figure.caption.60}% 
\contentsline {figure}{\numberline {5.18}{\ignorespaces {\relax \fontsize {10}{12}\selectfont \abovedisplayskip 10\p@ plus2\p@ minus5\p@ \abovedisplayshortskip \z@ plus3\p@ \belowdisplayshortskip 6\p@ plus3\p@ minus3\p@ \def \leftmargin \leftmargini \parsep 4.5\p@ plus2\p@ minus\p@ \topsep 9\p@ plus3\p@ minus5\p@ \itemsep 4.5\p@ plus2\p@ minus\p@ {\leftmargin \leftmargini \topsep 6\p@ plus2\p@ minus2\p@ \parsep 3\p@ plus2\p@ minus\p@ \itemsep \parsep }\belowdisplayskip \abovedisplayskip PCCs over a selected set of time instants $t_k$ for the measurements set of a dynamic agents travelling over a Bernoullian lemniscate trajectory. Colorscale black (0) - white (1). }\relax }}{79}{figure.caption.61}% 
\contentsline {figure}{\numberline {5.19}{\ignorespaces {\relax \fontsize {10}{12}\selectfont \abovedisplayskip 10\p@ plus2\p@ minus5\p@ \abovedisplayshortskip \z@ plus3\p@ \belowdisplayshortskip 6\p@ plus3\p@ minus3\p@ \def \leftmargin \leftmargini \parsep 4.5\p@ plus2\p@ minus\p@ \topsep 9\p@ plus3\p@ minus5\p@ \itemsep 4.5\p@ plus2\p@ minus\p@ {\leftmargin \leftmargini \topsep 6\p@ plus2\p@ minus2\p@ \parsep 3\p@ plus2\p@ minus\p@ \itemsep \parsep }\belowdisplayskip \abovedisplayskip Snapshot of the estimated probability distribution over 10000 samples taken at a random time instant $t_k$.}\relax }}{79}{figure.caption.62}% 
\contentsline {figure}{\numberline {5.20}{\ignorespaces \relax \fontsize {10}{12}\selectfont \abovedisplayskip 10\p@ plus2\p@ minus5\p@ \abovedisplayshortskip \z@ plus3\p@ \belowdisplayshortskip 6\p@ plus3\p@ minus3\p@ \def \leftmargin \leftmargini \parsep 4.5\p@ plus2\p@ minus\p@ \topsep 9\p@ plus3\p@ minus5\p@ \itemsep 4.5\p@ plus2\p@ minus\p@ {\leftmargin \leftmargini \topsep 6\p@ plus2\p@ minus2\p@ \parsep 3\p@ plus2\p@ minus\p@ \itemsep \parsep }\belowdisplayskip \abovedisplayskip {Goodness of fit occurrences for the baseline length error of three independent agents over a Bernoullian trajectory}\relax }}{80}{figure.caption.63}% 
\contentsline {figure}{\numberline {5.21}{\ignorespaces \relax \fontsize {10}{12}\selectfont \abovedisplayskip 10\p@ plus2\p@ minus5\p@ \abovedisplayshortskip \z@ plus3\p@ \belowdisplayshortskip 6\p@ plus3\p@ minus3\p@ \def \leftmargin \leftmargini \parsep 4.5\p@ plus2\p@ minus\p@ \topsep 9\p@ plus3\p@ minus5\p@ \itemsep 4.5\p@ plus2\p@ minus\p@ {\leftmargin \leftmargini \topsep 6\p@ plus2\p@ minus2\p@ \parsep 3\p@ plus2\p@ minus\p@ \itemsep \parsep }\belowdisplayskip \abovedisplayskip {Box plot of the time evolution of the \ac {PDF} of the baseline length error for the different methods.}\relax }}{81}{figure.caption.64}% 
\addvspace {10\p@ }
\contentsline {figure}{\numberline {6.1}{\ignorespaces {\relax \fontsize {10}{12}\selectfont \abovedisplayskip 10\p@ plus2\p@ minus5\p@ \abovedisplayshortskip \z@ plus3\p@ \belowdisplayshortskip 6\p@ plus3\p@ minus3\p@ \def \leftmargin \leftmargini \parsep 4.5\p@ plus2\p@ minus\p@ \topsep 9\p@ plus3\p@ minus5\p@ \itemsep 4.5\p@ plus2\p@ minus\p@ {\leftmargin \leftmargini \topsep 6\p@ plus2\p@ minus2\p@ \parsep 3\p@ plus2\p@ minus\p@ \itemsep \parsep }\belowdisplayskip \abovedisplayskip Hidden Markov Model (HMM) for a single agent retrieving direct observable measurements}.\relax }}{84}{figure.caption.65}% 
\contentsline {figure}{\numberline {6.2}{\ignorespaces {\relax \fontsize {10}{12}\selectfont \abovedisplayskip 10\p@ plus2\p@ minus5\p@ \abovedisplayshortskip \z@ plus3\p@ \belowdisplayshortskip 6\p@ plus3\p@ minus3\p@ \def \leftmargin \leftmargini \parsep 4.5\p@ plus2\p@ minus\p@ \topsep 9\p@ plus3\p@ minus5\p@ \itemsep 4.5\p@ plus2\p@ minus\p@ {\leftmargin \leftmargini \topsep 6\p@ plus2\p@ minus2\p@ \parsep 3\p@ plus2\p@ minus\p@ \itemsep \parsep }\belowdisplayskip \abovedisplayskip Modified HMM for dual agent state-space estimation with combined, correlated measurement generation. MM referred to the functional scheme of networked \ac {GNSS} receiver.}\relax }}{86}{figure.caption.66}% 
\contentsline {figure}{\numberline {6.3}{\ignorespaces {\relax \fontsize {10}{12}\selectfont \abovedisplayskip 10\p@ plus2\p@ minus5\p@ \abovedisplayshortskip \z@ plus3\p@ \belowdisplayshortskip 6\p@ plus3\p@ minus3\p@ \def \leftmargin \leftmargini \parsep 4.5\p@ plus2\p@ minus\p@ \topsep 9\p@ plus3\p@ minus5\p@ \itemsep 4.5\p@ plus2\p@ minus\p@ {\leftmargin \leftmargini \topsep 6\p@ plus2\p@ minus2\p@ \parsep 3\p@ plus2\p@ minus\p@ \itemsep \parsep }\belowdisplayskip \abovedisplayskip HMM in \ac {GNSS} aided system state estimation.}\relax }}{87}{figure.caption.67}% 
\contentsline {figure}{\numberline {6.4}{\ignorespaces {\relax \fontsize {10}{12}\selectfont \abovedisplayskip 10\p@ plus2\p@ minus5\p@ \abovedisplayshortskip \z@ plus3\p@ \belowdisplayshortskip 6\p@ plus3\p@ minus3\p@ \def \leftmargin \leftmargini \parsep 4.5\p@ plus2\p@ minus\p@ \topsep 9\p@ plus3\p@ minus5\p@ \itemsep 4.5\p@ plus2\p@ minus\p@ {\leftmargin \leftmargini \topsep 6\p@ plus2\p@ minus2\p@ \parsep 3\p@ plus2\p@ minus\p@ \itemsep \parsep }\belowdisplayskip \abovedisplayskip Indirect \ac {KF} scheme. }\relax }}{93}{figure.caption.68}% 
\contentsline {figure}{\numberline {6.5}{\ignorespaces {\relax \fontsize {10}{12}\selectfont \abovedisplayskip 10\p@ plus2\p@ minus5\p@ \abovedisplayshortskip \z@ plus3\p@ \belowdisplayshortskip 6\p@ plus3\p@ minus3\p@ \def \leftmargin \leftmargini \parsep 4.5\p@ plus2\p@ minus\p@ \topsep 9\p@ plus3\p@ minus5\p@ \itemsep 4.5\p@ plus2\p@ minus\p@ {\leftmargin \leftmargini \topsep 6\p@ plus2\p@ minus2\p@ \parsep 3\p@ plus2\p@ minus\p@ \itemsep \parsep }\belowdisplayskip \abovedisplayskip Example of theoretical computation of satellite-based positioning CRLB vs. hybrid positioning CRLB for a dynamic trajectory. }\relax }}{101}{figure.caption.69}% 
\addvspace {10\p@ }
\contentsline {figure}{\numberline {7.1}{\ignorespaces {\relax \fontsize {10}{12}\selectfont \abovedisplayskip 10\p@ plus2\p@ minus5\p@ \abovedisplayshortskip \z@ plus3\p@ \belowdisplayshortskip 6\p@ plus3\p@ minus3\p@ \def \leftmargin \leftmargini \parsep 4.5\p@ plus2\p@ minus\p@ \topsep 9\p@ plus3\p@ minus5\p@ \itemsep 4.5\p@ plus2\p@ minus\p@ {\leftmargin \leftmargini \topsep 6\p@ plus2\p@ minus2\p@ \parsep 3\p@ plus2\p@ minus\p@ \itemsep \parsep }\belowdisplayskip \abovedisplayskip \ac {KF} Loop for the smoothing of hybrid \ac {PVT} solutions.}\relax }}{104}{figure.caption.70}% 
\contentsline {figure}{\numberline {7.2}{\ignorespaces {\relax \fontsize {10}{12}\selectfont \abovedisplayskip 10\p@ plus2\p@ minus5\p@ \abovedisplayshortskip \z@ plus3\p@ \belowdisplayshortskip 6\p@ plus3\p@ minus3\p@ \def \leftmargin \leftmargini \parsep 4.5\p@ plus2\p@ minus\p@ \topsep 9\p@ plus3\p@ minus5\p@ \itemsep 4.5\p@ plus2\p@ minus\p@ {\leftmargin \leftmargini \topsep 6\p@ plus2\p@ minus2\p@ \parsep 3\p@ plus2\p@ minus\p@ \itemsep \parsep }\belowdisplayskip \abovedisplayskip Error of the positioning solution of a given agent (a). Random motion trajectory for the same agent with positioning failures (red marker) in which the positioning solution is guaranteed by the hybrid navigation filter (b).}\relax }}{108}{figure.caption.72}% 
\contentsline {figure}{\numberline {7.3}{\ignorespaces {\relax \fontsize {10}{12}\selectfont \abovedisplayskip 10\p@ plus2\p@ minus5\p@ \abovedisplayshortskip \z@ plus3\p@ \belowdisplayshortskip 6\p@ plus3\p@ minus3\p@ \def \leftmargin \leftmargini \parsep 4.5\p@ plus2\p@ minus\p@ \topsep 9\p@ plus3\p@ minus5\p@ \itemsep 4.5\p@ plus2\p@ minus\p@ {\leftmargin \leftmargini \topsep 6\p@ plus2\p@ minus2\p@ \parsep 3\p@ plus2\p@ minus\p@ \itemsep \parsep }\belowdisplayskip \abovedisplayskip Block scheme of numerical simulations. The outputs of the \ac {LMS} blocks were compared to assess the positioning performance. $\mathbf {X}_s$ indicates the positions matrix of the visible satellites}.\relax }}{109}{figure.caption.73}% 
\contentsline {figure}{\numberline {7.4}{\ignorespaces {\relax \fontsize {10}{12}\selectfont \abovedisplayskip 10\p@ plus2\p@ minus5\p@ \abovedisplayshortskip \z@ plus3\p@ \belowdisplayshortskip 6\p@ plus3\p@ minus3\p@ \def \leftmargin \leftmargini \parsep 4.5\p@ plus2\p@ minus\p@ \topsep 9\p@ plus3\p@ minus5\p@ \itemsep 4.5\p@ plus2\p@ minus\p@ {\leftmargin \leftmargini \topsep 6\p@ plus2\p@ minus2\p@ \parsep 3\p@ plus2\p@ minus\p@ \itemsep \parsep }\belowdisplayskip \abovedisplayskip Example of a Bernoullian lemniscate path of $1046.7$ m travelled at an average speed of $26.15$ m/s. The dashed lines represent the collaborative terrestrial ranges provided according to the \ac {W-IAR} method. }\relax }}{110}{figure.caption.74}% 
\contentsline {figure}{\numberline {7.5}{\ignorespaces {\relax \fontsize {10}{12}\selectfont \abovedisplayskip 10\p@ plus2\p@ minus5\p@ \abovedisplayshortskip \z@ plus3\p@ \belowdisplayshortskip 6\p@ plus3\p@ minus3\p@ \def \leftmargin \leftmargini \parsep 4.5\p@ plus2\p@ minus\p@ \topsep 9\p@ plus3\p@ minus5\p@ \itemsep 4.5\p@ plus2\p@ minus\p@ {\leftmargin \leftmargini \topsep 6\p@ plus2\p@ minus2\p@ \parsep 3\p@ plus2\p@ minus\p@ \itemsep \parsep }\belowdisplayskip \abovedisplayskip Skyplot of the relative azimuth, $\phi $, and elevation, $\alpha $, of the satellites and the aiding agent w.r.t. the target agent position at different time instants $t_k$ where $k\in (1,2,3,4,5)$.}\relax }}{111}{figure.caption.75}% 
\contentsline {figure}{\numberline {7.6}{\ignorespaces {\relax \fontsize {10}{12}\selectfont \abovedisplayskip 10\p@ plus2\p@ minus5\p@ \abovedisplayshortskip \z@ plus3\p@ \belowdisplayshortskip 6\p@ plus3\p@ minus3\p@ \def \leftmargin \leftmargini \parsep 4.5\p@ plus2\p@ minus\p@ \topsep 9\p@ plus3\p@ minus5\p@ \itemsep 4.5\p@ plus2\p@ minus\p@ {\leftmargin \leftmargini \topsep 6\p@ plus2\p@ minus2\p@ \parsep 3\p@ plus2\p@ minus\p@ \itemsep \parsep }\belowdisplayskip \abovedisplayskip Discrete time series of \ac {IAR} error \ac {PDF}s evaluated in a set of time instants along the Bernoullian trajectory (a). Occurrences percentage of \ac {BIC} best fits of the \ac {W-IAR} error w.r.t. to a set of known statistical distributions (b).}\relax }}{112}{figure.caption.76}% 
\contentsline {figure}{\numberline {7.7}{\ignorespaces \relax \fontsize {10}{12}\selectfont \abovedisplayskip 10\p@ plus2\p@ minus5\p@ \abovedisplayshortskip \z@ plus3\p@ \belowdisplayshortskip 6\p@ plus3\p@ minus3\p@ \def \leftmargin \leftmargini \parsep 4.5\p@ plus2\p@ minus\p@ \topsep 9\p@ plus3\p@ minus5\p@ \itemsep 4.5\p@ plus2\p@ minus\p@ {\leftmargin \leftmargini \topsep 6\p@ plus2\p@ minus2\p@ \parsep 3\p@ plus2\p@ minus\p@ \itemsep \parsep }\belowdisplayskip \abovedisplayskip Estimated positioning solutions according to the scenario in Figure \ref {fig:trajectory}. The information ellipses describe the horizontal standard deviation at $90\%$, $99\%$ and $99.9\%$ of confidence interval, obtained from the eigenvalues of the matrix ${P}_\mathbf {x}^{(k)}$ in a subset of time instants, $t_k$. Results from a Monte Carlo simulation with parameters $W=10000$, $\sigma _{sA}^{(k)}=1 \forall k$, $max(d_{AB}^{(k)})=200$ m. \relax }}{113}{figure.caption.77}% 
\contentsline {figure}{\numberline {7.8}{\ignorespaces \relax \fontsize {10}{12}\selectfont \abovedisplayskip 10\p@ plus2\p@ minus5\p@ \abovedisplayshortskip \z@ plus3\p@ \belowdisplayshortskip 6\p@ plus3\p@ minus3\p@ \def \leftmargin \leftmargini \parsep 4.5\p@ plus2\p@ minus\p@ \topsep 9\p@ plus3\p@ minus5\p@ \itemsep 4.5\p@ plus2\p@ minus\p@ {\leftmargin \leftmargini \topsep 6\p@ plus2\p@ minus2\p@ \parsep 3\p@ plus2\p@ minus\p@ \itemsep \parsep }\belowdisplayskip \abovedisplayskip Statistical analysis of experimental biases and standard deviations of standalone and hybrid positioning solutions by means of Monte Carlo simulations.\relax }}{114}{figure.caption.78}% 
\contentsline {figure}{\numberline {7.9}{\ignorespaces {\relax \fontsize {10}{12}\selectfont \abovedisplayskip 10\p@ plus2\p@ minus5\p@ \abovedisplayshortskip \z@ plus3\p@ \belowdisplayshortskip 6\p@ plus3\p@ minus3\p@ \def \leftmargin \leftmargini \parsep 4.5\p@ plus2\p@ minus\p@ \topsep 9\p@ plus3\p@ minus5\p@ \itemsep 4.5\p@ plus2\p@ minus\p@ {\leftmargin \leftmargini \topsep 6\p@ plus2\p@ minus2\p@ \parsep 3\p@ plus2\p@ minus\p@ \itemsep \parsep }\belowdisplayskip \abovedisplayskip Empirical \ac {CDF} of the positioning error $\mathaccentV {hat}05E{\xi }_\mathbf {x}$ for each time instant $t_k$.}\relax }}{114}{figure.caption.79}% 
\contentsline {figure}{\numberline {7.10}{\ignorespaces {\relax \fontsize {10}{12}\selectfont \abovedisplayskip 10\p@ plus2\p@ minus5\p@ \abovedisplayshortskip \z@ plus3\p@ \belowdisplayshortskip 6\p@ plus3\p@ minus3\p@ \def \leftmargin \leftmargini \parsep 4.5\p@ plus2\p@ minus\p@ \topsep 9\p@ plus3\p@ minus5\p@ \itemsep 4.5\p@ plus2\p@ minus\p@ {\leftmargin \leftmargini \topsep 6\p@ plus2\p@ minus2\p@ \parsep 3\p@ plus2\p@ minus\p@ \itemsep \parsep }\belowdisplayskip \abovedisplayskip Comparison of measured axial standard deviations and estimated standard deviations from the \ac {CRLB} for \ac {LMS} positioning and \ac {H-LMS} by Monte Carlo simulations.}\relax }}{115}{figure.caption.80}% 
\contentsline {figure}{\numberline {7.11}{\ignorespaces {\relax \fontsize {10}{12}\selectfont \abovedisplayskip 10\p@ plus2\p@ minus5\p@ \abovedisplayshortskip \z@ plus3\p@ \belowdisplayshortskip 6\p@ plus3\p@ minus3\p@ \def \leftmargin \leftmargini \parsep 4.5\p@ plus2\p@ minus\p@ \topsep 9\p@ plus3\p@ minus5\p@ \itemsep 4.5\p@ plus2\p@ minus\p@ {\leftmargin \leftmargini \topsep 6\p@ plus2\p@ minus2\p@ \parsep 3\p@ plus2\p@ minus\p@ \itemsep \parsep }\belowdisplayskip \abovedisplayskip Matrices of \ac {PCC} \textup {\hbox {\mathsurround \z@ \normalfont (\ignorespaces \ref {eq:corrCoeff}\unskip \@@italiccorr )}} computed for the measurement error covariance $\mathbf {R}_\rho $, and observed at sample time instants $t_k$, where $k \in \left \delimiter "4266308 1,5 \right \delimiter "5267309 $.}\relax }}{115}{figure.caption.81}% 
\contentsline {figure}{\numberline {7.12}{\ignorespaces {\relax \fontsize {10}{12}\selectfont \abovedisplayskip 10\p@ plus2\p@ minus5\p@ \abovedisplayshortskip \z@ plus3\p@ \belowdisplayshortskip 6\p@ plus3\p@ minus3\p@ \def \leftmargin \leftmargini \parsep 4.5\p@ plus2\p@ minus\p@ \topsep 9\p@ plus3\p@ minus5\p@ \itemsep 4.5\p@ plus2\p@ minus\p@ {\leftmargin \leftmargini \topsep 6\p@ plus2\p@ minus2\p@ \parsep 3\p@ plus2\p@ minus\p@ \itemsep \parsep }\belowdisplayskip \abovedisplayskip Horizontal \ac {CRLB} computed for \ac {H-LMS} in different elementary geometrical trajectories vs. horizontal \ac {CRLB} computed for \ac {LMS}.}\relax }}{116}{figure.caption.82}% 
\contentsline {figure}{\numberline {7.13}{\ignorespaces {\relax \fontsize {10}{12}\selectfont \abovedisplayskip 10\p@ plus2\p@ minus5\p@ \abovedisplayshortskip \z@ plus3\p@ \belowdisplayshortskip 6\p@ plus3\p@ minus3\p@ \def \leftmargin \leftmargini \parsep 4.5\p@ plus2\p@ minus\p@ \topsep 9\p@ plus3\p@ minus5\p@ \itemsep 4.5\p@ plus2\p@ minus\p@ {\leftmargin \leftmargini \topsep 6\p@ plus2\p@ minus2\p@ \parsep 3\p@ plus2\p@ minus\p@ \itemsep \parsep }\belowdisplayskip \abovedisplayskip Estimated EKF and H-EKF positioning solutions according to the scenario depicted in Figure \ref {fig:trajectory}. The information ellipses describe the horizontal standard deviation at $90\%$, $99\%$ and $99.9\%$ confidence intervals, obtained from the eigenvalues of the matrix $P_\mathbf {x}$ in a subset of time instants, $t_k$. Results from a Monte Carlo simulation with parameters $W=10000$, $\sigma _{sA}=1$, $max(d_{AB})=300$ m. }\relax }}{117}{figure.caption.84}% 
\contentsline {figure}{\numberline {7.14}{\ignorespaces {\relax \fontsize {10}{12}\selectfont \abovedisplayskip 10\p@ plus2\p@ minus5\p@ \abovedisplayshortskip \z@ plus3\p@ \belowdisplayshortskip 6\p@ plus3\p@ minus3\p@ \def \leftmargin \leftmargini \parsep 4.5\p@ plus2\p@ minus\p@ \topsep 9\p@ plus3\p@ minus5\p@ \itemsep 4.5\p@ plus2\p@ minus\p@ {\leftmargin \leftmargini \topsep 6\p@ plus2\p@ minus2\p@ \parsep 3\p@ plus2\p@ minus\p@ \itemsep \parsep }\belowdisplayskip \abovedisplayskip CRLB computed for EKF and H-EKF compared to the statistical values of the trace of the error covariance of the position obtained from the Monte Carlo simulation. The ordinate axis is logarithmic scale for improved readability.}\relax }}{117}{figure.caption.85}% 
\contentsline {figure}{\numberline {7.15}{\ignorespaces {\relax \fontsize {10}{12}\selectfont \abovedisplayskip 10\p@ plus2\p@ minus5\p@ \abovedisplayshortskip \z@ plus3\p@ \belowdisplayshortskip 6\p@ plus3\p@ minus3\p@ \def \leftmargin \leftmargini \parsep 4.5\p@ plus2\p@ minus\p@ \topsep 9\p@ plus3\p@ minus5\p@ \itemsep 4.5\p@ plus2\p@ minus\p@ {\leftmargin \leftmargini \topsep 6\p@ plus2\p@ minus2\p@ \parsep 3\p@ plus2\p@ minus\p@ \itemsep \parsep }\belowdisplayskip \abovedisplayskip High-level block scheme of the experimental setup.}\relax }}{118}{figure.caption.86}% 
\contentsline {figure}{\numberline {7.16}{\ignorespaces {\relax \fontsize {10}{12}\selectfont \abovedisplayskip 10\p@ plus2\p@ minus5\p@ \abovedisplayshortskip \z@ plus3\p@ \belowdisplayshortskip 6\p@ plus3\p@ minus3\p@ \def \leftmargin \leftmargini \parsep 4.5\p@ plus2\p@ minus\p@ \topsep 9\p@ plus3\p@ minus5\p@ \itemsep 4.5\p@ plus2\p@ minus\p@ {\leftmargin \leftmargini \topsep 6\p@ plus2\p@ minus2\p@ \parsep 3\p@ plus2\p@ minus\p@ \itemsep \parsep }\belowdisplayskip \abovedisplayskip Snapshot of simulated satellites positions by IFEN\textsuperscript {\relax \fontsize {6}{7}\selectfont \textregistered } NavX.}\relax }}{119}{figure.caption.87}% 
\contentsline {figure}{\numberline {7.17}{\ignorespaces {\relax \fontsize {10}{12}\selectfont \abovedisplayskip 10\p@ plus2\p@ minus5\p@ \abovedisplayshortskip \z@ plus3\p@ \belowdisplayshortskip 6\p@ plus3\p@ minus3\p@ \def \leftmargin \leftmargini \parsep 4.5\p@ plus2\p@ minus\p@ \topsep 9\p@ plus3\p@ minus5\p@ \itemsep 4.5\p@ plus2\p@ minus\p@ {\leftmargin \leftmargini \topsep 6\p@ plus2\p@ minus2\p@ \parsep 3\p@ plus2\p@ minus\p@ \itemsep \parsep }\belowdisplayskip \abovedisplayskip Multi-agent simulation scenario. 7 fixed GNSS receivers and a Target agent moving on a Bernoullian trajectory with lobes of radius $r_{{\mathcal {L}}} = 500$. Heading information indicates the motion direction.}\relax }}{120}{figure.caption.88}% 
\contentsline {figure}{\numberline {7.18}{\ignorespaces {\relax \fontsize {10}{12}\selectfont \abovedisplayskip 10\p@ plus2\p@ minus5\p@ \abovedisplayshortskip \z@ plus3\p@ \belowdisplayshortskip 6\p@ plus3\p@ minus3\p@ \def \leftmargin \leftmargini \parsep 4.5\p@ plus2\p@ minus\p@ \topsep 9\p@ plus3\p@ minus5\p@ \itemsep 4.5\p@ plus2\p@ minus\p@ {\leftmargin \leftmargini \topsep 6\p@ plus2\p@ minus2\p@ \parsep 3\p@ plus2\p@ minus\p@ \itemsep \parsep }\belowdisplayskip \abovedisplayskip Simulated dynamics of the target agent.}\relax }}{120}{figure.caption.89}% 
\contentsline {figure}{\numberline {7.19}{\ignorespaces {\relax \fontsize {10}{12}\selectfont \abovedisplayskip 10\p@ plus2\p@ minus5\p@ \abovedisplayshortskip \z@ plus3\p@ \belowdisplayshortskip 6\p@ plus3\p@ minus3\p@ \def \leftmargin \leftmargini \parsep 4.5\p@ plus2\p@ minus\p@ \topsep 9\p@ plus3\p@ minus5\p@ \itemsep 4.5\p@ plus2\p@ minus\p@ {\leftmargin \leftmargini \topsep 6\p@ plus2\p@ minus2\p@ \parsep 3\p@ plus2\p@ minus\p@ \itemsep \parsep }\belowdisplayskip \abovedisplayskip Simulated relative dynamics of the agents w.r.t. the target agent.}\relax }}{120}{figure.caption.90}% 
\contentsline {figure}{\numberline {7.20}{\ignorespaces {\relax \fontsize {10}{12}\selectfont \abovedisplayskip 10\p@ plus2\p@ minus5\p@ \abovedisplayshortskip \z@ plus3\p@ \belowdisplayshortskip 6\p@ plus3\p@ minus3\p@ \def \leftmargin \leftmargini \parsep 4.5\p@ plus2\p@ minus\p@ \topsep 9\p@ plus3\p@ minus5\p@ \itemsep 4.5\p@ plus2\p@ minus\p@ {\leftmargin \leftmargini \topsep 6\p@ plus2\p@ minus2\p@ \parsep 3\p@ plus2\p@ minus\p@ \itemsep \parsep }\belowdisplayskip \abovedisplayskip Epochs misalignment for 8 asynchronous, independent GNSS receivers observed at 10 Hz w.r.t. to the reference GPS time scale.}\relax }}{121}{figure.caption.91}% 
\contentsline {figure}{\numberline {7.21}{\ignorespaces {\relax \fontsize {10}{12}\selectfont \abovedisplayskip 10\p@ plus2\p@ minus5\p@ \abovedisplayshortskip \z@ plus3\p@ \belowdisplayshortskip 6\p@ plus3\p@ minus3\p@ \def \leftmargin \leftmargini \parsep 4.5\p@ plus2\p@ minus\p@ \topsep 9\p@ plus3\p@ minus5\p@ \itemsep 4.5\p@ plus2\p@ minus\p@ {\leftmargin \leftmargini \topsep 6\p@ plus2\p@ minus2\p@ \parsep 3\p@ plus2\p@ minus\p@ \itemsep \parsep }\belowdisplayskip \abovedisplayskip Mean error trend on a single inter-agent GNSS-based measurement in case of underestimation of the Doppler shift by the target receiver.}\relax }}{121}{figure.caption.92}% 
\contentsline {figure}{\numberline {7.22}{\ignorespaces {\relax \fontsize {10}{12}\selectfont \abovedisplayskip 10\p@ plus2\p@ minus5\p@ \abovedisplayshortskip \z@ plus3\p@ \belowdisplayshortskip 6\p@ plus3\p@ minus3\p@ \def \leftmargin \leftmargini \parsep 4.5\p@ plus2\p@ minus\p@ \topsep 9\p@ plus3\p@ minus5\p@ \itemsep 4.5\p@ plus2\p@ minus\p@ {\leftmargin \leftmargini \topsep 6\p@ plus2\p@ minus2\p@ \parsep 3\p@ plus2\p@ minus\p@ \itemsep \parsep }\belowdisplayskip \abovedisplayskip Example of standalone vs. hybrid CDF on the positioning error evaluated on a long path (280 s) with $S=6$ and $C=4$ in Earth Centered Earth Fixed (ECEF) reference frame.}\relax }}{122}{figure.caption.93}% 
\contentsline {figure}{\numberline {7.23}{\ignorespaces \relax \fontsize {10}{12}\selectfont \abovedisplayskip 10\p@ plus2\p@ minus5\p@ \abovedisplayshortskip \z@ plus3\p@ \belowdisplayshortskip 6\p@ plus3\p@ minus3\p@ \def \leftmargin \leftmargini \parsep 4.5\p@ plus2\p@ minus\p@ \topsep 9\p@ plus3\p@ minus5\p@ \itemsep 4.5\p@ plus2\p@ minus\p@ {\leftmargin \leftmargini \topsep 6\p@ plus2\p@ minus2\p@ \parsep 3\p@ plus2\p@ minus\p@ \itemsep \parsep }\belowdisplayskip \abovedisplayskip Percentiles extracted from the position error CDF. Position errors computed in \textit {high relative dynamics} (\ref {fig:trend01}) and \textit {low relative dynamic} (\ref {fig:trend02}).\relax }}{123}{figure.caption.94}% 
\contentsline {figure}{\numberline {7.24}{\ignorespaces {\relax \fontsize {10}{12}\selectfont \abovedisplayskip 10\p@ plus2\p@ minus5\p@ \abovedisplayshortskip \z@ plus3\p@ \belowdisplayshortskip 6\p@ plus3\p@ minus3\p@ \def \leftmargin \leftmargini \parsep 4.5\p@ plus2\p@ minus\p@ \topsep 9\p@ plus3\p@ minus5\p@ \itemsep 4.5\p@ plus2\p@ minus\p@ {\leftmargin \leftmargini \topsep 6\p@ plus2\p@ minus2\p@ \parsep 3\p@ plus2\p@ minus\p@ \itemsep \parsep }\belowdisplayskip \abovedisplayskip Average Performance improvement varying the number of satellites (available channels) and the number of aiding agents (color-scale).}\relax }}{124}{figure.caption.95}% 
\contentsline {figure}{\numberline {7.25}{\ignorespaces {\relax \fontsize {10}{12}\selectfont \abovedisplayskip 10\p@ plus2\p@ minus5\p@ \abovedisplayshortskip \z@ plus3\p@ \belowdisplayshortskip 6\p@ plus3\p@ minus3\p@ \def \leftmargin \leftmargini \parsep 4.5\p@ plus2\p@ minus\p@ \topsep 9\p@ plus3\p@ minus5\p@ \itemsep 4.5\p@ plus2\p@ minus\p@ {\leftmargin \leftmargini \topsep 6\p@ plus2\p@ minus2\p@ \parsep 3\p@ plus2\p@ minus\p@ \itemsep \parsep }\belowdisplayskip \abovedisplayskip $X$-$Y$ $3^\text {rd}$ order data fitting with multi-dimensional polynomial showing the trend of the average accuracy improvement in \textit {high relative dynamics} varying the number of satellites and aiding agents in high relative dynamics.}\relax }}{126}{figure.caption.97}% 
\contentsline {figure}{\numberline {7.26}{\ignorespaces {\relax \fontsize {10}{12}\selectfont \abovedisplayskip 10\p@ plus2\p@ minus5\p@ \abovedisplayshortskip \z@ plus3\p@ \belowdisplayshortskip 6\p@ plus3\p@ minus3\p@ \def \leftmargin \leftmargini \parsep 4.5\p@ plus2\p@ minus\p@ \topsep 9\p@ plus3\p@ minus5\p@ \itemsep 4.5\p@ plus2\p@ minus\p@ {\leftmargin \leftmargini \topsep 6\p@ plus2\p@ minus2\p@ \parsep 3\p@ plus2\p@ minus\p@ \itemsep \parsep }\belowdisplayskip \abovedisplayskip Bernoullian Lemniscate test trajectory. The results are referred to the S-shaped portion included between instants $t_s$ and $t_{e}$ and crossing the location of agent $C_1$.}\relax }}{127}{figure.caption.98}% 
\contentsline {figure}{\numberline {7.27}{\ignorespaces {\relax \fontsize {10}{12}\selectfont \abovedisplayskip 10\p@ plus2\p@ minus5\p@ \abovedisplayshortskip \z@ plus3\p@ \belowdisplayshortskip 6\p@ plus3\p@ minus3\p@ \def \leftmargin \leftmargini \parsep 4.5\p@ plus2\p@ minus\p@ \topsep 9\p@ plus3\p@ minus5\p@ \itemsep 4.5\p@ plus2\p@ minus\p@ {\leftmargin \leftmargini \topsep 6\p@ plus2\p@ minus2\p@ \parsep 3\p@ plus2\p@ minus\p@ \itemsep \parsep }\belowdisplayskip \abovedisplayskip CDFs of the estimated trajectory with plain s-PF ($N=1000$) and EKF navigation filters.}\relax }}{128}{figure.caption.100}% 
\contentsline {figure}{\numberline {7.28}{\ignorespaces {\relax \fontsize {10}{12}\selectfont \abovedisplayskip 10\p@ plus2\p@ minus5\p@ \abovedisplayshortskip \z@ plus3\p@ \belowdisplayshortskip 6\p@ plus3\p@ minus3\p@ \def \leftmargin \leftmargini \parsep 4.5\p@ plus2\p@ minus\p@ \topsep 9\p@ plus3\p@ minus5\p@ \itemsep 4.5\p@ plus2\p@ minus\p@ {\leftmargin \leftmargini \topsep 6\p@ plus2\p@ minus2\p@ \parsep 3\p@ plus2\p@ minus\p@ \itemsep \parsep }\belowdisplayskip \abovedisplayskip CDFs of the estimated trajectory with Hybrid s-PF using different numbers of particles and varying the number of collaborative contributions.}\relax }}{129}{figure.caption.101}% 
\contentsline {figure}{\numberline {7.29}{\ignorespaces {\relax \fontsize {10}{12}\selectfont \abovedisplayskip 10\p@ plus2\p@ minus5\p@ \abovedisplayshortskip \z@ plus3\p@ \belowdisplayshortskip 6\p@ plus3\p@ minus3\p@ \def \leftmargin \leftmargini \parsep 4.5\p@ plus2\p@ minus\p@ \topsep 9\p@ plus3\p@ minus5\p@ \itemsep 4.5\p@ plus2\p@ minus\p@ {\leftmargin \leftmargini \topsep 6\p@ plus2\p@ minus2\p@ \parsep 3\p@ plus2\p@ minus\p@ \itemsep \parsep }\belowdisplayskip \abovedisplayskip CDF of EKF and PF trajectory estimation varying the number of particles and the number of collaborative contributions in good satellite visibility.}\relax }}{129}{figure.caption.102}% 
\contentsline {figure}{\numberline {7.30}{\ignorespaces {\relax \fontsize {10}{12}\selectfont \abovedisplayskip 10\p@ plus2\p@ minus5\p@ \abovedisplayshortskip \z@ plus3\p@ \belowdisplayshortskip 6\p@ plus3\p@ minus3\p@ \def \leftmargin \leftmargini \parsep 4.5\p@ plus2\p@ minus\p@ \topsep 9\p@ plus3\p@ minus5\p@ \itemsep 4.5\p@ plus2\p@ minus\p@ {\leftmargin \leftmargini \topsep 6\p@ plus2\p@ minus2\p@ \parsep 3\p@ plus2\p@ minus\p@ \itemsep \parsep }\belowdisplayskip \abovedisplayskip CDF of EKF and PF trajectory estimation varying the number of particles and the number of collaborative contributions in poor satellite visibility.}\relax }}{130}{figure.caption.103}% 
\addvspace {10\p@ }
\contentsline {figure}{\numberline {8.1}{\ignorespaces {\relax \fontsize {10}{12}\selectfont \abovedisplayskip 10\p@ plus2\p@ minus5\p@ \abovedisplayshortskip \z@ plus3\p@ \belowdisplayshortskip 6\p@ plus3\p@ minus3\p@ \def \leftmargin \leftmargini \parsep 4.5\p@ plus2\p@ minus\p@ \topsep 9\p@ plus3\p@ minus5\p@ \itemsep 4.5\p@ plus2\p@ minus\p@ {\leftmargin \leftmargini \topsep 6\p@ plus2\p@ minus2\p@ \parsep 3\p@ plus2\p@ minus\p@ \itemsep \parsep }\belowdisplayskip \abovedisplayskip HANSEL testbed high-level block scheme.}\relax }}{133}{figure.caption.104}% 
\contentsline {figure}{\numberline {8.2}{\ignorespaces \relax \fontsize {10}{12}\selectfont \abovedisplayskip 10\p@ plus2\p@ minus5\p@ \abovedisplayshortskip \z@ plus3\p@ \belowdisplayshortskip 6\p@ plus3\p@ minus3\p@ \def \leftmargin \leftmargini \parsep 4.5\p@ plus2\p@ minus\p@ \topsep 9\p@ plus3\p@ minus5\p@ \itemsep 4.5\p@ plus2\p@ minus\p@ {\leftmargin \leftmargini \topsep 6\p@ plus2\p@ minus2\p@ \parsep 3\p@ plus2\p@ minus\p@ \itemsep \parsep }\belowdisplayskip \abovedisplayskip Network topologies for the \ac {CP} paradigm among networked receivers.\relax }}{135}{figure.caption.107}% 
\contentsline {figure}{\numberline {8.3}{\ignorespaces {\relax \fontsize {10}{12}\selectfont \abovedisplayskip 10\p@ plus2\p@ minus5\p@ \abovedisplayshortskip \z@ plus3\p@ \belowdisplayshortskip 6\p@ plus3\p@ minus3\p@ \def \leftmargin \leftmargini \parsep 4.5\p@ plus2\p@ minus\p@ \topsep 9\p@ plus3\p@ minus5\p@ \itemsep 4.5\p@ plus2\p@ minus\p@ {\leftmargin \leftmargini \topsep 6\p@ plus2\p@ minus2\p@ \parsep 3\p@ plus2\p@ minus\p@ \itemsep \parsep }\belowdisplayskip \abovedisplayskip Xiaomi\textsuperscript {\texttrademark } Mi 8 Pro and Broadcom\textsuperscript {\texttrademark } BCM47755 Dual-frequency \ac {GNSS} chip.}\relax }}{136}{figure.caption.108}% 
\contentsline {figure}{\numberline {8.4}{\ignorespaces {\relax \fontsize {10}{12}\selectfont \abovedisplayskip 10\p@ plus2\p@ minus5\p@ \abovedisplayshortskip \z@ plus3\p@ \belowdisplayshortskip 6\p@ plus3\p@ minus3\p@ \def \leftmargin \leftmargini \parsep 4.5\p@ plus2\p@ minus\p@ \topsep 9\p@ plus3\p@ minus5\p@ \itemsep 4.5\p@ plus2\p@ minus\p@ {\leftmargin \leftmargini \topsep 6\p@ plus2\p@ minus2\p@ \parsep 3\p@ plus2\p@ minus\p@ \itemsep \parsep }\belowdisplayskip \abovedisplayskip High-level configuration of the scalable \ac {CAPS.loc} client-server topology (exploited in the real implementation.}\relax }}{138}{figure.caption.109}% 
\contentsline {figure}{\numberline {8.5}{\ignorespaces {\relax \fontsize {10}{12}\selectfont \abovedisplayskip 10\p@ plus2\p@ minus5\p@ \abovedisplayshortskip \z@ plus3\p@ \belowdisplayshortskip 6\p@ plus3\p@ minus3\p@ \def \leftmargin \leftmargini \parsep 4.5\p@ plus2\p@ minus\p@ \topsep 9\p@ plus3\p@ minus5\p@ \itemsep 4.5\p@ plus2\p@ minus\p@ {\leftmargin \leftmargini \topsep 6\p@ plus2\p@ minus2\p@ \parsep 3\p@ plus2\p@ minus\p@ \itemsep \parsep }\belowdisplayskip \abovedisplayskip Full \ac {CPA} functional scheme showing all the threads and the communication processes among them.}\relax }}{141}{figure.caption.114}% 
\contentsline {figure}{\numberline {8.6}{\ignorespaces {\relax \fontsize {10}{12}\selectfont \abovedisplayskip 10\p@ plus2\p@ minus5\p@ \abovedisplayshortskip \z@ plus3\p@ \belowdisplayshortskip 6\p@ plus3\p@ minus3\p@ \def \leftmargin \leftmargini \parsep 4.5\p@ plus2\p@ minus\p@ \topsep 9\p@ plus3\p@ minus5\p@ \itemsep 4.5\p@ plus2\p@ minus\p@ {\leftmargin \leftmargini \topsep 6\p@ plus2\p@ minus2\p@ \parsep 3\p@ plus2\p@ minus\p@ \itemsep \parsep }\belowdisplayskip \abovedisplayskip Agent registration process as it is forseen for the \ac {CPA}/\ac {CPS} interaction}.\relax }}{142}{figure.caption.115}% 
\contentsline {figure}{\numberline {8.7}{\ignorespaces {\relax \fontsize {10}{12}\selectfont \abovedisplayskip 10\p@ plus2\p@ minus5\p@ \abovedisplayshortskip \z@ plus3\p@ \belowdisplayshortskip 6\p@ plus3\p@ minus3\p@ \def \leftmargin \leftmargini \parsep 4.5\p@ plus2\p@ minus\p@ \topsep 9\p@ plus3\p@ minus5\p@ \itemsep 4.5\p@ plus2\p@ minus\p@ {\leftmargin \leftmargini \topsep 6\p@ plus2\p@ minus2\p@ \parsep 3\p@ plus2\p@ minus\p@ \itemsep \parsep }\belowdisplayskip \abovedisplayskip Hybrid positioning flow chart.}\relax }}{144}{figure.caption.116}% 
\contentsline {figure}{\numberline {8.8}{\ignorespaces {\relax \fontsize {10}{12}\selectfont \abovedisplayskip 10\p@ plus2\p@ minus5\p@ \abovedisplayshortskip \z@ plus3\p@ \belowdisplayshortskip 6\p@ plus3\p@ minus3\p@ \def \leftmargin \leftmargini \parsep 4.5\p@ plus2\p@ minus\p@ \topsep 9\p@ plus3\p@ minus5\p@ \itemsep 4.5\p@ plus2\p@ minus\p@ {\leftmargin \leftmargini \topsep 6\p@ plus2\p@ minus2\p@ \parsep 3\p@ plus2\p@ minus\p@ \itemsep \parsep }\belowdisplayskip \abovedisplayskip Screenshots of the CPA developed within the HANSEL project.}\relax }}{145}{figure.caption.117}% 
\contentsline {figure}{\numberline {8.9}{\ignorespaces {\relax \fontsize {10}{12}\selectfont \abovedisplayskip 10\p@ plus2\p@ minus5\p@ \abovedisplayshortskip \z@ plus3\p@ \belowdisplayshortskip 6\p@ plus3\p@ minus3\p@ \def \leftmargin \leftmargini \parsep 4.5\p@ plus2\p@ minus\p@ \topsep 9\p@ plus3\p@ minus5\p@ \itemsep 4.5\p@ plus2\p@ minus\p@ {\leftmargin \leftmargini \topsep 6\p@ plus2\p@ minus2\p@ \parsep 3\p@ plus2\p@ minus\p@ \itemsep \parsep }\belowdisplayskip \abovedisplayskip Screenshots of the CPA configuration panel.}\relax }}{146}{figure.caption.118}% 
\contentsline {figure}{\numberline {8.10}{\ignorespaces {\relax \fontsize {10}{12}\selectfont \abovedisplayskip 10\p@ plus2\p@ minus5\p@ \abovedisplayshortskip \z@ plus3\p@ \belowdisplayshortskip 6\p@ plus3\p@ minus3\p@ \def \leftmargin \leftmargini \parsep 4.5\p@ plus2\p@ minus\p@ \topsep 9\p@ plus3\p@ minus5\p@ \itemsep 4.5\p@ plus2\p@ minus\p@ {\leftmargin \leftmargini \topsep 6\p@ plus2\p@ minus2\p@ \parsep 3\p@ plus2\p@ minus\p@ \itemsep \parsep }\belowdisplayskip \abovedisplayskip \SI {20}{\meter } baseline test with \ac {DDR} and \ac {PVT-R} comparison. \ac {GDOP}$=2.0$ }.\relax }}{148}{figure.caption.119}% 
\contentsline {figure}{\numberline {8.11}{\ignorespaces {\relax \fontsize {10}{12}\selectfont \abovedisplayskip 10\p@ plus2\p@ minus5\p@ \abovedisplayshortskip \z@ plus3\p@ \belowdisplayshortskip 6\p@ plus3\p@ minus3\p@ \def \leftmargin \leftmargini \parsep 4.5\p@ plus2\p@ minus\p@ \topsep 9\p@ plus3\p@ minus5\p@ \itemsep 4.5\p@ plus2\p@ minus\p@ {\leftmargin \leftmargini \topsep 6\p@ plus2\p@ minus2\p@ \parsep 3\p@ plus2\p@ minus\p@ \itemsep \parsep }\belowdisplayskip \abovedisplayskip \SI {20}{\meter } baseline test with DDR, W-DDR and \ac {APD} comparison. \ac {GDOP}$=2.5$, increased by filtering bad measurements}.\relax }}{148}{figure.caption.120}% 
\contentsline {figure}{\numberline {8.12}{\ignorespaces {\relax \fontsize {10}{12}\selectfont \abovedisplayskip 10\p@ plus2\p@ minus5\p@ \abovedisplayshortskip \z@ plus3\p@ \belowdisplayshortskip 6\p@ plus3\p@ minus3\p@ \def \leftmargin \leftmargini \parsep 4.5\p@ plus2\p@ minus\p@ \topsep 9\p@ plus3\p@ minus5\p@ \itemsep 4.5\p@ plus2\p@ minus\p@ {\leftmargin \leftmargini \topsep 6\p@ plus2\p@ minus2\p@ \parsep 3\p@ plus2\p@ minus\p@ \itemsep \parsep }\belowdisplayskip \abovedisplayskip Experiment setup exploiting 4G connectivity and \ac {CPS} on a remote server (Amazon Web Service located in Ireland).}\relax }}{149}{figure.caption.122}% 
\contentsline {figure}{\numberline {8.13}{\ignorespaces {\relax \fontsize {10}{12}\selectfont \abovedisplayskip 10\p@ plus2\p@ minus5\p@ \abovedisplayshortskip \z@ plus3\p@ \belowdisplayshortskip 6\p@ plus3\p@ minus3\p@ \def \leftmargin \leftmargini \parsep 4.5\p@ plus2\p@ minus\p@ \topsep 9\p@ plus3\p@ minus5\p@ \itemsep 4.5\p@ plus2\p@ minus\p@ {\leftmargin \leftmargini \topsep 6\p@ plus2\p@ minus2\p@ \parsep 3\p@ plus2\p@ minus\p@ \itemsep \parsep }\belowdisplayskip \abovedisplayskip Example of pedestrian urban paths with different profitability of the paradigm (greed dots indicate profitable integration). The cross marker indicates the origin of the local EN frame \added [id=1]{(Up direction is omitted for readability)}.}\relax }}{151}{figure.caption.123}% 
\contentsline {figure}{\numberline {8.14}{\ignorespaces {\relax \fontsize {10}{12}\selectfont \abovedisplayskip 10\p@ plus2\p@ minus5\p@ \abovedisplayshortskip \z@ plus3\p@ \belowdisplayshortskip 6\p@ plus3\p@ minus3\p@ \def \leftmargin \leftmargini \parsep 4.5\p@ plus2\p@ minus\p@ \topsep 9\p@ plus3\p@ minus5\p@ \itemsep 4.5\p@ plus2\p@ minus\p@ {\leftmargin \leftmargini \topsep 6\p@ plus2\p@ minus2\p@ \parsep 3\p@ plus2\p@ minus\p@ \itemsep \parsep }\belowdisplayskip \abovedisplayskip Classification of profitability according to the hysteresis threshold $T_{H}$}.\relax }}{152}{figure.caption.124}% 
\contentsline {figure}{\numberline {8.15}{\ignorespaces {\relax \fontsize {10}{12}\selectfont \abovedisplayskip 10\p@ plus2\p@ minus5\p@ \abovedisplayshortskip \z@ plus3\p@ \belowdisplayshortskip 6\p@ plus3\p@ minus3\p@ \def \leftmargin \leftmargini \parsep 4.5\p@ plus2\p@ minus\p@ \topsep 9\p@ plus3\p@ minus5\p@ \itemsep 4.5\p@ plus2\p@ minus\p@ {\leftmargin \leftmargini \topsep 6\p@ plus2\p@ minus2\p@ \parsep 3\p@ plus2\p@ minus\p@ \itemsep \parsep }\belowdisplayskip \abovedisplayskip Sample Pie charts of \ac {CP} profitability for two different smarpthones}.\relax }}{152}{figure.caption.125}% 
\contentsline {figure}{\numberline {8.16}{\ignorespaces {\relax \fontsize {10}{12}\selectfont \abovedisplayskip 10\p@ plus2\p@ minus5\p@ \abovedisplayshortskip \z@ plus3\p@ \belowdisplayshortskip 6\p@ plus3\p@ minus3\p@ \def \leftmargin \leftmargini \parsep 4.5\p@ plus2\p@ minus\p@ \topsep 9\p@ plus3\p@ minus5\p@ \itemsep 4.5\p@ plus2\p@ minus\p@ {\leftmargin \leftmargini \topsep 6\p@ plus2\p@ minus2\p@ \parsep 3\p@ plus2\p@ minus\p@ \itemsep \parsep }\belowdisplayskip \abovedisplayskip Example of barplot showing superimposed (3-D and 2-D) of the positioning solution for profitable \ac {CP} and \ac {GNSS}-only (GPS) \ac {PVT} for dataset \texttt {0210219-01}.}\relax }}{153}{figure.caption.126}% 
\contentsline {figure}{\numberline {8.17}{\ignorespaces \relax \fontsize {10}{12}\selectfont \abovedisplayskip 10\p@ plus2\p@ minus5\p@ \abovedisplayshortskip \z@ plus3\p@ \belowdisplayshortskip 6\p@ plus3\p@ minus3\p@ \def \leftmargin \leftmargini \parsep 4.5\p@ plus2\p@ minus\p@ \topsep 9\p@ plus3\p@ minus5\p@ \itemsep 4.5\p@ plus2\p@ minus\p@ {\leftmargin \leftmargini \topsep 6\p@ plus2\p@ minus2\p@ \parsep 3\p@ plus2\p@ minus\p@ \itemsep \parsep }\belowdisplayskip \abovedisplayskip Relative dynamics example between two cooperating agents.\relax }}{154}{figure.caption.127}% 
\contentsline {figure}{\numberline {8.18}{\ignorespaces {\relax \fontsize {10}{12}\selectfont \abovedisplayskip 10\p@ plus2\p@ minus5\p@ \abovedisplayshortskip \z@ plus3\p@ \belowdisplayshortskip 6\p@ plus3\p@ minus3\p@ \def \leftmargin \leftmargini \parsep 4.5\p@ plus2\p@ minus\p@ \topsep 9\p@ plus3\p@ minus5\p@ \itemsep 4.5\p@ plus2\p@ minus\p@ {\leftmargin \leftmargini \topsep 6\p@ plus2\p@ minus2\p@ \parsep 3\p@ plus2\p@ minus\p@ \itemsep \parsep }\belowdisplayskip \abovedisplayskip Pie charts of \ac {CP} profitability for the two smarpthone in the experiment \texttt {f-01}}\relax }}{156}{figure.caption.129}% 
\contentsline {figure}{\numberline {8.19}{\ignorespaces {\relax \fontsize {10}{12}\selectfont \abovedisplayskip 10\p@ plus2\p@ minus5\p@ \abovedisplayshortskip \z@ plus3\p@ \belowdisplayshortskip 6\p@ plus3\p@ minus3\p@ \def \leftmargin \leftmargini \parsep 4.5\p@ plus2\p@ minus\p@ \topsep 9\p@ plus3\p@ minus5\p@ \itemsep 4.5\p@ plus2\p@ minus\p@ {\leftmargin \leftmargini \topsep 6\p@ plus2\p@ minus2\p@ \parsep 3\p@ plus2\p@ minus\p@ \itemsep \parsep }\belowdisplayskip \abovedisplayskip Time series of profitability/unprofitability of \ac {CP} in the experiment \texttt {F-01}.}\relax }}{157}{figure.caption.130}% 
\contentsline {figure}{\numberline {8.20}{\ignorespaces {\relax \fontsize {10}{12}\selectfont \abovedisplayskip 10\p@ plus2\p@ minus5\p@ \abovedisplayshortskip \z@ plus3\p@ \belowdisplayshortskip 6\p@ plus3\p@ minus3\p@ \def \leftmargin \leftmargini \parsep 4.5\p@ plus2\p@ minus\p@ \topsep 9\p@ plus3\p@ minus5\p@ \itemsep 4.5\p@ plus2\p@ minus\p@ {\leftmargin \leftmargini \topsep 6\p@ plus2\p@ minus2\p@ \parsep 3\p@ plus2\p@ minus\p@ \itemsep \parsep }\belowdisplayskip \abovedisplayskip Pie charts of \ac {CP} profitability for the two smartphones in the experiment \texttt {d-02}.}\relax }}{158}{figure.caption.131}% 
\contentsline {figure}{\numberline {8.21}{\ignorespaces {\relax \fontsize {10}{12}\selectfont \abovedisplayskip 10\p@ plus2\p@ minus5\p@ \abovedisplayshortskip \z@ plus3\p@ \belowdisplayshortskip 6\p@ plus3\p@ minus3\p@ \def \leftmargin \leftmargini \parsep 4.5\p@ plus2\p@ minus\p@ \topsep 9\p@ plus3\p@ minus5\p@ \itemsep 4.5\p@ plus2\p@ minus\p@ {\leftmargin \leftmargini \topsep 6\p@ plus2\p@ minus2\p@ \parsep 3\p@ plus2\p@ minus\p@ \itemsep \parsep }\belowdisplayskip \abovedisplayskip Pie charts of \ac {CP} profitability for the two smartphones in the experiment \texttt {g-05}.}\relax }}{159}{figure.caption.132}% 
\contentsline {figure}{\numberline {8.22}{\ignorespaces {\relax \fontsize {10}{12}\selectfont \abovedisplayskip 10\p@ plus2\p@ minus5\p@ \abovedisplayshortskip \z@ plus3\p@ \belowdisplayshortskip 6\p@ plus3\p@ minus3\p@ \def \leftmargin \leftmargini \parsep 4.5\p@ plus2\p@ minus\p@ \topsep 9\p@ plus3\p@ minus5\p@ \itemsep 4.5\p@ plus2\p@ minus\p@ {\leftmargin \leftmargini \topsep 6\p@ plus2\p@ minus2\p@ \parsep 3\p@ plus2\p@ minus\p@ \itemsep \parsep }\belowdisplayskip \abovedisplayskip Example of pedestrian urban scenario with anchored variable baseline vector (experiment C-01) which exploit the CAPS.loc framework for \ac {CP}.}\relax }}{159}{figure.caption.133}% 
\contentsline {figure}{\numberline {8.23}{\ignorespaces {\relax \fontsize {10}{12}\selectfont \abovedisplayskip 10\p@ plus2\p@ minus5\p@ \abovedisplayshortskip \z@ plus3\p@ \belowdisplayshortskip 6\p@ plus3\p@ minus3\p@ \def \leftmargin \leftmargini \parsep 4.5\p@ plus2\p@ minus\p@ \topsep 9\p@ plus3\p@ minus5\p@ \itemsep 4.5\p@ plus2\p@ minus\p@ {\leftmargin \leftmargini \topsep 6\p@ plus2\p@ minus2\p@ \parsep 3\p@ plus2\p@ minus\p@ \itemsep \parsep }\belowdisplayskip \abovedisplayskip Pie charts of \ac {CP} profitability for the two smartphones in the experiment \texttt {c-01}.}\relax }}{160}{figure.caption.134}% 
\contentsline {figure}{\numberline {8.24}{\ignorespaces {\relax \fontsize {10}{12}\selectfont \abovedisplayskip 10\p@ plus2\p@ minus5\p@ \abovedisplayshortskip \z@ plus3\p@ \belowdisplayshortskip 6\p@ plus3\p@ minus3\p@ \def \leftmargin \leftmargini \parsep 4.5\p@ plus2\p@ minus\p@ \topsep 9\p@ plus3\p@ minus5\p@ \itemsep 4.5\p@ plus2\p@ minus\p@ {\leftmargin \leftmargini \topsep 6\p@ plus2\p@ minus2\p@ \parsep 3\p@ plus2\p@ minus\p@ \itemsep \parsep }\belowdisplayskip \abovedisplayskip Collection of mean errors comparisons for the experiments described in \ref {sec:results_detail}}.\relax }}{161}{figure.caption.135}% 
\contentsline {figure}{\numberline {8.25}{\ignorespaces {\relax \fontsize {10}{12}\selectfont \abovedisplayskip 10\p@ plus2\p@ minus5\p@ \abovedisplayshortskip \z@ plus3\p@ \belowdisplayshortskip 6\p@ plus3\p@ minus3\p@ \def \leftmargin \leftmargini \parsep 4.5\p@ plus2\p@ minus\p@ \topsep 9\p@ plus3\p@ minus5\p@ \itemsep 4.5\p@ plus2\p@ minus\p@ {\leftmargin \leftmargini \topsep 6\p@ plus2\p@ minus2\p@ \parsep 3\p@ plus2\p@ minus\p@ \itemsep \parsep }\belowdisplayskip \abovedisplayskip Collection of \ac {CDF}s for the sample experiments described in Section \ref {sec:results_detail}}.\relax }}{162}{figure.caption.136}% 
\contentsline {figure}{\numberline {8.26}{\ignorespaces {\relax \fontsize {10}{12}\selectfont \abovedisplayskip 10\p@ plus2\p@ minus5\p@ \abovedisplayshortskip \z@ plus3\p@ \belowdisplayshortskip 6\p@ plus3\p@ minus3\p@ \def \leftmargin \leftmargini \parsep 4.5\p@ plus2\p@ minus\p@ \topsep 9\p@ plus3\p@ minus5\p@ \itemsep 4.5\p@ plus2\p@ minus\p@ {\leftmargin \leftmargini \topsep 6\p@ plus2\p@ minus2\p@ \parsep 3\p@ plus2\p@ minus\p@ \itemsep \parsep }\belowdisplayskip \abovedisplayskip Galileo Masters 2019 award certificate for CAPS.loc.}\relax }}{166}{figure.caption.139}% 
\addvspace {10\p@ }
\addvspace {10\p@ }
\contentsline {figure}{\numberline {A.1}{\ignorespaces {\relax \fontsize {10}{12}\selectfont \abovedisplayskip 10\p@ plus2\p@ minus5\p@ \abovedisplayshortskip \z@ plus3\p@ \belowdisplayshortskip 6\p@ plus3\p@ minus3\p@ \def \leftmargin \leftmargini \parsep 4.5\p@ plus2\p@ minus\p@ \topsep 9\p@ plus3\p@ minus5\p@ \itemsep 4.5\p@ plus2\p@ minus\p@ {\leftmargin \leftmargini \topsep 6\p@ plus2\p@ minus2\p@ \parsep 3\p@ plus2\p@ minus\p@ \itemsep \parsep }\belowdisplayskip \abovedisplayskip Coordinates Reference Systems.}\relax }}{170}{figure.caption.140}% 
\contentsline {figure}{\numberline {A.2}{\ignorespaces \relax \fontsize {10}{12}\selectfont \abovedisplayskip 10\p@ plus2\p@ minus5\p@ \abovedisplayshortskip \z@ plus3\p@ \belowdisplayshortskip 6\p@ plus3\p@ minus3\p@ \def \leftmargin \leftmargini \parsep 4.5\p@ plus2\p@ minus\p@ \topsep 9\p@ plus3\p@ minus5\p@ \itemsep 4.5\p@ plus2\p@ minus\p@ {\leftmargin \leftmargini \topsep 6\p@ plus2\p@ minus2\p@ \parsep 3\p@ plus2\p@ minus\p@ \itemsep \parsep }\belowdisplayskip \abovedisplayskip {Ellipsoidal Coordinates \ac {LLA}/LLH.}\relax }}{171}{figure.caption.141}% 
\contentsline {figure}{\numberline {A.3}{\ignorespaces {\relax \fontsize {10}{12}\selectfont \abovedisplayskip 10\p@ plus2\p@ minus5\p@ \abovedisplayshortskip \z@ plus3\p@ \belowdisplayshortskip 6\p@ plus3\p@ minus3\p@ \def \leftmargin \leftmargini \parsep 4.5\p@ plus2\p@ minus\p@ \topsep 9\p@ plus3\p@ minus5\p@ \itemsep 4.5\p@ plus2\p@ minus\p@ {\leftmargin \leftmargini \topsep 6\p@ plus2\p@ minus2\p@ \parsep 3\p@ plus2\p@ minus\p@ \itemsep \parsep }\belowdisplayskip \abovedisplayskip \ac {LTP} shown w.r.t. a \ac {LLA} frame and as reference frame}.\relax }}{173}{figure.caption.142}% 
\addvspace {10\p@ }
\contentsline {figure}{\numberline {B.1}{\ignorespaces \relax \fontsize {10}{12}\selectfont \abovedisplayskip 10\p@ plus2\p@ minus5\p@ \abovedisplayshortskip \z@ plus3\p@ \belowdisplayshortskip 6\p@ plus3\p@ minus3\p@ \def \leftmargin \leftmargini \parsep 4.5\p@ plus2\p@ minus\p@ \topsep 9\p@ plus3\p@ minus5\p@ \itemsep 4.5\p@ plus2\p@ minus\p@ {\leftmargin \leftmargini \topsep 6\p@ plus2\p@ minus2\p@ \parsep 3\p@ plus2\p@ minus\p@ \itemsep \parsep }\belowdisplayskip \abovedisplayskip {Error ellipse of uncorrelated 2D positioning unbiased solutions drawn for 95\% of the confidence interval.}\relax }}{176}{figure.caption.143}% 
\contentsline {figure}{\numberline {B.2}{\ignorespaces \relax \fontsize {10}{12}\selectfont \abovedisplayskip 10\p@ plus2\p@ minus5\p@ \abovedisplayshortskip \z@ plus3\p@ \belowdisplayshortskip 6\p@ plus3\p@ minus3\p@ \def \leftmargin \leftmargini \parsep 4.5\p@ plus2\p@ minus\p@ \topsep 9\p@ plus3\p@ minus5\p@ \itemsep 4.5\p@ plus2\p@ minus\p@ {\leftmargin \leftmargini \topsep 6\p@ plus2\p@ minus2\p@ \parsep 3\p@ plus2\p@ minus\p@ \itemsep \parsep }\belowdisplayskip \abovedisplayskip {Error ellipses of correlated 2D positioning solutions shown for 5 confidence intervals indicated in the legend. Eigenvector are multiplied by the respective eigenvalue with a factor $2$ to reach $95$\% confidence value.}\relax }}{178}{figure.caption.144}% 
\addvspace {10\p@ }
\addvspace {10\p@ }
\contentsline {figure}{\numberline {D.1}{\ignorespaces {\relax \fontsize {10}{12}\selectfont \abovedisplayskip 10\p@ plus2\p@ minus5\p@ \abovedisplayshortskip \z@ plus3\p@ \belowdisplayshortskip 6\p@ plus3\p@ minus3\p@ \def \leftmargin \leftmargini \parsep 4.5\p@ plus2\p@ minus\p@ \topsep 9\p@ plus3\p@ minus5\p@ \itemsep 4.5\p@ plus2\p@ minus\p@ {\leftmargin \leftmargini \topsep 6\p@ plus2\p@ minus2\p@ \parsep 3\p@ plus2\p@ minus\p@ \itemsep \parsep }\belowdisplayskip \abovedisplayskip Possible implementation of the \ac {CAPS.loc} framework in Android systems}.\relax }}{191}{figure.caption.156}% 
\addvspace {10\p@ }
