%!PS-Adobe-3.0 EPSF-3.0
%%Creator: (MATLAB, The Mathworks, Inc. Version 9.5.0.944444 \(R2018b\). Operating System: Windows 10)
%%Title: (C:/Users/Alex/Documents/PhD Docs/01. GIT/my_phd_thesis/Chapter8/Figures/capsloc_res/pieCharts_examples_d02.eps)
%%CreationDate: 2019-11-04T10:54:38
%%Pages: (atend)
%%BoundingBox: 0 0 603 541
%%LanguageLevel: 3
%%EndComments
%%BeginProlog
%%BeginResource: procset (Apache XML Graphics Std ProcSet) 1.2 0
%%Version: 1.2 0
%%Copyright: (Copyright 2001-2003,2010 The Apache Software Foundation. License terms: http://www.apache.org/licenses/LICENSE-2.0)
/bd{bind def}bind def
/ld{load def}bd
/GR/grestore ld
/GS/gsave ld
/RM/rmoveto ld
/C/curveto ld
/t/show ld
/L/lineto ld
/ML/setmiterlimit ld
/CT/concat ld
/f/fill ld
/N/newpath ld
/S/stroke ld
/CC/setcmykcolor ld
/A/ashow ld
/cp/closepath ld
/RC/setrgbcolor ld
/LJ/setlinejoin ld
/GC/setgray ld
/LW/setlinewidth ld
/M/moveto ld
/re {4 2 roll M
1 index 0 rlineto
0 exch rlineto
neg 0 rlineto
cp } bd
/_ctm matrix def
/_tm matrix def
/BT { _ctm currentmatrix pop matrix _tm copy pop 0 0 moveto } bd
/ET { _ctm setmatrix } bd
/iTm { _ctm setmatrix _tm concat } bd
/Tm { _tm astore pop iTm 0 0 moveto } bd
/ux 0.0 def
/uy 0.0 def
/F {
  /Tp exch def
  /Tf exch def
  Tf findfont Tp scalefont setfont
  /cf Tf def  /cs Tp def
} bd
/ULS {currentpoint /uy exch def /ux exch def} bd
/ULE {
  /Tcx currentpoint pop def
  gsave
  newpath
  cf findfont cs scalefont dup
  /FontMatrix get 0 get /Ts exch def /FontInfo get dup
  /UnderlinePosition get Ts mul /To exch def
  /UnderlineThickness get Ts mul /Tt exch def
  ux uy To add moveto  Tcx uy To add lineto
  Tt setlinewidth stroke
  grestore
} bd
/OLE {
  /Tcx currentpoint pop def
  gsave
  newpath
  cf findfont cs scalefont dup
  /FontMatrix get 0 get /Ts exch def /FontInfo get dup
  /UnderlinePosition get Ts mul /To exch def
  /UnderlineThickness get Ts mul /Tt exch def
  ux uy To add cs add moveto Tcx uy To add cs add lineto
  Tt setlinewidth stroke
  grestore
} bd
/SOE {
  /Tcx currentpoint pop def
  gsave
  newpath
  cf findfont cs scalefont dup
  /FontMatrix get 0 get /Ts exch def /FontInfo get dup
  /UnderlinePosition get Ts mul /To exch def
  /UnderlineThickness get Ts mul /Tt exch def
  ux uy To add cs 10 mul 26 idiv add moveto Tcx uy To add cs 10 mul 26 idiv add lineto
  Tt setlinewidth stroke
  grestore
} bd
/QT {
/Y22 exch store
/X22 exch store
/Y21 exch store
/X21 exch store
currentpoint
/Y21 load 2 mul add 3 div exch
/X21 load 2 mul add 3 div exch
/X21 load 2 mul /X22 load add 3 div
/Y21 load 2 mul /Y22 load add 3 div
/X22 load /Y22 load curveto
} bd
/SSPD {
dup length /d exch dict def
{
/v exch def
/k exch def
currentpagedevice k known {
/cpdv currentpagedevice k get def
v cpdv ne {
/upd false def
/nullv v type /nulltype eq def
/nullcpdv cpdv type /nulltype eq def
nullv nullcpdv or
{
/upd true def
} {
/sametype v type cpdv type eq def
sametype {
v type /arraytype eq {
/vlen v length def
/cpdvlen cpdv length def
vlen cpdvlen eq {
0 1 vlen 1 sub {
/i exch def
/obj v i get def
/cpdobj cpdv i get def
obj cpdobj ne {
/upd true def
exit
} if
} for
} {
/upd true def
} ifelse
} {
v type /dicttype eq {
v {
/dv exch def
/dk exch def
/cpddv cpdv dk get def
dv cpddv ne {
/upd true def
exit
} if
} forall
} {
/upd true def
} ifelse
} ifelse
} if
} ifelse
upd true eq {
d k v put
} if
} if
} if
} forall
d length 0 gt {
d setpagedevice
} if
} bd
/RE { % /NewFontName [NewEncodingArray] /FontName RE -
  findfont dup length dict begin
  {
    1 index /FID ne
    {def} {pop pop} ifelse
  } forall
  /Encoding exch def
  /FontName 1 index def
  currentdict definefont pop
  end
} bind def
%%EndResource
%%BeginResource: procset (Apache XML Graphics EPS ProcSet) 1.0 0
%%Version: 1.0 0
%%Copyright: (Copyright 2002-2003 The Apache Software Foundation. License terms: http://www.apache.org/licenses/LICENSE-2.0)
/BeginEPSF { %def
/b4_Inc_state save def         % Save state for cleanup
/dict_count countdictstack def % Count objects on dict stack
/op_count count 1 sub def      % Count objects on operand stack
userdict begin                 % Push userdict on dict stack
/showpage { } def              % Redefine showpage, { } = null proc
0 setgray 0 setlinecap         % Prepare graphics state
1 setlinewidth 0 setlinejoin
10 setmiterlimit [ ] 0 setdash newpath
/languagelevel where           % If level not equal to 1 then
{pop languagelevel             % set strokeadjust and
1 ne                           % overprint to their defaults.
{false setstrokeadjust false setoverprint
} if
} if
} bd
/EndEPSF { %def
count op_count sub {pop} repeat            % Clean up stacks
countdictstack dict_count sub {end} repeat
b4_Inc_state restore
} bd
%%EndResource
%FOPBeginFontDict
%%IncludeResource: font Courier-Oblique
%%IncludeResource: font Courier-BoldOblique
%%IncludeResource: font Courier-Bold
%%IncludeResource: font ZapfDingbats
%%IncludeResource: font Symbol
%%IncludeResource: font Helvetica
%%IncludeResource: font Helvetica-Oblique
%%IncludeResource: font Helvetica-Bold
%%IncludeResource: font Helvetica-BoldOblique
%%IncludeResource: font Times-Roman
%%IncludeResource: font Times-Italic
%%IncludeResource: font Times-Bold
%%IncludeResource: font Times-BoldItalic
%%IncludeResource: font Courier
%FOPEndFontDict
%%BeginResource: encoding WinAnsiEncoding
/WinAnsiEncoding [
/.notdef /.notdef /.notdef /.notdef /.notdef
/.notdef /.notdef /.notdef /.notdef /.notdef
/.notdef /.notdef /.notdef /.notdef /.notdef
/.notdef /.notdef /.notdef /.notdef /.notdef
/.notdef /.notdef /.notdef /.notdef /.notdef
/.notdef /.notdef /.notdef /.notdef /.notdef
/.notdef /.notdef /space /exclam /quotedbl
/numbersign /dollar /percent /ampersand /quotesingle
/parenleft /parenright /asterisk /plus /comma
/hyphen /period /slash /zero /one
/two /three /four /five /six
/seven /eight /nine /colon /semicolon
/less /equal /greater /question /at
/A /B /C /D /E
/F /G /H /I /J
/K /L /M /N /O
/P /Q /R /S /T
/U /V /W /X /Y
/Z /bracketleft /backslash /bracketright /asciicircum
/underscore /quoteleft /a /b /c
/d /e /f /g /h
/i /j /k /l /m
/n /o /p /q /r
/s /t /u /v /w
/x /y /z /braceleft /bar
/braceright /asciitilde /bullet /Euro /bullet
/quotesinglbase /florin /quotedblbase /ellipsis /dagger
/daggerdbl /circumflex /perthousand /Scaron /guilsinglleft
/OE /bullet /Zcaron /bullet /bullet
/quoteleft /quoteright /quotedblleft /quotedblright /bullet
/endash /emdash /asciitilde /trademark /scaron
/guilsinglright /oe /bullet /zcaron /Ydieresis
/space /exclamdown /cent /sterling /currency
/yen /brokenbar /section /dieresis /copyright
/ordfeminine /guillemotleft /logicalnot /sfthyphen /registered
/macron /degree /plusminus /twosuperior /threesuperior
/acute /mu /paragraph /middot /cedilla
/onesuperior /ordmasculine /guillemotright /onequarter /onehalf
/threequarters /questiondown /Agrave /Aacute /Acircumflex
/Atilde /Adieresis /Aring /AE /Ccedilla
/Egrave /Eacute /Ecircumflex /Edieresis /Igrave
/Iacute /Icircumflex /Idieresis /Eth /Ntilde
/Ograve /Oacute /Ocircumflex /Otilde /Odieresis
/multiply /Oslash /Ugrave /Uacute /Ucircumflex
/Udieresis /Yacute /Thorn /germandbls /agrave
/aacute /acircumflex /atilde /adieresis /aring
/ae /ccedilla /egrave /eacute /ecircumflex
/edieresis /igrave /iacute /icircumflex /idieresis
/eth /ntilde /ograve /oacute /ocircumflex
/otilde /odieresis /divide /oslash /ugrave
/uacute /ucircumflex /udieresis /yacute /thorn
/ydieresis
] def
%%EndResource
%FOPBeginFontReencode
/Courier-Oblique findfont
dup length dict begin
  {1 index /FID ne {def} {pop pop} ifelse} forall
  /Encoding WinAnsiEncoding def
  currentdict
end
/Courier-Oblique exch definefont pop
/Courier-BoldOblique findfont
dup length dict begin
  {1 index /FID ne {def} {pop pop} ifelse} forall
  /Encoding WinAnsiEncoding def
  currentdict
end
/Courier-BoldOblique exch definefont pop
/Courier-Bold findfont
dup length dict begin
  {1 index /FID ne {def} {pop pop} ifelse} forall
  /Encoding WinAnsiEncoding def
  currentdict
end
/Courier-Bold exch definefont pop
/Helvetica findfont
dup length dict begin
  {1 index /FID ne {def} {pop pop} ifelse} forall
  /Encoding WinAnsiEncoding def
  currentdict
end
/Helvetica exch definefont pop
/Helvetica-Oblique findfont
dup length dict begin
  {1 index /FID ne {def} {pop pop} ifelse} forall
  /Encoding WinAnsiEncoding def
  currentdict
end
/Helvetica-Oblique exch definefont pop
/Helvetica-Bold findfont
dup length dict begin
  {1 index /FID ne {def} {pop pop} ifelse} forall
  /Encoding WinAnsiEncoding def
  currentdict
end
/Helvetica-Bold exch definefont pop
/Helvetica-BoldOblique findfont
dup length dict begin
  {1 index /FID ne {def} {pop pop} ifelse} forall
  /Encoding WinAnsiEncoding def
  currentdict
end
/Helvetica-BoldOblique exch definefont pop
/Times-Roman findfont
dup length dict begin
  {1 index /FID ne {def} {pop pop} ifelse} forall
  /Encoding WinAnsiEncoding def
  currentdict
end
/Times-Roman exch definefont pop
/Times-Italic findfont
dup length dict begin
  {1 index /FID ne {def} {pop pop} ifelse} forall
  /Encoding WinAnsiEncoding def
  currentdict
end
/Times-Italic exch definefont pop
/Times-Bold findfont
dup length dict begin
  {1 index /FID ne {def} {pop pop} ifelse} forall
  /Encoding WinAnsiEncoding def
  currentdict
end
/Times-Bold exch definefont pop
/Times-BoldItalic findfont
dup length dict begin
  {1 index /FID ne {def} {pop pop} ifelse} forall
  /Encoding WinAnsiEncoding def
  currentdict
end
/Times-BoldItalic exch definefont pop
/Courier findfont
dup length dict begin
  {1 index /FID ne {def} {pop pop} ifelse} forall
  /Encoding WinAnsiEncoding def
  currentdict
end
/Courier exch definefont pop
%FOPEndFontReencode
%%EndProlog
%%Page: 1 1
%%PageBoundingBox: 0 0 603 541
%%BeginPageSetup
[1 0 0 -1 0 541] CT
%%EndPageSetup
GS
[0.75 0 0 0.75 0 0.25] CT
N
0 0 M
804 0 L
804 721 L
0 721 L
0 0 L
cp
clip
1 GC
N
0 0 804 721 re
f
GR
GS
[0.75 0 0 0.75 0 0.25] CT
1 GC
N
0 0 804 721 re
f
GR
GS
[0.75 0 0 0.75 440.62541 46.89999] CT
/Helvetica-Bold 17.6 F
GS
[1 0 0 1 0 0] CT
-88.5 -4 moveto 
1 -1 scale
(EN Profitability SM01) t 
GR
GR
GS
[0.75 0 0 0.75 0 0.25] CT
0.302 0.745 0.933 RC
N
472.093 229.897 M
474.505 236.325 L
578.19 193.758 L
578.19 81.675 L
571.328 81.885 L
564.492 82.515 L
557.707 83.563 L
550.999 85.023 L
544.393 86.892 L
537.914 89.162 L
531.586 91.824 L
525.432 94.868 L
519.477 98.284 L
513.742 102.057 L
508.249 106.175 L
503.018 110.621 L
498.069 115.38 L
493.421 120.432 L
489.09 125.759 L
485.094 131.342 L
481.448 137.159 L
478.164 143.188 L
475.256 149.406 L
472.733 155.791 L
470.607 162.319 L
468.884 168.965 L
467.571 175.703 L
466.673 182.509 L
466.193 189.358 L
466.134 196.223 L
466.495 203.079 L
467.275 209.9 L
468.472 216.66 L
470.08 223.334 L
cp
f
GR
GS
[0.75 0 0 0.75 0 0.25] CT
0.302 0.745 0.933 RC
2 setlinecap
10.0 ML
0.667 LW
N
578.19 193.758 M
578.19 81.675 L
571.328 81.885 L
564.492 82.515 L
557.707 83.563 L
550.999 85.023 L
544.393 86.892 L
537.914 89.162 L
531.586 91.824 L
525.432 94.868 L
519.477 98.284 L
513.742 102.057 L
508.249 106.175 L
503.018 110.621 L
498.069 115.38 L
493.421 120.432 L
489.09 125.759 L
485.094 131.342 L
481.448 137.159 L
478.164 143.188 L
475.256 149.406 L
472.733 155.791 L
470.607 162.319 L
468.884 168.965 L
467.571 175.703 L
466.673 182.509 L
466.193 189.358 L
466.134 196.223 L
466.495 203.079 L
467.275 209.9 L
468.472 216.66 L
470.08 223.334 L
472.093 229.897 L
474.505 236.325 L
578.19 193.758 L
578.19 193.758 L
S
GR
GS
[0.75 0 0 0.75 0 0.25] CT
0.094 0.749 0.71 RC
N
528.274 295.157 M
534.328 298.668 L
540.59 301.794 L
547.034 304.524 L
553.636 306.845 L
560.371 308.751 L
567.211 310.232 L
574.13 311.283 L
581.101 311.901 L
588.098 312.082 L
595.091 311.826 L
602.056 311.134 L
608.963 310.009 L
615.787 308.455 L
622.501 306.478 L
629.078 304.086 L
635.493 301.288 L
641.721 298.096 L
647.737 294.521 L
653.519 290.577 L
659.043 286.28 L
664.289 281.647 L
669.234 276.695 L
673.862 271.445 L
587.5 200 L
483.814 242.567 L
486.673 248.955 L
489.925 255.152 L
493.557 261.134 L
497.556 266.878 L
501.905 272.361 L
506.588 277.562 L
511.586 282.461 L
516.881 287.038 L
522.451 291.276 L
cp
f
GR
GS
[0.75 0 0 0.75 0 0.25] CT
0 0.749 0.749 RC
2 setlinecap
10.0 ML
0.667 LW
N
587.5 200 M
483.814 242.567 L
486.673 248.955 L
489.925 255.152 L
493.557 261.134 L
497.556 266.878 L
501.905 272.361 L
506.588 277.562 L
511.586 282.461 L
516.881 287.038 L
522.451 291.276 L
528.274 295.157 L
534.328 298.668 L
540.59 301.794 L
547.034 304.524 L
553.636 306.845 L
560.371 308.751 L
567.211 310.232 L
574.13 311.283 L
581.101 311.901 L
588.098 312.082 L
595.091 311.826 L
602.056 311.134 L
608.963 310.009 L
615.787 308.455 L
622.501 306.478 L
629.078 304.086 L
635.493 301.288 L
641.721 298.096 L
647.737 294.521 L
653.519 290.577 L
659.043 286.28 L
664.289 281.647 L
669.234 276.695 L
673.862 271.445 L
587.5 200 L
587.5 200 L
S
GR
GS
[0.75 0 0 0.75 0 0.25] CT
0 0.447 0.741 RC
N
587.5 87.917 M
587.5 200 L
673.862 271.445 L
678.177 265.881 L
682.135 260.057 L
685.719 253.997 L
688.916 247.723 L
691.712 241.261 L
694.098 234.636 L
696.062 227.874 L
697.598 221.002 L
698.7 214.048 L
699.362 207.038 L
699.583 200 L
699.362 192.962 L
698.7 185.952 L
697.598 178.998 L
696.062 172.126 L
694.098 165.364 L
691.712 158.739 L
688.916 152.277 L
685.719 146.003 L
682.135 139.943 L
678.177 134.119 L
673.862 128.555 L
669.205 123.274 L
664.226 118.295 L
658.945 113.638 L
653.381 109.323 L
647.557 105.365 L
641.497 101.781 L
635.223 98.584 L
628.761 95.788 L
622.136 93.402 L
615.374 91.438 L
608.502 89.902 L
601.548 88.8 L
594.538 88.138 L
cp
f
GR
GS
[0.75 0 0 0.75 0 0.25] CT
0 0.447 0.741 RC
2 setlinecap
10.0 ML
0.667 LW
N
587.5 200 M
673.862 271.445 L
678.177 265.881 L
682.135 260.057 L
685.719 253.997 L
688.916 247.723 L
691.712 241.261 L
694.098 234.636 L
696.062 227.874 L
697.598 221.002 L
698.7 214.048 L
699.362 207.038 L
699.583 200 L
699.362 192.962 L
698.7 185.952 L
697.598 178.998 L
696.062 172.126 L
694.098 165.364 L
691.712 158.739 L
688.916 152.277 L
685.719 146.003 L
682.135 139.943 L
678.177 134.119 L
673.862 128.555 L
669.205 123.274 L
664.226 118.295 L
658.945 113.638 L
653.381 109.323 L
647.557 105.365 L
641.497 101.781 L
635.223 98.584 L
628.761 95.788 L
622.136 93.402 L
615.374 91.438 L
608.502 89.902 L
601.548 88.8 L
594.538 88.138 L
587.5 87.917 L
587.5 200 L
587.5 200 L
S
GR
GS
[0.75 0 0 0.75 408.58864 130.07518] CT
1 GC
/Helvetica-Bold 18.667 F
GS
[1 0 0 1 0 0] CT
-38 -5 moveto 
1 -1 scale
(31%) t 
GR
GR
GS
[0.75 0 0 0.75 436.48384 188.41939] CT
1 GC
/Helvetica-Bold 18.667 F
GS
[1 0 0 1 0 0] CT
-19 19 moveto 
1 -1 scale
(33%) t 
GR
GR
GS
[0.75 0 0 0.75 473.29321 138.62872] CT
1 GC
/Helvetica-Bold 18.667 F
GS
[1 0 0 1 0 0] CT
0 -5 moveto 
1 -1 scale
(36%) t 
GR
GR
GS
[0.75 0 0 0.75 175.12517 46.89999] CT
/Helvetica-Bold 17.6 F
GS
[1 0 0 1 0 0] CT
-95 -4 moveto 
1 -1 scale
(ENU Profitability SM01) t 
GR
GR
GS
[0.75 0 0 0.75 0 0.25] CT
0.302 0.745 0.933 RC
N
117.953 232.894 M
120.492 239.336 L
123.424 245.608 L
126.737 251.688 L
130.42 257.551 L
134.457 263.176 L
223.45 195.037 L
223.45 82.954 L
216.53 83.168 L
209.635 83.809 L
202.794 84.874 L
196.031 86.36 L
189.373 88.26 L
182.845 90.568 L
176.472 93.274 L
170.278 96.369 L
164.287 99.841 L
158.522 103.675 L
153.005 107.858 L
147.757 112.374 L
142.797 117.206 L
138.145 122.334 L
133.819 127.74 L
129.835 133.403 L
126.208 139.301 L
122.952 145.412 L
120.079 151.712 L
117.601 158.177 L
115.527 164.783 L
113.865 171.504 L
112.621 178.316 L
111.8 185.191 L
111.405 192.103 L
111.438 199.027 L
111.898 205.936 L
112.784 212.803 L
114.092 219.602 L
115.817 226.308 L
cp
f
GR
GS
[0.75 0 0 0.75 0 0.25] CT
0.302 0.745 0.933 RC
2 setlinecap
10.0 ML
0.667 LW
N
223.45 195.037 M
223.45 82.954 L
216.53 83.168 L
209.635 83.809 L
202.794 84.874 L
196.031 86.36 L
189.373 88.26 L
182.845 90.568 L
176.472 93.274 L
170.278 96.369 L
164.287 99.841 L
158.522 103.675 L
153.005 107.858 L
147.757 112.374 L
142.797 117.206 L
138.145 122.334 L
133.819 127.74 L
129.835 133.403 L
126.208 139.301 L
122.952 145.412 L
120.079 151.712 L
117.601 158.177 L
115.527 164.783 L
113.865 171.504 L
112.621 178.316 L
111.8 185.191 L
111.405 192.103 L
111.438 199.027 L
111.898 205.936 L
112.784 212.803 L
114.092 219.602 L
115.817 226.308 L
117.953 232.894 L
120.492 239.336 L
123.424 245.608 L
126.737 251.688 L
130.42 257.551 L
134.457 263.176 L
223.45 195.037 L
223.45 195.037 L
S
GR
GS
[0.75 0 0 0.75 0 0.25] CT
0.094 0.749 0.71 RC
N
169.568 292.061 M
175.401 295.85 L
181.459 299.269 L
187.717 302.306 L
194.151 304.949 L
200.737 307.188 L
207.449 309.014 L
214.261 310.42 L
221.148 311.401 L
228.082 311.952 L
235.036 312.073 L
241.985 311.762 L
248.902 311.02 L
255.759 309.851 L
262.53 308.259 L
269.189 306.249 L
275.711 303.831 L
282.071 301.013 L
288.243 297.805 L
294.204 294.221 L
299.932 290.274 L
305.404 285.98 L
310.599 281.354 L
315.497 276.415 L
320.079 271.181 L
324.328 265.674 L
328.226 259.913 L
331.76 253.922 L
334.916 247.723 L
233.5 200 L
144.507 268.139 L
148.905 273.528 L
153.629 278.634 L
158.66 283.437 L
163.98 287.918 L
cp
f
GR
GS
[0.75 0 0 0.75 0 0.25] CT
0 0.749 0.749 RC
2 setlinecap
10.0 ML
0.667 LW
N
233.5 200 M
144.507 268.139 L
148.905 273.528 L
153.629 278.634 L
158.66 283.437 L
163.98 287.918 L
169.568 292.061 L
175.401 295.85 L
181.459 299.269 L
187.717 302.306 L
194.151 304.949 L
200.737 307.188 L
207.449 309.014 L
214.261 310.42 L
221.148 311.401 L
228.082 311.952 L
235.036 312.073 L
241.985 311.762 L
248.902 311.02 L
255.759 309.851 L
262.53 308.259 L
269.189 306.249 L
275.711 303.831 L
282.071 301.013 L
288.243 297.805 L
294.204 294.221 L
299.932 290.274 L
305.404 285.98 L
310.599 281.354 L
315.497 276.415 L
320.079 271.181 L
324.328 265.674 L
328.226 259.913 L
331.76 253.922 L
334.916 247.723 L
233.5 200 L
233.5 200 L
S
GR
GS
[0.75 0 0 0.75 0 0.25] CT
0 0.447 0.741 RC
N
233.5 87.917 M
233.5 200 L
334.916 247.723 L
337.712 241.261 L
340.098 234.636 L
342.062 227.874 L
343.598 221.002 L
344.7 214.048 L
345.362 207.038 L
345.583 200 L
345.362 192.962 L
344.7 185.952 L
343.598 178.998 L
342.062 172.126 L
340.098 165.364 L
337.712 158.739 L
334.916 152.277 L
331.719 146.003 L
328.135 139.943 L
324.177 134.119 L
319.862 128.555 L
315.205 123.274 L
310.226 118.295 L
304.945 113.638 L
299.381 109.323 L
293.557 105.365 L
287.497 101.781 L
281.223 98.584 L
274.761 95.788 L
268.136 93.402 L
261.374 91.438 L
254.502 89.902 L
247.548 88.8 L
240.538 88.138 L
cp
f
GR
GS
[0.75 0 0 0.75 0 0.25] CT
0 0.447 0.741 RC
2 setlinecap
10.0 ML
0.667 LW
N
233.5 200 M
334.916 247.723 L
337.712 241.261 L
340.098 234.636 L
342.062 227.874 L
343.598 221.002 L
344.7 214.048 L
345.362 207.038 L
345.583 200 L
345.362 192.962 L
344.7 185.952 L
343.598 178.998 L
342.062 172.126 L
340.098 165.364 L
337.712 158.739 L
334.916 152.277 L
331.719 146.003 L
328.135 139.943 L
324.177 134.119 L
319.862 128.555 L
315.205 123.274 L
310.226 118.295 L
304.945 113.638 L
299.381 109.323 L
293.557 105.365 L
287.497 101.781 L
281.223 98.584 L
274.761 95.788 L
268.136 93.402 L
261.374 91.438 L
254.502 89.902 L
247.548 88.8 L
240.538 88.138 L
233.5 87.917 L
233.5 200 L
233.5 200 L
S
GR
GS
[0.75 0 0 0.75 146.92633 132.58677] CT
1 GC
/Helvetica-Bold 18.667 F
GS
[1 0 0 1 0 0] CT
-38 -5 moveto 
1 -1 scale
(35%) t 
GR
GR
GS
[0.75 0 0 0.75 181.2332 185.94175] CT
1 GC
/Helvetica-Bold 18.667 F
GS
[1 0 0 1 0 0] CT
-19 19 moveto 
1 -1 scale
(33%) t 
GR
GR
GS
[0.75 0 0 0.75 199.94895 136.70277] CT
1 GC
/Helvetica-Bold 18.667 F
GS
[1 0 0 1 0 0] CT
0 -5 moveto 
1 -1 scale
(32%) t 
GR
GR
GS
[0.75 0 0 0.75 0 0.25] CT
1 GC
N
633 676 M
633 648 L
186 648 L
186 676 L
cp
f
GR
GS
[0.75 0 0 0.75 174.75 496.75] CT
/Helvetica 18.667 F
GS
[1 0 0 1 0 0] CT
0 7 moveto 
1 -1 scale
(Profitability) t 
GR
GR
GS
[0.75 0 0 0.75 0 0.25] CT
0.302 0.745 0.933 RC
N
230 671 M
230 653 L
190 653 L
190 671 L
cp
f
GR
GS
[0.75 0 0 0.75 0 0.25] CT
0.302 0.745 0.933 RC
10.0 ML
0.667 LW
N
190 671 M
190 653 L
230 653 L
230 671 L
cp
S
GR
GS
[0.75 0 0 0.75 282 496.75] CT
/Helvetica 18.667 F
GS
[1 0 0 1 0 0] CT
0 7 moveto 
1 -1 scale
(Hysteresis) t 
GR
GR
GS
[0.75 0 0 0.75 0 0.25] CT
0.094 0.749 0.71 RC
N
373 671 M
373 653 L
333 653 L
333 671 L
cp
f
GR
GS
[0.75 0 0 0.75 0 0.25] CT
0 0.749 0.749 RC
10.0 ML
0.667 LW
N
333 671 M
333 653 L
373 653 L
373 671 L
cp
S
GR
GS
[0.75 0 0 0.75 386.25 496.75] CT
/Helvetica 18.667 F
GS
[1 0 0 1 0 0] CT
0 7 moveto 
1 -1 scale
(Unprofitability) t 
GR
GR
GS
[0.75 0 0 0.75 0 0.25] CT
0 0.447 0.741 RC
N
512 671 M
512 653 L
472 653 L
472 671 L
cp
f
GR
GS
[0.75 0 0 0.75 0 0.25] CT
0 0.447 0.741 RC
10.0 ML
0.667 LW
N
472 671 M
472 653 L
512 653 L
512 671 L
cp
S
GR
GS
[0.75 0 0 0.75 0 0.25] CT
1 GC
10.0 ML
0.667 LW
N
186 676 M
186 648 L
633 648 L
633 676 L
cp
S
GR
GS
[0.75 0 0 0.75 439.87541 280.14999] CT
/Helvetica-Bold 17.6 F
GS
[1 0 0 1 0 0] CT
-88.5 -4 moveto 
1 -1 scale
(EN Profitability SM02) t 
GR
GR
GS
[0.75 0 0 0.75 0 0.25] CT
0.302 0.745 0.933 RC
N
567.628 389.176 M
561.809 390.264 L
585.318 499.854 L
585.318 387.771 L
579.399 387.927 L
573.497 388.396 L
cp
f
GR
GS
[0.75 0 0 0.75 0 0.25] CT
0.302 0.745 0.933 RC
2 setlinecap
10.0 ML
0.667 LW
N
585.318 499.854 M
585.318 387.771 L
579.399 387.927 L
573.497 388.396 L
567.628 389.176 L
561.809 390.264 L
585.318 499.854 L
585.318 499.854 L
S
GR
GS
[0.75 0 0 0.75 0 0.25] CT
0.094 0.749 0.71 RC
N
505.393 588.359 M
510.374 593.265 L
515.651 597.851 L
521.204 602.1 L
527.011 605.994 L
533.05 609.518 L
539.296 612.659 L
545.726 615.404 L
552.315 617.743 L
559.037 619.667 L
565.866 621.168 L
572.775 622.24 L
579.737 622.879 L
586.726 623.083 L
593.713 622.851 L
600.673 622.184 L
607.578 621.084 L
614.4 619.555 L
621.114 617.605 L
627.693 615.239 L
634.112 612.468 L
640.346 609.302 L
646.37 605.753 L
652.162 601.836 L
657.698 597.565 L
662.956 592.958 L
667.917 588.032 L
672.562 582.805 L
676.871 577.3 L
680.829 571.536 L
684.42 565.537 L
687.63 559.326 L
690.446 552.927 L
692.858 546.364 L
694.856 539.664 L
696.432 532.853 L
697.581 525.956 L
698.297 519.001 L
698.579 512.015 L
698.424 505.025 L
697.834 498.058 L
696.81 491.142 L
695.357 484.303 L
693.481 477.568 L
691.189 470.963 L
688.489 464.514 L
685.392 458.245 L
681.91 452.182 L
678.057 446.348 L
673.848 440.765 L
669.299 435.456 L
664.428 430.44 L
659.254 425.738 L
653.796 421.368 L
648.077 417.347 L
642.118 413.69 L
635.943 410.411 L
629.575 407.524 L
586.5 511 L
562.991 401.41 L
556.204 403.089 L
549.534 405.188 L
543.009 407.698 L
536.653 410.611 L
530.491 413.914 L
524.547 417.595 L
518.844 421.64 L
513.404 426.032 L
508.248 430.755 L
503.397 435.79 L
498.87 441.117 L
494.683 446.717 L
490.854 452.566 L
487.397 458.644 L
484.325 464.924 L
481.651 471.385 L
479.385 477.999 L
477.536 484.741 L
476.111 491.586 L
475.115 498.507 L
474.553 505.476 L
474.426 512.466 L
474.736 519.451 L
475.48 526.403 L
476.656 533.295 L
478.26 540.1 L
480.285 546.792 L
482.723 553.345 L
485.565 559.733 L
488.8 565.931 L
492.415 571.916 L
496.396 577.663 L
500.728 583.151 L
cp
f
GR
GS
[0.75 0 0 0.75 0 0.25] CT
0 0.749 0.749 RC
2 setlinecap
10.0 ML
0.667 LW
N
586.5 511 M
562.991 401.41 L
556.204 403.089 L
549.534 405.188 L
543.009 407.698 L
536.653 410.611 L
530.491 413.914 L
524.547 417.595 L
518.844 421.64 L
513.404 426.032 L
508.248 430.755 L
503.397 435.79 L
498.87 441.117 L
494.683 446.717 L
490.854 452.566 L
487.397 458.644 L
484.325 464.924 L
481.651 471.385 L
479.385 477.999 L
477.536 484.741 L
476.111 491.586 L
475.115 498.507 L
474.553 505.476 L
474.426 512.466 L
474.736 519.451 L
475.48 526.403 L
476.656 533.295 L
478.26 540.1 L
480.285 546.792 L
482.723 553.345 L
485.565 559.733 L
488.8 565.931 L
492.415 571.916 L
496.396 577.663 L
500.728 583.151 L
505.393 588.359 L
510.374 593.265 L
515.651 597.851 L
521.204 602.1 L
527.011 605.994 L
533.05 609.518 L
539.296 612.659 L
545.726 615.404 L
552.315 617.743 L
559.037 619.667 L
565.866 621.168 L
572.775 622.24 L
579.737 622.879 L
586.726 623.083 L
593.713 622.851 L
600.673 622.184 L
607.578 621.084 L
614.4 619.555 L
621.114 617.605 L
627.693 615.239 L
634.112 612.468 L
640.346 609.302 L
646.37 605.753 L
652.162 601.836 L
657.698 597.565 L
662.956 592.958 L
667.917 588.032 L
672.562 582.805 L
676.871 577.3 L
680.829 571.536 L
684.42 565.537 L
687.63 559.326 L
690.446 552.927 L
692.858 546.364 L
694.856 539.664 L
696.432 532.853 L
697.581 525.956 L
698.297 519.001 L
698.579 512.015 L
698.424 505.025 L
697.834 498.058 L
696.81 491.142 L
695.357 484.303 L
693.481 477.568 L
691.189 470.963 L
688.489 464.514 L
685.392 458.245 L
681.91 452.182 L
678.057 446.348 L
673.848 440.765 L
669.299 435.456 L
664.428 430.44 L
659.254 425.738 L
653.796 421.368 L
648.077 417.347 L
642.118 413.69 L
635.943 410.411 L
629.575 407.524 L
586.5 511 L
586.5 511 L
S
GR
GS
[0.75 0 0 0.75 0 0.25] CT
0 0.447 0.741 RC
N
586.5 398.917 M
586.5 511 L
629.575 407.524 L
623.678 405.262 L
617.664 403.336 L
611.551 401.752 L
605.358 400.514 L
599.105 399.628 L
592.813 399.095 L
cp
f
GR
GS
[0.75 0 0 0.75 0 0.25] CT
0 0.447 0.741 RC
2 setlinecap
10.0 ML
0.667 LW
N
586.5 511 M
629.575 407.524 L
623.678 405.262 L
617.664 403.336 L
611.551 401.752 L
605.358 400.514 L
599.105 399.628 L
592.813 399.095 L
586.5 398.917 L
586.5 511 L
586.5 511 L
S
GR
GS
[0.75 0 0 0.75 432.23648 316.18755] CT
1 GC
/Helvetica-Bold 18.667 F
GS
[1 0 0 1 0 0] CT
-13.5 -5 moveto 
1 -1 scale
(3%) t 
GR
GR
GS
[0.75 0 0 0.75 443.41937 409.58131] CT
1 GC
/Helvetica-Bold 18.667 F
GS
[1 0 0 1 0 0] CT
-19 19 moveto 
1 -1 scale
(91%) t 
GR
GR
GS
[0.75 0 0 0.75 454.99461 327.32393] CT
1 GC
/Helvetica-Bold 18.667 F
GS
[1 0 0 1 0 0] CT
-13.5 -5 moveto 
1 -1 scale
(6%) t 
GR
GR
GS
[0.75 0 0 0.75 174.37517 280.14999] CT
/Helvetica-Bold 17.6 F
GS
[1 0 0 1 0 0] CT
-95 -4 moveto 
1 -1 scale
(ENU Profitability SM02) t 
GR
GR
GS
[0.75 0 0 0.75 0 0.25] CT
0.302 0.745 0.933 RC
N
208.501 390.097 M
202.964 391.383 L
231.083 499.882 L
231.083 387.798 L
225.401 387.942 L
219.733 388.374 L
214.095 389.093 L
cp
f
GR
GS
[0.75 0 0 0.75 0 0.25] CT
0.302 0.745 0.933 RC
2 setlinecap
10.0 ML
0.667 LW
N
231.083 499.882 M
231.083 387.798 L
225.401 387.942 L
219.733 388.374 L
214.095 389.093 L
208.501 390.097 L
202.964 391.383 L
231.083 499.882 L
231.083 499.882 L
S
GR
GS
[0.75 0 0 0.75 0 0.25] CT
0.094 0.749 0.71 RC
N
164.885 600.392 M
170.576 604.424 L
176.506 608.094 L
182.653 611.389 L
188.993 614.295 L
195.502 616.801 L
202.154 618.897 L
208.923 620.576 L
215.783 621.83 L
222.709 622.655 L
229.672 623.048 L
236.646 623.007 L
243.604 622.532 L
250.519 621.625 L
257.365 620.291 L
264.114 618.532 L
270.741 616.358 L
277.219 613.776 L
283.525 610.796 L
289.633 607.429 L
295.519 603.689 L
301.162 599.59 L
306.539 595.148 L
311.629 590.381 L
316.413 585.306 L
320.872 579.943 L
324.989 574.313 L
328.747 568.438 L
332.133 562.341 L
335.133 556.045 L
337.736 549.575 L
339.932 542.955 L
341.711 536.211 L
343.068 529.37 L
343.996 522.458 L
344.493 515.502 L
344.556 508.528 L
344.185 501.563 L
343.382 494.635 L
342.15 487.771 L
340.493 480.996 L
338.418 474.338 L
335.932 467.821 L
333.047 461.472 L
329.772 455.314 L
326.12 449.372 L
322.106 443.669 L
317.745 438.227 L
313.054 433.066 L
308.051 428.207 L
302.755 423.668 L
297.188 419.468 L
291.37 415.622 L
285.324 412.145 L
279.073 409.051 L
272.643 406.352 L
232.5 511 L
204.381 402.501 L
197.688 404.46 L
191.129 406.831 L
184.73 409.606 L
178.517 412.773 L
172.512 416.321 L
166.74 420.235 L
161.222 424.501 L
155.98 429.101 L
151.035 434.019 L
146.405 439.234 L
142.108 444.728 L
138.161 450.478 L
134.58 456.463 L
131.378 462.658 L
128.567 469.041 L
126.158 475.586 L
124.162 482.269 L
122.585 489.062 L
121.433 495.941 L
120.711 502.878 L
120.423 509.846 L
120.568 516.819 L
121.146 523.769 L
122.156 530.67 L
123.593 537.495 L
125.452 544.217 L
127.725 550.81 L
130.404 557.25 L
133.478 563.51 L
136.935 569.567 L
140.763 575.397 L
144.946 580.978 L
149.467 586.288 L
154.31 591.306 L
159.456 596.013 L
cp
f
GR
GS
[0.75 0 0 0.75 0 0.25] CT
0 0.749 0.749 RC
2 setlinecap
10.0 ML
0.667 LW
N
232.5 511 M
204.381 402.501 L
197.688 404.46 L
191.129 406.831 L
184.73 409.606 L
178.517 412.773 L
172.512 416.321 L
166.74 420.235 L
161.222 424.501 L
155.98 429.101 L
151.035 434.019 L
146.405 439.234 L
142.108 444.728 L
138.161 450.478 L
134.58 456.463 L
131.378 462.658 L
128.567 469.041 L
126.158 475.586 L
124.162 482.269 L
122.585 489.062 L
121.433 495.941 L
120.711 502.878 L
120.423 509.846 L
120.568 516.819 L
121.146 523.769 L
122.156 530.67 L
123.593 537.495 L
125.452 544.217 L
127.725 550.81 L
130.404 557.25 L
133.478 563.51 L
136.935 569.567 L
140.763 575.397 L
144.946 580.978 L
149.467 586.288 L
154.31 591.306 L
159.456 596.013 L
164.885 600.392 L
170.576 604.424 L
176.506 608.094 L
182.653 611.389 L
188.993 614.295 L
195.502 616.801 L
202.154 618.897 L
208.923 620.576 L
215.783 621.83 L
222.709 622.655 L
229.672 623.048 L
236.646 623.007 L
243.604 622.532 L
250.519 621.625 L
257.365 620.291 L
264.114 618.532 L
270.741 616.358 L
277.219 613.776 L
283.525 610.796 L
289.633 607.429 L
295.519 603.689 L
301.162 599.59 L
306.539 595.148 L
311.629 590.381 L
316.413 585.306 L
320.872 579.943 L
324.989 574.313 L
328.747 568.438 L
332.133 562.341 L
335.133 556.045 L
337.736 549.575 L
339.932 542.955 L
341.711 536.211 L
343.068 529.37 L
343.996 522.458 L
344.493 515.502 L
344.556 508.528 L
344.185 501.563 L
343.382 494.635 L
342.15 487.771 L
340.493 480.996 L
338.418 474.338 L
335.932 467.821 L
333.047 461.472 L
329.772 455.314 L
326.12 449.372 L
322.106 443.669 L
317.745 438.227 L
313.054 433.066 L
308.051 428.207 L
302.755 423.668 L
297.188 419.468 L
291.37 415.622 L
285.324 412.145 L
279.073 409.051 L
272.643 406.352 L
232.5 511 L
232.5 511 L
S
GR
GS
[0.75 0 0 0.75 0 0.25] CT
0 0.447 0.741 RC
N
232.5 398.917 M
232.5 511 L
272.643 406.352 L
266.183 404.098 L
259.598 402.242 L
252.913 400.791 L
246.151 399.751 L
239.338 399.125 L
cp
f
GR
GS
[0.75 0 0 0.75 0 0.25] CT
0 0.447 0.741 RC
2 setlinecap
10.0 ML
0.667 LW
N
232.5 511 M
272.643 406.352 L
266.183 404.098 L
259.598 402.242 L
252.913 400.791 L
246.151 399.751 L
239.338 399.125 L
232.5 398.917 L
232.5 511 L
232.5 511 L
S
GR
GS
[0.75 0 0 0.75 164.61922 312.68474] CT
1 GC
/Helvetica-Bold 18.667 F
GS
[1 0 0 1 0 0] CT
-13.5 -5 moveto 
1 -1 scale
(4%) t 
GR
GR
GS
[0.75 0 0 0.75 175.16701 403.82196] CT
1 GC
/Helvetica-Bold 18.667 F
GS
[1 0 0 1 0 0] CT
-19 19 moveto 
1 -1 scale
(90%) t 
GR
GR
GS
[0.75 0 0 0.75 187.46542 323.32767] CT
1 GC
/Helvetica-Bold 18.667 F
GS
[1 0 0 1 0 0] CT
-13.5 -5 moveto 
1 -1 scale
(6%) t 
GR
GR
%%Trailer
%%Pages: 1
%%EOF
