%!PS-Adobe-3.0 EPSF-3.0
%%Creator: (MATLAB, The Mathworks, Inc. Version 9.5.0.944444 \(R2018b\). Operating System: Windows 10)
%%Title: (X:/[ALEX] - Collaborative ranging CRLB/submission TVT/Revision/fig/biasCDF_revision.eps)
%%CreationDate: 2019-05-10T17:27:58
%%Pages: (atend)
%%BoundingBox: 0 0 734 326
%%LanguageLevel: 3
%%EndComments
%%BeginProlog
%%BeginResource: procset (Apache XML Graphics Std ProcSet) 1.2 0
%%Version: 1.2 0
%%Copyright: (Copyright 2001-2003,2010 The Apache Software Foundation. License terms: http://www.apache.org/licenses/LICENSE-2.0)
/bd{bind def}bind def
/ld{load def}bd
/GR/grestore ld
/GS/gsave ld
/RM/rmoveto ld
/C/curveto ld
/t/show ld
/L/lineto ld
/ML/setmiterlimit ld
/CT/concat ld
/f/fill ld
/N/newpath ld
/S/stroke ld
/CC/setcmykcolor ld
/A/ashow ld
/cp/closepath ld
/RC/setrgbcolor ld
/LJ/setlinejoin ld
/GC/setgray ld
/LW/setlinewidth ld
/M/moveto ld
/re {4 2 roll M
1 index 0 rlineto
0 exch rlineto
neg 0 rlineto
cp } bd
/_ctm matrix def
/_tm matrix def
/BT { _ctm currentmatrix pop matrix _tm copy pop 0 0 moveto } bd
/ET { _ctm setmatrix } bd
/iTm { _ctm setmatrix _tm concat } bd
/Tm { _tm astore pop iTm 0 0 moveto } bd
/ux 0.0 def
/uy 0.0 def
/F {
  /Tp exch def
  /Tf exch def
  Tf findfont Tp scalefont setfont
  /cf Tf def  /cs Tp def
} bd
/ULS {currentpoint /uy exch def /ux exch def} bd
/ULE {
  /Tcx currentpoint pop def
  gsave
  newpath
  cf findfont cs scalefont dup
  /FontMatrix get 0 get /Ts exch def /FontInfo get dup
  /UnderlinePosition get Ts mul /To exch def
  /UnderlineThickness get Ts mul /Tt exch def
  ux uy To add moveto  Tcx uy To add lineto
  Tt setlinewidth stroke
  grestore
} bd
/OLE {
  /Tcx currentpoint pop def
  gsave
  newpath
  cf findfont cs scalefont dup
  /FontMatrix get 0 get /Ts exch def /FontInfo get dup
  /UnderlinePosition get Ts mul /To exch def
  /UnderlineThickness get Ts mul /Tt exch def
  ux uy To add cs add moveto Tcx uy To add cs add lineto
  Tt setlinewidth stroke
  grestore
} bd
/SOE {
  /Tcx currentpoint pop def
  gsave
  newpath
  cf findfont cs scalefont dup
  /FontMatrix get 0 get /Ts exch def /FontInfo get dup
  /UnderlinePosition get Ts mul /To exch def
  /UnderlineThickness get Ts mul /Tt exch def
  ux uy To add cs 10 mul 26 idiv add moveto Tcx uy To add cs 10 mul 26 idiv add lineto
  Tt setlinewidth stroke
  grestore
} bd
/QT {
/Y22 exch store
/X22 exch store
/Y21 exch store
/X21 exch store
currentpoint
/Y21 load 2 mul add 3 div exch
/X21 load 2 mul add 3 div exch
/X21 load 2 mul /X22 load add 3 div
/Y21 load 2 mul /Y22 load add 3 div
/X22 load /Y22 load curveto
} bd
/SSPD {
dup length /d exch dict def
{
/v exch def
/k exch def
currentpagedevice k known {
/cpdv currentpagedevice k get def
v cpdv ne {
/upd false def
/nullv v type /nulltype eq def
/nullcpdv cpdv type /nulltype eq def
nullv nullcpdv or
{
/upd true def
} {
/sametype v type cpdv type eq def
sametype {
v type /arraytype eq {
/vlen v length def
/cpdvlen cpdv length def
vlen cpdvlen eq {
0 1 vlen 1 sub {
/i exch def
/obj v i get def
/cpdobj cpdv i get def
obj cpdobj ne {
/upd true def
exit
} if
} for
} {
/upd true def
} ifelse
} {
v type /dicttype eq {
v {
/dv exch def
/dk exch def
/cpddv cpdv dk get def
dv cpddv ne {
/upd true def
exit
} if
} forall
} {
/upd true def
} ifelse
} ifelse
} if
} ifelse
upd true eq {
d k v put
} if
} if
} if
} forall
d length 0 gt {
d setpagedevice
} if
} bd
/RE { % /NewFontName [NewEncodingArray] /FontName RE -
  findfont dup length dict begin
  {
    1 index /FID ne
    {def} {pop pop} ifelse
  } forall
  /Encoding exch def
  /FontName 1 index def
  currentdict definefont pop
  end
} bind def
%%EndResource
%%BeginResource: procset (Apache XML Graphics EPS ProcSet) 1.0 0
%%Version: 1.0 0
%%Copyright: (Copyright 2002-2003 The Apache Software Foundation. License terms: http://www.apache.org/licenses/LICENSE-2.0)
/BeginEPSF { %def
/b4_Inc_state save def         % Save state for cleanup
/dict_count countdictstack def % Count objects on dict stack
/op_count count 1 sub def      % Count objects on operand stack
userdict begin                 % Push userdict on dict stack
/showpage { } def              % Redefine showpage, { } = null proc
0 setgray 0 setlinecap         % Prepare graphics state
1 setlinewidth 0 setlinejoin
10 setmiterlimit [ ] 0 setdash newpath
/languagelevel where           % If level not equal to 1 then
{pop languagelevel             % set strokeadjust and
1 ne                           % overprint to their defaults.
{false setstrokeadjust false setoverprint
} if
} if
} bd
/EndEPSF { %def
count op_count sub {pop} repeat            % Clean up stacks
countdictstack dict_count sub {end} repeat
b4_Inc_state restore
} bd
%%EndResource
%FOPBeginFontDict
%%IncludeResource: font Courier-Oblique
%%IncludeResource: font Courier-BoldOblique
%%IncludeResource: font Courier-Bold
%%IncludeResource: font ZapfDingbats
%%IncludeResource: font Symbol
%%IncludeResource: font Helvetica
%%IncludeResource: font Helvetica-Oblique
%%IncludeResource: font Helvetica-Bold
%%IncludeResource: font Helvetica-BoldOblique
%%IncludeResource: font Times-Roman
%%IncludeResource: font Times-Italic
%%IncludeResource: font Times-Bold
%%IncludeResource: font Times-BoldItalic
%%IncludeResource: font Courier
%FOPEndFontDict
%%BeginResource: encoding WinAnsiEncoding
/WinAnsiEncoding [
/.notdef /.notdef /.notdef /.notdef /.notdef
/.notdef /.notdef /.notdef /.notdef /.notdef
/.notdef /.notdef /.notdef /.notdef /.notdef
/.notdef /.notdef /.notdef /.notdef /.notdef
/.notdef /.notdef /.notdef /.notdef /.notdef
/.notdef /.notdef /.notdef /.notdef /.notdef
/.notdef /.notdef /space /exclam /quotedbl
/numbersign /dollar /percent /ampersand /quotesingle
/parenleft /parenright /asterisk /plus /comma
/hyphen /period /slash /zero /one
/two /three /four /five /six
/seven /eight /nine /colon /semicolon
/less /equal /greater /question /at
/A /B /C /D /E
/F /G /H /I /J
/K /L /M /N /O
/P /Q /R /S /T
/U /V /W /X /Y
/Z /bracketleft /backslash /bracketright /asciicircum
/underscore /quoteleft /a /b /c
/d /e /f /g /h
/i /j /k /l /m
/n /o /p /q /r
/s /t /u /v /w
/x /y /z /braceleft /bar
/braceright /asciitilde /bullet /Euro /bullet
/quotesinglbase /florin /quotedblbase /ellipsis /dagger
/daggerdbl /circumflex /perthousand /Scaron /guilsinglleft
/OE /bullet /Zcaron /bullet /bullet
/quoteleft /quoteright /quotedblleft /quotedblright /bullet
/endash /emdash /asciitilde /trademark /scaron
/guilsinglright /oe /bullet /zcaron /Ydieresis
/space /exclamdown /cent /sterling /currency
/yen /brokenbar /section /dieresis /copyright
/ordfeminine /guillemotleft /logicalnot /sfthyphen /registered
/macron /degree /plusminus /twosuperior /threesuperior
/acute /mu /paragraph /middot /cedilla
/onesuperior /ordmasculine /guillemotright /onequarter /onehalf
/threequarters /questiondown /Agrave /Aacute /Acircumflex
/Atilde /Adieresis /Aring /AE /Ccedilla
/Egrave /Eacute /Ecircumflex /Edieresis /Igrave
/Iacute /Icircumflex /Idieresis /Eth /Ntilde
/Ograve /Oacute /Ocircumflex /Otilde /Odieresis
/multiply /Oslash /Ugrave /Uacute /Ucircumflex
/Udieresis /Yacute /Thorn /germandbls /agrave
/aacute /acircumflex /atilde /adieresis /aring
/ae /ccedilla /egrave /eacute /ecircumflex
/edieresis /igrave /iacute /icircumflex /idieresis
/eth /ntilde /ograve /oacute /ocircumflex
/otilde /odieresis /divide /oslash /ugrave
/uacute /ucircumflex /udieresis /yacute /thorn
/ydieresis
] def
%%EndResource
%FOPBeginFontReencode
/Courier-Oblique findfont
dup length dict begin
  {1 index /FID ne {def} {pop pop} ifelse} forall
  /Encoding WinAnsiEncoding def
  currentdict
end
/Courier-Oblique exch definefont pop
/Courier-BoldOblique findfont
dup length dict begin
  {1 index /FID ne {def} {pop pop} ifelse} forall
  /Encoding WinAnsiEncoding def
  currentdict
end
/Courier-BoldOblique exch definefont pop
/Courier-Bold findfont
dup length dict begin
  {1 index /FID ne {def} {pop pop} ifelse} forall
  /Encoding WinAnsiEncoding def
  currentdict
end
/Courier-Bold exch definefont pop
/Helvetica findfont
dup length dict begin
  {1 index /FID ne {def} {pop pop} ifelse} forall
  /Encoding WinAnsiEncoding def
  currentdict
end
/Helvetica exch definefont pop
/Helvetica-Oblique findfont
dup length dict begin
  {1 index /FID ne {def} {pop pop} ifelse} forall
  /Encoding WinAnsiEncoding def
  currentdict
end
/Helvetica-Oblique exch definefont pop
/Helvetica-Bold findfont
dup length dict begin
  {1 index /FID ne {def} {pop pop} ifelse} forall
  /Encoding WinAnsiEncoding def
  currentdict
end
/Helvetica-Bold exch definefont pop
/Helvetica-BoldOblique findfont
dup length dict begin
  {1 index /FID ne {def} {pop pop} ifelse} forall
  /Encoding WinAnsiEncoding def
  currentdict
end
/Helvetica-BoldOblique exch definefont pop
/Times-Roman findfont
dup length dict begin
  {1 index /FID ne {def} {pop pop} ifelse} forall
  /Encoding WinAnsiEncoding def
  currentdict
end
/Times-Roman exch definefont pop
/Times-Italic findfont
dup length dict begin
  {1 index /FID ne {def} {pop pop} ifelse} forall
  /Encoding WinAnsiEncoding def
  currentdict
end
/Times-Italic exch definefont pop
/Times-Bold findfont
dup length dict begin
  {1 index /FID ne {def} {pop pop} ifelse} forall
  /Encoding WinAnsiEncoding def
  currentdict
end
/Times-Bold exch definefont pop
/Times-BoldItalic findfont
dup length dict begin
  {1 index /FID ne {def} {pop pop} ifelse} forall
  /Encoding WinAnsiEncoding def
  currentdict
end
/Times-BoldItalic exch definefont pop
/Courier findfont
dup length dict begin
  {1 index /FID ne {def} {pop pop} ifelse} forall
  /Encoding WinAnsiEncoding def
  currentdict
end
/Courier exch definefont pop
%FOPEndFontReencode
%%EndProlog
%%Page: 1 1
%%PageBoundingBox: 0 0 734 326
%%BeginPageSetup
[1 0 0 -1 0 326] CT
%%EndPageSetup
GS
[0.75 0 0 0.75 0 0.5] CT
N
0 0 M
978 0 L
978 434 L
0 434 L
0 0 L
cp
clip
1 GC
N
0 0 978 434 re
f
GR
GS
[0.75 0 0 0.75 0 0.5] CT
1 GC
N
0 0 978 434 re
f
GR
GS
[0.75 0 0 0.75 0 0.5] CT
1 GC
N
127 352 M
885 352 L
885 48 L
127 48 L
cp
f
GR
GS
[0.75 0 0 0.75 0 0.5] CT
0.873 GC
1 LJ
0.667 LW
N
127 352 M
127 48 L
S
GR
GS
[0.75 0 0 0.75 0 0.5] CT
0.873 GC
1 LJ
0.667 LW
N
202.782 352 M
202.782 48 L
S
GR
GS
[0.75 0 0 0.75 0 0.5] CT
0.873 GC
1 LJ
0.667 LW
N
278.564 352 M
278.564 48 L
S
GR
GS
[0.75 0 0 0.75 0 0.5] CT
0.873 GC
1 LJ
0.667 LW
N
354.346 352 M
354.346 48 L
S
GR
GS
[0.75 0 0 0.75 0 0.5] CT
0.873 GC
1 LJ
0.667 LW
N
430.128 352 M
430.128 48 L
S
GR
GS
[0.75 0 0 0.75 0 0.5] CT
0.873 GC
1 LJ
0.667 LW
N
505.91 352 M
505.91 48 L
S
GR
GS
[0.75 0 0 0.75 0 0.5] CT
0.873 GC
1 LJ
0.667 LW
N
581.692 352 M
581.692 48 L
S
GR
GS
[0.75 0 0 0.75 0 0.5] CT
0.873 GC
1 LJ
0.667 LW
N
657.474 352 M
657.474 48 L
S
GR
GS
[0.75 0 0 0.75 0 0.5] CT
0.873 GC
1 LJ
0.667 LW
N
733.256 352 M
733.256 48 L
S
GR
GS
[0.75 0 0 0.75 0 0.5] CT
0.873 GC
1 LJ
0.667 LW
N
809.038 352 M
809.038 48 L
S
GR
GS
[0.75 0 0 0.75 0 0.5] CT
0.873 GC
1 LJ
0.667 LW
N
884.82 352 M
884.82 48 L
S
GR
GS
[0.75 0 0 0.75 0 0.5] CT
0.873 GC
1 LJ
0.667 LW
N
885 352 M
127 352 L
S
GR
GS
[0.75 0 0 0.75 0 0.5] CT
0.873 GC
1 LJ
0.667 LW
N
885 291.2 M
127 291.2 L
S
GR
GS
[0.75 0 0 0.75 0 0.5] CT
0.873 GC
1 LJ
0.667 LW
N
885 230.4 M
127 230.4 L
S
GR
GS
[0.75 0 0 0.75 0 0.5] CT
0.873 GC
1 LJ
0.667 LW
N
885 169.6 M
127 169.6 L
S
GR
GS
[0.75 0 0 0.75 0 0.5] CT
0.873 GC
1 LJ
0.667 LW
N
885 108.8 M
127 108.8 L
S
GR
GS
[0.75 0 0 0.75 0 0.5] CT
0.873 GC
1 LJ
0.667 LW
N
885 48 M
127 48 L
S
GR
GS
[0.75 0 0 0.75 0 0.5] CT
0.149 GC
2 setlinecap
1 LJ
0.667 LW
N
127 352 M
885 352 L
S
GR
GS
[0.75 0 0 0.75 0 0.5] CT
0.149 GC
2 setlinecap
1 LJ
0.667 LW
N
127 48 M
885 48 L
S
GR
GS
[0.75 0 0 0.75 0 0.5] CT
0.149 GC
2 setlinecap
1 LJ
0.667 LW
N
127 352 M
127 344.42 L
S
GR
GS
[0.75 0 0 0.75 0 0.5] CT
0.149 GC
2 setlinecap
1 LJ
0.667 LW
N
202.782 352 M
202.782 344.42 L
S
GR
GS
[0.75 0 0 0.75 0 0.5] CT
0.149 GC
2 setlinecap
1 LJ
0.667 LW
N
278.564 352 M
278.564 344.42 L
S
GR
GS
[0.75 0 0 0.75 0 0.5] CT
0.149 GC
2 setlinecap
1 LJ
0.667 LW
N
354.346 352 M
354.346 344.42 L
S
GR
GS
[0.75 0 0 0.75 0 0.5] CT
0.149 GC
2 setlinecap
1 LJ
0.667 LW
N
430.128 352 M
430.128 344.42 L
S
GR
GS
[0.75 0 0 0.75 0 0.5] CT
0.149 GC
2 setlinecap
1 LJ
0.667 LW
N
505.91 352 M
505.91 344.42 L
S
GR
GS
[0.75 0 0 0.75 0 0.5] CT
0.149 GC
2 setlinecap
1 LJ
0.667 LW
N
581.692 352 M
581.692 344.42 L
S
GR
GS
[0.75 0 0 0.75 0 0.5] CT
0.149 GC
2 setlinecap
1 LJ
0.667 LW
N
657.474 352 M
657.474 344.42 L
S
GR
GS
[0.75 0 0 0.75 0 0.5] CT
0.149 GC
2 setlinecap
1 LJ
0.667 LW
N
733.256 352 M
733.256 344.42 L
S
GR
GS
[0.75 0 0 0.75 0 0.5] CT
0.149 GC
2 setlinecap
1 LJ
0.667 LW
N
809.038 352 M
809.038 344.42 L
S
GR
GS
[0.75 0 0 0.75 0 0.5] CT
0.149 GC
2 setlinecap
1 LJ
0.667 LW
N
884.82 352 M
884.82 344.42 L
S
GR
GS
[0.75 0 0 0.75 0 0.5] CT
0.149 GC
2 setlinecap
1 LJ
0.667 LW
N
127 48 M
127 55.58 L
S
GR
GS
[0.75 0 0 0.75 0 0.5] CT
0.149 GC
2 setlinecap
1 LJ
0.667 LW
N
202.782 48 M
202.782 55.58 L
S
GR
GS
[0.75 0 0 0.75 0 0.5] CT
0.149 GC
2 setlinecap
1 LJ
0.667 LW
N
278.564 48 M
278.564 55.58 L
S
GR
GS
[0.75 0 0 0.75 0 0.5] CT
0.149 GC
2 setlinecap
1 LJ
0.667 LW
N
354.346 48 M
354.346 55.58 L
S
GR
GS
[0.75 0 0 0.75 0 0.5] CT
0.149 GC
2 setlinecap
1 LJ
0.667 LW
N
430.128 48 M
430.128 55.58 L
S
GR
GS
[0.75 0 0 0.75 0 0.5] CT
0.149 GC
2 setlinecap
1 LJ
0.667 LW
N
505.91 48 M
505.91 55.58 L
S
GR
GS
[0.75 0 0 0.75 0 0.5] CT
0.149 GC
2 setlinecap
1 LJ
0.667 LW
N
581.692 48 M
581.692 55.58 L
S
GR
GS
[0.75 0 0 0.75 0 0.5] CT
0.149 GC
2 setlinecap
1 LJ
0.667 LW
N
657.474 48 M
657.474 55.58 L
S
GR
GS
[0.75 0 0 0.75 0 0.5] CT
0.149 GC
2 setlinecap
1 LJ
0.667 LW
N
733.256 48 M
733.256 55.58 L
S
GR
GS
[0.75 0 0 0.75 0 0.5] CT
0.149 GC
2 setlinecap
1 LJ
0.667 LW
N
809.038 48 M
809.038 55.58 L
S
GR
GS
[0.75 0 0 0.75 0 0.5] CT
0.149 GC
2 setlinecap
1 LJ
0.667 LW
N
884.82 48 M
884.82 55.58 L
S
GR
GS
[0.75 0 0 0.75 95.25 269.69999] CT
0.149 GC
N
-0.083 18.389 M
-2.661 18.389 -3.583 16.264 QT
-4.505 14.139 -4.505 11.217 QT
-4.505 9.404 -4.177 7.795 QT
-3.849 6.186 -2.857 5.061 QT
-1.865 3.936 -0.083 3.936 QT
1.307 3.936 2.182 4.607 QT
3.057 5.279 3.526 6.357 QT
3.995 7.436 4.159 8.654 QT
4.323 9.873 4.323 11.217 QT
4.323 13.029 3.995 14.6 QT
3.667 16.17 2.69 17.279 QT
1.714 18.389 -0.083 18.389 QT
cp
-0.083 17.842 M
1.089 17.842 1.659 16.639 QT
2.229 15.436 2.362 13.982 QT
2.495 12.529 2.495 10.889 QT
2.495 9.311 2.362 7.975 QT
2.229 6.639 1.659 5.561 QT
1.089 4.482 -0.083 4.482 QT
-1.271 4.482 -1.849 5.568 QT
-2.427 6.654 -2.56 7.982 QT
-2.693 9.311 -2.693 10.889 QT
-2.693 12.061 -2.63 13.092 QT
-2.568 14.123 -2.326 15.225 QT
-2.083 16.326 -1.536 17.084 QT
-0.99 17.842 -0.083 17.842 QT
cp
f
GR
GS
[0.75 0 0 0.75 152.08649 269.69999] CT
0.149 GC
N
-8.38 18.389 M
-10.958 18.389 -11.88 16.264 QT
-12.802 14.139 -12.802 11.217 QT
-12.802 9.404 -12.473 7.795 QT
-12.145 6.186 -11.153 5.061 QT
-10.161 3.936 -8.38 3.936 QT
-6.989 3.936 -6.114 4.607 QT
-5.239 5.279 -4.77 6.357 QT
-4.302 7.436 -4.137 8.654 QT
-3.973 9.873 -3.973 11.217 QT
-3.973 13.029 -4.302 14.6 QT
-4.63 16.17 -5.606 17.279 QT
-6.583 18.389 -8.38 18.389 QT
cp
-8.38 17.842 M
-7.208 17.842 -6.637 16.639 QT
-6.067 15.436 -5.934 13.982 QT
-5.802 12.529 -5.802 10.889 QT
-5.802 9.311 -5.934 7.975 QT
-6.067 6.639 -6.637 5.561 QT
-7.208 4.482 -8.38 4.482 QT
-9.567 4.482 -10.145 5.568 QT
-10.723 6.654 -10.856 7.982 QT
-10.989 9.311 -10.989 10.889 QT
-10.989 12.061 -10.927 13.092 QT
-10.864 14.123 -10.622 15.225 QT
-10.38 16.326 -9.833 17.084 QT
-9.286 17.842 -8.38 17.842 QT
cp
f
GR
GS
[0.75 0 0 0.75 152.08649 269.69999] CT
0.149 GC
N
-1.197 16.764 M
-1.197 16.295 -0.846 15.951 QT
-0.494 15.607 -0.041 15.607 QT
0.24 15.607 0.521 15.764 QT
0.803 15.92 0.959 16.193 QT
1.115 16.467 1.115 16.764 QT
1.115 17.217 0.771 17.568 QT
0.428 17.92 -0.041 17.92 QT
-0.494 17.92 -0.846 17.568 QT
-1.197 17.217 -1.197 16.764 QT
cp
f
GR
GS
[0.75 0 0 0.75 152.08649 269.69999] CT
0.149 GC
N
4.01 17.92 M
4.01 17.357 L
4.01 17.311 4.057 17.248 QT
7.307 13.639 L
8.057 12.826 8.518 12.287 QT
8.979 11.748 9.424 11.037 QT
9.869 10.326 10.135 9.6 QT
10.4 8.873 10.4 8.045 QT
10.4 7.186 10.08 6.396 QT
9.76 5.607 9.127 5.139 QT
8.494 4.67 7.604 4.67 QT
6.697 4.67 5.971 5.217 QT
5.244 5.764 4.947 6.639 QT
5.025 6.623 5.166 6.623 QT
5.635 6.623 5.971 6.936 QT
6.307 7.248 6.307 7.764 QT
6.307 8.232 5.971 8.568 QT
5.635 8.904 5.166 8.904 QT
4.682 8.904 4.346 8.561 QT
4.01 8.217 4.01 7.764 QT
4.01 6.967 4.307 6.279 QT
4.604 5.592 5.166 5.053 QT
5.729 4.514 6.424 4.225 QT
7.119 3.936 7.916 3.936 QT
9.119 3.936 10.15 4.443 QT
11.182 4.951 11.791 5.881 QT
12.4 6.811 12.4 8.045 QT
12.4 8.951 12.002 9.771 QT
11.604 10.592 10.979 11.264 QT
10.354 11.936 9.377 12.787 QT
8.4 13.639 8.088 13.936 QT
5.713 16.217 L
7.729 16.217 L
9.213 16.217 10.213 16.193 QT
11.213 16.17 11.275 16.107 QT
11.525 15.842 11.775 14.17 QT
12.4 14.17 L
11.807 17.92 L
4.01 17.92 L
cp
f
GR
GS
[0.75 0 0 0.75 208.92297 269.69999] CT
0.149 GC
N
/f517376704{-8.38 18.389 M
-10.958 18.389 -11.88 16.264 QT
-12.802 14.139 -12.802 11.217 QT
-12.802 9.404 -12.473 7.795 QT
-12.145 6.186 -11.153 5.061 QT
-10.161 3.936 -8.38 3.936 QT
-6.989 3.936 -6.114 4.607 QT
-5.239 5.279 -4.77 6.357 QT
-4.302 7.436 -4.137 8.654 QT
-3.973 9.873 -3.973 11.217 QT
-3.973 13.029 -4.302 14.6 QT
-4.63 16.17 -5.606 17.279 QT
-6.583 18.389 -8.38 18.389 QT
cp
-8.38 17.842 M
-7.208 17.842 -6.637 16.639 QT
-6.067 15.436 -5.934 13.982 QT
-5.802 12.529 -5.802 10.889 QT
-5.802 9.311 -5.934 7.975 QT
-6.067 6.639 -6.637 5.561 QT
-7.208 4.482 -8.38 4.482 QT
-9.567 4.482 -10.145 5.568 QT
-10.723 6.654 -10.856 7.982 QT
-10.989 9.311 -10.989 10.889 QT
-10.989 12.061 -10.927 13.092 QT
-10.864 14.123 -10.622 15.225 QT
-10.38 16.326 -9.833 17.084 QT
-9.286 17.842 -8.38 17.842 QT
cp}def
f517376704
f
GR
GS
[0.75 0 0 0.75 208.92297 269.69999] CT
0.149 GC
N
/f1728610396{-1.197 16.764 M
-1.197 16.295 -0.846 15.951 QT
-0.494 15.607 -0.041 15.607 QT
0.24 15.607 0.521 15.764 QT
0.803 15.92 0.959 16.193 QT
1.115 16.467 1.115 16.764 QT
1.115 17.217 0.771 17.568 QT
0.428 17.92 -0.041 17.92 QT
-0.494 17.92 -0.846 17.568 QT
-1.197 17.217 -1.197 16.764 QT
cp}def
f1728610396
f
GR
GS
[0.75 0 0 0.75 208.92297 269.69999] CT
0.149 GC
N
/f695145265{3.541 14.451 M
3.541 13.717 L
10.041 4.029 L
10.104 3.936 10.26 3.936 QT
10.557 3.936 L
10.791 3.936 10.791 4.17 QT
10.791 13.717 L
12.854 13.717 L
12.854 14.451 L
10.791 14.451 L
10.791 16.514 L
10.791 16.951 11.408 17.068 QT
12.025 17.186 12.838 17.186 QT
12.838 17.92 L
7.057 17.92 L
7.057 17.186 L
7.869 17.186 8.479 17.068 QT
9.088 16.951 9.088 16.514 QT
9.088 14.451 L
3.541 14.451 L
cp
4.244 13.717 M
9.213 13.717 L
9.213 6.279 L
4.244 13.717 L
cp}def
f695145265
f
GR
GS
[0.75 0 0 0.75 265.75946 269.69999] CT
0.149 GC
N
f517376704
f
GR
GS
[0.75 0 0 0.75 265.75946 269.69999] CT
0.149 GC
N
f1728610396
f
GR
GS
[0.75 0 0 0.75 265.75946 269.69999] CT
0.149 GC
N
/f-156203671{8.213 18.389 M
6.916 18.389 6.041 17.693 QT
5.166 16.998 4.69 15.896 QT
4.213 14.795 4.025 13.584 QT
3.838 12.373 3.838 11.139 QT
3.838 9.467 4.486 7.795 QT
5.135 6.123 6.393 5.029 QT
7.65 3.936 9.369 3.936 QT
10.088 3.936 10.713 4.209 QT
11.338 4.482 11.69 5.006 QT
12.041 5.529 12.041 6.279 QT
12.041 6.717 11.744 7.006 QT
11.447 7.295 11.025 7.295 QT
10.619 7.295 10.322 6.998 QT
10.025 6.701 10.025 6.279 QT
10.025 5.873 10.322 5.576 QT
10.619 5.279 11.025 5.279 QT
11.135 5.279 L
10.869 4.904 10.385 4.725 QT
9.9 4.545 9.369 4.545 QT
8.729 4.545 8.197 4.818 QT
7.666 5.092 7.229 5.561 QT
6.791 6.029 6.51 6.6 QT
6.229 7.17 6.065 7.896 QT
5.9 8.623 5.861 9.264 QT
5.822 9.904 5.822 10.857 QT
6.197 9.998 6.869 9.451 QT
7.541 8.904 8.4 8.904 QT
9.338 8.904 10.104 9.287 QT
10.869 9.67 11.424 10.342 QT
11.979 11.014 12.268 11.873 QT
12.557 12.732 12.557 13.607 QT
12.557 14.842 12.01 15.959 QT
11.463 17.076 10.471 17.732 QT
9.479 18.389 8.213 18.389 QT
cp
8.213 17.717 M
9.025 17.717 9.518 17.35 QT
10.01 16.982 10.236 16.373 QT
10.463 15.764 10.525 15.139 QT
10.588 14.514 10.588 13.607 QT
10.588 12.42 10.471 11.584 QT
10.354 10.748 9.854 10.107 QT
9.354 9.467 8.322 9.467 QT
7.463 9.467 6.916 10.037 QT
6.369 10.607 6.119 11.482 QT
5.869 12.357 5.869 13.17 QT
5.869 13.451 5.885 13.592 QT
5.885 13.623 5.877 13.646 QT
5.869 13.67 5.869 13.701 QT
5.869 14.592 6.049 15.514 QT
6.229 16.436 6.752 17.076 QT
7.275 17.717 8.213 17.717 QT
cp}def
f-156203671
f
GR
GS
[0.75 0 0 0.75 322.59595 269.69999] CT
0.149 GC
N
f517376704
f
GR
GS
[0.75 0 0 0.75 322.59595 269.69999] CT
0.149 GC
N
f1728610396
f
GR
GS
[0.75 0 0 0.75 322.59595 269.69999] CT
0.149 GC
N
/f-1890546385{3.838 14.732 M
3.838 13.467 4.674 12.498 QT
5.51 11.529 6.807 10.889 QT
6.025 10.389 L
5.307 9.904 4.861 9.123 QT
4.416 8.342 4.416 7.482 QT
4.416 6.482 4.94 5.67 QT
5.463 4.857 6.338 4.396 QT
7.213 3.936 8.213 3.936 QT
9.15 3.936 10.018 4.311 QT
10.885 4.686 11.44 5.396 QT
11.994 6.107 11.994 7.076 QT
11.994 7.795 11.666 8.396 QT
11.338 8.998 10.752 9.482 QT
10.166 9.967 9.51 10.295 QT
10.713 11.076 L
11.541 11.607 12.049 12.49 QT
12.557 13.373 12.557 14.357 QT
12.557 15.482 11.947 16.42 QT
11.338 17.357 10.338 17.873 QT
9.338 18.389 8.213 18.389 QT
7.119 18.389 6.111 17.943 QT
5.104 17.498 4.471 16.662 QT
3.838 15.826 3.838 14.732 QT
cp
4.979 14.732 M
4.979 15.561 5.44 16.248 QT
5.9 16.936 6.65 17.326 QT
7.4 17.717 8.213 17.717 QT
9.432 17.717 10.424 17.006 QT
11.416 16.295 11.416 15.107 QT
11.416 14.717 11.26 14.318 QT
11.104 13.92 10.822 13.6 QT
10.541 13.279 10.197 13.076 QT
7.369 11.248 L
6.713 11.592 6.166 12.123 QT
5.619 12.654 5.299 13.326 QT
4.979 13.998 4.979 14.732 QT
cp
6.432 8.326 M
8.979 9.967 L
9.854 9.451 10.416 8.725 QT
10.979 7.998 10.979 7.076 QT
10.979 6.373 10.588 5.787 QT
10.197 5.201 9.557 4.873 QT
8.916 4.545 8.197 4.545 QT
7.557 4.545 6.908 4.787 QT
6.26 5.029 5.846 5.514 QT
5.432 5.998 5.432 6.654 QT
5.432 7.639 6.432 8.326 QT
cp}def
f-1890546385
f
GR
GS
[0.75 0 0 0.75 379.43243 269.69999] CT
0.149 GC
N
/f-927642101{-3.38 17.92 M
-3.38 17.186 L
-0.755 17.186 -0.755 16.514 QT
-0.755 5.498 L
-1.849 6.014 -3.505 6.014 QT
-3.505 5.279 L
-0.927 5.279 0.385 3.936 QT
0.682 3.936 L
0.745 3.936 0.815 3.99 QT
0.885 4.045 0.885 4.123 QT
0.885 16.514 L
0.885 17.186 3.51 17.186 QT
3.51 17.92 L
-3.38 17.92 L
cp}def
f-927642101
f
GR
GS
[0.75 0 0 0.75 436.26892 269.69999] CT
0.149 GC
N
/f-1169586820{-11.677 17.92 M
-11.677 17.186 L
-9.052 17.186 -9.052 16.514 QT
-9.052 5.498 L
-10.145 6.014 -11.802 6.014 QT
-11.802 5.279 L
-9.223 5.279 -7.911 3.936 QT
-7.614 3.936 L
-7.552 3.936 -7.481 3.99 QT
-7.411 4.045 -7.411 4.123 QT
-7.411 16.514 L
-7.411 17.186 -4.786 17.186 QT
-4.786 17.92 L
-11.677 17.92 L
cp}def
f-1169586820
f
GR
GS
[0.75 0 0 0.75 436.26892 269.69999] CT
0.149 GC
N
f1728610396
f
GR
GS
[0.75 0 0 0.75 436.26892 269.69999] CT
0.149 GC
N
/f971902629{4.01 17.92 M
4.01 17.357 L
4.01 17.311 4.057 17.248 QT
7.307 13.639 L
8.057 12.826 8.518 12.287 QT
8.979 11.748 9.424 11.037 QT
9.869 10.326 10.135 9.6 QT
10.4 8.873 10.4 8.045 QT
10.4 7.186 10.08 6.396 QT
9.76 5.607 9.127 5.139 QT
8.494 4.67 7.604 4.67 QT
6.697 4.67 5.971 5.217 QT
5.244 5.764 4.947 6.639 QT
5.025 6.623 5.166 6.623 QT
5.635 6.623 5.971 6.936 QT
6.307 7.248 6.307 7.764 QT
6.307 8.232 5.971 8.568 QT
5.635 8.904 5.166 8.904 QT
4.682 8.904 4.346 8.561 QT
4.01 8.217 4.01 7.764 QT
4.01 6.967 4.307 6.279 QT
4.604 5.592 5.166 5.053 QT
5.729 4.514 6.424 4.225 QT
7.119 3.936 7.916 3.936 QT
9.119 3.936 10.15 4.443 QT
11.182 4.951 11.791 5.881 QT
12.4 6.811 12.4 8.045 QT
12.4 8.951 12.002 9.771 QT
11.604 10.592 10.979 11.264 QT
10.354 11.936 9.377 12.787 QT
8.4 13.639 8.088 13.936 QT
5.713 16.217 L
7.729 16.217 L
9.213 16.217 10.213 16.193 QT
11.213 16.17 11.275 16.107 QT
11.525 15.842 11.775 14.17 QT
12.4 14.17 L
11.807 17.92 L
4.01 17.92 L
cp}def
f971902629
f
GR
GS
[0.75 0 0 0.75 493.10541 269.69999] CT
0.149 GC
N
f-1169586820
f
GR
GS
[0.75 0 0 0.75 493.10541 269.69999] CT
0.149 GC
N
f1728610396
f
GR
GS
[0.75 0 0 0.75 493.10541 269.69999] CT
0.149 GC
N
f695145265
f
GR
GS
[0.75 0 0 0.75 549.94189 269.69999] CT
0.149 GC
N
f-1169586820
f
GR
GS
[0.75 0 0 0.75 549.94189 269.69999] CT
0.149 GC
N
f1728610396
f
GR
GS
[0.75 0 0 0.75 549.94189 269.69999] CT
0.149 GC
N
f-156203671
f
GR
GS
[0.75 0 0 0.75 606.77834 269.69999] CT
0.149 GC
N
f-1169586820
f
GR
GS
[0.75 0 0 0.75 606.77834 269.69999] CT
0.149 GC
N
f1728610396
f
GR
GS
[0.75 0 0 0.75 606.77834 269.69999] CT
0.149 GC
N
f-1890546385
f
GR
GS
[0.75 0 0 0.75 663.61487 269.69999] CT
0.149 GC
N
/f364372466{-4.286 17.92 M
-4.286 17.357 L
-4.286 17.311 -4.24 17.248 QT
-0.99 13.639 L
-0.24 12.826 0.221 12.287 QT
0.682 11.748 1.128 11.037 QT
1.573 10.326 1.839 9.6 QT
2.104 8.873 2.104 8.045 QT
2.104 7.186 1.784 6.396 QT
1.464 5.607 0.831 5.139 QT
0.198 4.67 -0.693 4.67 QT
-1.599 4.67 -2.326 5.217 QT
-3.052 5.764 -3.349 6.639 QT
-3.271 6.623 -3.13 6.623 QT
-2.661 6.623 -2.326 6.936 QT
-1.99 7.248 -1.99 7.764 QT
-1.99 8.232 -2.326 8.568 QT
-2.661 8.904 -3.13 8.904 QT
-3.615 8.904 -3.951 8.561 QT
-4.286 8.217 -4.286 7.764 QT
-4.286 6.967 -3.99 6.279 QT
-3.693 5.592 -3.13 5.053 QT
-2.568 4.514 -1.872 4.225 QT
-1.177 3.936 -0.38 3.936 QT
0.823 3.936 1.854 4.443 QT
2.885 4.951 3.495 5.881 QT
4.104 6.811 4.104 8.045 QT
4.104 8.951 3.706 9.771 QT
3.307 10.592 2.682 11.264 QT
2.057 11.936 1.081 12.787 QT
0.104 13.639 -0.208 13.936 QT
-2.583 16.217 L
-0.568 16.217 L
0.917 16.217 1.917 16.193 QT
2.917 16.17 2.979 16.107 QT
3.229 15.842 3.479 14.17 QT
4.104 14.17 L
3.51 17.92 L
-4.286 17.92 L
cp}def
f364372466
f
GR
GS
[0.75 0 0 0.75 380.46384 288.75944] CT
0.149 GC
N
/f-570407196{-33.685 26.603 M
-33.653 26.291 -33.325 26.291 QT
-33.294 26.291 -32.81 26.556 QT
-32.325 26.822 -31.747 27.033 QT
-31.169 27.244 -30.591 27.244 QT
-30.091 27.244 -29.747 26.814 QT
-29.403 26.384 -29.403 25.884 QT
-29.403 25.166 -30.153 24.884 QT
-34.747 23.103 L
-35.935 22.634 -36.7 21.72 QT
-37.466 20.806 -37.466 19.65 QT
-37.466 18.603 -36.911 17.478 QT
-36.356 16.353 -35.489 15.431 QT
-34.622 14.509 -33.638 13.947 QT
-34.419 13.478 -34.864 12.728 QT
-35.31 11.978 -35.31 11.087 QT
-35.31 10.134 -34.919 9.322 QT
-34.528 8.509 -33.856 7.837 QT
-33.185 7.166 -32.356 6.697 QT
-31.528 6.228 -30.669 5.994 QT
-30.794 5.431 -30.794 4.978 QT
-30.794 3.525 -30.231 3.525 QT
-30.091 3.525 -29.981 3.626 QT
-29.872 3.728 -29.872 3.884 QT
-29.872 4.009 -29.95 4.455 QT
-30.028 4.9 -30.028 5.009 QT
-30.028 5.478 -29.903 5.822 QT
-29.2 5.681 -28.56 5.681 QT
-26.075 5.681 -26.075 6.447 QT
-26.075 7.353 -28.841 7.353 QT
-29.685 7.353 -30.2 6.791 QT
-30.981 7.181 -31.645 7.908 QT
-32.31 8.634 -32.677 9.525 QT
-33.044 10.416 -33.044 11.322 QT
-33.044 12.587 -32.31 13.353 QT
-31.356 13.025 -30.388 13.025 QT
-27.919 13.025 -27.919 13.791 QT
-27.919 14.697 -30.669 14.697 QT
-31.794 14.697 -32.778 14.353 QT
-33.981 15.009 -34.981 16.322 QT
-35.981 17.634 -35.981 18.869 QT
-35.981 19.65 -35.411 20.251 QT
-34.841 20.853 -33.997 21.212 QT
-29.2 23.072 L
-28.591 23.306 -28.2 23.83 QT
-27.81 24.353 -27.81 25.025 QT
-27.81 26.134 -28.661 27.033 QT
-29.513 27.931 -30.622 27.931 QT
-30.966 27.931 -31.739 27.751 QT
-32.513 27.572 -33.099 27.267 QT
-33.685 26.962 -33.685 26.603 QT
cp
-31.497 13.869 M
-31.138 14.009 -30.622 14.009 QT
-29.31 14.009 -28.747 13.837 QT
-29.263 13.744 -30.419 13.744 QT
-30.872 13.744 -31.497 13.869 QT
cp
-29.435 6.494 M
-29.185 6.666 -28.763 6.666 QT
-27.481 6.666 -26.903 6.494 QT
-29.435 6.494 L
cp}def
f-570407196
f
GR
GS
[0.75 0 0 0.75 380.46384 288.75944] CT
0.149 GC
N
/f529986634{-26.002 26.4 M
-26.002 25.431 L
-24.393 25.431 -24.221 25.259 QT
-21.658 22.353 L
-24.502 18.931 L
-25.908 18.931 L
-25.908 17.962 L
-21.44 17.962 L
-21.44 18.931 L
-22.127 18.931 L
-20.424 20.962 L
-18.768 19.087 L
-18.768 19.009 -19.041 18.97 QT
-19.315 18.931 -19.487 18.931 QT
-19.487 17.962 L
-15.69 17.962 L
-15.69 18.931 L
-17.299 18.931 -17.471 19.103 QT
-19.783 21.728 L
-16.705 25.431 L
-15.283 25.431 L
-15.283 26.4 L
-19.768 26.4 L
-19.768 25.431 L
-19.065 25.431 L
-21.018 23.119 L
-22.924 25.275 L
-22.924 25.337 -22.651 25.384 QT
-22.377 25.431 -22.205 25.431 QT
-22.205 26.4 L
-26.002 26.4 L
cp}def
f529986634
f
GR
GS
[0.75 0 0 0.75 380.46384 288.75944] CT
0.149 GC
N
/f1121920648{3.503 29.103 M
2.003 27.916 0.909 26.376 QT
-0.185 24.837 -0.872 23.095 QT
-1.56 21.353 -1.904 19.455 QT
-2.247 17.556 -2.247 15.65 QT
-2.247 13.712 -1.904 11.814 QT
-1.56 9.916 -0.857 8.166 QT
-0.154 6.416 0.94 4.884 QT
2.034 3.353 3.503 2.197 QT
3.503 2.15 3.628 2.15 QT
3.878 2.15 L
3.956 2.15 4.026 2.22 QT
4.096 2.291 4.096 2.384 QT
4.096 2.509 4.034 2.556 QT
2.721 3.853 1.846 5.33 QT
0.971 6.806 0.432 8.47 QT
-0.107 10.134 -0.341 11.923 QT
-0.575 13.712 -0.575 15.65 QT
-0.575 24.228 4.018 28.681 QT
4.096 28.775 4.096 28.916 QT
4.096 28.978 4.018 29.064 QT
3.94 29.15 3.878 29.15 QT
3.628 29.15 L
3.503 29.15 3.503 29.103 QT
cp}def
f1121920648
f
GR
GS
[0.75 0 0 0.75 380.46384 288.75944] CT
0.149 GC
N
/f1527786969{6.295 22.4 M
6.295 21.447 L
7.232 21.447 7.818 21.306 QT
8.404 21.166 8.404 20.587 QT
8.404 13.228 L
8.404 12.494 8.193 12.173 QT
7.982 11.853 7.568 11.783 QT
7.154 11.712 6.295 11.712 QT
6.295 10.759 L
10.217 10.462 L
10.217 13.103 L
10.764 11.947 11.826 11.205 QT
12.889 10.462 14.139 10.462 QT
17.248 10.462 17.779 12.994 QT
18.326 11.869 19.365 11.166 QT
20.404 10.462 21.654 10.462 QT
22.873 10.462 23.709 10.861 QT
24.545 11.259 24.967 12.072 QT
25.389 12.884 25.389 14.103 QT
25.389 20.587 L
25.389 21.166 25.99 21.306 QT
26.592 21.447 27.498 21.447 QT
27.498 22.4 L
21.326 22.4 L
21.326 21.447 L
22.248 21.447 22.842 21.306 QT
23.436 21.166 23.436 20.587 QT
23.436 14.181 L
23.436 12.822 23.053 11.994 QT
22.67 11.166 21.482 11.166 QT
19.92 11.166 18.904 12.416 QT
17.889 13.666 17.889 15.275 QT
17.889 20.587 L
17.889 21.166 18.482 21.306 QT
19.076 21.447 19.998 21.447 QT
19.998 22.4 L
13.811 22.4 L
13.811 21.447 L
14.732 21.447 15.326 21.306 QT
15.92 21.166 15.92 20.587 QT
15.92 14.181 L
15.92 12.869 15.537 12.017 QT
15.154 11.166 13.982 11.166 QT
12.404 11.166 11.397 12.416 QT
10.389 13.666 10.389 15.275 QT
10.389 20.587 L
10.389 21.166 10.982 21.306 QT
11.576 21.447 12.482 21.447 QT
12.482 22.4 L
6.295 22.4 L
cp}def
f1527786969
f
GR
GS
[0.75 0 0 0.75 380.46384 288.75944] CT
0.149 GC
N
/f1472783029{29.47 29.15 M
29.236 29.15 29.236 28.916 QT
29.236 28.791 29.283 28.744 QT
33.908 24.228 33.908 15.65 QT
33.908 7.072 29.345 2.619 QT
29.236 2.541 29.236 2.384 QT
29.236 2.291 29.306 2.22 QT
29.377 2.15 29.47 2.15 QT
29.72 2.15 L
29.799 2.15 29.861 2.197 QT
31.799 3.728 33.088 5.916 QT
34.377 8.103 34.978 10.587 QT
35.58 13.072 35.58 15.65 QT
35.58 17.556 35.259 19.408 QT
34.939 21.259 34.228 23.064 QT
33.517 24.869 32.439 26.392 QT
31.361 27.916 29.861 29.103 QT
29.799 29.15 29.72 29.15 QT
29.47 29.15 L
cp}def
f1472783029
f
GR
GS
[0.75 0 0 0.75 0 0.5] CT
0.149 GC
2 setlinecap
1 LJ
0.667 LW
N
127 352 M
127 48 L
S
GR
GS
[0.75 0 0 0.75 0 0.5] CT
0.149 GC
2 setlinecap
1 LJ
0.667 LW
N
885 352 M
885 48 L
S
GR
GS
[0.75 0 0 0.75 0 0.5] CT
0.149 GC
2 setlinecap
1 LJ
0.667 LW
N
127 352 M
134.58 352 L
S
GR
GS
[0.75 0 0 0.75 0 0.5] CT
0.149 GC
2 setlinecap
1 LJ
0.667 LW
N
127 291.2 M
134.58 291.2 L
S
GR
GS
[0.75 0 0 0.75 0 0.5] CT
0.149 GC
2 setlinecap
1 LJ
0.667 LW
N
127 230.4 M
134.58 230.4 L
S
GR
GS
[0.75 0 0 0.75 0 0.5] CT
0.149 GC
2 setlinecap
1 LJ
0.667 LW
N
127 169.6 M
134.58 169.6 L
S
GR
GS
[0.75 0 0 0.75 0 0.5] CT
0.149 GC
2 setlinecap
1 LJ
0.667 LW
N
127 108.8 M
134.58 108.8 L
S
GR
GS
[0.75 0 0 0.75 0 0.5] CT
0.149 GC
2 setlinecap
1 LJ
0.667 LW
N
127 48 M
134.58 48 L
S
GR
GS
[0.75 0 0 0.75 0 0.5] CT
0.149 GC
2 setlinecap
1 LJ
0.667 LW
N
885 352 M
877.42 352 L
S
GR
GS
[0.75 0 0 0.75 0 0.5] CT
0.149 GC
2 setlinecap
1 LJ
0.667 LW
N
885 291.2 M
877.42 291.2 L
S
GR
GS
[0.75 0 0 0.75 0 0.5] CT
0.149 GC
2 setlinecap
1 LJ
0.667 LW
N
885 230.4 M
877.42 230.4 L
S
GR
GS
[0.75 0 0 0.75 0 0.5] CT
0.149 GC
2 setlinecap
1 LJ
0.667 LW
N
885 169.6 M
877.42 169.6 L
S
GR
GS
[0.75 0 0 0.75 0 0.5] CT
0.149 GC
2 setlinecap
1 LJ
0.667 LW
N
885 108.8 M
877.42 108.8 L
S
GR
GS
[0.75 0 0 0.75 0 0.5] CT
0.149 GC
2 setlinecap
1 LJ
0.667 LW
N
885 48 M
877.42 48 L
S
GR
GS
[0.75 0 0 0.75 90.05 264.5] CT
0.149 GC
N
/f-1781641207{-5.417 5.589 M
-7.995 5.589 -8.917 3.464 QT
-9.839 1.339 -9.839 -1.583 QT
-9.839 -3.396 -9.51 -5.005 QT
-9.182 -6.614 -8.19 -7.739 QT
-7.198 -8.864 -5.417 -8.864 QT
-4.026 -8.864 -3.151 -8.193 QT
-2.276 -7.521 -1.807 -6.443 QT
-1.339 -5.364 -1.175 -4.146 QT
-1.01 -2.927 -1.01 -1.583 QT
-1.01 0.229 -1.339 1.8 QT
-1.667 3.37 -2.643 4.479 QT
-3.62 5.589 -5.417 5.589 QT
cp
-5.417 5.042 M
-4.245 5.042 -3.675 3.839 QT
-3.104 2.636 -2.971 1.182 QT
-2.839 -0.271 -2.839 -1.911 QT
-2.839 -3.489 -2.971 -4.825 QT
-3.104 -6.161 -3.675 -7.239 QT
-4.245 -8.318 -5.417 -8.318 QT
-6.604 -8.318 -7.182 -7.232 QT
-7.76 -6.146 -7.893 -4.818 QT
-8.026 -3.489 -8.026 -1.911 QT
-8.026 -0.739 -7.964 0.292 QT
-7.901 1.323 -7.659 2.425 QT
-7.417 3.526 -6.87 4.284 QT
-6.323 5.042 -5.417 5.042 QT
cp}def
f-1781641207
f
GR
GS
[0.75 0 0 0.75 90.05 218.90001] CT
0.149 GC
N
/f-2117570807{-22.009 5.589 M
-24.587 5.589 -25.509 3.464 QT
-26.431 1.339 -26.431 -1.583 QT
-26.431 -3.396 -26.103 -5.005 QT
-25.775 -6.614 -24.783 -7.739 QT
-23.791 -8.864 -22.009 -8.864 QT
-20.619 -8.864 -19.744 -8.193 QT
-18.869 -7.521 -18.4 -6.443 QT
-17.931 -5.364 -17.767 -4.146 QT
-17.603 -2.927 -17.603 -1.583 QT
-17.603 0.229 -17.931 1.8 QT
-18.259 3.37 -19.236 4.479 QT
-20.212 5.589 -22.009 5.589 QT
cp
-22.009 5.042 M
-20.837 5.042 -20.267 3.839 QT
-19.697 2.636 -19.564 1.182 QT
-19.431 -0.271 -19.431 -1.911 QT
-19.431 -3.489 -19.564 -4.825 QT
-19.697 -6.161 -20.267 -7.239 QT
-20.837 -8.318 -22.009 -8.318 QT
-23.197 -8.318 -23.775 -7.232 QT
-24.353 -6.146 -24.486 -4.818 QT
-24.619 -3.489 -24.619 -1.911 QT
-24.619 -0.739 -24.556 0.292 QT
-24.494 1.323 -24.252 2.425 QT
-24.009 3.526 -23.462 4.284 QT
-22.916 5.042 -22.009 5.042 QT
cp}def
f-2117570807
f
GR
GS
[0.75 0 0 0.75 90.05 218.90001] CT
0.149 GC
N
/f-1691089683{-14.827 3.964 M
-14.827 3.495 -14.475 3.151 QT
-14.124 2.807 -13.671 2.807 QT
-13.39 2.807 -13.108 2.964 QT
-12.827 3.12 -12.671 3.393 QT
-12.515 3.667 -12.515 3.964 QT
-12.515 4.417 -12.858 4.768 QT
-13.202 5.12 -13.671 5.12 QT
-14.124 5.12 -14.475 4.768 QT
-14.827 4.417 -14.827 3.964 QT
cp}def
f-1691089683
f
GR
GS
[0.75 0 0 0.75 90.05 218.90001] CT
0.149 GC
N
/f332566649{-9.62 5.12 M
-9.62 4.557 L
-9.62 4.511 -9.573 4.448 QT
-6.323 0.839 L
-5.573 0.026 -5.112 -0.513 QT
-4.651 -1.052 -4.206 -1.763 QT
-3.76 -2.474 -3.495 -3.2 QT
-3.229 -3.927 -3.229 -4.755 QT
-3.229 -5.614 -3.55 -6.404 QT
-3.87 -7.193 -4.503 -7.661 QT
-5.135 -8.13 -6.026 -8.13 QT
-6.932 -8.13 -7.659 -7.583 QT
-8.385 -7.036 -8.682 -6.161 QT
-8.604 -6.177 -8.464 -6.177 QT
-7.995 -6.177 -7.659 -5.864 QT
-7.323 -5.552 -7.323 -5.036 QT
-7.323 -4.568 -7.659 -4.232 QT
-7.995 -3.896 -8.464 -3.896 QT
-8.948 -3.896 -9.284 -4.239 QT
-9.62 -4.583 -9.62 -5.036 QT
-9.62 -5.833 -9.323 -6.521 QT
-9.026 -7.208 -8.464 -7.747 QT
-7.901 -8.286 -7.206 -8.575 QT
-6.51 -8.864 -5.714 -8.864 QT
-4.51 -8.864 -3.479 -8.357 QT
-2.448 -7.849 -1.839 -6.919 QT
-1.229 -5.989 -1.229 -4.755 QT
-1.229 -3.849 -1.628 -3.029 QT
-2.026 -2.208 -2.651 -1.536 QT
-3.276 -0.864 -4.253 -0.013 QT
-5.229 0.839 -5.542 1.136 QT
-7.917 3.417 L
-5.901 3.417 L
-4.417 3.417 -3.417 3.393 QT
-2.417 3.37 -2.354 3.307 QT
-2.104 3.042 -1.854 1.37 QT
-1.229 1.37 L
-1.823 5.12 L
-9.62 5.12 L
cp}def
f332566649
f
GR
GS
[0.75 0 0 0.75 90.05 173.3] CT
0.149 GC
N
f-2117570807
f
GR
GS
[0.75 0 0 0.75 90.05 173.3] CT
0.149 GC
N
f-1691089683
f
GR
GS
[0.75 0 0 0.75 90.05 173.3] CT
0.149 GC
N
/f-1264211284{-10.089 1.651 M
-10.089 0.917 L
-3.589 -8.771 L
-3.526 -8.864 -3.37 -8.864 QT
-3.073 -8.864 L
-2.839 -8.864 -2.839 -8.63 QT
-2.839 0.917 L
-0.776 0.917 L
-0.776 1.651 L
-2.839 1.651 L
-2.839 3.714 L
-2.839 4.151 -2.221 4.268 QT
-1.604 4.386 -0.792 4.386 QT
-0.792 5.12 L
-6.573 5.12 L
-6.573 4.386 L
-5.76 4.386 -5.151 4.268 QT
-4.542 4.151 -4.542 3.714 QT
-4.542 1.651 L
-10.089 1.651 L
cp
-9.385 0.917 M
-4.417 0.917 L
-4.417 -6.521 L
-9.385 0.917 L
cp}def
f-1264211284
f
GR
GS
[0.75 0 0 0.75 90.05 127.69999] CT
0.149 GC
N
f-2117570807
f
GR
GS
[0.75 0 0 0.75 90.05 127.69999] CT
0.149 GC
N
f-1691089683
f
GR
GS
[0.75 0 0 0.75 90.05 127.69999] CT
0.149 GC
N
/f1443657103{-5.417 5.589 M
-6.714 5.589 -7.589 4.893 QT
-8.464 4.198 -8.94 3.096 QT
-9.417 1.995 -9.604 0.784 QT
-9.792 -0.427 -9.792 -1.661 QT
-9.792 -3.333 -9.143 -5.005 QT
-8.495 -6.677 -7.237 -7.771 QT
-5.979 -8.864 -4.26 -8.864 QT
-3.542 -8.864 -2.917 -8.591 QT
-2.292 -8.318 -1.94 -7.794 QT
-1.589 -7.271 -1.589 -6.521 QT
-1.589 -6.083 -1.885 -5.794 QT
-2.182 -5.505 -2.604 -5.505 QT
-3.01 -5.505 -3.307 -5.802 QT
-3.604 -6.099 -3.604 -6.521 QT
-3.604 -6.927 -3.307 -7.224 QT
-3.01 -7.521 -2.604 -7.521 QT
-2.495 -7.521 L
-2.76 -7.896 -3.245 -8.075 QT
-3.729 -8.255 -4.26 -8.255 QT
-4.901 -8.255 -5.432 -7.982 QT
-5.964 -7.708 -6.401 -7.239 QT
-6.839 -6.771 -7.12 -6.2 QT
-7.401 -5.63 -7.565 -4.904 QT
-7.729 -4.177 -7.768 -3.536 QT
-7.807 -2.896 -7.807 -1.943 QT
-7.432 -2.802 -6.76 -3.349 QT
-6.089 -3.896 -5.229 -3.896 QT
-4.292 -3.896 -3.526 -3.513 QT
-2.76 -3.13 -2.206 -2.458 QT
-1.651 -1.786 -1.362 -0.927 QT
-1.073 -0.068 -1.073 0.807 QT
-1.073 2.042 -1.62 3.159 QT
-2.167 4.276 -3.159 4.932 QT
-4.151 5.589 -5.417 5.589 QT
cp
-5.417 4.917 M
-4.604 4.917 -4.112 4.55 QT
-3.62 4.182 -3.393 3.573 QT
-3.167 2.964 -3.104 2.339 QT
-3.042 1.714 -3.042 0.807 QT
-3.042 -0.38 -3.159 -1.216 QT
-3.276 -2.052 -3.776 -2.693 QT
-4.276 -3.333 -5.307 -3.333 QT
-6.167 -3.333 -6.714 -2.763 QT
-7.26 -2.193 -7.51 -1.318 QT
-7.76 -0.443 -7.76 0.37 QT
-7.76 0.651 -7.745 0.792 QT
-7.745 0.823 -7.753 0.846 QT
-7.76 0.87 -7.76 0.901 QT
-7.76 1.792 -7.581 2.714 QT
-7.401 3.636 -6.878 4.276 QT
-6.354 4.917 -5.417 4.917 QT
cp}def
f1443657103
f
GR
GS
[0.75 0 0 0.75 90.05 82.1] CT
0.149 GC
N
f-2117570807
f
GR
GS
[0.75 0 0 0.75 90.05 82.1] CT
0.149 GC
N
f-1691089683
f
GR
GS
[0.75 0 0 0.75 90.05 82.1] CT
0.149 GC
N
/f-671156145{-9.792 1.932 M
-9.792 0.667 -8.956 -0.302 QT
-8.12 -1.271 -6.823 -1.911 QT
-7.604 -2.411 L
-8.323 -2.896 -8.768 -3.677 QT
-9.214 -4.458 -9.214 -5.318 QT
-9.214 -6.318 -8.69 -7.13 QT
-8.167 -7.943 -7.292 -8.404 QT
-6.417 -8.864 -5.417 -8.864 QT
-4.479 -8.864 -3.612 -8.489 QT
-2.745 -8.114 -2.19 -7.404 QT
-1.635 -6.693 -1.635 -5.724 QT
-1.635 -5.005 -1.964 -4.404 QT
-2.292 -3.802 -2.878 -3.318 QT
-3.464 -2.833 -4.12 -2.505 QT
-2.917 -1.724 L
-2.089 -1.193 -1.581 -0.31 QT
-1.073 0.573 -1.073 1.557 QT
-1.073 2.682 -1.682 3.62 QT
-2.292 4.557 -3.292 5.073 QT
-4.292 5.589 -5.417 5.589 QT
-6.51 5.589 -7.518 5.143 QT
-8.526 4.698 -9.159 3.862 QT
-9.792 3.026 -9.792 1.932 QT
cp
-8.651 1.932 M
-8.651 2.761 -8.19 3.448 QT
-7.729 4.136 -6.979 4.526 QT
-6.229 4.917 -5.417 4.917 QT
-4.198 4.917 -3.206 4.206 QT
-2.214 3.495 -2.214 2.307 QT
-2.214 1.917 -2.37 1.518 QT
-2.526 1.12 -2.807 0.8 QT
-3.089 0.479 -3.432 0.276 QT
-6.26 -1.552 L
-6.917 -1.208 -7.464 -0.677 QT
-8.01 -0.146 -8.331 0.526 QT
-8.651 1.198 -8.651 1.932 QT
cp
-7.198 -4.474 M
-4.651 -2.833 L
-3.776 -3.349 -3.214 -4.075 QT
-2.651 -4.802 -2.651 -5.724 QT
-2.651 -6.427 -3.042 -7.013 QT
-3.432 -7.599 -4.073 -7.927 QT
-4.714 -8.255 -5.432 -8.255 QT
-6.073 -8.255 -6.721 -8.013 QT
-7.37 -7.771 -7.784 -7.286 QT
-8.198 -6.802 -8.198 -6.146 QT
-8.198 -5.161 -7.198 -4.474 QT
cp}def
f-671156145
f
GR
GS
[0.75 0 0 0.75 90.05 36.5] CT
0.149 GC
N
/f2067142573{-8.714 5.12 M
-8.714 4.386 L
-6.089 4.386 -6.089 3.714 QT
-6.089 -7.302 L
-7.182 -6.786 -8.839 -6.786 QT
-8.839 -7.521 L
-6.26 -7.521 -4.948 -8.864 QT
-4.651 -8.864 L
-4.589 -8.864 -4.518 -8.81 QT
-4.448 -8.755 -4.448 -8.677 QT
-4.448 3.714 L
-4.448 4.386 -1.823 4.386 QT
-1.823 5.12 L
-8.714 5.12 L
cp}def
f2067142573
f
GR
GS
[0 -0.75 0.75 0 66.6055 150.49989] CT
0.149 GC
N
/f-1993987278{-19.846 -10.901 M
-19.065 -9.901 -17.885 -9.323 QT
-16.706 -8.745 -15.44 -8.745 QT
-14.378 -8.745 -13.464 -9.167 QT
-12.549 -9.589 -11.87 -10.347 QT
-11.19 -11.104 -10.823 -12.057 QT
-10.456 -13.011 -10.456 -14.057 QT
-10.456 -14.245 -10.268 -14.245 QT
-9.987 -14.245 L
-9.799 -14.245 -9.799 -14.026 QT
-9.799 -12.823 -10.26 -11.706 QT
-10.721 -10.589 -11.565 -9.737 QT
-12.409 -8.886 -13.503 -8.417 QT
-14.596 -7.948 -15.784 -7.948 QT
-17.44 -7.948 -18.917 -8.612 QT
-20.393 -9.276 -21.487 -10.44 QT
-22.581 -11.604 -23.19 -13.128 QT
-23.799 -14.651 -23.799 -16.307 QT
-23.799 -17.964 -23.19 -19.487 QT
-22.581 -21.011 -21.487 -22.182 QT
-20.393 -23.354 -18.917 -24.011 QT
-17.44 -24.667 -15.784 -24.667 QT
-14.612 -24.667 -13.534 -24.151 QT
-12.456 -23.636 -11.643 -22.714 QT
-10.299 -24.604 L
-10.174 -24.667 -10.143 -24.667 QT
-9.987 -24.667 L
-9.909 -24.667 -9.854 -24.612 QT
-9.799 -24.557 -9.799 -24.479 QT
-9.799 -18.261 L
-9.799 -18.057 -9.987 -18.057 QT
-10.393 -18.057 L
-10.612 -18.057 -10.612 -18.261 QT
-10.612 -18.932 -10.878 -19.753 QT
-11.143 -20.573 -11.549 -21.307 QT
-11.956 -22.042 -12.503 -22.604 QT
-13.784 -23.854 -15.456 -23.854 QT
-16.737 -23.854 -17.893 -23.284 QT
-19.049 -22.714 -19.846 -21.698 QT
-20.69 -20.62 -21.018 -19.245 QT
-21.346 -17.87 -21.346 -16.307 QT
-21.346 -14.745 -21.018 -13.362 QT
-20.69 -11.979 -19.846 -10.901 QT
cp}def
f-1993987278
f
GR
GS
[0 -0.75 0.75 0 66.6055 150.49989] CT
0.149 GC
N
/f301356903{-7.383 -8.448 M
-7.383 -9.261 L
-5.008 -9.261 -5.008 -9.979 QT
-5.008 -22.62 L
-5.008 -23.354 -7.383 -23.354 QT
-7.383 -24.167 L
1.102 -24.167 L
2.664 -24.167 3.969 -23.487 QT
5.274 -22.807 6.196 -21.667 QT
7.117 -20.526 7.617 -19.089 QT
8.117 -17.651 8.117 -16.151 QT
8.117 -14.698 7.61 -13.323 QT
7.102 -11.948 6.157 -10.839 QT
5.211 -9.729 3.914 -9.089 QT
2.617 -8.448 1.102 -8.448 QT
-7.383 -8.448 L
cp
-2.945 -9.979 M
-2.945 -9.495 -2.664 -9.378 QT
-2.383 -9.261 -1.773 -9.261 QT
0.492 -9.261 L
1.68 -9.261 2.742 -9.768 QT
3.805 -10.276 4.492 -11.182 QT
5.227 -12.151 5.477 -13.347 QT
5.727 -14.542 5.727 -16.151 QT
5.727 -17.823 5.477 -19.081 QT
5.227 -20.339 4.492 -21.323 QT
3.805 -22.307 2.75 -22.831 QT
1.696 -23.354 0.492 -23.354 QT
-1.773 -23.354 L
-2.195 -23.354 -2.429 -23.315 QT
-2.664 -23.276 -2.804 -23.12 QT
-2.945 -22.964 -2.945 -22.62 QT
-2.945 -9.979 L
cp}def
f301356903
f
GR
GS
[0 -0.75 0.75 0 66.6055 150.49989] CT
0.149 GC
N
/f-337023504{10.481 -8.448 M
10.481 -9.261 L
12.856 -9.261 12.856 -9.979 QT
12.856 -22.62 L
12.856 -23.354 10.481 -23.354 QT
10.481 -24.167 L
23.168 -24.167 L
23.809 -18.886 L
23.137 -18.886 L
22.981 -20.339 22.715 -21.175 QT
22.45 -22.011 21.95 -22.487 QT
21.45 -22.964 20.598 -23.159 QT
19.747 -23.354 18.262 -23.354 QT
16.168 -23.354 L
15.747 -23.354 15.52 -23.315 QT
15.293 -23.276 15.145 -23.12 QT
14.997 -22.964 14.997 -22.62 QT
14.997 -16.698 L
16.622 -16.698 L
17.809 -16.698 18.356 -16.909 QT
18.903 -17.12 19.114 -17.667 QT
19.325 -18.214 19.325 -19.401 QT
19.981 -19.401 L
19.981 -13.214 L
19.325 -13.214 L
19.325 -14.386 19.114 -14.94 QT
18.903 -15.495 18.356 -15.698 QT
17.809 -15.901 16.622 -15.901 QT
14.997 -15.901 L
14.997 -9.979 L
14.997 -9.261 17.95 -9.261 QT
17.95 -8.448 L
10.481 -8.448 L
cp}def
f-337023504
f
GR
GS
[0.75 0 0 0.75 0 0.5] CT
1 LJ
2.667 LW
N
130.126 352 M
130.126 351.257 L
139.365 351.257 L
139.365 350.513 L
141.231 350.513 L
141.231 349.77 L
144.656 349.77 L
144.656 349.027 L
145.286 349.027 L
145.286 348.284 L
146.837 348.284 L
146.837 347.54 L
146.946 347.54 L
146.946 346.797 L
147.672 346.797 L
147.672 346.054 L
150.05 346.054 L
150.05 345.311 L
151.499 345.311 L
151.499 344.567 L
152.345 344.567 L
152.345 343.824 L
152.916 343.824 L
152.916 343.081 L
153.14 343.081 L
153.14 342.337 L
153.399 342.337 L
153.399 341.594 L
153.631 341.594 L
153.631 340.851 L
154.217 340.851 L
154.217 340.108 L
154.94 340.108 L
154.94 339.364 L
155.695 339.364 L
155.695 338.621 L
155.703 338.621 L
155.703 337.878 L
155.823 337.878 L
155.823 337.134 L
155.929 337.134 L
155.929 336.391 L
156.77 336.391 L
156.77 335.648 L
157.239 335.648 L
157.239 334.905 L
157.976 334.905 L
157.976 334.161 L
158.348 334.161 L
158.348 333.418 L
158.42 333.418 L
158.42 332.675 L
159.269 332.675 L
159.269 331.932 L
159.374 331.932 L
159.374 331.188 L
159.998 331.188 L
159.998 330.445 L
160.065 330.445 L
160.065 329.702 L
160.281 329.702 L
160.281 328.958 L
160.325 328.958 L
160.325 328.215 L
161.585 328.215 L
161.585 327.472 L
162.071 327.472 L
162.071 326.729 L
165.322 326.729 L
165.322 325.985 L
166.374 325.985 L
166.374 325.242 L
166.528 325.242 L
166.528 324.499 L
167.188 324.499 L
167.188 323.755 L
167.792 323.755 L
167.792 323.012 L
167.994 323.012 L
167.994 322.269 L
167.998 322.269 L
167.998 321.526 L
168.137 321.526 L
168.137 320.782 L
168.254 320.782 L
168.254 320.039 L
168.594 320.039 L
168.594 319.296 L
169.022 319.296 L
169.022 318.553 L
170.284 318.553 L
170.284 317.809 L
170.376 317.809 L
170.376 317.066 L
170.933 317.066 L
170.933 316.323 L
171.551 316.323 L
171.551 315.579 L
172.206 315.579 L
172.206 314.836 L
172.319 314.836 L
172.319 314.093 L
172.992 314.093 L
172.992 313.35 L
173.902 313.35 L
173.902 312.606 L
174.141 312.606 L
174.141 311.863 L
174.483 311.863 L
174.483 311.12 L
175.259 311.12 L
175.259 310.377 L
175.81 310.377 L
175.81 309.633 L
175.849 309.633 L
175.849 308.89 L
176.845 308.89 L
176.845 308.147 L
177.768 308.147 L
177.768 307.403 L
177.84 307.403 L
177.84 306.66 L
178.055 306.66 L
178.055 305.917 L
178.846 305.917 L
178.846 305.174 L
180.511 305.174 L
180.511 304.43 L
181.525 304.43 L
181.525 303.687 L
181.556 303.687 L
181.556 302.944 L
182.425 302.944 L
182.425 302.201 L
182.741 302.201 L
182.741 301.457 L
183.238 301.457 L
183.238 300.714 L
184.173 300.714 L
184.173 299.971 L
185.604 299.971 L
185.604 299.227 L
186.52 299.227 L
186.52 298.484 L
187.372 298.484 L
187.372 297.741 L
187.496 297.741 L
187.496 296.998 L
187.684 296.998 L
187.684 296.254 L
188.599 296.254 L
188.599 295.511 L
189.212 295.511 L
189.212 294.768 L
189.474 294.768 L
189.474 294.024 L
189.864 294.024 L
189.864 293.281 L
189.896 293.281 L
189.896 292.538 L
190.491 292.538 L
190.491 291.795 L
191.378 291.795 L
191.378 291.051 L
191.763 291.051 L
191.763 290.308 L
192.353 290.308 L
192.353 289.565 L
193.4 289.565 L
193.4 288.822 L
193.9 288.822 L
193.9 288.078 L
194.4 288.078 L
194.4 287.335 L
194.425 287.335 L
194.425 286.592 L
194.475 286.592 L
194.475 285.848 L
194.479 285.848 L
194.479 285.105 L
195.467 285.105 L
195.467 284.362 L
195.61 284.362 L
195.61 283.619 L
195.756 283.619 L
195.756 282.875 L
196.103 282.875 L
196.103 282.132 L
196.146 282.132 L
196.146 281.389 L
196.446 281.389 L
196.446 280.645 L
197.612 280.645 L
197.612 279.902 L
197.65 279.902 L
197.65 279.159 L
198.057 279.159 L
198.057 278.416 L
198.223 278.416 L
198.223 277.672 L
198.276 277.672 L
198.276 276.929 L
199.828 276.929 L
199.828 276.186 L
200.025 276.186 L
200.025 275.443 L
200.41 275.443 L
200.41 274.699 L
202.182 274.699 L
202.182 273.956 L
202.265 273.956 L
202.265 273.213 L
202.62 273.213 L
202.62 272.469 L
202.646 272.469 L
202.646 271.726 L
202.719 271.726 L
202.719 270.983 L
203.611 270.983 L
203.611 270.24 L
204.056 270.24 L
204.056 269.496 L
204.491 269.496 L
204.491 268.753 L
204.565 268.753 L
204.565 268.01 L
206.397 268.01 L
206.397 267.267 L
206.419 267.267 L
206.419 266.523 L
207.417 266.523 L
207.417 265.78 L
207.462 265.78 L
207.462 265.037 L
207.577 265.037 L
207.577 264.293 L
208.14 264.293 L
208.14 263.55 L
209.351 263.55 L
209.351 262.807 L
209.518 262.807 L
209.518 262.064 L
210.308 262.064 L
210.308 261.32 L
210.318 261.32 L
210.318 260.577 L
211.11 260.577 L
211.11 259.834 L
212.99 259.834 L
212.99 259.09 L
213.341 259.09 L
213.341 258.347 L
213.552 258.347 L
213.552 257.604 L
214.021 257.604 L
214.021 256.861 L
215.183 256.861 L
215.183 256.117 L
216.878 256.117 L
216.878 255.374 L
216.911 255.374 L
216.911 254.631 L
216.971 254.631 L
216.971 253.888 L
217.534 253.888 L
217.534 253.144 L
218.005 253.144 L
218.005 252.401 L
218.414 252.401 L
218.414 251.658 L
218.957 251.658 L
218.957 250.914 L
219.451 250.914 L
219.451 250.171 L
221.573 250.171 L
221.573 249.428 L
221.647 249.428 L
221.647 248.685 L
221.859 248.685 L
221.859 247.941 L
222.062 247.941 L
222.062 247.198 L
223.477 247.198 L
223.477 246.455 L
223.568 246.455 L
223.568 245.711 L
223.694 245.711 L
223.694 244.968 L
223.734 244.968 L
223.734 244.225 L
224.775 244.225 L
224.775 243.482 L
225.313 243.482 L
225.313 242.738 L
225.365 242.738 L
225.365 241.995 L
225.562 241.995 L
225.562 241.252 L
225.669 241.252 L
225.669 240.509 L
231.36 240.509 L
231.36 239.765 L
231.622 239.765 L
231.622 239.022 L
231.942 239.022 L
231.942 238.279 L
232.058 238.279 L
232.058 237.535 L
233.017 237.535 L
233.017 236.792 L
235.085 236.792 L
235.085 236.049 L
235.933 236.049 L
235.933 235.306 L
238.985 235.306 L
238.985 234.562 L
239.317 234.562 L
239.317 233.819 L
239.62 233.819 L
239.62 233.076 L
239.66 233.076 L
239.66 232.333 L
239.834 232.333 L
239.834 231.589 L
240.451 231.589 L
240.451 230.846 L
240.57 230.846 L
240.57 230.103 L
240.682 230.103 L
240.682 229.359 L
240.99 229.359 L
240.99 228.616 L
241.034 228.616 L
241.034 227.873 L
241.164 227.873 L
241.164 227.13 L
241.234 227.13 L
241.234 226.386 L
241.337 226.386 L
241.337 225.643 L
241.928 225.643 L
241.928 224.9 L
243.129 224.9 L
243.129 224.156 L
243.455 224.156 L
243.455 223.413 L
244.7 223.413 L
244.7 222.67 L
244.735 222.67 L
244.735 221.927 L
245.961 221.927 L
245.961 221.183 L
246.978 221.183 L
246.978 220.44 L
247.589 220.44 L
247.589 219.697 L
248.184 219.697 L
248.184 218.954 L
249.045 218.954 L
249.045 218.21 L
252.846 218.21 L
252.846 217.467 L
253.828 217.467 L
253.828 216.724 L
257.179 216.724 L
257.179 215.98 L
257.276 215.98 L
257.276 215.237 L
259.888 215.237 L
259.888 214.494 L
259.983 214.494 L
259.983 213.751 L
263.435 213.751 L
263.435 213.007 L
263.475 213.007 L
263.475 212.264 L
263.683 212.264 L
263.683 211.521 L
263.934 211.521 L
263.934 210.778 L
264.083 210.778 L
264.083 210.034 L
264.304 210.034 L
264.304 209.291 L
264.611 209.291 L
264.611 208.548 L
266.581 208.548 L
266.581 207.804 L
267.255 207.804 L
267.255 207.061 L
267.48 207.061 L
267.48 206.318 L
268.54 206.318 L
268.54 205.575 L
268.969 205.575 L
268.969 204.831 L
270.042 204.831 L
270.042 204.088 L
270.822 204.088 L
270.822 203.345 L
271.904 203.345 L
271.904 202.601 L
273.893 202.601 L
273.893 201.858 L
274.126 201.858 L
274.126 201.115 L
275.289 201.115 L
275.289 200.372 L
275.424 200.372 L
275.424 199.628 L
276.58 199.628 L
276.58 198.885 L
277.812 198.885 L
277.812 198.142 L
277.938 198.142 L
277.938 197.399 L
278.127 197.399 L
278.127 196.655 L
278.956 196.655 L
278.956 195.912 L
279.911 195.912 L
279.911 195.169 L
280.194 195.169 L
280.194 194.425 L
282.088 194.425 L
282.088 193.682 L
282.242 193.682 L
282.242 192.939 L
282.279 192.939 L
282.279 192.196 L
282.865 192.196 L
282.865 191.452 L
285.813 191.452 L
285.813 190.709 L
286.074 190.709 L
286.074 189.966 L
287.097 189.966 L
287.097 189.223 L
287.304 189.223 L
287.304 188.479 L
287.518 188.479 L
287.518 187.736 L
287.638 187.736 L
287.638 186.993 L
287.794 186.993 L
287.794 186.249 L
288.347 186.249 L
288.347 185.506 L
288.399 185.506 L
288.399 184.763 L
289.077 184.763 L
289.077 184.02 L
289.832 184.02 L
289.832 183.276 L
291.266 183.276 L
291.266 182.533 L
292.301 182.533 L
292.301 181.79 L
293.168 181.79 L
293.168 181.046 L
294.173 181.046 L
294.173 180.303 L
294.614 180.303 L
294.614 179.56 L
296.447 179.56 L
296.447 178.817 L
296.782 178.817 L
296.782 178.073 L
297.617 178.073 L
297.617 177.33 L
298.871 177.33 L
298.871 176.587 L
299.105 176.587 L
299.105 175.844 L
300.549 175.844 L
300.549 175.1 L
300.846 175.1 L
300.846 174.357 L
302.517 174.357 L
302.517 173.614 L
302.811 173.614 L
302.811 172.87 L
303.262 172.87 L
303.262 172.127 L
304.719 172.127 L
304.719 171.384 L
304.874 171.384 L
304.874 170.641 L
306.657 170.641 L
306.657 169.897 L
307.579 169.897 L
307.579 169.154 L
307.759 169.154 L
307.759 168.411 L
307.928 168.411 L
307.928 167.667 L
307.947 167.667 L
307.947 166.924 L
308.089 166.924 L
308.089 166.181 L
308.244 166.181 L
308.244 165.438 L
309.03 165.438 L
309.03 164.694 L
309.329 164.694 L
309.329 163.951 L
310.113 163.951 L
310.113 163.208 L
310.45 163.208 L
310.45 162.465 L
311.245 162.465 L
311.245 161.721 L
312.896 161.721 L
312.896 160.978 L
312.91 160.978 L
312.91 160.235 L
313.32 160.235 L
313.32 159.491 L
313.612 159.491 L
313.612 158.748 L
315.185 158.748 L
315.185 158.005 L
316.214 158.005 L
316.214 157.262 L
316.534 157.262 L
316.534 156.518 L
317.377 156.518 L
317.377 155.775 L
317.708 155.775 L
317.708 155.032 L
318.578 155.032 L
318.578 154.289 L
318.763 154.289 L
318.763 153.545 L
319.256 153.545 L
319.256 152.802 L
320.819 152.802 L
320.819 152.059 L
321.644 152.059 L
321.644 151.315 L
322.034 151.315 L
322.034 150.572 L
322.408 150.572 L
322.408 149.829 L
323.375 149.829 L
323.375 149.086 L
326.244 149.086 L
326.244 148.342 L
326.383 148.342 L
326.383 147.599 L
328.421 147.599 L
328.421 146.856 L
329.114 146.856 L
329.114 146.112 L
329.514 146.112 L
329.514 145.369 L
330.034 145.369 L
330.034 144.626 L
330.718 144.626 L
330.718 143.883 L
331.742 143.883 L
331.742 143.139 L
332.514 143.139 L
332.514 142.396 L
333.602 142.396 L
333.602 141.653 L
334.425 141.653 L
334.425 140.91 L
335.411 140.91 L
335.411 140.166 L
335.822 140.166 L
335.822 139.423 L
336.147 139.423 L
336.147 138.68 L
339.802 138.68 L
339.802 137.936 L
341.011 137.936 L
341.011 137.193 L
342.12 137.193 L
342.12 136.45 L
342.137 136.45 L
342.137 135.707 L
342.452 135.707 L
342.452 134.963 L
343.516 134.963 L
343.516 134.22 L
345.321 134.22 L
345.321 133.477 L
345.42 133.477 L
345.42 132.733 L
347.379 132.733 L
347.379 131.99 L
347.759 131.99 L
347.759 131.247 L
347.874 131.247 L
347.874 130.504 L
350.345 130.504 L
350.345 129.76 L
350.519 129.76 L
350.519 129.017 L
353.218 129.017 L
353.218 128.274 L
354.152 128.274 L
354.152 127.531 L
355.135 127.531 L
355.135 126.787 L
355.227 126.787 L
355.227 126.044 L
358.64 126.044 L
358.64 125.301 L
359.065 125.301 L
359.065 124.557 L
360.877 124.557 L
360.877 123.814 L
361.697 123.814 L
361.697 123.071 L
362.745 123.071 L
362.745 122.328 L
363.991 122.328 L
363.991 121.584 L
364.642 121.584 L
364.642 120.841 L
365.135 120.841 L
365.135 120.098 L
365.59 120.098 L
365.59 119.355 L
365.788 119.355 L
365.788 118.611 L
368.219 118.611 L
368.219 117.868 L
368.558 117.868 L
368.558 117.125 L
369.154 117.125 L
369.154 116.381 L
369.867 116.381 L
369.867 115.638 L
374.121 115.638 L
374.121 114.895 L
374.617 114.895 L
374.617 114.152 L
377.986 114.152 L
377.986 113.408 L
379.26 113.408 L
379.26 112.665 L
380.011 112.665 L
380.011 111.922 L
382.58 111.922 L
382.58 111.178 L
384.067 111.178 L
384.067 110.435 L
385.024 110.435 L
385.024 109.692 L
385.545 109.692 L
385.545 108.949 L
385.725 108.949 L
385.725 108.205 L
387.845 108.205 L
387.845 107.462 L
387.907 107.462 L
387.907 106.719 L
387.945 106.719 L
387.945 105.976 L
389.725 105.976 L
389.725 105.232 L
390.141 105.232 L
390.141 104.489 L
390.867 104.489 L
390.867 103.746 L
391.239 103.746 L
391.239 103.002 L
392.025 103.002 L
392.025 102.259 L
400.201 102.259 L
400.201 101.516 L
401.805 101.516 L
401.805 100.773 L
409.568 100.773 L
409.568 100.029 L
410.71 100.029 L
410.71 99.286 L
412.238 99.286 L
412.238 98.543 L
412.734 98.543 L
412.734 97.8 L
412.853 97.8 L
412.853 97.056 L
413.35 97.056 L
413.35 96.313 L
413.372 96.313 L
413.372 95.57 L
415.594 95.57 L
415.594 94.826 L
416.018 94.826 L
416.018 94.083 L
418.766 94.083 L
418.766 93.34 L
424.749 93.34 L
424.749 92.597 L
427.644 92.597 L
427.644 91.853 L
428.086 91.853 L
428.086 91.11 L
428.76 91.11 L
428.76 90.367 L
431.199 90.367 L
431.199 89.623 L
431.337 89.623 L
431.337 88.88 L
431.584 88.88 L
431.584 88.137 L
432.38 88.137 L
432.38 87.394 L
432.481 87.394 L
432.481 86.65 L
433.679 86.65 L
433.679 85.907 L
437.714 85.907 L
437.714 85.164 L
438.768 85.164 L
438.768 84.421 L
443.497 84.421 L
443.497 83.677 L
443.549 83.677 L
443.549 82.934 L
446.023 82.934 L
446.023 82.191 L
447.472 82.191 L
447.472 81.447 L
447.65 81.447 L
447.65 80.704 L
447.983 80.704 L
447.983 79.961 L
450.366 79.961 L
450.366 79.218 L
452.256 79.218 L
452.256 78.474 L
453.027 78.474 L
453.027 77.731 L
453.828 77.731 L
453.828 76.988 L
457.384 76.988 L
457.384 76.244 L
459.71 76.244 L
459.71 75.501 L
462.305 75.501 L
462.305 74.758 L
465.772 74.758 L
465.772 74.015 L
475.581 74.015 L
475.581 73.271 L
476.225 73.271 L
476.225 72.528 L
482.09 72.528 L
482.09 71.785 L
482.496 71.785 L
482.496 71.042 L
484.288 71.042 L
484.288 70.298 L
487.321 70.298 L
487.321 69.555 L
491.527 69.555 L
491.527 68.812 L
495.326 68.812 L
495.326 68.068 L
500.817 68.068 L
500.817 67.325 L
506.682 67.325 L
506.682 66.582 L
512.885 66.582 L
512.885 65.839 L
519.611 65.839 L
519.611 65.095 L
520.517 65.095 L
520.517 64.352 L
523.581 64.352 L
523.581 63.609 L
526.158 63.609 L
526.158 62.866 L
528.003 62.866 L
528.003 62.122 L
530.897 62.122 L
530.897 61.379 L
537.255 61.379 L
537.255 60.636 L
539.176 60.636 L
539.176 59.892 L
548.549 59.892 L
548.549 59.149 L
549.414 59.149 L
549.414 58.406 L
564.151 58.406 L
564.151 57.663 L
565.165 57.663 L
565.165 56.919 L
567.468 56.919 L
567.468 56.176 L
577.238 56.176 L
577.238 55.433 L
596.729 55.433 L
596.729 54.689 L
597.998 54.689 L
597.998 53.946 L
599.796 53.946 L
599.796 53.203 L
626.197 53.203 L
626.197 52.46 L
631.849 52.46 L
631.849 51.716 L
641.802 51.716 L
641.802 50.973 L
658.172 50.973 L
658.172 50.23 L
665.575 50.23 L
665.575 49.487 L
676.961 49.487 L
676.961 48.743 L
678.547 48.743 L
678.547 48 L
S
GR
GS
[0.75 0 0 0.75 0 0.5] CT
1 0 0 RC
1 LJ
2.667 LW
N
136.577 352 M
136.577 351.257 L
143.797 351.257 L
143.797 350.513 L
144.095 350.513 L
144.095 349.77 L
145.113 349.77 L
145.113 349.027 L
148.127 349.027 L
148.127 348.284 L
151.37 348.284 L
151.37 347.54 L
151.796 347.54 L
151.796 346.797 L
153.983 346.797 L
153.983 346.054 L
154.05 346.054 L
154.05 345.311 L
155.391 345.311 L
155.391 344.567 L
157.049 344.567 L
157.049 343.824 L
158.111 343.824 L
158.111 343.081 L
158.511 343.081 L
158.511 342.337 L
159.411 342.337 L
159.411 341.594 L
159.677 341.594 L
159.677 340.851 L
159.818 340.851 L
159.818 340.108 L
160.068 340.108 L
160.068 339.364 L
160.516 339.364 L
160.516 338.621 L
162.123 338.621 L
162.123 337.878 L
162.641 337.878 L
162.641 337.134 L
164.293 337.134 L
164.293 336.391 L
164.388 336.391 L
164.388 335.648 L
165.332 335.648 L
165.332 334.905 L
166.095 334.905 L
166.095 334.161 L
166.49 334.161 L
166.49 333.418 L
166.604 333.418 L
166.604 332.675 L
166.804 332.675 L
166.804 331.932 L
168.806 331.932 L
168.806 331.188 L
169.072 331.188 L
169.072 330.445 L
169.705 330.445 L
169.705 329.702 L
170.331 329.702 L
170.331 328.958 L
170.753 328.958 L
170.753 328.215 L
170.782 328.215 L
170.782 327.472 L
171.418 327.472 L
171.418 326.729 L
171.798 326.729 L
171.798 325.985 L
172.801 325.985 L
172.801 325.242 L
172.977 325.242 L
172.977 324.499 L
173.089 324.499 L
173.089 323.755 L
173.386 323.755 L
173.386 323.012 L
174.256 323.012 L
174.256 322.269 L
174.722 322.269 L
174.722 321.526 L
174.875 321.526 L
174.875 320.782 L
175.183 320.782 L
175.183 320.039 L
175.29 320.039 L
175.29 319.296 L
175.489 319.296 L
175.489 318.553 L
175.566 318.553 L
175.566 317.809 L
175.582 317.809 L
175.582 317.066 L
175.936 317.066 L
175.936 316.323 L
176.701 316.323 L
176.701 315.579 L
176.792 315.579 L
176.792 314.836 L
176.81 314.836 L
176.81 314.093 L
177.352 314.093 L
177.352 313.35 L
177.373 313.35 L
177.373 312.606 L
177.618 312.606 L
177.618 311.863 L
178.185 311.863 L
178.185 311.12 L
178.256 311.12 L
178.256 310.377 L
178.934 310.377 L
178.934 309.633 L
179.243 309.633 L
179.243 308.89 L
179.481 308.89 L
179.481 308.147 L
180.173 308.147 L
180.173 307.403 L
180.391 307.403 L
180.391 306.66 L
181.702 306.66 L
181.702 305.917 L
182.597 305.917 L
182.597 305.174 L
182.638 305.174 L
182.638 304.43 L
182.935 304.43 L
182.935 303.687 L
182.967 303.687 L
182.967 302.944 L
183.08 302.944 L
183.08 302.201 L
183.534 302.201 L
183.534 301.457 L
183.613 301.457 L
183.613 300.714 L
183.731 300.714 L
183.731 299.971 L
184.207 299.971 L
184.207 299.227 L
184.702 299.227 L
184.702 298.484 L
185.32 298.484 L
185.32 297.741 L
185.546 297.741 L
185.546 296.998 L
185.969 296.998 L
185.969 296.254 L
186.892 296.254 L
186.892 295.511 L
187.06 295.511 L
187.06 294.768 L
187.105 294.768 L
187.105 294.024 L
187.244 294.024 L
187.244 293.281 L
187.267 293.281 L
187.267 292.538 L
188.162 292.538 L
188.162 291.795 L
188.504 291.795 L
188.504 291.051 L
189.244 291.051 L
189.244 290.308 L
189.4 290.308 L
189.4 289.565 L
189.501 289.565 L
189.501 288.822 L
189.83 288.822 L
189.83 288.078 L
189.957 288.078 L
189.957 287.335 L
190.28 287.335 L
190.28 286.592 L
190.392 286.592 L
190.392 285.848 L
190.499 285.848 L
190.499 285.105 L
190.586 285.105 L
190.586 284.362 L
190.739 284.362 L
190.739 283.619 L
191.047 283.619 L
191.047 282.875 L
191.344 282.875 L
191.344 282.132 L
191.445 282.132 L
191.445 281.389 L
192.322 281.389 L
192.322 280.645 L
193.548 280.645 L
193.548 279.902 L
193.583 279.902 L
193.583 279.159 L
194.125 279.159 L
194.125 278.416 L
194.131 278.416 L
194.131 277.672 L
194.435 277.672 L
194.435 276.929 L
194.479 276.929 L
194.479 276.186 L
194.84 276.186 L
194.84 275.443 L
195.266 275.443 L
195.266 274.699 L
196.547 274.699 L
196.547 273.956 L
197.658 273.956 L
197.658 273.213 L
198.288 273.213 L
198.288 272.469 L
198.567 272.469 L
198.567 271.726 L
198.837 271.726 L
198.837 270.983 L
199.293 270.983 L
199.293 270.24 L
199.649 270.24 L
199.649 269.496 L
199.823 269.496 L
199.823 268.753 L
199.835 268.753 L
199.835 268.01 L
201.116 268.01 L
201.116 267.267 L
201.967 267.267 L
201.967 266.523 L
202.355 266.523 L
202.355 265.78 L
202.528 265.78 L
202.528 265.037 L
202.715 265.037 L
202.715 264.293 L
203.406 264.293 L
203.406 263.55 L
203.598 263.55 L
203.598 262.807 L
203.878 262.807 L
203.878 262.064 L
204.683 262.064 L
204.683 261.32 L
205.028 261.32 L
205.028 260.577 L
205.04 260.577 L
205.04 259.834 L
205.073 259.834 L
205.073 259.09 L
205.542 259.09 L
205.542 258.347 L
206.85 258.347 L
206.85 257.604 L
206.852 257.604 L
206.852 256.861 L
207.227 256.861 L
207.227 256.117 L
207.52 256.117 L
207.52 255.374 L
208.8 255.374 L
208.8 254.631 L
209.194 254.631 L
209.194 253.888 L
209.236 253.888 L
209.236 253.144 L
209.41 253.144 L
209.41 252.401 L
209.491 252.401 L
209.491 251.658 L
209.529 251.658 L
209.529 250.914 L
209.568 250.914 L
209.568 250.171 L
209.649 250.171 L
209.649 249.428 L
210.32 249.428 L
210.32 248.685 L
210.748 248.685 L
210.748 247.941 L
211.393 247.941 L
211.393 247.198 L
212.367 247.198 L
212.367 246.455 L
212.671 246.455 L
212.671 245.711 L
212.754 245.711 L
212.754 244.968 L
213.417 244.968 L
213.417 244.225 L
213.421 244.225 L
213.421 243.482 L
213.761 243.482 L
213.761 242.738 L
213.845 242.738 L
213.845 241.995 L
213.874 241.995 L
213.874 241.252 L
213.887 241.252 L
213.887 240.509 L
214.073 240.509 L
214.073 239.765 L
214.139 239.765 L
214.139 239.022 L
214.212 239.022 L
214.212 238.279 L
214.67 238.279 L
214.67 237.535 L
215.976 237.535 L
215.976 236.792 L
216.413 236.792 L
216.413 236.049 L
216.783 236.049 L
216.783 235.306 L
216.848 235.306 L
216.848 234.562 L
216.911 234.562 L
216.911 233.819 L
218.05 233.819 L
218.05 233.076 L
218.415 233.076 L
218.415 232.333 L
218.79 232.333 L
218.79 231.589 L
219.27 231.589 L
219.27 230.846 L
219.278 230.846 L
219.278 230.103 L
220.353 230.103 L
220.353 229.359 L
220.754 229.359 L
220.754 228.616 L
221.013 228.616 L
221.013 227.873 L
221.159 227.873 L
221.159 227.13 L
221.698 227.13 L
221.698 226.386 L
221.883 226.386 L
221.883 225.643 L
222.402 225.643 L
222.402 224.9 L
223.291 224.9 L
223.291 224.156 L
223.293 224.156 L
223.293 223.413 L
223.415 223.413 L
223.415 222.67 L
223.863 222.67 L
223.863 221.927 L
224.439 221.927 L
224.439 221.183 L
225.387 221.183 L
225.387 220.44 L
225.421 220.44 L
225.421 219.697 L
226.717 219.697 L
226.717 218.954 L
227.083 218.954 L
227.083 218.21 L
227.9 218.21 L
227.9 217.467 L
228.977 217.467 L
228.977 216.724 L
229.623 216.724 L
229.623 215.98 L
230.272 215.98 L
230.272 215.237 L
230.334 215.237 L
230.334 214.494 L
230.458 214.494 L
230.458 213.751 L
230.585 213.751 L
230.585 213.007 L
231.519 213.007 L
231.519 212.264 L
231.682 212.264 L
231.682 211.521 L
232.896 211.521 L
232.896 210.778 L
233.197 210.778 L
233.197 210.034 L
233.438 210.034 L
233.438 209.291 L
233.62 209.291 L
233.62 208.548 L
233.836 208.548 L
233.836 207.804 L
235.157 207.804 L
235.157 207.061 L
236.029 207.061 L
236.029 206.318 L
237.51 206.318 L
237.51 205.575 L
238.379 205.575 L
238.379 204.831 L
238.6 204.831 L
238.6 204.088 L
238.815 204.088 L
238.815 203.345 L
239.998 203.345 L
239.998 202.601 L
240.506 202.601 L
240.506 201.858 L
240.578 201.858 L
240.578 201.115 L
241.011 201.115 L
241.011 200.372 L
241.028 200.372 L
241.028 199.628 L
241.666 199.628 L
241.666 198.885 L
241.778 198.885 L
241.778 198.142 L
242.139 198.142 L
242.139 197.399 L
242.697 197.399 L
242.697 196.655 L
242.719 196.655 L
242.719 195.912 L
243.608 195.912 L
243.608 195.169 L
243.673 195.169 L
243.673 194.425 L
244.143 194.425 L
244.143 193.682 L
244.879 193.682 L
244.879 192.939 L
245.23 192.939 L
245.23 192.196 L
245.25 192.196 L
245.25 191.452 L
245.484 191.452 L
245.484 190.709 L
245.714 190.709 L
245.714 189.966 L
246.115 189.966 L
246.115 189.223 L
246.338 189.223 L
246.338 188.479 L
246.694 188.479 L
246.694 187.736 L
247.629 187.736 L
247.629 186.993 L
248.261 186.993 L
248.261 186.249 L
248.263 186.249 L
248.263 185.506 L
248.446 185.506 L
248.446 184.763 L
249.367 184.763 L
249.367 184.02 L
249.591 184.02 L
249.591 183.276 L
249.745 183.276 L
249.745 182.533 L
250.128 182.533 L
250.128 181.79 L
250.625 181.79 L
250.625 181.046 L
251.305 181.046 L
251.305 180.303 L
252.116 180.303 L
252.116 179.56 L
253.068 179.56 L
253.068 178.817 L
253.233 178.817 L
253.233 178.073 L
254.661 178.073 L
254.661 177.33 L
254.856 177.33 L
254.856 176.587 L
255.489 176.587 L
255.489 175.844 L
255.622 175.844 L
255.622 175.1 L
256.538 175.1 L
256.538 174.357 L
256.738 174.357 L
256.738 173.614 L
257.334 173.614 L
257.334 172.87 L
257.69 172.87 L
257.69 172.127 L
258.115 172.127 L
258.115 171.384 L
259.298 171.384 L
259.298 170.641 L
259.581 170.641 L
259.581 169.897 L
259.593 169.897 L
259.593 169.154 L
260.301 169.154 L
260.301 168.411 L
261.978 168.411 L
261.978 167.667 L
263.294 167.667 L
263.294 166.924 L
266.661 166.924 L
266.661 166.181 L
266.751 166.181 L
266.751 165.438 L
268.446 165.438 L
268.446 164.694 L
268.631 164.694 L
268.631 163.951 L
268.804 163.951 L
268.804 163.208 L
269.614 163.208 L
269.614 162.465 L
269.907 162.465 L
269.907 161.721 L
270.283 161.721 L
270.283 160.978 L
271.422 160.978 L
271.422 160.235 L
272.143 160.235 L
272.143 159.491 L
272.36 159.491 L
272.36 158.748 L
272.743 158.748 L
272.743 158.005 L
272.843 158.005 L
272.843 157.262 L
273.131 157.262 L
273.131 156.518 L
273.208 156.518 L
273.208 155.775 L
274.917 155.775 L
274.917 155.032 L
275.638 155.032 L
275.638 154.289 L
275.723 154.289 L
275.723 153.545 L
275.744 153.545 L
275.744 152.802 L
275.861 152.802 L
275.861 152.059 L
276.125 152.059 L
276.125 151.315 L
276.447 151.315 L
276.447 150.572 L
277.213 150.572 L
277.213 149.829 L
279.588 149.829 L
279.588 149.086 L
279.844 149.086 L
279.844 148.342 L
279.957 148.342 L
279.957 147.599 L
280.523 147.599 L
280.523 146.856 L
280.639 146.856 L
280.639 146.112 L
281.096 146.112 L
281.096 145.369 L
282.317 145.369 L
282.317 144.626 L
282.586 144.626 L
282.586 143.883 L
282.92 143.883 L
282.92 143.139 L
283.416 143.139 L
283.416 142.396 L
283.905 142.396 L
283.905 141.653 L
284.117 141.653 L
284.117 140.91 L
289.787 140.91 L
289.787 140.166 L
289.851 140.166 L
289.851 139.423 L
290.032 139.423 L
290.032 138.68 L
290.741 138.68 L
290.741 137.936 L
291.629 137.936 L
291.629 137.193 L
291.802 137.193 L
291.802 136.45 L
291.952 136.45 L
291.952 135.707 L
293.001 135.707 L
293.001 134.963 L
293.328 134.963 L
293.328 134.22 L
293.849 134.22 L
293.849 133.477 L
294.174 133.477 L
294.174 132.733 L
295.009 132.733 L
295.009 131.99 L
295.126 131.99 L
295.126 131.247 L
296.98 131.247 L
296.98 130.504 L
297.042 130.504 L
297.042 129.76 L
297.721 129.76 L
297.721 129.017 L
298.274 129.017 L
298.274 128.274 L
298.856 128.274 L
298.856 127.531 L
299.532 127.531 L
299.532 126.787 L
299.995 126.787 L
299.995 126.044 L
300.592 126.044 L
300.592 125.301 L
301.511 125.301 L
301.511 124.557 L
301.918 124.557 L
301.918 123.814 L
303.004 123.814 L
303.004 123.071 L
303.71 123.071 L
303.71 122.328 L
304.904 122.328 L
304.904 121.584 L
306.646 121.584 L
306.646 120.841 L
306.977 120.841 L
306.977 120.098 L
308.399 120.098 L
308.399 119.355 L
309.467 119.355 L
309.467 118.611 L
312.514 118.611 L
312.514 117.868 L
312.686 117.868 L
312.686 117.125 L
314.394 117.125 L
314.394 116.381 L
315.543 116.381 L
315.543 115.638 L
317.541 115.638 L
317.541 114.895 L
319.912 114.895 L
319.912 114.152 L
324.887 114.152 L
324.887 113.408 L
325.617 113.408 L
325.617 112.665 L
326.478 112.665 L
326.478 111.922 L
328.717 111.922 L
328.717 111.178 L
329.076 111.178 L
329.076 110.435 L
329.455 110.435 L
329.455 109.692 L
329.48 109.692 L
329.48 108.949 L
330.211 108.949 L
330.211 108.205 L
331.631 108.205 L
331.631 107.462 L
333.561 107.462 L
333.561 106.719 L
335.794 106.719 L
335.794 105.976 L
337.306 105.976 L
337.306 105.232 L
340.862 105.232 L
340.862 104.489 L
342.817 104.489 L
342.817 103.746 L
345.48 103.746 L
345.48 103.002 L
347.87 103.002 L
347.87 102.259 L
359.243 102.259 L
359.243 101.516 L
363.428 101.516 L
363.428 100.773 L
363.785 100.773 L
363.785 100.029 L
364.083 100.029 L
364.083 99.286 L
364.49 99.286 L
364.49 98.543 L
367.39 98.543 L
367.39 97.8 L
367.644 97.8 L
367.644 97.056 L
371.871 97.056 L
371.871 96.313 L
377.534 96.313 L
377.534 95.57 L
380.374 95.57 L
380.374 94.826 L
383.083 94.826 L
383.083 94.083 L
384.84 94.083 L
384.84 93.34 L
388.316 93.34 L
388.316 92.597 L
389.21 92.597 L
389.21 91.853 L
399.559 91.853 L
399.559 91.11 L
400.796 91.11 L
400.796 90.367 L
407.829 90.367 L
407.829 89.623 L
412.464 89.623 L
412.464 88.88 L
413.989 88.88 L
413.989 88.137 L
415.075 88.137 L
415.075 87.394 L
415.092 87.394 L
415.092 86.65 L
416.196 86.65 L
416.196 85.907 L
417.922 85.907 L
417.922 85.164 L
424.547 85.164 L
424.547 84.421 L
425.387 84.421 L
425.387 83.677 L
426.356 83.677 L
426.356 82.934 L
427.021 82.934 L
427.021 82.191 L
427.869 82.191 L
427.869 81.447 L
433.844 81.447 L
433.844 80.704 L
434.399 80.704 L
434.399 79.961 L
442.893 79.961 L
442.893 79.218 L
450.468 79.218 L
450.468 78.474 L
455.05 78.474 L
455.05 77.731 L
455.116 77.731 L
455.116 76.988 L
455.716 76.988 L
455.716 76.244 L
461.22 76.244 L
461.22 75.501 L
461.369 75.501 L
461.369 74.758 L
463.145 74.758 L
463.145 74.015 L
463.359 74.015 L
463.359 73.271 L
471.904 73.271 L
471.904 72.528 L
472.405 72.528 L
472.405 71.785 L
473.973 71.785 L
473.973 71.042 L
474.775 71.042 L
474.775 70.298 L
477.339 70.298 L
477.339 69.555 L
479.429 69.555 L
479.429 68.812 L
479.626 68.812 L
479.626 68.068 L
485.154 68.068 L
485.154 67.325 L
489.788 67.325 L
489.788 66.582 L
490.761 66.582 L
490.761 65.839 L
501.186 65.839 L
501.186 65.095 L
507.795 65.095 L
507.795 64.352 L
511.681 64.352 L
511.681 63.609 L
526.332 63.609 L
526.332 62.866 L
528.477 62.866 L
528.477 62.122 L
530.676 62.122 L
530.676 61.379 L
539.649 61.379 L
539.649 60.636 L
542.013 60.636 L
542.013 59.892 L
545.445 59.892 L
545.445 59.149 L
561.543 59.149 L
561.543 58.406 L
582.897 58.406 L
582.897 57.663 L
584.406 57.663 L
584.406 56.919 L
589.894 56.919 L
589.894 56.176 L
596.308 56.176 L
596.308 55.433 L
606.886 55.433 L
606.886 54.689 L
608.306 54.689 L
608.306 53.946 L
659.102 53.946 L
659.102 53.203 L
672.515 53.203 L
672.515 52.46 L
676.099 52.46 L
676.099 51.716 L
687.832 51.716 L
687.832 50.973 L
707.734 50.973 L
707.734 50.23 L
753.101 50.23 L
753.101 49.487 L
770.981 49.487 L
770.981 48.743 L
866.407 48.743 L
866.407 48 L
S
GR
GS
[0.75 0 0 0.75 0 0.5] CT
1 GC
N
874 341 M
874 286 L
755 286 L
755 341 L
cp
f
GR
GS
[0.75 0 0 0.75 601.5439 225.96051] CT
N
/f1816321008{0.641 5.12 M
0.641 4.386 L
2.813 4.386 2.813 3.714 QT
2.813 -7.818 L
2.813 -8.489 0.641 -8.489 QT
0.641 -9.224 L
7.453 -9.224 L
7.453 -8.489 L
4.766 -8.489 4.766 -7.818 QT
4.766 3.714 L
4.766 4.167 5.023 4.276 QT
5.281 4.386 5.828 4.386 QT
7.453 4.386 L
9.031 4.386 9.875 3.807 QT
10.719 3.229 11.078 2.245 QT
11.438 1.261 11.625 -0.38 QT
12.219 -0.38 L
11.641 5.12 L
0.641 5.12 L
cp}def
f1816321008
f
GR
GS
[0.75 0 0 0.75 601.5439 225.96051] CT
N
/f-1254475979{14.068 5.12 M
14.068 4.386 L
16.24 4.386 16.24 3.136 QT
16.24 -7.818 L
16.24 -8.489 14.068 -8.489 QT
14.068 -9.224 L
18.036 -9.224 L
18.302 -9.224 18.38 -8.989 QT
22.958 2.901 L
27.521 -8.989 L
27.615 -9.224 27.865 -9.224 QT
31.833 -9.224 L
31.833 -8.489 L
29.661 -8.489 29.661 -7.818 QT
29.661 3.714 L
29.661 4.386 31.833 4.386 QT
31.833 5.12 L
25.724 5.12 L
25.724 4.386 L
27.88 4.386 27.88 3.714 QT
27.88 -8.505 L
22.708 4.886 L
22.63 5.12 22.365 5.12 QT
22.099 5.12 22.005 4.886 QT
16.896 -8.349 L
16.896 3.136 L
16.896 4.386 19.068 4.386 QT
19.068 5.12 L
14.068 5.12 L
cp}def
f-1254475979
f
GR
GS
[0.75 0 0 0.75 601.5439 225.96051] CT
N
/f-1795888728{34.061 5.417 M
34.061 0.511 L
34.061 0.354 34.248 0.354 QT
34.514 0.354 L
34.576 0.354 34.623 0.401 QT
34.67 0.448 34.67 0.511 QT
34.67 2.573 35.951 3.706 QT
37.233 4.839 39.295 4.839 QT
40.03 4.839 40.647 4.417 QT
41.264 3.995 41.6 3.315 QT
41.936 2.636 41.936 1.917 QT
41.936 1.276 41.686 0.675 QT
41.436 0.073 40.951 -0.364 QT
40.467 -0.802 39.858 -0.958 QT
37.139 -1.614 L
35.78 -1.974 34.92 -3.091 QT
34.061 -4.208 34.061 -5.583 QT
34.061 -6.677 34.616 -7.63 QT
35.17 -8.583 36.108 -9.138 QT
37.045 -9.693 38.139 -9.693 QT
40.248 -9.693 41.483 -8.255 QT
42.342 -9.63 L
42.405 -9.693 42.483 -9.693 QT
42.623 -9.693 L
42.686 -9.693 42.748 -9.646 QT
42.811 -9.599 42.811 -9.505 QT
42.811 -4.646 L
42.811 -4.458 42.623 -4.458 QT
42.389 -4.458 L
42.186 -4.458 42.186 -4.646 QT
42.186 -5.177 42.006 -5.81 QT
41.826 -6.443 41.514 -7.029 QT
41.201 -7.614 40.826 -7.989 QT
39.811 -9.005 38.139 -9.005 QT
37.42 -9.005 36.819 -8.646 QT
36.217 -8.286 35.858 -7.661 QT
35.498 -7.036 35.498 -6.349 QT
35.498 -5.443 36.053 -4.708 QT
36.608 -3.974 37.514 -3.739 QT
40.248 -3.068 L
40.92 -2.911 41.522 -2.482 QT
42.123 -2.052 42.522 -1.489 QT
42.92 -0.927 43.147 -0.239 QT
43.373 0.448 43.373 1.198 QT
43.373 2.323 42.85 3.339 QT
42.326 4.354 41.373 4.971 QT
40.42 5.589 39.295 5.589 QT
38.608 5.589 37.873 5.432 QT
37.139 5.276 36.53 4.956 QT
35.92 4.636 35.405 4.136 QT
34.53 5.526 L
34.467 5.589 34.373 5.589 QT
34.248 5.589 L
34.061 5.589 34.061 5.417 QT
cp}def
f-1795888728
f
GR
GS
[0.75 0 0 0.75 0 0.5] CT
1 LJ
2.667 LW
N
759.005 300.614 M
799.055 300.614 L
S
GR
GS
[0.75 0 0 0.75 601.5439 245.28949] CT
N
/f-1753218115{0.641 5.12 M
0.641 4.386 L
2.813 4.386 2.813 3.714 QT
2.813 -7.818 L
2.813 -8.489 0.641 -8.489 QT
0.641 -9.224 L
6.938 -9.224 L
6.938 -8.489 L
4.766 -8.489 4.766 -7.818 QT
4.766 -2.708 L
10.969 -2.708 L
10.969 -7.818 L
10.969 -8.489 8.797 -8.489 QT
8.797 -9.224 L
15.078 -9.224 L
15.078 -8.489 L
12.922 -8.489 12.922 -7.818 QT
12.922 3.714 L
12.922 4.386 15.078 4.386 QT
15.078 5.12 L
8.797 5.12 L
8.797 4.386 L
10.969 4.386 10.969 3.714 QT
10.969 -1.974 L
4.766 -1.974 L
4.766 3.714 L
4.766 4.386 6.938 4.386 QT
6.938 5.12 L
0.641 5.12 L
cp}def
f-1753218115
f
GR
GS
[0.75 0 0 0.75 601.5439 245.28949] CT
N
/f1247936638{16.234 1.229 M
16.234 -0.068 L
21.797 -0.068 L
21.797 1.229 L
16.234 1.229 L
cp}def
f1247936638
f
GR
GS
[0.75 0 0 0.75 601.5439 245.28949] CT
N
/f-914098448{23.752 5.12 M
23.752 4.386 L
25.924 4.386 25.924 3.714 QT
25.924 -7.818 L
25.924 -8.489 23.752 -8.489 QT
23.752 -9.224 L
30.564 -9.224 L
30.564 -8.489 L
27.877 -8.489 27.877 -7.818 QT
27.877 3.714 L
27.877 4.167 28.135 4.276 QT
28.392 4.386 28.939 4.386 QT
30.564 4.386 L
32.142 4.386 32.986 3.807 QT
33.83 3.229 34.189 2.245 QT
34.549 1.261 34.736 -0.38 QT
35.33 -0.38 L
34.752 5.12 L
23.752 5.12 L
cp}def
f-914098448
f
GR
GS
[0.75 0 0 0.75 601.5439 245.28949] CT
N
/f116352523{37.179 5.12 M
37.179 4.386 L
39.351 4.386 39.351 3.136 QT
39.351 -7.818 L
39.351 -8.489 37.179 -8.489 QT
37.179 -9.224 L
41.148 -9.224 L
41.413 -9.224 41.491 -8.989 QT
46.069 2.901 L
50.632 -8.989 L
50.726 -9.224 50.976 -9.224 QT
54.944 -9.224 L
54.944 -8.489 L
52.773 -8.489 52.773 -7.818 QT
52.773 3.714 L
52.773 4.386 54.944 4.386 QT
54.944 5.12 L
48.835 5.12 L
48.835 4.386 L
50.991 4.386 50.991 3.714 QT
50.991 -8.505 L
45.819 4.886 L
45.741 5.12 45.476 5.12 QT
45.21 5.12 45.116 4.886 QT
40.007 -8.349 L
40.007 3.136 L
40.007 4.386 42.179 4.386 QT
42.179 5.12 L
37.179 5.12 L
cp}def
f116352523
f
GR
GS
[0.75 0 0 0.75 601.5439 245.28949] CT
N
/f1156609090{57.172 5.417 M
57.172 0.511 L
57.172 0.354 57.359 0.354 QT
57.625 0.354 L
57.688 0.354 57.734 0.401 QT
57.781 0.448 57.781 0.511 QT
57.781 2.573 59.063 3.706 QT
60.344 4.839 62.406 4.839 QT
63.141 4.839 63.758 4.417 QT
64.375 3.995 64.711 3.315 QT
65.047 2.636 65.047 1.917 QT
65.047 1.276 64.797 0.675 QT
64.547 0.073 64.063 -0.364 QT
63.578 -0.802 62.969 -0.958 QT
60.25 -1.614 L
58.891 -1.974 58.031 -3.091 QT
57.172 -4.208 57.172 -5.583 QT
57.172 -6.677 57.727 -7.63 QT
58.281 -8.583 59.219 -9.138 QT
60.156 -9.693 61.25 -9.693 QT
63.359 -9.693 64.594 -8.255 QT
65.453 -9.63 L
65.516 -9.693 65.594 -9.693 QT
65.734 -9.693 L
65.797 -9.693 65.859 -9.646 QT
65.922 -9.599 65.922 -9.505 QT
65.922 -4.646 L
65.922 -4.458 65.734 -4.458 QT
65.5 -4.458 L
65.297 -4.458 65.297 -4.646 QT
65.297 -5.177 65.117 -5.81 QT
64.938 -6.443 64.625 -7.029 QT
64.313 -7.614 63.938 -7.989 QT
62.922 -9.005 61.25 -9.005 QT
60.531 -9.005 59.93 -8.646 QT
59.328 -8.286 58.969 -7.661 QT
58.609 -7.036 58.609 -6.349 QT
58.609 -5.443 59.164 -4.708 QT
59.719 -3.974 60.625 -3.739 QT
63.359 -3.068 L
64.031 -2.911 64.633 -2.482 QT
65.234 -2.052 65.633 -1.489 QT
66.031 -0.927 66.258 -0.239 QT
66.484 0.448 66.484 1.198 QT
66.484 2.323 65.961 3.339 QT
65.438 4.354 64.484 4.971 QT
63.531 5.589 62.406 5.589 QT
61.719 5.589 60.984 5.432 QT
60.25 5.276 59.641 4.956 QT
59.031 4.636 58.516 4.136 QT
57.641 5.526 L
57.578 5.589 57.484 5.589 QT
57.359 5.589 L
57.172 5.589 57.172 5.417 QT
cp}def
f1156609090
f
GR
GS
[0.75 0 0 0.75 0 0.5] CT
1 0 0 RC
1 LJ
2.667 LW
N
759.005 326.386 M
799.055 326.386 L
S
GR
GS
[0.75 0 0 0.75 0 0.5] CT
0.149 GC
10.0 ML
0.667 LW
N
755 341 M
755 286 L
874 286 L
874 341 L
cp
S
GR
%%Trailer
%%Pages: 1
%%EOF
