%!PS-Adobe-3.0 EPSF-3.0
%%Creator: (MATLAB, The Mathworks, Inc. Version 9.5.0.944444 \(R2018b\). Operating System: Windows 10)
%%Title: (C:/Users/Alex/Documents/PhD Docs/01. GIT/my_phd_thesis/Chapter8/Figures/capsloc_res/02102019_pieCharts.eps)
%%CreationDate: 2019-10-10T14:37:39
%%Pages: (atend)
%%BoundingBox: 0 0 720 659
%%LanguageLevel: 3
%%EndComments
%%BeginProlog
%%BeginResource: procset (Apache XML Graphics Std ProcSet) 1.2 0
%%Version: 1.2 0
%%Copyright: (Copyright 2001-2003,2010 The Apache Software Foundation. License terms: http://www.apache.org/licenses/LICENSE-2.0)
/bd{bind def}bind def
/ld{load def}bd
/GR/grestore ld
/GS/gsave ld
/RM/rmoveto ld
/C/curveto ld
/t/show ld
/L/lineto ld
/ML/setmiterlimit ld
/CT/concat ld
/f/fill ld
/N/newpath ld
/S/stroke ld
/CC/setcmykcolor ld
/A/ashow ld
/cp/closepath ld
/RC/setrgbcolor ld
/LJ/setlinejoin ld
/GC/setgray ld
/LW/setlinewidth ld
/M/moveto ld
/re {4 2 roll M
1 index 0 rlineto
0 exch rlineto
neg 0 rlineto
cp } bd
/_ctm matrix def
/_tm matrix def
/BT { _ctm currentmatrix pop matrix _tm copy pop 0 0 moveto } bd
/ET { _ctm setmatrix } bd
/iTm { _ctm setmatrix _tm concat } bd
/Tm { _tm astore pop iTm 0 0 moveto } bd
/ux 0.0 def
/uy 0.0 def
/F {
  /Tp exch def
  /Tf exch def
  Tf findfont Tp scalefont setfont
  /cf Tf def  /cs Tp def
} bd
/ULS {currentpoint /uy exch def /ux exch def} bd
/ULE {
  /Tcx currentpoint pop def
  gsave
  newpath
  cf findfont cs scalefont dup
  /FontMatrix get 0 get /Ts exch def /FontInfo get dup
  /UnderlinePosition get Ts mul /To exch def
  /UnderlineThickness get Ts mul /Tt exch def
  ux uy To add moveto  Tcx uy To add lineto
  Tt setlinewidth stroke
  grestore
} bd
/OLE {
  /Tcx currentpoint pop def
  gsave
  newpath
  cf findfont cs scalefont dup
  /FontMatrix get 0 get /Ts exch def /FontInfo get dup
  /UnderlinePosition get Ts mul /To exch def
  /UnderlineThickness get Ts mul /Tt exch def
  ux uy To add cs add moveto Tcx uy To add cs add lineto
  Tt setlinewidth stroke
  grestore
} bd
/SOE {
  /Tcx currentpoint pop def
  gsave
  newpath
  cf findfont cs scalefont dup
  /FontMatrix get 0 get /Ts exch def /FontInfo get dup
  /UnderlinePosition get Ts mul /To exch def
  /UnderlineThickness get Ts mul /Tt exch def
  ux uy To add cs 10 mul 26 idiv add moveto Tcx uy To add cs 10 mul 26 idiv add lineto
  Tt setlinewidth stroke
  grestore
} bd
/QT {
/Y22 exch store
/X22 exch store
/Y21 exch store
/X21 exch store
currentpoint
/Y21 load 2 mul add 3 div exch
/X21 load 2 mul add 3 div exch
/X21 load 2 mul /X22 load add 3 div
/Y21 load 2 mul /Y22 load add 3 div
/X22 load /Y22 load curveto
} bd
/SSPD {
dup length /d exch dict def
{
/v exch def
/k exch def
currentpagedevice k known {
/cpdv currentpagedevice k get def
v cpdv ne {
/upd false def
/nullv v type /nulltype eq def
/nullcpdv cpdv type /nulltype eq def
nullv nullcpdv or
{
/upd true def
} {
/sametype v type cpdv type eq def
sametype {
v type /arraytype eq {
/vlen v length def
/cpdvlen cpdv length def
vlen cpdvlen eq {
0 1 vlen 1 sub {
/i exch def
/obj v i get def
/cpdobj cpdv i get def
obj cpdobj ne {
/upd true def
exit
} if
} for
} {
/upd true def
} ifelse
} {
v type /dicttype eq {
v {
/dv exch def
/dk exch def
/cpddv cpdv dk get def
dv cpddv ne {
/upd true def
exit
} if
} forall
} {
/upd true def
} ifelse
} ifelse
} if
} ifelse
upd true eq {
d k v put
} if
} if
} if
} forall
d length 0 gt {
d setpagedevice
} if
} bd
/RE { % /NewFontName [NewEncodingArray] /FontName RE -
  findfont dup length dict begin
  {
    1 index /FID ne
    {def} {pop pop} ifelse
  } forall
  /Encoding exch def
  /FontName 1 index def
  currentdict definefont pop
  end
} bind def
%%EndResource
%%BeginResource: procset (Apache XML Graphics EPS ProcSet) 1.0 0
%%Version: 1.0 0
%%Copyright: (Copyright 2002-2003 The Apache Software Foundation. License terms: http://www.apache.org/licenses/LICENSE-2.0)
/BeginEPSF { %def
/b4_Inc_state save def         % Save state for cleanup
/dict_count countdictstack def % Count objects on dict stack
/op_count count 1 sub def      % Count objects on operand stack
userdict begin                 % Push userdict on dict stack
/showpage { } def              % Redefine showpage, { } = null proc
0 setgray 0 setlinecap         % Prepare graphics state
1 setlinewidth 0 setlinejoin
10 setmiterlimit [ ] 0 setdash newpath
/languagelevel where           % If level not equal to 1 then
{pop languagelevel             % set strokeadjust and
1 ne                           % overprint to their defaults.
{false setstrokeadjust false setoverprint
} if
} if
} bd
/EndEPSF { %def
count op_count sub {pop} repeat            % Clean up stacks
countdictstack dict_count sub {end} repeat
b4_Inc_state restore
} bd
%%EndResource
%FOPBeginFontDict
%%IncludeResource: font Courier-Oblique
%%IncludeResource: font Courier-BoldOblique
%%IncludeResource: font Courier-Bold
%%IncludeResource: font ZapfDingbats
%%IncludeResource: font Symbol
%%IncludeResource: font Helvetica
%%IncludeResource: font Helvetica-Oblique
%%IncludeResource: font Helvetica-Bold
%%IncludeResource: font Helvetica-BoldOblique
%%IncludeResource: font Times-Roman
%%IncludeResource: font Times-Italic
%%IncludeResource: font Times-Bold
%%IncludeResource: font Times-BoldItalic
%%IncludeResource: font Courier
%FOPEndFontDict
%%BeginResource: encoding WinAnsiEncoding
/WinAnsiEncoding [
/.notdef /.notdef /.notdef /.notdef /.notdef
/.notdef /.notdef /.notdef /.notdef /.notdef
/.notdef /.notdef /.notdef /.notdef /.notdef
/.notdef /.notdef /.notdef /.notdef /.notdef
/.notdef /.notdef /.notdef /.notdef /.notdef
/.notdef /.notdef /.notdef /.notdef /.notdef
/.notdef /.notdef /space /exclam /quotedbl
/numbersign /dollar /percent /ampersand /quotesingle
/parenleft /parenright /asterisk /plus /comma
/hyphen /period /slash /zero /one
/two /three /four /five /six
/seven /eight /nine /colon /semicolon
/less /equal /greater /question /at
/A /B /C /D /E
/F /G /H /I /J
/K /L /M /N /O
/P /Q /R /S /T
/U /V /W /X /Y
/Z /bracketleft /backslash /bracketright /asciicircum
/underscore /quoteleft /a /b /c
/d /e /f /g /h
/i /j /k /l /m
/n /o /p /q /r
/s /t /u /v /w
/x /y /z /braceleft /bar
/braceright /asciitilde /bullet /Euro /bullet
/quotesinglbase /florin /quotedblbase /ellipsis /dagger
/daggerdbl /circumflex /perthousand /Scaron /guilsinglleft
/OE /bullet /Zcaron /bullet /bullet
/quoteleft /quoteright /quotedblleft /quotedblright /bullet
/endash /emdash /asciitilde /trademark /scaron
/guilsinglright /oe /bullet /zcaron /Ydieresis
/space /exclamdown /cent /sterling /currency
/yen /brokenbar /section /dieresis /copyright
/ordfeminine /guillemotleft /logicalnot /sfthyphen /registered
/macron /degree /plusminus /twosuperior /threesuperior
/acute /mu /paragraph /middot /cedilla
/onesuperior /ordmasculine /guillemotright /onequarter /onehalf
/threequarters /questiondown /Agrave /Aacute /Acircumflex
/Atilde /Adieresis /Aring /AE /Ccedilla
/Egrave /Eacute /Ecircumflex /Edieresis /Igrave
/Iacute /Icircumflex /Idieresis /Eth /Ntilde
/Ograve /Oacute /Ocircumflex /Otilde /Odieresis
/multiply /Oslash /Ugrave /Uacute /Ucircumflex
/Udieresis /Yacute /Thorn /germandbls /agrave
/aacute /acircumflex /atilde /adieresis /aring
/ae /ccedilla /egrave /eacute /ecircumflex
/edieresis /igrave /iacute /icircumflex /idieresis
/eth /ntilde /ograve /oacute /ocircumflex
/otilde /odieresis /divide /oslash /ugrave
/uacute /ucircumflex /udieresis /yacute /thorn
/ydieresis
] def
%%EndResource
%FOPBeginFontReencode
/Courier-Oblique findfont
dup length dict begin
  {1 index /FID ne {def} {pop pop} ifelse} forall
  /Encoding WinAnsiEncoding def
  currentdict
end
/Courier-Oblique exch definefont pop
/Courier-BoldOblique findfont
dup length dict begin
  {1 index /FID ne {def} {pop pop} ifelse} forall
  /Encoding WinAnsiEncoding def
  currentdict
end
/Courier-BoldOblique exch definefont pop
/Courier-Bold findfont
dup length dict begin
  {1 index /FID ne {def} {pop pop} ifelse} forall
  /Encoding WinAnsiEncoding def
  currentdict
end
/Courier-Bold exch definefont pop
/Helvetica findfont
dup length dict begin
  {1 index /FID ne {def} {pop pop} ifelse} forall
  /Encoding WinAnsiEncoding def
  currentdict
end
/Helvetica exch definefont pop
/Helvetica-Oblique findfont
dup length dict begin
  {1 index /FID ne {def} {pop pop} ifelse} forall
  /Encoding WinAnsiEncoding def
  currentdict
end
/Helvetica-Oblique exch definefont pop
/Helvetica-Bold findfont
dup length dict begin
  {1 index /FID ne {def} {pop pop} ifelse} forall
  /Encoding WinAnsiEncoding def
  currentdict
end
/Helvetica-Bold exch definefont pop
/Helvetica-BoldOblique findfont
dup length dict begin
  {1 index /FID ne {def} {pop pop} ifelse} forall
  /Encoding WinAnsiEncoding def
  currentdict
end
/Helvetica-BoldOblique exch definefont pop
/Times-Roman findfont
dup length dict begin
  {1 index /FID ne {def} {pop pop} ifelse} forall
  /Encoding WinAnsiEncoding def
  currentdict
end
/Times-Roman exch definefont pop
/Times-Italic findfont
dup length dict begin
  {1 index /FID ne {def} {pop pop} ifelse} forall
  /Encoding WinAnsiEncoding def
  currentdict
end
/Times-Italic exch definefont pop
/Times-Bold findfont
dup length dict begin
  {1 index /FID ne {def} {pop pop} ifelse} forall
  /Encoding WinAnsiEncoding def
  currentdict
end
/Times-Bold exch definefont pop
/Times-BoldItalic findfont
dup length dict begin
  {1 index /FID ne {def} {pop pop} ifelse} forall
  /Encoding WinAnsiEncoding def
  currentdict
end
/Times-BoldItalic exch definefont pop
/Courier findfont
dup length dict begin
  {1 index /FID ne {def} {pop pop} ifelse} forall
  /Encoding WinAnsiEncoding def
  currentdict
end
/Courier exch definefont pop
%FOPEndFontReencode
%%EndProlog
%%Page: 1 1
%%PageBoundingBox: 0 0 720 659
%%BeginPageSetup
[1 0 0 -1 0 659] CT
%%EndPageSetup
GS
[0.75 0 0 0.75 0 -0.25] CT
1 GC
N
0 0 960 879 re
f
GR
GS
[0.75 0 0 0.75 0 -0.25] CT
1 GC
N
0 0 960 879 re
f
GR
GS
[0.75 0 0 0.75 218.62521 52.43749] CT
/Helvetica-Bold 14.667 F
GS
[1 0 0 1 0 0] CT
-79 -4 moveto 
1 -1 scale
(ENU Profitability SM01) t 
GR
GR
GS
[0.75 0 0 0.75 0 -0.25] CT
0.302 0.749 0.929 RC
N
174.992 145.682 M
170.602 152.448 L
284.94 221.844 L
284.94 88.094 L
276.878 88.338 L
268.846 89.066 L
260.872 90.278 L
252.985 91.968 L
245.215 94.13 L
237.589 96.756 L
230.136 99.838 L
222.882 103.363 L
215.853 107.319 L
209.076 111.691 L
202.574 116.464 L
196.372 121.62 L
190.492 127.141 L
184.956 133.006 L
179.783 139.194 L
cp
f
GR
GS
[0.75 0 0 0.75 0 -0.25] CT
0.094 0.749 0.71 RC
N
207.06 337.225 M
213.682 342.282 L
220.607 346.916 L
227.806 351.11 L
235.253 354.848 L
242.918 358.115 L
250.771 360.898 L
258.783 363.187 L
266.921 364.972 L
275.155 366.248 L
283.453 367.008 L
291.781 367.25 L
300.109 366.973 L
308.403 366.178 L
316.631 364.868 L
324.762 363.048 L
332.764 360.726 L
340.606 357.909 L
348.257 354.61 L
355.688 350.841 L
362.87 346.617 L
369.775 341.953 L
376.376 336.869 L
382.647 331.384 L
388.565 325.519 L
394.106 319.296 L
399.25 312.741 L
403.974 305.878 L
408.263 298.734 L
412.098 291.337 L
415.465 283.716 L
418.352 275.9 L
420.746 267.919 L
422.638 259.805 L
424.021 251.588 L
424.89 243.301 L
425.242 234.977 L
425.074 226.646 L
291.5 233.5 L
177.162 164.104 L
173.063 171.358 L
169.423 178.853 L
166.257 186.56 L
163.578 194.449 L
161.394 202.49 L
159.716 210.652 L
158.549 218.902 L
157.898 227.208 L
157.766 235.539 L
158.152 243.862 L
159.056 252.145 L
160.474 260.356 L
162.4 268.462 L
164.828 276.433 L
167.747 284.237 L
171.146 291.844 L
175.013 299.225 L
179.331 306.35 L
184.085 313.193 L
189.255 319.727 L
194.823 325.926 L
200.765 331.766 L
cp
f
GR
GS
[0.75 0 0 0.75 0 -0.25] CT
0 0.451 0.741 RC
N
291.5 99.75 M
291.5 233.5 L
425.074 226.646 L
424.411 218.545 L
423.257 210.499 L
421.617 202.538 L
419.496 194.692 L
416.902 186.988 L
413.845 179.457 L
410.337 172.125 L
406.389 165.02 L
402.017 158.167 L
397.237 151.593 L
392.066 145.322 L
386.524 139.376 L
380.632 133.777 L
374.409 128.547 L
367.881 123.705 L
361.071 119.268 L
354.003 115.253 L
346.705 111.674 L
339.203 108.546 L
331.525 105.879 L
323.699 103.684 L
315.754 101.967 L
307.719 100.737 L
299.624 99.997 L
cp
f
GR
GS
[0.75 0 0 0.75 159.58302 69.97417] CT
/Helvetica 18.667 F
GS
[1 0 0 1 0 0] CT
-92 -5 moveto 
1 -1 scale
(Profit: 16%) t 
GR
GR
GS
[0.75 0 0 0.75 218.63342 220.36657] CT
1 GC
/Helvetica 18.667 F
GS
[1 0 0 1 0 0] CT
-60 19 moveto 
1 -1 scale
(Invariant: 59%) t 
GR
GR
GS
[0.75 0 0 0.75 294.62446 94.87608] CT
/Helvetica 18.667 F
GS
[1 0 0 1 0 0] CT
0 -5 moveto 
1 -1 scale
(Degraded: 24%) t 
GR
GR
GS
[0.75 0 0 0.75 535.8755 52.43749] CT
/Helvetica-Bold 14.667 F
GS
[1 0 0 1 0 0] CT
-74 -4 moveto 
1 -1 scale
(EN Profitability SM02) t 
GR
GR
GS
[0.75 0 0 0.75 0 -0.25] CT
0.302 0.749 0.929 RC
N
621.926 119.982 M
616.072 125.362 L
709.459 221.111 L
709.459 87.361 L
701.511 87.598 L
693.592 88.306 L
685.729 89.483 L
677.95 91.126 L
670.282 93.228 L
662.752 95.782 L
655.388 98.778 L
648.214 102.208 L
641.257 106.057 L
634.541 110.313 L
628.09 114.96 L
cp
f
GR
GS
[0.75 0 0 0.75 0 -0.25] CT
0.094 0.749 0.71 RC
N
612.862 320.442 M
618.512 326.642 L
624.54 332.476 L
630.922 337.921 L
637.632 342.955 L
644.645 347.558 L
651.932 351.713 L
659.466 355.403 L
667.216 358.613 L
675.153 361.331 L
683.243 363.547 L
691.457 365.25 L
699.762 366.436 L
708.124 367.098 L
716.512 367.235 L
724.892 366.846 L
733.23 365.932 L
741.496 364.497 L
749.655 362.547 L
757.675 360.09 L
765.526 357.134 L
773.176 353.692 L
780.595 349.778 L
787.755 345.405 L
794.626 340.593 L
801.182 335.36 L
807.396 329.725 L
813.246 323.712 L
818.707 317.345 L
823.758 310.647 L
828.38 303.646 L
832.553 296.369 L
836.262 288.845 L
839.492 281.103 L
842.23 273.174 L
844.466 265.089 L
846.191 256.879 L
847.397 248.578 L
848.081 240.217 L
848.24 231.83 L
847.872 223.449 L
846.979 215.108 L
845.566 206.839 L
843.637 198.675 L
841.2 190.649 L
838.264 182.79 L
834.842 175.131 L
830.946 167.702 L
826.592 160.532 L
714.5 233.5 L
621.113 137.751 L
615.294 143.793 L
609.866 150.189 L
604.849 156.912 L
600.263 163.937 L
596.127 171.235 L
592.457 178.778 L
589.266 186.536 L
586.569 194.479 L
584.374 202.576 L
582.691 210.794 L
581.527 219.102 L
580.886 227.466 L
580.771 235.854 L
581.181 244.232 L
582.116 252.569 L
583.572 260.83 L
585.543 268.984 L
588.021 276.999 L
590.997 284.842 L
594.458 292.483 L
598.392 299.892 L
602.782 307.04 L
607.612 313.899 L
cp
f
GR
GS
[0.75 0 0 0.75 0 -0.25] CT
0 0.451 0.741 RC
N
714.5 99.75 M
714.5 233.5 L
826.592 160.532 L
821.847 153.715 L
816.688 147.206 L
811.135 141.03 L
805.209 135.21 L
798.933 129.769 L
792.332 124.728 L
785.431 120.107 L
778.256 115.923 L
770.835 112.193 L
763.197 108.93 L
755.371 106.148 L
747.388 103.856 L
739.277 102.065 L
731.071 100.781 L
722.802 100.008 L
cp
f
GR
GS
[0.75 0 0 0.75 472.50476 69.37755] CT
/Helvetica 18.667 F
GS
[1 0 0 1 0 0] CT
-46 -5 moveto 
1 -1 scale
(Profit: 12%) t 
GR
GR
GS
[0.75 0 0 0.75 540.21606 214.7968] CT
1 GC
/Helvetica 18.667 F
GS
[1 0 0 1 0 0] CT
-60 19 moveto 
1 -1 scale
(Invariant: 72%) t 
GR
GR
GS
[0.75 0 0 0.75 588.47337 77.8742] CT
/Helvetica 18.667 F
GS
[1 0 0 1 0 0] CT
0 -5 moveto 
1 -1 scale
(Degraded: 16%) t 
GR
GR
GS
[0.75 0 0 0.75 530.6255 352.4375] CT
/Helvetica-Bold 14.667 F
GS
[1 0 0 1 0 0] CT
-74 -4 moveto 
1 -1 scale
(EN Profitability SM02) t 
GR
GR
GS
[0.75 0 0 0.75 0 -0.25] CT
0.302 0.749 0.929 RC
N
614.6 520.256 M
608.738 525.677 L
702.439 621.12 L
702.439 487.37 L
694.457 487.608 L
686.505 488.322 L
678.609 489.51 L
670.798 491.166 L
663.1 493.286 L
655.542 495.861 L
648.151 498.882 L
640.954 502.34 L
633.976 506.22 L
627.241 510.51 L
620.775 515.195 L
cp
f
GR
GS
[0.75 0 0 0.75 0 -0.25] CT
0.094 0.749 0.71 RC
N
617.953 732.85 M
624.36 738.271 L
631.096 743.279 L
638.132 747.855 L
645.441 751.981 L
652.994 755.64 L
660.763 758.818 L
668.715 761.503 L
676.82 763.684 L
685.046 765.352 L
693.36 766.5 L
701.73 767.125 L
710.123 767.224 L
718.505 766.797 L
726.844 765.844 L
735.107 764.37 L
743.261 762.381 L
751.274 759.884 L
759.115 756.889 L
766.753 753.409 L
774.157 749.457 L
781.299 745.047 L
788.15 740.199 L
794.683 734.93 L
800.874 729.262 L
806.696 723.217 L
812.128 716.819 L
817.148 710.092 L
821.736 703.064 L
825.875 695.762 L
829.547 688.214 L
832.738 680.452 L
835.437 672.504 L
837.631 664.403 L
839.313 656.18 L
840.476 647.868 L
841.115 639.499 L
841.229 631.106 L
840.815 622.723 L
839.877 614.383 L
838.417 606.117 L
836.442 597.96 L
833.959 589.942 L
830.978 582.096 L
827.51 574.453 L
823.57 567.042 L
819.173 559.892 L
814.337 553.033 L
809.079 546.49 L
803.422 540.29 L
797.387 534.457 L
790.997 529.014 L
707.5 633.5 L
613.799 538.058 L
607.997 544.123 L
602.587 550.54 L
597.59 557.284 L
593.026 564.327 L
588.913 571.644 L
585.267 579.203 L
582.102 586.977 L
579.431 594.934 L
577.264 603.043 L
575.61 611.271 L
574.476 619.588 L
573.865 627.958 L
573.78 636.351 L
574.223 644.733 L
575.19 653.07 L
576.677 661.331 L
578.681 669.481 L
581.191 677.49 L
584.199 685.326 L
587.692 692.958 L
591.658 700.355 L
596.079 707.489 L
600.939 714.332 L
606.219 720.857 L
611.898 727.037 L
cp
f
GR
GS
[0.75 0 0 0.75 0 -0.25] CT
0 0.451 0.741 RC
N
707.5 499.75 M
707.5 633.5 L
790.997 529.014 L
784.441 524.096 L
777.595 519.589 L
770.486 515.509 L
763.14 511.873 L
755.586 508.693 L
747.85 505.982 L
739.964 503.75 L
731.955 502.005 L
723.855 500.754 L
715.693 500.001 L
cp
f
GR
GS
[0.75 0 0 0.75 451.32193 374.70212] CT
/Helvetica 18.667 F
GS
[1 0 0 1 0 0] CT
-46 -5 moveto 
1 -1 scale
(Profit: 12%) t 
GR
GR
GS
[0.75 0 0 0.75 533.99908 525.07533] CT
1 GC
/Helvetica-Bold 18.667 F
GS
[1 0 0 1 0 0] CT
-63.5 19 moveto 
1 -1 scale
(Invariant: 77%) t 
GR
GR
GS
[0.75 0 0 0.75 627.1219 383.49182] CT
/Helvetica 18.667 F
GS
[1 0 0 1 0 0] CT
-65 -5 moveto 
1 -1 scale
(Degraded: 11%) t 
GR
GR
GS
[0.75 0 0 0.75 213.37521 352.4375] CT
/Helvetica-Bold 14.667 F
GS
[1 0 0 1 0 0] CT
-79 -4 moveto 
1 -1 scale
(ENU Profitability SM01) t 
GR
GR
GS
[0.75 0 0 0.75 0 -0.25] CT
0.302 0.749 0.929 RC
N
194.938 517.517 M
188.655 522.991 L
279.614 621.049 L
279.614 487.299 L
271.284 487.559 L
262.986 488.337 L
254.753 489.63 L
246.616 491.434 L
238.608 493.74 L
230.758 496.542 L
223.099 499.826 L
215.659 503.581 L
208.467 507.793 L
201.551 512.444 L
cp
f
GR
GS
[0.75 0 0 0.75 0 -0.25] CT
0.094 0.749 0.71 RC
N
179.722 716.63 M
185.095 722.986 L
190.853 728.995 L
196.974 734.635 L
203.433 739.883 L
210.207 744.719 L
217.268 749.124 L
224.589 753.082 L
232.142 756.576 L
239.898 759.594 L
247.827 762.124 L
255.898 764.156 L
264.079 765.682 L
272.34 766.696 L
280.648 767.195 L
288.97 767.175 L
297.275 766.638 L
305.531 765.586 L
313.705 764.022 L
321.767 761.953 L
329.684 759.387 L
337.426 756.333 L
344.963 752.803 L
352.266 748.812 L
359.306 744.374 L
366.057 739.507 L
372.492 734.229 L
378.587 728.562 L
384.317 722.526 L
389.661 716.146 L
394.597 709.445 L
399.107 702.451 L
403.174 695.189 L
406.781 687.689 L
409.914 679.979 L
412.562 672.089 L
414.714 664.049 L
416.362 655.891 L
417.5 647.647 L
418.122 639.348 L
418.227 631.026 L
417.814 622.713 L
284.5 633.5 L
193.54 535.442 L
187.618 541.289 L
182.07 547.493 L
176.919 554.03 L
172.185 560.875 L
167.885 568.001 L
164.038 575.381 L
160.656 582.985 L
157.754 590.786 L
155.343 598.751 L
153.432 606.851 L
152.028 615.055 L
151.137 623.329 L
150.763 631.643 L
150.906 639.965 L
151.567 648.261 L
152.742 656.5 L
154.428 664.65 L
156.617 672.68 L
159.302 680.558 L
162.471 688.253 L
166.112 695.737 L
170.212 702.979 L
174.755 709.953 L
cp
f
GR
GS
[0.75 0 0 0.75 0 -0.25] CT
0 0.451 0.741 RC
N
284.5 499.75 M
284.5 633.5 L
417.814 622.713 L
416.888 614.463 L
415.452 606.285 L
413.511 598.212 L
411.073 590.276 L
408.147 582.506 L
404.745 574.932 L
400.879 567.584 L
396.565 560.49 L
391.82 553.678 L
386.66 547.173 L
381.107 541.001 L
375.182 535.185 L
368.907 529.748 L
362.307 524.711 L
355.407 520.093 L
348.234 515.912 L
340.815 512.184 L
333.18 508.923 L
325.356 506.143 L
317.376 503.853 L
309.268 502.063 L
301.065 500.78 L
292.799 500.008 L
cp
f
GR
GS
[0.75 0 0 0.75 124.40464 379.31812] CT
/Helvetica 18.667 F
GS
[1 0 0 1 0 0] CT
-46 -5 moveto 
1 -1 scale
(Profit: 12%) t 
GR
GR
GS
[0.75 0 0 0.75 213.85998 522.20758] CT
1 GC
/Helvetica-Bold 18.667 F
GS
[1 0 0 1 0 0] CT
-63.5 19 moveto 
1 -1 scale
(Invariant: 64%) t 
GR
GR
GS
[0.75 0 0 0.75 288.18743 393.76491] CT
/Helvetica 18.667 F
GS
[1 0 0 1 0 0] CT
0 -5 moveto 
1 -1 scale
(Degraded: 24%) t 
GR
GR
%%Trailer
%%Pages: 1
%%EOF
