%!PS-Adobe-3.0 EPSF-3.0
%%Creator: (MATLAB, The Mathworks, Inc. Version 9.5.0.944444 \(R2018b\). Operating System: Windows 10)
%%Title: (C:/Users/Alex/Documents/PhD Docs/NavSAS Git Repo/ieee_trans_vehicular_iar2019/fig/Inter_Agent_Range_RAWmeasurements_new.eps)
%%CreationDate: 2019-04-29T12:13:03
%%Pages: (atend)
%%BoundingBox: 0 0 664 477
%%LanguageLevel: 3
%%EndComments
%%BeginProlog
%%BeginResource: procset (Apache XML Graphics Std ProcSet) 1.2 0
%%Version: 1.2 0
%%Copyright: (Copyright 2001-2003,2010 The Apache Software Foundation. License terms: http://www.apache.org/licenses/LICENSE-2.0)
/bd{bind def}bind def
/ld{load def}bd
/GR/grestore ld
/GS/gsave ld
/RM/rmoveto ld
/C/curveto ld
/t/show ld
/L/lineto ld
/ML/setmiterlimit ld
/CT/concat ld
/f/fill ld
/N/newpath ld
/S/stroke ld
/CC/setcmykcolor ld
/A/ashow ld
/cp/closepath ld
/RC/setrgbcolor ld
/LJ/setlinejoin ld
/GC/setgray ld
/LW/setlinewidth ld
/M/moveto ld
/re {4 2 roll M
1 index 0 rlineto
0 exch rlineto
neg 0 rlineto
cp } bd
/_ctm matrix def
/_tm matrix def
/BT { _ctm currentmatrix pop matrix _tm copy pop 0 0 moveto } bd
/ET { _ctm setmatrix } bd
/iTm { _ctm setmatrix _tm concat } bd
/Tm { _tm astore pop iTm 0 0 moveto } bd
/ux 0.0 def
/uy 0.0 def
/F {
  /Tp exch def
  /Tf exch def
  Tf findfont Tp scalefont setfont
  /cf Tf def  /cs Tp def
} bd
/ULS {currentpoint /uy exch def /ux exch def} bd
/ULE {
  /Tcx currentpoint pop def
  gsave
  newpath
  cf findfont cs scalefont dup
  /FontMatrix get 0 get /Ts exch def /FontInfo get dup
  /UnderlinePosition get Ts mul /To exch def
  /UnderlineThickness get Ts mul /Tt exch def
  ux uy To add moveto  Tcx uy To add lineto
  Tt setlinewidth stroke
  grestore
} bd
/OLE {
  /Tcx currentpoint pop def
  gsave
  newpath
  cf findfont cs scalefont dup
  /FontMatrix get 0 get /Ts exch def /FontInfo get dup
  /UnderlinePosition get Ts mul /To exch def
  /UnderlineThickness get Ts mul /Tt exch def
  ux uy To add cs add moveto Tcx uy To add cs add lineto
  Tt setlinewidth stroke
  grestore
} bd
/SOE {
  /Tcx currentpoint pop def
  gsave
  newpath
  cf findfont cs scalefont dup
  /FontMatrix get 0 get /Ts exch def /FontInfo get dup
  /UnderlinePosition get Ts mul /To exch def
  /UnderlineThickness get Ts mul /Tt exch def
  ux uy To add cs 10 mul 26 idiv add moveto Tcx uy To add cs 10 mul 26 idiv add lineto
  Tt setlinewidth stroke
  grestore
} bd
/QT {
/Y22 exch store
/X22 exch store
/Y21 exch store
/X21 exch store
currentpoint
/Y21 load 2 mul add 3 div exch
/X21 load 2 mul add 3 div exch
/X21 load 2 mul /X22 load add 3 div
/Y21 load 2 mul /Y22 load add 3 div
/X22 load /Y22 load curveto
} bd
/SSPD {
dup length /d exch dict def
{
/v exch def
/k exch def
currentpagedevice k known {
/cpdv currentpagedevice k get def
v cpdv ne {
/upd false def
/nullv v type /nulltype eq def
/nullcpdv cpdv type /nulltype eq def
nullv nullcpdv or
{
/upd true def
} {
/sametype v type cpdv type eq def
sametype {
v type /arraytype eq {
/vlen v length def
/cpdvlen cpdv length def
vlen cpdvlen eq {
0 1 vlen 1 sub {
/i exch def
/obj v i get def
/cpdobj cpdv i get def
obj cpdobj ne {
/upd true def
exit
} if
} for
} {
/upd true def
} ifelse
} {
v type /dicttype eq {
v {
/dv exch def
/dk exch def
/cpddv cpdv dk get def
dv cpddv ne {
/upd true def
exit
} if
} forall
} {
/upd true def
} ifelse
} ifelse
} if
} ifelse
upd true eq {
d k v put
} if
} if
} if
} forall
d length 0 gt {
d setpagedevice
} if
} bd
/RE { % /NewFontName [NewEncodingArray] /FontName RE -
  findfont dup length dict begin
  {
    1 index /FID ne
    {def} {pop pop} ifelse
  } forall
  /Encoding exch def
  /FontName 1 index def
  currentdict definefont pop
  end
} bind def
%%EndResource
%%BeginResource: procset (Apache XML Graphics EPS ProcSet) 1.0 0
%%Version: 1.0 0
%%Copyright: (Copyright 2002-2003 The Apache Software Foundation. License terms: http://www.apache.org/licenses/LICENSE-2.0)
/BeginEPSF { %def
/b4_Inc_state save def         % Save state for cleanup
/dict_count countdictstack def % Count objects on dict stack
/op_count count 1 sub def      % Count objects on operand stack
userdict begin                 % Push userdict on dict stack
/showpage { } def              % Redefine showpage, { } = null proc
0 setgray 0 setlinecap         % Prepare graphics state
1 setlinewidth 0 setlinejoin
10 setmiterlimit [ ] 0 setdash newpath
/languagelevel where           % If level not equal to 1 then
{pop languagelevel             % set strokeadjust and
1 ne                           % overprint to their defaults.
{false setstrokeadjust false setoverprint
} if
} if
} bd
/EndEPSF { %def
count op_count sub {pop} repeat            % Clean up stacks
countdictstack dict_count sub {end} repeat
b4_Inc_state restore
} bd
%%EndResource
%FOPBeginFontDict
%%IncludeResource: font Courier-Oblique
%%IncludeResource: font Courier-BoldOblique
%%IncludeResource: font Courier-Bold
%%IncludeResource: font ZapfDingbats
%%IncludeResource: font Symbol
%%IncludeResource: font Helvetica
%%IncludeResource: font Helvetica-Oblique
%%IncludeResource: font Helvetica-Bold
%%IncludeResource: font Helvetica-BoldOblique
%%IncludeResource: font Times-Roman
%%IncludeResource: font Times-Italic
%%IncludeResource: font Times-Bold
%%IncludeResource: font Times-BoldItalic
%%IncludeResource: font Courier
%FOPEndFontDict
%%BeginResource: encoding WinAnsiEncoding
/WinAnsiEncoding [
/.notdef /.notdef /.notdef /.notdef /.notdef
/.notdef /.notdef /.notdef /.notdef /.notdef
/.notdef /.notdef /.notdef /.notdef /.notdef
/.notdef /.notdef /.notdef /.notdef /.notdef
/.notdef /.notdef /.notdef /.notdef /.notdef
/.notdef /.notdef /.notdef /.notdef /.notdef
/.notdef /.notdef /space /exclam /quotedbl
/numbersign /dollar /percent /ampersand /quotesingle
/parenleft /parenright /asterisk /plus /comma
/hyphen /period /slash /zero /one
/two /three /four /five /six
/seven /eight /nine /colon /semicolon
/less /equal /greater /question /at
/A /B /C /D /E
/F /G /H /I /J
/K /L /M /N /O
/P /Q /R /S /T
/U /V /W /X /Y
/Z /bracketleft /backslash /bracketright /asciicircum
/underscore /quoteleft /a /b /c
/d /e /f /g /h
/i /j /k /l /m
/n /o /p /q /r
/s /t /u /v /w
/x /y /z /braceleft /bar
/braceright /asciitilde /bullet /Euro /bullet
/quotesinglbase /florin /quotedblbase /ellipsis /dagger
/daggerdbl /circumflex /perthousand /Scaron /guilsinglleft
/OE /bullet /Zcaron /bullet /bullet
/quoteleft /quoteright /quotedblleft /quotedblright /bullet
/endash /emdash /asciitilde /trademark /scaron
/guilsinglright /oe /bullet /zcaron /Ydieresis
/space /exclamdown /cent /sterling /currency
/yen /brokenbar /section /dieresis /copyright
/ordfeminine /guillemotleft /logicalnot /sfthyphen /registered
/macron /degree /plusminus /twosuperior /threesuperior
/acute /mu /paragraph /middot /cedilla
/onesuperior /ordmasculine /guillemotright /onequarter /onehalf
/threequarters /questiondown /Agrave /Aacute /Acircumflex
/Atilde /Adieresis /Aring /AE /Ccedilla
/Egrave /Eacute /Ecircumflex /Edieresis /Igrave
/Iacute /Icircumflex /Idieresis /Eth /Ntilde
/Ograve /Oacute /Ocircumflex /Otilde /Odieresis
/multiply /Oslash /Ugrave /Uacute /Ucircumflex
/Udieresis /Yacute /Thorn /germandbls /agrave
/aacute /acircumflex /atilde /adieresis /aring
/ae /ccedilla /egrave /eacute /ecircumflex
/edieresis /igrave /iacute /icircumflex /idieresis
/eth /ntilde /ograve /oacute /ocircumflex
/otilde /odieresis /divide /oslash /ugrave
/uacute /ucircumflex /udieresis /yacute /thorn
/ydieresis
] def
%%EndResource
%FOPBeginFontReencode
/Courier-Oblique findfont
dup length dict begin
  {1 index /FID ne {def} {pop pop} ifelse} forall
  /Encoding WinAnsiEncoding def
  currentdict
end
/Courier-Oblique exch definefont pop
/Courier-BoldOblique findfont
dup length dict begin
  {1 index /FID ne {def} {pop pop} ifelse} forall
  /Encoding WinAnsiEncoding def
  currentdict
end
/Courier-BoldOblique exch definefont pop
/Courier-Bold findfont
dup length dict begin
  {1 index /FID ne {def} {pop pop} ifelse} forall
  /Encoding WinAnsiEncoding def
  currentdict
end
/Courier-Bold exch definefont pop
/Helvetica findfont
dup length dict begin
  {1 index /FID ne {def} {pop pop} ifelse} forall
  /Encoding WinAnsiEncoding def
  currentdict
end
/Helvetica exch definefont pop
/Helvetica-Oblique findfont
dup length dict begin
  {1 index /FID ne {def} {pop pop} ifelse} forall
  /Encoding WinAnsiEncoding def
  currentdict
end
/Helvetica-Oblique exch definefont pop
/Helvetica-Bold findfont
dup length dict begin
  {1 index /FID ne {def} {pop pop} ifelse} forall
  /Encoding WinAnsiEncoding def
  currentdict
end
/Helvetica-Bold exch definefont pop
/Helvetica-BoldOblique findfont
dup length dict begin
  {1 index /FID ne {def} {pop pop} ifelse} forall
  /Encoding WinAnsiEncoding def
  currentdict
end
/Helvetica-BoldOblique exch definefont pop
/Times-Roman findfont
dup length dict begin
  {1 index /FID ne {def} {pop pop} ifelse} forall
  /Encoding WinAnsiEncoding def
  currentdict
end
/Times-Roman exch definefont pop
/Times-Italic findfont
dup length dict begin
  {1 index /FID ne {def} {pop pop} ifelse} forall
  /Encoding WinAnsiEncoding def
  currentdict
end
/Times-Italic exch definefont pop
/Times-Bold findfont
dup length dict begin
  {1 index /FID ne {def} {pop pop} ifelse} forall
  /Encoding WinAnsiEncoding def
  currentdict
end
/Times-Bold exch definefont pop
/Times-BoldItalic findfont
dup length dict begin
  {1 index /FID ne {def} {pop pop} ifelse} forall
  /Encoding WinAnsiEncoding def
  currentdict
end
/Times-BoldItalic exch definefont pop
/Courier findfont
dup length dict begin
  {1 index /FID ne {def} {pop pop} ifelse} forall
  /Encoding WinAnsiEncoding def
  currentdict
end
/Courier exch definefont pop
%FOPEndFontReencode
%%EndProlog
%%Page: 1 1
%%PageBoundingBox: 0 0 664 477
%%BeginPageSetup
[1 0 0 -1 0 477] CT
%%EndPageSetup
GS
[0.75 0 0 0.75 0 0] CT
1 GC
N
0 0 885 636 re
f
GR
GS
[0.75 0 0 0.75 0 0] CT
1 GC
N
0 0 885 636 re
f
GR
GS
[0.75 0 0 0.75 0 0] CT
1 GC
N
115 276 M
801 276 L
801 46 L
115 46 L
cp
f
GR
GS
[0.75 0 0 0.75 0 0] CT
0.873 GC
1 LJ
0.667 LW
N
167.769 276 M
167.769 46 L
S
GR
GS
[0.75 0 0 0.75 0 0] CT
0.873 GC
1 LJ
0.667 LW
N
273.308 276 M
273.308 46 L
S
GR
GS
[0.75 0 0 0.75 0 0] CT
0.873 GC
1 LJ
0.667 LW
N
378.846 276 M
378.846 46 L
S
GR
GS
[0.75 0 0 0.75 0 0] CT
0.873 GC
1 LJ
0.667 LW
N
484.385 276 M
484.385 46 L
S
GR
GS
[0.75 0 0 0.75 0 0] CT
0.873 GC
1 LJ
0.667 LW
N
589.923 276 M
589.923 46 L
S
GR
GS
[0.75 0 0 0.75 0 0] CT
0.873 GC
1 LJ
0.667 LW
N
695.462 276 M
695.462 46 L
S
GR
GS
[0.75 0 0 0.75 0 0] CT
0.873 GC
1 LJ
0.667 LW
N
801 276 M
801 46 L
S
GR
GS
[0.75 0 0 0.75 0 0] CT
0.873 GC
1 LJ
0.667 LW
N
801 276 M
115 276 L
S
GR
GS
[0.75 0 0 0.75 0 0] CT
0.873 GC
1 LJ
0.667 LW
N
801 210.286 M
115 210.286 L
S
GR
GS
[0.75 0 0 0.75 0 0] CT
0.873 GC
1 LJ
0.667 LW
N
801 144.571 M
115 144.571 L
S
GR
GS
[0.75 0 0 0.75 0 0] CT
0.873 GC
1 LJ
0.667 LW
N
801 78.857 M
115 78.857 L
S
GR
GS
[0.75 0 0 0.75 0 0] CT
0.149 GC
2 setlinecap
1 LJ
0.667 LW
N
115 276 M
801 276 L
S
GR
GS
[0.75 0 0 0.75 0 0] CT
0.149 GC
2 setlinecap
1 LJ
0.667 LW
N
115 46 M
801 46 L
S
GR
GS
[0.75 0 0 0.75 0 0] CT
0.149 GC
2 setlinecap
1 LJ
0.667 LW
N
167.769 276 M
167.769 269.14 L
S
GR
GS
[0.75 0 0 0.75 0 0] CT
0.149 GC
2 setlinecap
1 LJ
0.667 LW
N
273.308 276 M
273.308 269.14 L
S
GR
GS
[0.75 0 0 0.75 0 0] CT
0.149 GC
2 setlinecap
1 LJ
0.667 LW
N
378.846 276 M
378.846 269.14 L
S
GR
GS
[0.75 0 0 0.75 0 0] CT
0.149 GC
2 setlinecap
1 LJ
0.667 LW
N
484.385 276 M
484.385 269.14 L
S
GR
GS
[0.75 0 0 0.75 0 0] CT
0.149 GC
2 setlinecap
1 LJ
0.667 LW
N
589.923 276 M
589.923 269.14 L
S
GR
GS
[0.75 0 0 0.75 0 0] CT
0.149 GC
2 setlinecap
1 LJ
0.667 LW
N
695.462 276 M
695.462 269.14 L
S
GR
GS
[0.75 0 0 0.75 0 0] CT
0.149 GC
2 setlinecap
1 LJ
0.667 LW
N
801 276 M
801 269.14 L
S
GR
GS
[0.75 0 0 0.75 0 0] CT
0.149 GC
2 setlinecap
1 LJ
0.667 LW
N
167.769 46 M
167.769 52.86 L
S
GR
GS
[0.75 0 0 0.75 0 0] CT
0.149 GC
2 setlinecap
1 LJ
0.667 LW
N
273.308 46 M
273.308 52.86 L
S
GR
GS
[0.75 0 0 0.75 0 0] CT
0.149 GC
2 setlinecap
1 LJ
0.667 LW
N
378.846 46 M
378.846 52.86 L
S
GR
GS
[0.75 0 0 0.75 0 0] CT
0.149 GC
2 setlinecap
1 LJ
0.667 LW
N
484.385 46 M
484.385 52.86 L
S
GR
GS
[0.75 0 0 0.75 0 0] CT
0.149 GC
2 setlinecap
1 LJ
0.667 LW
N
589.923 46 M
589.923 52.86 L
S
GR
GS
[0.75 0 0 0.75 0 0] CT
0.149 GC
2 setlinecap
1 LJ
0.667 LW
N
695.462 46 M
695.462 52.86 L
S
GR
GS
[0.75 0 0 0.75 0 0] CT
0.149 GC
2 setlinecap
1 LJ
0.667 LW
N
801 46 M
801 52.86 L
S
GR
GS
[0.75 0 0 0.75 125.82692 212.60001] CT
0.149 GC
N
0 20.691 M
-2.938 20.691 -4 18.269 QT
-5.063 15.847 -5.063 12.504 QT
-5.063 10.426 -4.68 8.582 QT
-4.297 6.738 -3.164 5.457 QT
-2.031 4.176 0 4.176 QT
1.578 4.176 2.586 4.949 QT
3.594 5.722 4.125 6.949 QT
4.656 8.176 4.852 9.574 QT
5.047 10.972 5.047 12.504 QT
5.047 14.566 4.664 16.363 QT
4.281 18.16 3.164 19.426 QT
2.047 20.691 0 20.691 QT
cp
0 20.066 M
1.344 20.066 2 18.691 QT
2.656 17.316 2.805 15.652 QT
2.953 13.988 2.953 12.113 QT
2.953 10.316 2.805 8.793 QT
2.656 7.269 2 6.035 QT
1.344 4.801 0 4.801 QT
-1.359 4.801 -2.016 6.043 QT
-2.672 7.285 -2.82 8.801 QT
-2.969 10.316 -2.969 12.113 QT
-2.969 13.457 -2.906 14.636 QT
-2.844 15.816 -2.563 17.082 QT
-2.281 18.347 -1.656 19.207 QT
-1.031 20.066 0 20.066 QT
cp
f
GR
GS
[0.75 0 0 0.75 204.98076 212.60001] CT
0.149 GC
N
-9.906 17.426 M
-9.672 18.129 -9.156 18.707 QT
-8.641 19.285 -7.945 19.605 QT
-7.25 19.926 -6.5 19.926 QT
-4.766 19.926 -4.109 18.574 QT
-3.453 17.222 -3.453 15.301 QT
-3.453 14.472 -3.484 13.902 QT
-3.516 13.332 -3.641 12.816 QT
-3.859 11.972 -4.422 11.34 QT
-4.984 10.707 -5.781 10.707 QT
-6.594 10.707 -7.172 10.949 QT
-7.75 11.191 -8.117 11.519 QT
-8.484 11.847 -8.766 12.215 QT
-9.047 12.582 -9.109 12.597 QT
-9.391 12.597 L
-9.438 12.597 -9.531 12.519 QT
-9.625 12.441 -9.625 12.379 QT
-9.625 4.363 L
-9.625 4.301 -9.547 4.238 QT
-9.469 4.176 -9.391 4.176 QT
-9.313 4.176 L
-7.703 4.941 -5.875 4.941 QT
-4.094 4.941 -2.453 4.176 QT
-2.375 4.176 L
-2.297 4.176 -2.227 4.23 QT
-2.156 4.285 -2.156 4.363 QT
-2.156 4.582 L
-2.156 4.707 -2.203 4.707 QT
-3.016 5.785 -4.258 6.394 QT
-5.5 7.004 -6.813 7.004 QT
-7.781 7.004 -8.781 6.738 QT
-8.781 11.269 L
-7.984 10.629 -7.359 10.355 QT
-6.734 10.082 -5.766 10.082 QT
-4.438 10.082 -3.391 10.84 QT
-2.344 11.597 -1.781 12.824 QT
-1.219 14.051 -1.219 15.332 QT
-1.219 16.769 -1.93 18.004 QT
-2.641 19.238 -3.859 19.965 QT
-5.078 20.691 -6.5 20.691 QT
-7.688 20.691 -8.68 20.082 QT
-9.672 19.472 -10.234 18.441 QT
-10.797 17.41 -10.797 16.238 QT
-10.797 15.707 -10.445 15.363 QT
-10.094 15.019 -9.578 15.019 QT
-9.047 15.019 -8.688 15.371 QT
-8.328 15.722 -8.328 16.238 QT
-8.328 16.754 -8.688 17.113 QT
-9.047 17.472 -9.578 17.472 QT
-9.656 17.472 -9.758 17.457 QT
-9.859 17.441 -9.906 17.426 QT
cp
f
GR
GS
[0.75 0 0 0.75 204.98076 212.60001] CT
0.149 GC
N
6 20.691 M
3.063 20.691 2 18.269 QT
0.938 15.847 0.938 12.504 QT
0.938 10.426 1.32 8.582 QT
1.703 6.738 2.836 5.457 QT
3.969 4.176 6 4.176 QT
7.578 4.176 8.586 4.949 QT
9.594 5.722 10.125 6.949 QT
10.656 8.176 10.852 9.574 QT
11.047 10.972 11.047 12.504 QT
11.047 14.566 10.664 16.363 QT
10.281 18.16 9.164 19.426 QT
8.047 20.691 6 20.691 QT
cp
6 20.066 M
7.344 20.066 8 18.691 QT
8.656 17.316 8.805 15.652 QT
8.953 13.988 8.953 12.113 QT
8.953 10.316 8.805 8.793 QT
8.656 7.269 8 6.035 QT
7.344 4.801 6 4.801 QT
4.641 4.801 3.984 6.043 QT
3.328 7.285 3.18 8.801 QT
3.031 10.316 3.031 12.113 QT
3.031 13.457 3.094 14.636 QT
3.156 15.816 3.438 17.082 QT
3.719 18.347 4.344 19.207 QT
4.969 20.066 6 20.066 QT
cp
f
GR
GS
[0.75 0 0 0.75 284.13462 212.60001] CT
0.149 GC
N
-15.766 20.16 M
-15.766 19.316 L
-12.766 19.316 -12.766 18.551 QT
-12.766 5.957 L
-14.016 6.551 -15.906 6.551 QT
-15.906 5.707 L
-12.969 5.707 -11.469 4.176 QT
-11.125 4.176 L
-11.047 4.176 -10.969 4.238 QT
-10.891 4.301 -10.891 4.379 QT
-10.891 18.551 L
-10.891 19.316 -7.891 19.316 QT
-7.891 20.16 L
-15.766 20.16 L
cp
f
GR
GS
[0.75 0 0 0.75 284.13462 212.60001] CT
0.149 GC
N
/f-1749699357{0 20.691 M
-2.938 20.691 -4 18.269 QT
-5.063 15.847 -5.063 12.504 QT
-5.063 10.426 -4.68 8.582 QT
-4.297 6.738 -3.164 5.457 QT
-2.031 4.176 0 4.176 QT
1.578 4.176 2.586 4.949 QT
3.594 5.722 4.125 6.949 QT
4.656 8.176 4.852 9.574 QT
5.047 10.972 5.047 12.504 QT
5.047 14.566 4.664 16.363 QT
4.281 18.16 3.164 19.426 QT
2.047 20.691 0 20.691 QT
cp
0 20.066 M
1.344 20.066 2 18.691 QT
2.656 17.316 2.805 15.652 QT
2.953 13.988 2.953 12.113 QT
2.953 10.316 2.805 8.793 QT
2.656 7.269 2 6.035 QT
1.344 4.801 0 4.801 QT
-1.359 4.801 -2.016 6.043 QT
-2.672 7.285 -2.82 8.801 QT
-2.969 10.316 -2.969 12.113 QT
-2.969 13.457 -2.906 14.636 QT
-2.844 15.816 -2.563 17.082 QT
-2.281 18.347 -1.656 19.207 QT
-1.031 20.066 0 20.066 QT
cp}def
f-1749699357
f
GR
GS
[0.75 0 0 0.75 284.13462 212.60001] CT
0.149 GC
N
/f1314376594{12 20.691 M
9.063 20.691 8 18.269 QT
6.938 15.847 6.938 12.504 QT
6.938 10.426 7.32 8.582 QT
7.703 6.738 8.836 5.457 QT
9.969 4.176 12 4.176 QT
13.578 4.176 14.586 4.949 QT
15.594 5.722 16.125 6.949 QT
16.656 8.176 16.852 9.574 QT
17.047 10.972 17.047 12.504 QT
17.047 14.566 16.664 16.363 QT
16.281 18.16 15.164 19.426 QT
14.047 20.691 12 20.691 QT
cp
12 20.066 M
13.344 20.066 14 18.691 QT
14.656 17.316 14.805 15.652 QT
14.953 13.988 14.953 12.113 QT
14.953 10.316 14.805 8.793 QT
14.656 7.269 14 6.035 QT
13.344 4.801 12 4.801 QT
10.641 4.801 9.984 6.043 QT
9.328 7.285 9.18 8.801 QT
9.031 10.316 9.031 12.113 QT
9.031 13.457 9.094 14.636 QT
9.156 15.816 9.438 17.082 QT
9.719 18.347 10.344 19.207 QT
10.969 20.066 12 20.066 QT
cp}def
f1314376594
f
GR
GS
[0.75 0 0 0.75 363.28846 212.60001] CT
0.149 GC
N
/f-336516700{-15.766 20.16 M
-15.766 19.316 L
-12.766 19.316 -12.766 18.551 QT
-12.766 5.957 L
-14.016 6.551 -15.906 6.551 QT
-15.906 5.707 L
-12.969 5.707 -11.469 4.176 QT
-11.125 4.176 L
-11.047 4.176 -10.969 4.238 QT
-10.891 4.301 -10.891 4.379 QT
-10.891 18.551 L
-10.891 19.316 -7.891 19.316 QT
-7.891 20.16 L
-15.766 20.16 L
cp}def
f-336516700
f
GR
GS
[0.75 0 0 0.75 363.28846 212.60001] CT
0.149 GC
N
/f-685938123{-3.906 17.426 M
-3.672 18.129 -3.156 18.707 QT
-2.641 19.285 -1.945 19.605 QT
-1.25 19.926 -0.5 19.926 QT
1.234 19.926 1.891 18.574 QT
2.547 17.222 2.547 15.301 QT
2.547 14.472 2.516 13.902 QT
2.484 13.332 2.359 12.816 QT
2.141 11.972 1.578 11.34 QT
1.016 10.707 0.219 10.707 QT
-0.594 10.707 -1.172 10.949 QT
-1.75 11.191 -2.117 11.519 QT
-2.484 11.847 -2.766 12.215 QT
-3.047 12.582 -3.109 12.597 QT
-3.391 12.597 L
-3.438 12.597 -3.531 12.519 QT
-3.625 12.441 -3.625 12.379 QT
-3.625 4.363 L
-3.625 4.301 -3.547 4.238 QT
-3.469 4.176 -3.391 4.176 QT
-3.313 4.176 L
-1.703 4.941 0.125 4.941 QT
1.906 4.941 3.547 4.176 QT
3.625 4.176 L
3.703 4.176 3.773 4.23 QT
3.844 4.285 3.844 4.363 QT
3.844 4.582 L
3.844 4.707 3.797 4.707 QT
2.984 5.785 1.742 6.394 QT
0.5 7.004 -0.813 7.004 QT
-1.781 7.004 -2.781 6.738 QT
-2.781 11.269 L
-1.984 10.629 -1.359 10.355 QT
-0.734 10.082 0.234 10.082 QT
1.563 10.082 2.609 10.84 QT
3.656 11.597 4.219 12.824 QT
4.781 14.051 4.781 15.332 QT
4.781 16.769 4.07 18.004 QT
3.359 19.238 2.141 19.965 QT
0.922 20.691 -0.5 20.691 QT
-1.688 20.691 -2.68 20.082 QT
-3.672 19.472 -4.234 18.441 QT
-4.797 17.41 -4.797 16.238 QT
-4.797 15.707 -4.445 15.363 QT
-4.094 15.019 -3.578 15.019 QT
-3.047 15.019 -2.688 15.371 QT
-2.328 15.722 -2.328 16.238 QT
-2.328 16.754 -2.688 17.113 QT
-3.047 17.472 -3.578 17.472 QT
-3.656 17.472 -3.758 17.457 QT
-3.859 17.441 -3.906 17.426 QT
cp}def
f-685938123
f
GR
GS
[0.75 0 0 0.75 363.28846 212.60001] CT
0.149 GC
N
f1314376594
f
GR
GS
[0.75 0 0 0.75 442.44232 212.60001] CT
0.149 GC
N
f-1749699357
f
GR
GS
[0.75 0 0 0.75 521.59616 212.60001] CT
0.149 GC
N
/f422893355{-9.906 17.426 M
-9.672 18.129 -9.156 18.707 QT
-8.641 19.285 -7.945 19.605 QT
-7.25 19.926 -6.5 19.926 QT
-4.766 19.926 -4.109 18.574 QT
-3.453 17.222 -3.453 15.301 QT
-3.453 14.472 -3.484 13.902 QT
-3.516 13.332 -3.641 12.816 QT
-3.859 11.972 -4.422 11.34 QT
-4.984 10.707 -5.781 10.707 QT
-6.594 10.707 -7.172 10.949 QT
-7.75 11.191 -8.117 11.519 QT
-8.484 11.847 -8.766 12.215 QT
-9.047 12.582 -9.109 12.597 QT
-9.391 12.597 L
-9.438 12.597 -9.531 12.519 QT
-9.625 12.441 -9.625 12.379 QT
-9.625 4.363 L
-9.625 4.301 -9.547 4.238 QT
-9.469 4.176 -9.391 4.176 QT
-9.313 4.176 L
-7.703 4.941 -5.875 4.941 QT
-4.094 4.941 -2.453 4.176 QT
-2.375 4.176 L
-2.297 4.176 -2.227 4.23 QT
-2.156 4.285 -2.156 4.363 QT
-2.156 4.582 L
-2.156 4.707 -2.203 4.707 QT
-3.016 5.785 -4.258 6.394 QT
-5.5 7.004 -6.813 7.004 QT
-7.781 7.004 -8.781 6.738 QT
-8.781 11.269 L
-7.984 10.629 -7.359 10.355 QT
-6.734 10.082 -5.766 10.082 QT
-4.438 10.082 -3.391 10.84 QT
-2.344 11.597 -1.781 12.824 QT
-1.219 14.051 -1.219 15.332 QT
-1.219 16.769 -1.93 18.004 QT
-2.641 19.238 -3.859 19.965 QT
-5.078 20.691 -6.5 20.691 QT
-7.688 20.691 -8.68 20.082 QT
-9.672 19.472 -10.234 18.441 QT
-10.797 17.41 -10.797 16.238 QT
-10.797 15.707 -10.445 15.363 QT
-10.094 15.019 -9.578 15.019 QT
-9.047 15.019 -8.688 15.371 QT
-8.328 15.722 -8.328 16.238 QT
-8.328 16.754 -8.688 17.113 QT
-9.047 17.472 -9.578 17.472 QT
-9.656 17.472 -9.758 17.457 QT
-9.859 17.441 -9.906 17.426 QT
cp}def
f422893355
f
GR
GS
[0.75 0 0 0.75 521.59616 212.60001] CT
0.149 GC
N
/f1305826713{6 20.691 M
3.063 20.691 2 18.269 QT
0.938 15.847 0.938 12.504 QT
0.938 10.426 1.32 8.582 QT
1.703 6.738 2.836 5.457 QT
3.969 4.176 6 4.176 QT
7.578 4.176 8.586 4.949 QT
9.594 5.722 10.125 6.949 QT
10.656 8.176 10.852 9.574 QT
11.047 10.972 11.047 12.504 QT
11.047 14.566 10.664 16.363 QT
10.281 18.16 9.164 19.426 QT
8.047 20.691 6 20.691 QT
cp
6 20.066 M
7.344 20.066 8 18.691 QT
8.656 17.316 8.805 15.652 QT
8.953 13.988 8.953 12.113 QT
8.953 10.316 8.805 8.793 QT
8.656 7.269 8 6.035 QT
7.344 4.801 6 4.801 QT
4.641 4.801 3.984 6.043 QT
3.328 7.285 3.18 8.801 QT
3.031 10.316 3.031 12.113 QT
3.031 13.457 3.094 14.636 QT
3.156 15.816 3.438 17.082 QT
3.719 18.347 4.344 19.207 QT
4.969 20.066 6 20.066 QT
cp}def
f1305826713
f
GR
GS
[0.75 0 0 0.75 600.75 212.60001] CT
0.149 GC
N
f-336516700
f
GR
GS
[0.75 0 0 0.75 600.75 212.60001] CT
0.149 GC
N
f-1749699357
f
GR
GS
[0.75 0 0 0.75 600.75 212.60001] CT
0.149 GC
N
f1314376594
f
GR
GS
[0.75 0 0 0.75 0 0] CT
0.149 GC
2 setlinecap
1 LJ
0.667 LW
N
115 276 M
115 46 L
S
GR
GS
[0.75 0 0 0.75 0 0] CT
0.149 GC
2 setlinecap
1 LJ
0.667 LW
N
801 276 M
801 46 L
S
GR
GS
[0.75 0 0 0.75 0 0] CT
0.149 GC
2 setlinecap
1 LJ
0.667 LW
N
115 276 M
121.86 276 L
S
GR
GS
[0.75 0 0 0.75 0 0] CT
0.149 GC
2 setlinecap
1 LJ
0.667 LW
N
115 210.286 M
121.86 210.286 L
S
GR
GS
[0.75 0 0 0.75 0 0] CT
0.149 GC
2 setlinecap
1 LJ
0.667 LW
N
115 144.571 M
121.86 144.571 L
S
GR
GS
[0.75 0 0 0.75 0 0] CT
0.149 GC
2 setlinecap
1 LJ
0.667 LW
N
115 78.857 M
121.86 78.857 L
S
GR
GS
[0.75 0 0 0.75 0 0] CT
0.149 GC
2 setlinecap
1 LJ
0.667 LW
N
801 276 M
794.14 276 L
S
GR
GS
[0.75 0 0 0.75 0 0] CT
0.149 GC
2 setlinecap
1 LJ
0.667 LW
N
801 210.286 M
794.14 210.286 L
S
GR
GS
[0.75 0 0 0.75 0 0] CT
0.149 GC
2 setlinecap
1 LJ
0.667 LW
N
801 144.571 M
794.14 144.571 L
S
GR
GS
[0.75 0 0 0.75 0 0] CT
0.149 GC
2 setlinecap
1 LJ
0.667 LW
N
801 78.857 M
794.14 78.857 L
S
GR
GS
[0.75 0 0 0.75 80.65001 207] CT
0.149 GC
N
/f1219663315{-6 6.291 M
-8.938 6.291 -10 3.869 QT
-11.063 1.447 -11.063 -1.896 QT
-11.063 -3.974 -10.68 -5.818 QT
-10.297 -7.662 -9.164 -8.943 QT
-8.031 -10.224 -6 -10.224 QT
-4.422 -10.224 -3.414 -9.451 QT
-2.406 -8.678 -1.875 -7.451 QT
-1.344 -6.224 -1.148 -4.826 QT
-0.953 -3.428 -0.953 -1.896 QT
-0.953 0.166 -1.336 1.963 QT
-1.719 3.76 -2.836 5.026 QT
-3.953 6.291 -6 6.291 QT
cp
-6 5.666 M
-4.656 5.666 -4 4.291 QT
-3.344 2.916 -3.195 1.252 QT
-3.047 -0.412 -3.047 -2.287 QT
-3.047 -4.084 -3.195 -5.607 QT
-3.344 -7.131 -4 -8.365 QT
-4.656 -9.599 -6 -9.599 QT
-7.359 -9.599 -8.016 -8.357 QT
-8.672 -7.115 -8.82 -5.599 QT
-8.969 -4.084 -8.969 -2.287 QT
-8.969 -0.943 -8.906 0.236 QT
-8.844 1.416 -8.563 2.682 QT
-8.281 3.947 -7.656 4.807 QT
-7.031 5.666 -6 5.666 QT
cp}def
f1219663315
f
GR
GS
[0.75 0 0 0.75 80.65001 157.71429] CT
0.149 GC
N
/f343106209{-34.797 5.76 M
-34.797 5.119 L
-34.797 5.057 -34.75 4.979 QT
-31.031 0.854 L
-30.188 -0.053 -29.656 -0.678 QT
-29.125 -1.303 -28.609 -2.107 QT
-28.094 -2.912 -27.797 -3.748 QT
-27.5 -4.584 -27.5 -5.521 QT
-27.5 -6.506 -27.867 -7.404 QT
-28.234 -8.303 -28.953 -8.842 QT
-29.672 -9.381 -30.688 -9.381 QT
-31.734 -9.381 -32.563 -8.756 QT
-33.391 -8.131 -33.734 -7.131 QT
-33.641 -7.162 -33.484 -7.162 QT
-32.938 -7.162 -32.555 -6.795 QT
-32.172 -6.428 -32.172 -5.849 QT
-32.172 -5.303 -32.555 -4.92 QT
-32.938 -4.537 -33.484 -4.537 QT
-34.047 -4.537 -34.422 -4.935 QT
-34.797 -5.334 -34.797 -5.849 QT
-34.797 -6.756 -34.461 -7.545 QT
-34.125 -8.334 -33.484 -8.951 QT
-32.844 -9.568 -32.039 -9.896 QT
-31.234 -10.224 -30.344 -10.224 QT
-28.969 -10.224 -27.781 -9.646 QT
-26.594 -9.068 -25.906 -8.006 QT
-25.219 -6.943 -25.219 -5.521 QT
-25.219 -4.49 -25.672 -3.553 QT
-26.125 -2.615 -26.844 -1.842 QT
-27.563 -1.068 -28.672 -0.099 QT
-29.781 0.869 -30.141 1.197 QT
-32.859 3.807 L
-30.547 3.807 L
-28.844 3.807 -27.703 3.783 QT
-26.563 3.76 -26.5 3.697 QT
-26.219 3.385 -25.922 1.479 QT
-25.219 1.479 L
-25.891 5.76 L
-34.797 5.76 L
cp}def
f343106209
f
GR
GS
[0.75 0 0 0.75 80.65001 157.71429] CT
0.149 GC
N
/f-1890641509{-18 6.291 M
-20.938 6.291 -22 3.869 QT
-23.063 1.447 -23.063 -1.896 QT
-23.063 -3.974 -22.68 -5.818 QT
-22.297 -7.662 -21.164 -8.943 QT
-20.031 -10.224 -18 -10.224 QT
-16.422 -10.224 -15.414 -9.451 QT
-14.406 -8.678 -13.875 -7.451 QT
-13.344 -6.224 -13.149 -4.826 QT
-12.953 -3.428 -12.953 -1.896 QT
-12.953 0.166 -13.336 1.963 QT
-13.719 3.76 -14.836 5.026 QT
-15.953 6.291 -18 6.291 QT
cp
-18 5.666 M
-16.656 5.666 -16 4.291 QT
-15.344 2.916 -15.195 1.252 QT
-15.047 -0.412 -15.047 -2.287 QT
-15.047 -4.084 -15.195 -5.607 QT
-15.344 -7.131 -16 -8.365 QT
-16.656 -9.599 -18 -9.599 QT
-19.359 -9.599 -20.016 -8.357 QT
-20.672 -7.115 -20.82 -5.599 QT
-20.969 -4.084 -20.969 -2.287 QT
-20.969 -0.943 -20.906 0.236 QT
-20.844 1.416 -20.563 2.682 QT
-20.281 3.947 -19.656 4.807 QT
-19.031 5.666 -18 5.666 QT
cp}def
f-1890641509
f
GR
GS
[0.75 0 0 0.75 80.65001 157.71429] CT
0.149 GC
N
f1219663315
f
GR
GS
[0.75 0 0 0.75 80.65001 108.42857] CT
0.149 GC
N
/f-340820550{-35.328 1.791 M
-35.328 0.947 L
-27.906 -10.115 L
-27.828 -10.224 -27.672 -10.224 QT
-27.313 -10.224 L
-27.047 -10.224 -27.047 -9.959 QT
-27.047 0.947 L
-24.688 0.947 L
-24.688 1.791 L
-27.047 1.791 L
-27.047 4.151 L
-27.047 4.651 -26.344 4.783 QT
-25.641 4.916 -24.719 4.916 QT
-24.719 5.76 L
-31.328 5.76 L
-31.328 4.916 L
-30.391 4.916 -29.688 4.783 QT
-28.984 4.651 -28.984 4.151 QT
-28.984 1.791 L
-35.328 1.791 L
cp
-34.531 0.947 M
-28.844 0.947 L
-28.844 -7.537 L
-34.531 0.947 L
cp}def
f-340820550
f
GR
GS
[0.75 0 0 0.75 80.65001 108.42857] CT
0.149 GC
N
f-1890641509
f
GR
GS
[0.75 0 0 0.75 80.65001 108.42857] CT
0.149 GC
N
f1219663315
f
GR
GS
[0.75 0 0 0.75 80.65001 59.14285] CT
0.149 GC
N
/f-1757710027{-30 6.291 M
-31.484 6.291 -32.484 5.494 QT
-33.484 4.697 -34.024 3.44 QT
-34.563 2.182 -34.774 0.799 QT
-34.984 -0.584 -34.984 -2.006 QT
-34.984 -3.896 -34.25 -5.81 QT
-33.516 -7.724 -32.078 -8.974 QT
-30.641 -10.224 -28.672 -10.224 QT
-27.859 -10.224 -27.149 -9.912 QT
-26.438 -9.599 -26.031 -8.998 QT
-25.625 -8.396 -25.625 -7.537 QT
-25.625 -7.053 -25.961 -6.717 QT
-26.297 -6.381 -26.781 -6.381 QT
-27.25 -6.381 -27.594 -6.724 QT
-27.938 -7.068 -27.938 -7.537 QT
-27.938 -8.006 -27.594 -8.349 QT
-27.25 -8.693 -26.781 -8.693 QT
-26.656 -8.693 L
-26.969 -9.131 -27.524 -9.334 QT
-28.078 -9.537 -28.672 -9.537 QT
-29.406 -9.537 -30.016 -9.217 QT
-30.625 -8.896 -31.117 -8.357 QT
-31.609 -7.818 -31.938 -7.17 QT
-32.266 -6.521 -32.453 -5.693 QT
-32.641 -4.865 -32.688 -4.139 QT
-32.734 -3.412 -32.734 -2.303 QT
-32.313 -3.287 -31.539 -3.912 QT
-30.766 -4.537 -29.781 -4.537 QT
-28.719 -4.537 -27.844 -4.107 QT
-26.969 -3.678 -26.336 -2.912 QT
-25.703 -2.146 -25.367 -1.162 QT
-25.031 -0.178 -25.031 0.838 QT
-25.031 2.244 -25.656 3.518 QT
-26.281 4.791 -27.422 5.541 QT
-28.563 6.291 -30 6.291 QT
cp
-30 5.526 M
-29.078 5.526 -28.516 5.104 QT
-27.953 4.682 -27.688 3.986 QT
-27.422 3.291 -27.359 2.58 QT
-27.297 1.869 -27.297 0.838 QT
-27.297 -0.521 -27.422 -1.482 QT
-27.547 -2.443 -28.125 -3.178 QT
-28.703 -3.912 -29.875 -3.912 QT
-30.859 -3.912 -31.484 -3.256 QT
-32.109 -2.599 -32.399 -1.599 QT
-32.688 -0.599 -32.688 0.338 QT
-32.688 0.651 -32.656 0.807 QT
-32.656 0.854 -32.664 0.877 QT
-32.672 0.901 -32.688 0.932 QT
-32.688 1.963 -32.477 3.018 QT
-32.266 4.072 -31.664 4.799 QT
-31.063 5.526 -30 5.526 QT
cp}def
f-1757710027
f
GR
GS
[0.75 0 0 0.75 80.65001 59.14285] CT
0.149 GC
N
f-1890641509
f
GR
GS
[0.75 0 0 0.75 80.65001 59.14285] CT
0.149 GC
N
f1219663315
f
GR
GS
[0 -0.75 0.75 0 50.64991 119.99992] CT
0.149 GC
N
/f697913506{-60.924 -9.504 M
-60.924 -10.426 L
-58.237 -10.426 -58.237 -11.238 QT
-58.237 -25.52 L
-58.237 -26.348 -60.924 -26.348 QT
-60.924 -27.27 L
-52.752 -27.27 L
-51.299 -27.27 -49.69 -26.738 QT
-48.08 -26.207 -47.002 -25.129 QT
-45.924 -24.051 -45.924 -22.551 QT
-45.924 -21.457 -46.58 -20.606 QT
-47.237 -19.754 -48.26 -19.176 QT
-49.283 -18.598 -50.346 -18.348 QT
-49.174 -17.942 -48.299 -17.051 QT
-47.424 -16.16 -47.252 -15.02 QT
-46.877 -12.707 L
-46.627 -11.145 -46.346 -10.379 QT
-46.065 -9.613 -45.112 -9.613 QT
-44.299 -9.613 -43.901 -10.363 QT
-43.502 -11.113 -43.502 -12.004 QT
-43.502 -12.098 -43.416 -12.168 QT
-43.33 -12.238 -43.252 -12.238 QT
-43.002 -12.238 L
-42.752 -12.238 -42.752 -11.895 QT
-42.752 -11.176 -43.033 -10.496 QT
-43.315 -9.817 -43.838 -9.371 QT
-44.362 -8.926 -45.096 -8.926 QT
-46.971 -8.926 -48.322 -9.863 QT
-49.674 -10.801 -49.674 -12.598 QT
-49.674 -14.91 L
-49.674 -16.207 -50.572 -17.137 QT
-51.471 -18.067 -52.783 -18.067 QT
-55.908 -18.067 L
-55.908 -11.238 L
-55.908 -10.426 -53.221 -10.426 QT
-53.221 -9.504 L
-60.924 -9.504 L
cp
-55.908 -18.738 M
-53.127 -18.738 L
-50.971 -18.738 -49.838 -19.606 QT
-48.705 -20.473 -48.705 -22.551 QT
-48.705 -24.629 -49.822 -25.488 QT
-50.94 -26.348 -53.127 -26.348 QT
-54.58 -26.348 L
-55.049 -26.348 -55.315 -26.309 QT
-55.58 -26.27 -55.744 -26.09 QT
-55.908 -25.91 -55.908 -25.52 QT
-55.908 -18.738 L
cp}def
f697913506
f
GR
GS
[0 -0.75 0.75 0 50.64991 119.99992] CT
0.149 GC
N
/f1025962467{-41.303 -12.051 M
-41.303 -13.598 -40.084 -14.574 QT
-38.866 -15.551 -37.163 -15.949 QT
-35.459 -16.348 -33.913 -16.348 QT
-33.913 -17.41 L
-33.913 -18.16 -34.249 -18.863 QT
-34.584 -19.567 -35.202 -20.02 QT
-35.819 -20.473 -36.569 -20.473 QT
-38.303 -20.473 -39.194 -19.692 QT
-38.709 -19.692 -38.381 -19.324 QT
-38.053 -18.957 -38.053 -18.457 QT
-38.053 -17.942 -38.42 -17.567 QT
-38.788 -17.192 -39.303 -17.192 QT
-39.819 -17.192 -40.186 -17.567 QT
-40.553 -17.942 -40.553 -18.457 QT
-40.553 -19.832 -39.311 -20.496 QT
-38.069 -21.16 -36.569 -21.16 QT
-35.522 -21.16 -34.452 -20.707 QT
-33.381 -20.254 -32.702 -19.418 QT
-32.022 -18.582 -32.022 -17.457 QT
-32.022 -11.613 L
-32.022 -11.098 -31.811 -10.676 QT
-31.6 -10.254 -31.147 -10.254 QT
-30.709 -10.254 -30.499 -10.684 QT
-30.288 -11.113 -30.288 -11.613 QT
-30.288 -13.27 L
-29.522 -13.27 L
-29.522 -11.613 L
-29.522 -11.035 -29.827 -10.504 QT
-30.131 -9.973 -30.647 -9.66 QT
-31.163 -9.348 -31.756 -9.348 QT
-32.522 -9.348 -33.077 -9.942 QT
-33.631 -10.535 -33.694 -11.348 QT
-34.178 -10.363 -35.116 -9.785 QT
-36.053 -9.207 -37.116 -9.207 QT
-38.116 -9.207 -39.069 -9.504 QT
-40.022 -9.801 -40.663 -10.426 QT
-41.303 -11.051 -41.303 -12.051 QT
cp
-39.194 -12.051 M
-39.194 -11.145 -38.522 -10.52 QT
-37.85 -9.895 -36.944 -9.895 QT
-36.1 -9.895 -35.413 -10.317 QT
-34.725 -10.738 -34.319 -11.457 QT
-33.913 -12.176 -33.913 -12.988 QT
-33.913 -15.692 L
-35.1 -15.692 -36.334 -15.301 QT
-37.569 -14.91 -38.381 -14.09 QT
-39.194 -13.27 -39.194 -12.051 QT
cp}def
f1025962467
f
GR
GS
[0 -0.75 0.75 0 50.64991 119.99992] CT
0.149 GC
N
/f-2138788715{-28.369 -9.504 M
-28.369 -10.426 L
-27.494 -10.426 -26.916 -10.559 QT
-26.338 -10.692 -26.338 -11.238 QT
-26.338 -18.348 L
-26.338 -19.035 -26.548 -19.348 QT
-26.759 -19.66 -27.158 -19.731 QT
-27.556 -19.801 -28.369 -19.801 QT
-28.369 -20.707 L
-24.603 -20.988 L
-24.603 -18.457 L
-24.088 -19.567 -23.064 -20.278 QT
-22.041 -20.988 -20.838 -20.988 QT
-19.025 -20.988 -18.119 -20.129 QT
-17.213 -19.27 -17.213 -17.488 QT
-17.213 -11.238 L
-17.213 -10.692 -16.642 -10.559 QT
-16.072 -10.426 -15.181 -10.426 QT
-15.181 -9.504 L
-21.134 -9.504 L
-21.134 -10.426 L
-20.244 -10.426 -19.673 -10.559 QT
-19.103 -10.692 -19.103 -11.238 QT
-19.103 -17.41 L
-19.103 -18.676 -19.47 -19.496 QT
-19.838 -20.317 -20.994 -20.317 QT
-22.494 -20.317 -23.47 -19.113 QT
-24.447 -17.91 -24.447 -16.379 QT
-24.447 -11.238 L
-24.447 -10.692 -23.869 -10.559 QT
-23.291 -10.426 -22.416 -10.426 QT
-22.416 -9.504 L
-28.369 -9.504 L
cp}def
f-2138788715
f
GR
GS
[0 -0.75 0.75 0 50.64991 119.99992] CT
0.149 GC
N
/f-1929507990{-13.765 -7.473 M
-13.765 -8.395 -13.093 -9.09 QT
-12.421 -9.785 -11.483 -10.082 QT
-12.015 -10.473 -12.28 -11.067 QT
-12.546 -11.66 -12.546 -12.332 QT
-12.546 -13.551 -11.78 -14.488 QT
-12.968 -15.66 -12.968 -17.176 QT
-12.968 -17.988 -12.624 -18.699 QT
-12.28 -19.41 -11.655 -19.926 QT
-11.03 -20.442 -10.265 -20.715 QT
-9.499 -20.988 -8.702 -20.988 QT
-7.155 -20.988 -5.921 -20.098 QT
-5.39 -20.66 -4.663 -20.973 QT
-3.936 -21.285 -3.14 -21.285 QT
-2.593 -21.285 -2.233 -20.887 QT
-1.874 -20.488 -1.874 -19.926 QT
-1.874 -19.613 -2.116 -19.371 QT
-2.358 -19.129 -2.671 -19.129 QT
-2.999 -19.129 -3.241 -19.371 QT
-3.483 -19.613 -3.483 -19.926 QT
-3.483 -20.41 -3.171 -20.598 QT
-4.515 -20.598 -5.483 -19.676 QT
-5.015 -19.207 -4.726 -18.528 QT
-4.436 -17.848 -4.436 -17.176 QT
-4.436 -16.067 -5.046 -15.184 QT
-5.655 -14.301 -6.655 -13.817 QT
-7.655 -13.332 -8.702 -13.332 QT
-10.124 -13.332 -11.311 -14.098 QT
-11.671 -13.598 -11.671 -12.957 QT
-11.671 -12.27 -11.226 -11.754 QT
-10.78 -11.238 -10.093 -11.238 QT
-7.952 -11.238 L
-6.405 -11.238 -5.163 -10.965 QT
-3.921 -10.692 -3.077 -9.848 QT
-2.233 -9.004 -2.233 -7.473 QT
-2.233 -6.332 -3.194 -5.574 QT
-4.155 -4.817 -5.499 -4.481 QT
-6.843 -4.145 -7.983 -4.145 QT
-9.14 -4.145 -10.483 -4.481 QT
-11.827 -4.817 -12.796 -5.574 QT
-13.765 -6.332 -13.765 -7.473 QT
cp
-12.296 -7.473 M
-12.296 -6.598 -11.585 -6.004 QT
-10.874 -5.41 -9.874 -5.129 QT
-8.874 -4.848 -7.983 -4.848 QT
-7.108 -4.848 -6.108 -5.129 QT
-5.108 -5.41 -4.397 -6.004 QT
-3.686 -6.598 -3.686 -7.473 QT
-3.686 -8.832 -4.936 -9.231 QT
-6.186 -9.629 -7.952 -9.629 QT
-10.093 -9.629 L
-10.686 -9.629 -11.186 -9.348 QT
-11.686 -9.067 -11.991 -8.551 QT
-12.296 -8.035 -12.296 -7.473 QT
cp
-8.702 -14.02 M
-6.499 -14.02 -6.499 -17.176 QT
-6.499 -18.535 -6.968 -19.418 QT
-7.436 -20.301 -8.702 -20.301 QT
-9.983 -20.301 -10.452 -19.418 QT
-10.921 -18.535 -10.921 -17.176 QT
-10.921 -16.317 -10.741 -15.613 QT
-10.561 -14.91 -10.077 -14.465 QT
-9.593 -14.02 -8.702 -14.02 QT
cp}def
f-1929507990
f
GR
GS
[0 -0.75 0.75 0 50.64991 119.99992] CT
0.149 GC
N
/f-756511173{5.185 -9.207 M
3.607 -9.207 2.279 -10.043 QT
0.951 -10.879 0.193 -12.27 QT
-0.565 -13.66 -0.565 -15.207 QT
-0.565 -16.723 0.131 -18.098 QT
0.826 -19.473 2.06 -20.317 QT
3.295 -21.16 4.826 -21.16 QT
6.014 -21.16 6.896 -20.762 QT
7.779 -20.363 8.35 -19.653 QT
8.92 -18.942 9.217 -17.973 QT
9.514 -17.004 9.514 -15.848 QT
9.514 -15.504 9.248 -15.504 QT
1.717 -15.504 L
1.717 -15.223 L
1.717 -13.067 2.584 -11.52 QT
3.451 -9.973 5.42 -9.973 QT
6.217 -9.973 6.896 -10.332 QT
7.576 -10.692 8.076 -11.324 QT
8.576 -11.957 8.764 -12.676 QT
8.779 -12.77 8.85 -12.84 QT
8.92 -12.91 9.014 -12.91 QT
9.248 -12.91 L
9.514 -12.91 9.514 -12.582 QT
9.139 -11.098 7.92 -10.153 QT
6.701 -9.207 5.185 -9.207 QT
cp
1.732 -16.16 M
7.67 -16.16 L
7.67 -17.129 7.396 -18.137 QT
7.123 -19.145 6.49 -19.809 QT
5.857 -20.473 4.826 -20.473 QT
3.357 -20.473 2.545 -19.098 QT
1.732 -17.723 1.732 -16.16 QT
cp}def
f-756511173
f
GR
GS
[0 -0.75 0.75 0 50.64991 119.99992] CT
0.149 GC
N
/f1000289451{27.313 -3.051 M
25.859 -4.192 24.813 -5.676 QT
23.766 -7.16 23.102 -8.832 QT
22.438 -10.504 22.109 -12.332 QT
21.781 -14.16 21.781 -16.004 QT
21.781 -17.863 22.109 -19.692 QT
22.438 -21.52 23.117 -23.215 QT
23.797 -24.91 24.852 -26.379 QT
25.906 -27.848 27.313 -28.957 QT
27.313 -29.004 27.438 -29.004 QT
27.688 -29.004 L
27.75 -29.004 27.82 -28.934 QT
27.891 -28.863 27.891 -28.77 QT
27.891 -28.66 27.828 -28.613 QT
26.563 -27.363 25.719 -25.942 QT
24.875 -24.52 24.359 -22.918 QT
23.844 -21.317 23.617 -19.59 QT
23.391 -17.863 23.391 -16.004 QT
23.391 -7.738 27.813 -3.442 QT
27.891 -3.379 27.891 -3.238 QT
27.891 -3.176 27.82 -3.09 QT
27.75 -3.004 27.688 -3.004 QT
27.438 -3.004 L
27.313 -3.004 27.313 -3.051 QT
cp}def
f1000289451
f
GR
GS
[0 -0.75 0.75 0 50.64991 119.99992] CT
0.149 GC
N
/f-1702725103{30.298 -9.504 M
30.298 -10.426 L
31.173 -10.426 31.751 -10.559 QT
32.329 -10.692 32.329 -11.238 QT
32.329 -18.348 L
32.329 -19.035 32.118 -19.348 QT
31.907 -19.66 31.509 -19.731 QT
31.11 -19.801 30.298 -19.801 QT
30.298 -20.707 L
34.064 -20.988 L
34.064 -18.457 L
34.579 -19.567 35.603 -20.278 QT
36.626 -20.988 37.829 -20.988 QT
40.829 -20.988 41.345 -18.551 QT
41.876 -19.645 42.876 -20.317 QT
43.876 -20.988 45.064 -20.988 QT
46.251 -20.988 47.056 -20.613 QT
47.86 -20.238 48.267 -19.457 QT
48.673 -18.676 48.673 -17.488 QT
48.673 -11.238 L
48.673 -10.692 49.251 -10.559 QT
49.829 -10.426 50.704 -10.426 QT
50.704 -9.504 L
44.751 -9.504 L
44.751 -10.426 L
45.642 -10.426 46.212 -10.559 QT
46.782 -10.692 46.782 -11.238 QT
46.782 -17.41 L
46.782 -18.723 46.415 -19.52 QT
46.048 -20.317 44.907 -20.317 QT
43.407 -20.317 42.431 -19.113 QT
41.454 -17.91 41.454 -16.379 QT
41.454 -11.238 L
41.454 -10.692 42.025 -10.559 QT
42.595 -10.426 43.485 -10.426 QT
43.485 -9.504 L
37.532 -9.504 L
37.532 -10.426 L
38.423 -10.426 38.993 -10.559 QT
39.564 -10.692 39.564 -11.238 QT
39.564 -17.41 L
39.564 -18.676 39.196 -19.496 QT
38.829 -20.317 37.673 -20.317 QT
36.173 -20.317 35.196 -19.113 QT
34.22 -17.91 34.22 -16.379 QT
34.22 -11.238 L
34.22 -10.692 34.798 -10.559 QT
35.376 -10.426 36.251 -10.426 QT
36.251 -9.504 L
30.298 -9.504 L
cp}def
f-1702725103
f
GR
GS
[0 -0.75 0.75 0 50.64991 119.99992] CT
0.149 GC
N
/f1655991986{53.204 -3.004 M
52.97 -3.004 52.97 -3.238 QT
52.97 -3.348 53.032 -3.395 QT
57.47 -7.738 57.47 -16.004 QT
57.47 -24.27 53.079 -28.567 QT
52.97 -28.629 52.97 -28.77 QT
52.97 -28.863 53.04 -28.934 QT
53.111 -29.004 53.204 -29.004 QT
53.454 -29.004 L
53.517 -29.004 53.579 -28.957 QT
55.439 -27.488 56.681 -25.379 QT
57.923 -23.27 58.501 -20.879 QT
59.079 -18.488 59.079 -16.004 QT
59.079 -14.16 58.767 -12.379 QT
58.454 -10.598 57.782 -8.863 QT
57.111 -7.129 56.064 -5.66 QT
55.017 -4.192 53.579 -3.051 QT
53.517 -3.004 53.454 -3.004 QT
53.204 -3.004 L
cp}def
f1655991986
f
GR
GS
[0.75 0 0 0.75 0 0] CT
1 0.843 0 RC
1 LJ
8 LW
N
114.918 115.402 M
115 115.405 L
120.277 166.382 L
125.554 170.26 L
130.831 171.348 L
136.108 178.057 L
141.385 175.842 L
146.662 183.162 L
151.938 187.248 L
157.215 187.688 L
S
GR
GS
[0.75 0 0 0.75 0 0] CT
1 0.843 0 RC
1 LJ
8 LW
N
167.769 199.273 M
173.046 202.609 L
178.323 205.541 L
183.6 206.967 L
188.877 215.847 L
194.154 222.024 L
199.431 222.118 L
204.708 222.152 L
S
GR
GS
[0.75 0 0 0.75 0 0] CT
1 0.843 0 RC
1 LJ
8 LW
N
220.538 187.645 M
225.815 186.435 L
S
GR
GS
[0.75 0 0 0.75 0 0] CT
1 0.843 0 RC
1 LJ
8 LW
N
246.923 168.476 M
252.2 152.557 L
257.477 151.134 L
262.754 150.709 L
268.031 148.672 L
273.308 148.28 L
278.585 146.375 L
283.862 141.49 L
289.138 125.543 L
294.415 124.445 L
S
GR
GS
[0.75 0 0 0.75 0 0] CT
1 0.843 0 RC
1 LJ
8 LW
N
304.969 128.008 M
310.246 127.926 L
315.523 128.219 L
S
GR
GS
[0.75 0 0 0.75 0 0] CT
1 0.843 0 RC
1 LJ
8 LW
N
373.569 133.4 M
378.846 127.427 L
384.123 128.069 L
389.4 130.109 L
394.677 131.701 L
399.954 131.651 L
405.231 132.697 L
410.508 133.84 L
415.785 133.944 L
421.062 134.963 L
426.338 135.064 L
431.615 135.992 L
436.892 136.146 L
442.169 138.117 L
447.446 138.133 L
S
GR
GS
[0.75 0 0 0.75 0 0] CT
1 0.843 0 RC
1 LJ
8 LW
N
473.831 170.938 M
479.108 180.69 L
484.385 186.947 L
489.662 187.631 L
494.938 190.302 L
500.215 188.918 L
S
GR
GS
[0.75 0 0 0.75 0 0] CT
1 0.843 0 RC
1 LJ
8 LW
N
579.369 197.27 M
584.646 197.702 L
589.923 198.181 L
595.2 199.816 L
600.477 201.861 L
605.754 202.995 L
611.031 203.002 L
616.308 226.093 L
621.585 227.132 L
626.862 229.133 L
632.138 228.871 L
637.415 231.727 L
642.692 231.882 L
647.969 231.928 L
653.246 232.902 L
658.523 232.972 L
663.8 233.316 L
669.077 233.826 L
674.354 234.082 L
679.631 234.42 L
684.908 235.289 L
690.185 235.172 L
695.462 237.925 L
700.738 239.166 L
706.015 237.341 L
711.292 238.109 L
716.569 236.153 L
721.846 235.094 L
727.123 236.964 L
732.4 237.113 L
737.677 237.311 L
742.954 240.201 L
748.231 244.412 L
753.508 244.734 L
758.785 244.521 L
764.062 246.343 L
769.338 248.509 L
774.615 248.17 L
779.892 250.993 L
785.169 251.472 L
790.446 251.375 L
795.723 242.939 L
801 241.957 L
801.082 241.958 L
S
GR
GS
[0.75 0 0 0.75 0 0] CT
0.929 0.694 0.125 RC
1 LJ
2.667 LW
N
114.918 129.423 M
115 129.453 L
120.277 165.343 L
125.554 168.175 L
130.831 170.761 L
136.108 175.778 L
141.385 177.155 L
146.662 181.749 L
151.938 186.347 L
157.215 186.75 L
162.492 189.072 L
167.769 197.547 L
173.046 200.906 L
178.323 203.301 L
183.6 204.91 L
188.877 213.698 L
194.154 222.758 L
199.431 222.607 L
204.708 222.65 L
209.985 194.444 L
215.262 190.339 L
220.538 185.118 L
225.815 183.866 L
231.092 180.445 L
236.369 179.748 L
241.646 178.263 L
246.923 164.556 L
252.2 149.59 L
257.477 148.173 L
262.754 147.913 L
268.031 145.907 L
273.308 145.287 L
278.585 143.439 L
283.862 138.671 L
289.138 122.922 L
294.415 122.998 L
299.692 121.651 L
304.969 127.746 L
310.246 127.509 L
315.523 127.869 L
320.8 128.762 L
326.077 130.725 L
331.354 130.774 L
336.631 132.547 L
341.908 122.661 L
347.185 129.359 L
S
GR
GS
[0.75 0 0 0.75 0 0] CT
0.929 0.694 0.125 RC
1 LJ
2.667 LW
N
368.292 131.053 M
373.569 129.559 L
378.846 128.24 L
384.123 128.536 L
389.4 129.662 L
394.677 131.378 L
399.954 131.364 L
405.231 132.237 L
410.508 133.34 L
415.785 133.462 L
421.062 134.419 L
426.338 134.541 L
431.615 135.423 L
436.892 135.551 L
442.169 137.524 L
447.446 137.54 L
452.723 138.275 L
458 138.476 L
463.277 138.689 L
468.554 153.789 L
473.831 171.401 L
479.108 181.276 L
484.385 187.765 L
489.662 187.872 L
494.938 189.237 L
500.215 189.327 L
505.492 192.609 L
510.769 194.324 L
516.046 194.113 L
521.323 193.736 L
526.6 194.022 L
531.877 194.923 L
537.154 193.48 L
542.431 194.555 L
547.708 194.096 L
552.985 194.19 L
558.262 194.299 L
563.538 194.523 L
568.815 194.581 L
574.092 194.55 L
579.369 197.153 L
584.646 197.744 L
589.923 198.148 L
595.2 199.832 L
600.477 201.36 L
605.754 202.567 L
611.031 202.695 L
616.308 225.956 L
621.585 227.254 L
626.862 228.235 L
632.138 228.447 L
637.415 231.361 L
642.692 231.573 L
647.969 231.701 L
653.246 232.366 L
658.523 232.452 L
663.8 232.93 L
669.077 234.583 L
674.354 234.913 L
679.631 235.247 L
684.908 235.73 L
690.185 235.83 L
695.462 236.217 L
700.738 236.441 L
706.015 235.965 L
711.292 236.08 L
716.569 236.335 L
721.846 236.677 L
727.123 238.421 L
732.4 237.978 L
737.677 238.071 L
742.954 240.81 L
748.231 240.965 L
753.508 241.336 L
758.785 241.438 L
764.062 243.686 L
769.338 244.904 L
774.615 246.121 L
779.892 247.931 L
785.169 249.679 L
790.446 249.598 L
795.723 241.543 L
801 240.964 L
801.082 240.962 L
S
GR
GS
[0.75 0 0 0.75 0 0] CT
0.494 0.184 0.557 RC
1 LJ
2.667 LW
N
114.918 129.423 M
115 129.453 L
120.277 165.343 L
125.554 168.175 L
130.831 170.761 L
136.108 175.778 L
141.385 177.155 L
146.662 181.749 L
151.938 186.347 L
157.215 186.75 L
162.492 189.072 L
167.769 197.547 L
173.046 200.906 L
178.323 203.301 L
183.6 204.91 L
188.877 213.698 L
194.154 222.758 L
199.431 222.607 L
204.708 222.65 L
209.985 194.444 L
215.262 190.339 L
220.538 185.118 L
225.815 183.866 L
231.092 180.445 L
236.369 179.748 L
241.646 178.263 L
246.923 164.556 L
252.2 149.59 L
257.477 148.173 L
262.754 147.913 L
268.031 145.907 L
273.308 145.287 L
278.585 143.439 L
283.862 138.671 L
289.138 122.922 L
294.415 122.998 L
299.692 121.651 L
304.969 127.746 L
310.246 127.509 L
315.523 127.869 L
320.8 128.762 L
326.077 130.725 L
331.354 130.774 L
336.631 132.547 L
341.908 122.661 L
347.185 129.359 L
S
GR
GS
[0.75 0 0 0.75 0 0] CT
0.494 0.184 0.557 RC
1 LJ
2.667 LW
N
368.292 131.053 M
373.569 129.559 L
378.846 128.24 L
384.123 128.536 L
389.4 129.662 L
394.677 131.378 L
399.954 131.364 L
405.231 132.237 L
410.508 133.34 L
415.785 133.462 L
421.062 134.419 L
426.338 134.541 L
431.615 135.423 L
436.892 135.551 L
442.169 137.524 L
447.446 137.54 L
452.723 138.275 L
458 138.476 L
463.277 138.689 L
468.554 153.789 L
473.831 171.401 L
479.108 181.276 L
484.385 187.765 L
489.662 187.872 L
494.938 189.237 L
500.215 189.327 L
505.492 192.609 L
510.769 194.324 L
516.046 194.113 L
521.323 193.736 L
526.6 194.022 L
531.877 194.923 L
537.154 193.48 L
542.431 194.555 L
547.708 194.096 L
552.985 194.19 L
558.262 194.299 L
563.538 194.523 L
568.815 194.581 L
574.092 194.55 L
579.369 197.153 L
584.646 197.744 L
589.923 198.148 L
595.2 199.832 L
600.477 201.36 L
605.754 202.567 L
611.031 202.695 L
616.308 225.956 L
621.585 227.254 L
626.862 228.235 L
632.138 228.447 L
637.415 231.361 L
642.692 231.573 L
647.969 231.701 L
653.246 232.366 L
658.523 232.452 L
663.8 232.93 L
669.077 234.583 L
674.354 234.913 L
679.631 235.247 L
684.908 235.73 L
690.185 235.83 L
695.462 236.217 L
700.738 236.441 L
706.015 235.965 L
711.292 236.08 L
716.569 236.335 L
721.846 236.677 L
727.123 238.421 L
732.4 237.978 L
737.677 238.071 L
742.954 240.81 L
748.231 240.965 L
753.508 241.336 L
758.785 241.438 L
764.062 243.686 L
769.338 244.904 L
774.615 246.121 L
779.892 247.931 L
785.169 249.679 L
790.446 249.598 L
795.723 241.543 L
801 240.964 L
801.082 240.962 L
S
GR
GS
[0.75 0 0 0.75 0 0] CT
0.467 0.675 0.188 RC
1 LJ
2.667 LW
N
114.918 128.37 M
115 128.4 L
120.277 164.061 L
125.554 167.137 L
130.831 168.864 L
136.108 174.756 L
141.385 175.251 L
146.662 179.574 L
151.938 184.698 L
157.215 185.118 L
S
GR
GS
[0.75 0 0 0.75 0 0] CT
0.467 0.675 0.188 RC
1 LJ
2.667 LW
N
167.769 195.464 M
173.046 198.885 L
178.323 201.333 L
183.6 202.96 L
188.877 214.487 L
194.154 219.988 L
199.431 219.797 L
204.708 219.89 L
S
GR
GS
[0.75 0 0 0.75 0 0] CT
0.467 0.675 0.188 RC
1 LJ
2.667 LW
N
220.538 184.453 M
225.815 183.202 L
S
GR
GS
[0.75 0 0 0.75 0 0] CT
0.467 0.675 0.188 RC
1 LJ
2.667 LW
N
246.923 165.496 M
252.2 149.682 L
257.477 147.805 L
262.754 147.549 L
268.031 145.528 L
273.308 144.898 L
278.585 143.035 L
283.862 138.257 L
289.138 122.385 L
294.415 124.564 L
S
GR
GS
[0.75 0 0 0.75 0 0] CT
0.467 0.675 0.188 RC
1 LJ
2.667 LW
N
304.969 129.539 M
310.246 129.338 L
315.523 129.735 L
S
GR
GS
[0.75 0 0 0.75 0 0] CT
0.467 0.675 0.188 RC
1 LJ
2.667 LW
N
373.569 130.526 M
378.846 129.583 L
384.123 129.869 L
389.4 129.51 L
394.677 131.469 L
399.954 131.452 L
405.231 131.964 L
410.508 133.033 L
415.785 133.169 L
421.062 134.163 L
426.338 134.275 L
431.615 135.192 L
436.892 135.316 L
442.169 137.614 L
447.446 137.632 L
S
GR
GS
[0.75 0 0 0.75 0 0] CT
0.467 0.675 0.188 RC
1 LJ
2.667 LW
N
473.831 173.114 M
479.108 182.975 L
484.385 189.492 L
489.662 189.595 L
494.938 190.305 L
500.215 190.938 L
S
GR
GS
[0.75 0 0 0.75 0 0] CT
0.467 0.675 0.188 RC
1 LJ
2.667 LW
N
579.369 198.543 M
584.646 199.149 L
589.923 199.554 L
595.2 199.622 L
600.477 201.17 L
605.754 202.374 L
611.031 202.448 L
616.308 227.273 L
621.585 228.099 L
626.862 229.148 L
632.138 229.771 L
637.415 232.688 L
642.692 232.873 L
647.969 233.003 L
653.246 233.624 L
658.523 233.715 L
663.8 234.179 L
669.077 234.807 L
674.354 235.121 L
679.631 235.406 L
684.908 235.801 L
690.185 235.968 L
695.462 236.599 L
700.738 236.731 L
706.015 236.188 L
711.292 236.424 L
716.569 236.058 L
721.846 236.695 L
727.123 238.959 L
732.4 238.229 L
737.677 238.583 L
742.954 241.314 L
748.231 246.121 L
753.508 243.437 L
758.785 246.996 L
764.062 242.846 L
769.338 243.983 L
774.615 247.28 L
779.892 249.586 L
785.169 249.439 L
790.446 249.291 L
795.723 241.231 L
801 239.949 L
801.082 239.947 L
S
GR
GS
[0.75 0 0 0.75 0 0] CT
1 0 0 RC
1 LJ
2.667 LW
N
114.918 145.84 M
115 145.843 L
120.277 165.851 L
125.554 168.465 L
130.831 171.063 L
136.108 175.843 L
141.385 176.99 L
146.662 182.394 L
151.938 187.34 L
157.215 187.842 L
162.492 189.634 L
167.769 197.894 L
173.046 202.19 L
178.323 202.83 L
183.6 204.983 L
188.877 213.716 L
194.154 223.873 L
199.431 223.741 L
204.708 223.678 L
209.985 196.136 L
215.262 190.671 L
220.538 184.815 L
225.815 183.587 L
231.092 180.259 L
236.369 179.635 L
241.646 178.418 L
246.923 163.923 L
252.2 149.11 L
257.477 147.98 L
262.754 147.764 L
268.031 145.587 L
273.308 144.914 L
278.585 143.298 L
283.862 138.612 L
289.138 122.748 L
294.415 123.35 L
299.692 123.877 L
304.969 127.885 L
310.246 128.009 L
315.523 128.459 L
320.8 130.267 L
326.077 130.343 L
331.354 130.24 L
336.631 130.325 L
341.908 130.404 L
347.185 130.658 L
352.462 130.119 L
357.738 130.919 L
363.015 130.551 L
368.292 130.864 L
373.569 129.534 L
378.846 129.414 L
384.123 129.08 L
389.4 129.887 L
394.677 131.565 L
399.954 131.669 L
405.231 132.38 L
410.508 133.243 L
415.785 133.339 L
421.062 134.352 L
426.338 134.509 L
431.615 135.392 L
436.892 135.54 L
442.169 136.717 L
447.446 136.867 L
452.723 138.24 L
458 138.46 L
463.277 138.658 L
468.554 153.936 L
473.831 171.239 L
479.108 181.112 L
484.385 187.683 L
489.662 187.925 L
494.938 189.235 L
500.215 189.3 L
505.492 193.213 L
510.769 193.704 L
516.046 193.673 L
521.323 193.592 L
526.6 193.512 L
531.877 193.611 L
537.154 193.643 L
542.431 193.812 L
547.708 193.858 L
552.985 193.878 L
558.262 193.883 L
563.538 193.551 L
568.815 193.555 L
574.092 193.567 L
579.369 196.73 L
584.646 197.148 L
589.923 197.707 L
595.2 200.447 L
600.477 201.635 L
605.754 202.742 L
611.031 203.162 L
616.308 225.933 L
621.585 228.089 L
626.862 228.279 L
632.138 228.447 L
637.415 231.294 L
642.692 231.455 L
647.969 231.583 L
653.246 232.35 L
658.523 232.481 L
663.8 232.934 L
669.077 233.903 L
674.354 234.598 L
679.631 234.713 L
684.908 235.058 L
690.185 235.206 L
695.462 235.354 L
700.738 235.305 L
706.015 235.452 L
711.292 235.584 L
716.569 235.518 L
721.846 235.547 L
727.123 237.499 L
732.4 237.685 L
737.677 238.086 L
742.954 240.102 L
748.231 241.211 L
753.508 241.749 L
758.785 241.972 L
764.062 243.508 L
769.338 244.469 L
774.615 245.427 L
779.892 247.135 L
785.169 250.505 L
790.446 250.406 L
795.723 240.628 L
801 240.49 L
801.082 240.493 L
S
GR
GS
[0.75 0 0 0.75 0 0] CT
1 GC
N
786 202 M
786 68 L
639 68 L
639 202 L
cp
f
GR
GS
[0.75 0 0 0.75 516.8177 62.1] CT
N
/f-1657957548{0.547 5.12 M
0.547 4.386 L
2.813 4.386 2.813 3.714 QT
2.813 -7.818 L
2.813 -8.489 0.547 -8.489 QT
0.547 -9.224 L
7.031 -9.224 L
7.031 -8.489 L
4.766 -8.489 4.766 -7.818 QT
4.766 3.714 L
4.766 4.386 7.031 4.386 QT
7.031 5.12 L
0.547 5.12 L
cp}def
f-1657957548
f
GR
GS
[0.75 0 0 0.75 516.8177 62.1] CT
N
/f-1984996643{8.376 5.12 M
8.376 4.386 L
10.251 4.386 10.688 3.136 QT
15.094 -9.693 L
15.157 -9.911 15.438 -9.911 QT
15.704 -9.911 L
15.985 -9.911 16.047 -9.693 QT
20.641 3.714 L
20.844 4.151 21.391 4.268 QT
21.938 4.386 22.751 4.386 QT
22.751 5.12 L
16.907 5.12 L
16.907 4.386 L
18.641 4.386 18.641 3.823 QT
18.641 3.714 L
17.501 0.432 L
12.407 0.432 L
11.469 3.136 L
11.454 3.214 11.454 3.354 QT
11.454 3.886 11.946 4.136 QT
12.438 4.386 13.016 4.386 QT
13.016 5.12 L
8.376 5.12 L
cp
12.657 -0.302 M
17.266 -0.302 L
14.954 -7.005 L
12.657 -0.302 L
cp}def
f-1984996643
f
GR
GS
[0.75 0 0 0.75 516.8177 62.1] CT
N
/f-1025401139{24.407 5.12 M
24.407 4.386 L
26.563 4.386 26.563 3.714 QT
26.563 -7.818 L
26.563 -8.489 24.407 -8.489 QT
24.407 -9.224 L
31.001 -9.224 L
32.172 -9.224 33.469 -8.802 QT
34.766 -8.38 35.641 -7.505 QT
36.516 -6.63 36.516 -5.427 QT
36.516 -4.536 35.985 -3.849 QT
35.454 -3.161 34.626 -2.693 QT
33.797 -2.224 32.938 -2.021 QT
33.891 -1.693 34.594 -0.974 QT
35.297 -0.255 35.438 0.667 QT
35.735 2.542 L
35.954 3.792 36.172 4.417 QT
36.391 5.042 37.172 5.042 QT
37.829 5.042 38.149 4.432 QT
38.469 3.823 38.469 3.104 QT
38.469 3.026 38.54 2.971 QT
38.61 2.917 38.672 2.917 QT
38.876 2.917 L
39.079 2.917 39.079 3.198 QT
39.079 3.761 38.852 4.315 QT
38.626 4.87 38.196 5.229 QT
37.766 5.589 37.188 5.589 QT
35.672 5.589 34.579 4.831 QT
33.485 4.073 33.485 2.62 QT
33.485 0.745 L
33.485 -0.302 32.758 -1.044 QT
32.032 -1.786 30.969 -1.786 QT
28.454 -1.786 L
28.454 3.714 L
28.454 4.386 30.61 4.386 QT
30.61 5.12 L
24.407 5.12 L
cp
28.454 -2.333 M
30.704 -2.333 L
32.438 -2.333 33.352 -3.036 QT
34.266 -3.739 34.266 -5.427 QT
34.266 -7.099 33.36 -7.794 QT
32.454 -8.489 30.704 -8.489 QT
29.516 -8.489 L
29.141 -8.489 28.93 -8.458 QT
28.719 -8.427 28.587 -8.279 QT
28.454 -8.13 28.454 -7.818 QT
28.454 -2.333 L
cp}def
f-1025401139
f
GR
GS
[0.75 0 0 0.75 0 0] CT
1 0.843 0 RC
1 LJ
8 LW
N
646.107 82.8 M
686.091 82.8 L
S
GR
GS
[0.75 0 0 0.75 516.8177 81.675] CT
N
/f1282608044{0.703 5.12 M
0.703 4.386 L
2.859 4.386 2.859 3.714 QT
2.859 -7.818 L
2.859 -8.489 0.703 -8.489 QT
0.703 -9.224 L
8.172 -9.224 L
9.328 -9.224 10.477 -8.755 QT
11.625 -8.286 12.367 -7.38 QT
13.109 -6.474 13.109 -5.271 QT
13.109 -4.114 12.359 -3.232 QT
11.609 -2.349 10.469 -1.888 QT
9.328 -1.427 8.172 -1.427 QT
4.813 -1.427 L
4.813 3.714 L
4.813 4.386 6.969 4.386 QT
6.969 5.12 L
0.703 5.12 L
cp
4.75 -2.052 M
7.594 -2.052 L
8.75 -2.052 9.469 -2.388 QT
10.188 -2.724 10.523 -3.427 QT
10.859 -4.13 10.859 -5.271 QT
10.859 -6.989 10.109 -7.739 QT
9.359 -8.489 7.594 -8.489 QT
5.813 -8.489 L
5.438 -8.489 5.227 -8.458 QT
5.016 -8.427 4.883 -8.279 QT
4.75 -8.13 4.75 -7.818 QT
4.75 -2.052 L
cp}def
f1282608044
f
GR
GS
[0.75 0 0 0.75 516.8177 81.675] CT
N
/f-574775429{15.222 5.12 M
15.222 4.386 L
17.378 4.386 17.378 3.714 QT
17.378 -7.818 L
17.378 -8.489 15.222 -8.489 QT
15.222 -9.224 L
21.815 -9.224 L
22.987 -9.224 24.284 -8.802 QT
25.581 -8.38 26.456 -7.505 QT
27.331 -6.63 27.331 -5.427 QT
27.331 -4.536 26.8 -3.849 QT
26.269 -3.161 25.44 -2.693 QT
24.612 -2.224 23.753 -2.021 QT
24.706 -1.693 25.409 -0.974 QT
26.112 -0.255 26.253 0.667 QT
26.55 2.542 L
26.769 3.792 26.987 4.417 QT
27.206 5.042 27.987 5.042 QT
28.644 5.042 28.964 4.432 QT
29.284 3.823 29.284 3.104 QT
29.284 3.026 29.354 2.971 QT
29.425 2.917 29.487 2.917 QT
29.69 2.917 L
29.894 2.917 29.894 3.198 QT
29.894 3.761 29.667 4.315 QT
29.44 4.87 29.011 5.229 QT
28.581 5.589 28.003 5.589 QT
26.487 5.589 25.394 4.831 QT
24.3 4.073 24.3 2.62 QT
24.3 0.745 L
24.3 -0.302 23.573 -1.044 QT
22.847 -1.786 21.784 -1.786 QT
19.269 -1.786 L
19.269 3.714 L
19.269 4.386 21.425 4.386 QT
21.425 5.12 L
15.222 5.12 L
cp
19.269 -2.333 M
21.519 -2.333 L
23.253 -2.333 24.167 -3.036 QT
25.081 -3.739 25.081 -5.427 QT
25.081 -7.099 24.175 -7.794 QT
23.269 -8.489 21.519 -8.489 QT
20.331 -8.489 L
19.956 -8.489 19.745 -8.458 QT
19.534 -8.427 19.401 -8.279 QT
19.269 -8.13 19.269 -7.818 QT
19.269 -2.333 L
cp}def
f-574775429
f
GR
GS
[0.75 0 0 0.75 0 0] CT
0.929 0.694 0.125 RC
1 LJ
2.667 LW
N
646.107 108.9 M
686.091 108.9 L
S
GR
GS
[0.75 0 0 0.75 516.8177 101.25] CT
N
/f1886913203{1.172 5.417 M
1.172 0.511 L
1.172 0.354 1.359 0.354 QT
1.625 0.354 L
1.688 0.354 1.734 0.401 QT
1.781 0.448 1.781 0.511 QT
1.781 2.573 3.063 3.706 QT
4.344 4.839 6.406 4.839 QT
7.141 4.839 7.758 4.417 QT
8.375 3.995 8.711 3.315 QT
9.047 2.636 9.047 1.917 QT
9.047 1.276 8.797 0.675 QT
8.547 0.073 8.063 -0.364 QT
7.578 -0.802 6.969 -0.958 QT
4.25 -1.614 L
2.891 -1.974 2.031 -3.091 QT
1.172 -4.208 1.172 -5.583 QT
1.172 -6.677 1.727 -7.63 QT
2.281 -8.583 3.219 -9.138 QT
4.156 -9.693 5.25 -9.693 QT
7.359 -9.693 8.594 -8.255 QT
9.453 -9.63 L
9.516 -9.693 9.594 -9.693 QT
9.734 -9.693 L
9.797 -9.693 9.859 -9.646 QT
9.922 -9.599 9.922 -9.505 QT
9.922 -4.646 L
9.922 -4.458 9.734 -4.458 QT
9.5 -4.458 L
9.297 -4.458 9.297 -4.646 QT
9.297 -5.177 9.117 -5.81 QT
8.938 -6.443 8.625 -7.029 QT
8.313 -7.614 7.938 -7.989 QT
6.922 -9.005 5.25 -9.005 QT
4.531 -9.005 3.93 -8.646 QT
3.328 -8.286 2.969 -7.661 QT
2.609 -7.036 2.609 -6.349 QT
2.609 -5.443 3.164 -4.708 QT
3.719 -3.974 4.625 -3.739 QT
7.359 -3.068 L
8.031 -2.911 8.633 -2.482 QT
9.234 -2.052 9.633 -1.489 QT
10.031 -0.927 10.258 -0.239 QT
10.484 0.448 10.484 1.198 QT
10.484 2.323 9.961 3.339 QT
9.438 4.354 8.484 4.971 QT
7.531 5.589 6.406 5.589 QT
5.719 5.589 4.984 5.432 QT
4.25 5.276 3.641 4.956 QT
3.031 4.636 2.516 4.136 QT
1.641 5.526 L
1.578 5.589 1.484 5.589 QT
1.359 5.589 L
1.172 5.589 1.172 5.417 QT
cp}def
f1886913203
f
GR
GS
[0.75 0 0 0.75 516.8177 101.25] CT
N
/f1818420723{12.555 5.12 M
12.555 4.386 L
14.711 4.386 14.711 3.714 QT
14.711 -7.818 L
14.711 -8.489 12.555 -8.489 QT
12.555 -9.224 L
20.289 -9.224 L
21.727 -9.224 22.914 -8.607 QT
24.102 -7.989 24.946 -6.95 QT
25.789 -5.911 26.243 -4.599 QT
26.696 -3.286 26.696 -1.911 QT
26.696 -0.583 26.235 0.675 QT
25.774 1.932 24.907 2.94 QT
24.039 3.948 22.86 4.534 QT
21.68 5.12 20.289 5.12 QT
12.555 5.12 L
cp
16.602 3.714 M
16.602 4.167 16.86 4.276 QT
17.118 4.386 17.664 4.386 QT
19.743 4.386 L
20.821 4.386 21.789 3.917 QT
22.758 3.448 23.399 2.62 QT
24.071 1.729 24.289 0.643 QT
24.508 -0.443 24.508 -1.911 QT
24.508 -3.443 24.289 -4.591 QT
24.071 -5.739 23.399 -6.646 QT
22.774 -7.536 21.813 -8.013 QT
20.852 -8.489 19.743 -8.489 QT
17.664 -8.489 L
17.289 -8.489 17.078 -8.458 QT
16.868 -8.427 16.735 -8.279 QT
16.602 -8.13 16.602 -7.818 QT
16.602 3.714 L
cp}def
f1818420723
f
GR
GS
[0.75 0 0 0.75 0 0] CT
0.494 0.184 0.557 RC
1 LJ
2.667 LW
N
646.107 135 M
686.091 135 L
S
GR
GS
[0.75 0 0 0.75 516.8177 120.825] CT
N
/f-597267615{0.672 5.12 M
0.672 4.386 L
2.547 4.386 2.984 3.136 QT
7.391 -9.693 L
7.453 -9.911 7.734 -9.911 QT
8 -9.911 L
8.281 -9.911 8.344 -9.693 QT
12.938 3.714 L
13.141 4.151 13.688 4.268 QT
14.234 4.386 15.047 4.386 QT
15.047 5.12 L
9.203 5.12 L
9.203 4.386 L
10.938 4.386 10.938 3.823 QT
10.938 3.714 L
9.797 0.432 L
4.703 0.432 L
3.766 3.136 L
3.75 3.214 3.75 3.354 QT
3.75 3.886 4.242 4.136 QT
4.734 4.386 5.313 4.386 QT
5.313 5.12 L
0.672 5.12 L
cp
4.953 -0.302 M
9.563 -0.302 L
7.25 -7.005 L
4.953 -0.302 L
cp}def
f-597267615
f
GR
GS
[0.75 0 0 0.75 516.8177 120.825] CT
N
/f1637560580{16.703 5.12 M
16.703 4.386 L
18.859 4.386 18.859 3.714 QT
18.859 -7.818 L
18.859 -8.489 16.703 -8.489 QT
16.703 -9.224 L
24.172 -9.224 L
25.328 -9.224 26.477 -8.755 QT
27.625 -8.286 28.367 -7.38 QT
29.109 -6.474 29.109 -5.271 QT
29.109 -4.114 28.359 -3.232 QT
27.609 -2.349 26.469 -1.888 QT
25.328 -1.427 24.172 -1.427 QT
20.813 -1.427 L
20.813 3.714 L
20.813 4.386 22.969 4.386 QT
22.969 5.12 L
16.703 5.12 L
cp
20.75 -2.052 M
23.594 -2.052 L
24.75 -2.052 25.469 -2.388 QT
26.188 -2.724 26.523 -3.427 QT
26.859 -4.13 26.859 -5.271 QT
26.859 -6.989 26.109 -7.739 QT
25.359 -8.489 23.594 -8.489 QT
21.813 -8.489 L
21.438 -8.489 21.227 -8.458 QT
21.016 -8.427 20.883 -8.279 QT
20.75 -8.13 20.75 -7.818 QT
20.75 -2.052 L
cp}def
f1637560580
f
GR
GS
[0.75 0 0 0.75 516.8177 120.825] CT
N
/f374720792{31.222 5.12 M
31.222 4.386 L
33.378 4.386 33.378 3.714 QT
33.378 -7.818 L
33.378 -8.489 31.222 -8.489 QT
31.222 -9.224 L
38.956 -9.224 L
40.394 -9.224 41.581 -8.607 QT
42.769 -7.989 43.612 -6.95 QT
44.456 -5.911 44.909 -4.599 QT
45.362 -3.286 45.362 -1.911 QT
45.362 -0.583 44.901 0.675 QT
44.44 1.932 43.573 2.94 QT
42.706 3.948 41.526 4.534 QT
40.347 5.12 38.956 5.12 QT
31.222 5.12 L
cp
35.269 3.714 M
35.269 4.167 35.526 4.276 QT
35.784 4.386 36.331 4.386 QT
38.409 4.386 L
39.487 4.386 40.456 3.917 QT
41.425 3.448 42.065 2.62 QT
42.737 1.729 42.956 0.643 QT
43.175 -0.443 43.175 -1.911 QT
43.175 -3.443 42.956 -4.591 QT
42.737 -5.739 42.065 -6.646 QT
41.44 -7.536 40.48 -8.013 QT
39.519 -8.489 38.409 -8.489 QT
36.331 -8.489 L
35.956 -8.489 35.745 -8.458 QT
35.534 -8.427 35.401 -8.279 QT
35.269 -8.13 35.269 -7.818 QT
35.269 3.714 L
cp}def
f374720792
f
GR
GS
[0.75 0 0 0.75 0 0] CT
0.467 0.675 0.188 RC
1 LJ
2.667 LW
N
646.107 161.1 M
686.091 161.1 L
S
GR
GS
[0.75 0 0 0.75 516.8177 140.4] CT
N
/f2079530806{0.703 5.12 M
0.703 4.386 L
2.859 4.386 2.859 3.714 QT
2.859 -7.818 L
2.859 -8.489 0.703 -8.489 QT
0.703 -9.224 L
7.297 -9.224 L
8.469 -9.224 9.766 -8.802 QT
11.063 -8.38 11.938 -7.505 QT
12.813 -6.63 12.813 -5.427 QT
12.813 -4.536 12.281 -3.849 QT
11.75 -3.161 10.922 -2.693 QT
10.094 -2.224 9.234 -2.021 QT
10.188 -1.693 10.891 -0.974 QT
11.594 -0.255 11.734 0.667 QT
12.031 2.542 L
12.25 3.792 12.469 4.417 QT
12.688 5.042 13.469 5.042 QT
14.125 5.042 14.445 4.432 QT
14.766 3.823 14.766 3.104 QT
14.766 3.026 14.836 2.971 QT
14.906 2.917 14.969 2.917 QT
15.172 2.917 L
15.375 2.917 15.375 3.198 QT
15.375 3.761 15.148 4.315 QT
14.922 4.87 14.492 5.229 QT
14.063 5.589 13.484 5.589 QT
11.969 5.589 10.875 4.831 QT
9.781 4.073 9.781 2.62 QT
9.781 0.745 L
9.781 -0.302 9.055 -1.044 QT
8.328 -1.786 7.266 -1.786 QT
4.75 -1.786 L
4.75 3.714 L
4.75 4.386 6.906 4.386 QT
6.906 5.12 L
0.703 5.12 L
cp
4.75 -2.333 M
7 -2.333 L
8.734 -2.333 9.648 -3.036 QT
10.563 -3.739 10.563 -5.427 QT
10.563 -7.099 9.656 -7.794 QT
8.75 -8.489 7 -8.489 QT
5.813 -8.489 L
5.438 -8.489 5.227 -8.458 QT
5.016 -8.427 4.883 -8.279 QT
4.75 -8.13 4.75 -7.818 QT
4.75 -2.333 L
cp}def
f2079530806
f
GR
GS
[0.75 0 0 0.75 516.8177 140.4] CT
N
/f1489000050{20.938 5.354 M
19.657 5.354 18.587 4.682 QT
17.516 4.011 16.899 2.886 QT
16.282 1.761 16.282 0.511 QT
16.282 -0.708 16.844 -1.818 QT
17.407 -2.927 18.407 -3.607 QT
19.407 -4.286 20.641 -4.286 QT
21.594 -4.286 22.313 -3.966 QT
23.032 -3.646 23.493 -3.075 QT
23.954 -2.505 24.188 -1.724 QT
24.422 -0.943 24.422 -0.005 QT
24.422 0.276 24.204 0.276 QT
18.126 0.276 L
18.126 0.495 L
18.126 2.245 18.829 3.495 QT
19.532 4.745 21.126 4.745 QT
21.766 4.745 22.313 4.456 QT
22.86 4.167 23.266 3.651 QT
23.672 3.136 23.813 2.557 QT
23.829 2.479 23.891 2.425 QT
23.954 2.37 24.016 2.37 QT
24.204 2.37 L
24.422 2.37 24.422 2.636 QT
24.126 3.823 23.141 4.589 QT
22.157 5.354 20.938 5.354 QT
cp
18.141 -0.255 M
22.938 -0.255 L
22.938 -1.036 22.712 -1.849 QT
22.485 -2.661 21.977 -3.2 QT
21.469 -3.739 20.641 -3.739 QT
19.454 -3.739 18.797 -2.63 QT
18.141 -1.521 18.141 -0.255 QT
cp}def
f1489000050
f
GR
GS
[0.75 0 0 0.75 516.8177 140.4] CT
N
/f-1280960535{25.857 5.12 M
25.857 4.386 L
26.576 4.386 27.037 4.268 QT
27.498 4.151 27.498 3.714 QT
27.498 -3.193 L
25.888 -3.193 L
25.888 -3.927 L
27.498 -3.927 L
27.498 -6.443 L
27.498 -7.13 27.779 -7.716 QT
28.06 -8.302 28.537 -8.739 QT
29.013 -9.177 29.631 -9.435 QT
30.248 -9.693 30.92 -9.693 QT
31.623 -9.693 32.193 -9.271 QT
32.763 -8.849 32.763 -8.146 QT
32.763 -7.755 32.49 -7.482 QT
32.216 -7.208 31.826 -7.208 QT
31.42 -7.208 31.138 -7.482 QT
30.857 -7.755 30.857 -8.146 QT
30.857 -8.802 31.42 -9.036 QT
31.076 -9.146 30.81 -9.146 QT
30.201 -9.146 29.763 -8.708 QT
29.326 -8.271 29.115 -7.646 QT
28.904 -7.021 28.904 -6.411 QT
28.904 -3.927 L
31.31 -3.927 L
31.31 -3.193 L
28.966 -3.193 L
28.966 3.714 L
28.966 4.151 29.584 4.268 QT
30.201 4.386 30.998 4.386 QT
30.998 5.12 L
25.857 5.12 L
cp}def
f-1280960535
f
GR
GS
[0.75 0 0 0.75 516.8177 140.4] CT
N
/f-679061643{36.938 5.354 M
35.657 5.354 34.587 4.682 QT
33.516 4.011 32.899 2.886 QT
32.282 1.761 32.282 0.511 QT
32.282 -0.708 32.844 -1.818 QT
33.407 -2.927 34.407 -3.607 QT
35.407 -4.286 36.641 -4.286 QT
37.594 -4.286 38.313 -3.966 QT
39.032 -3.646 39.493 -3.075 QT
39.954 -2.505 40.188 -1.724 QT
40.422 -0.943 40.422 -0.005 QT
40.422 0.276 40.204 0.276 QT
34.126 0.276 L
34.126 0.495 L
34.126 2.245 34.829 3.495 QT
35.532 4.745 37.126 4.745 QT
37.766 4.745 38.313 4.456 QT
38.86 4.167 39.266 3.651 QT
39.672 3.136 39.813 2.557 QT
39.829 2.479 39.891 2.425 QT
39.954 2.37 40.016 2.37 QT
40.204 2.37 L
40.422 2.37 40.422 2.636 QT
40.126 3.823 39.141 4.589 QT
38.157 5.354 36.938 5.354 QT
cp
34.141 -0.255 M
38.938 -0.255 L
38.938 -1.036 38.712 -1.849 QT
38.485 -2.661 37.977 -3.2 QT
37.469 -3.739 36.641 -3.739 QT
35.454 -3.739 34.797 -2.63 QT
34.141 -1.521 34.141 -0.255 QT
cp}def
f-679061643
f
GR
GS
[0.75 0 0 0.75 516.8177 140.4] CT
N
/f-1845167661{41.732 5.12 M
41.732 4.386 L
42.451 4.386 42.912 4.268 QT
43.373 4.151 43.373 3.714 QT
43.373 -2.021 L
43.373 -2.583 43.201 -2.833 QT
43.029 -3.083 42.709 -3.138 QT
42.388 -3.193 41.732 -3.193 QT
41.732 -3.927 L
44.732 -4.161 L
44.732 -2.114 L
45.076 -3.021 45.701 -3.591 QT
46.326 -4.161 47.216 -4.161 QT
47.841 -4.161 48.334 -3.794 QT
48.826 -3.427 48.826 -2.818 QT
48.826 -2.443 48.552 -2.161 QT
48.279 -1.88 47.888 -1.88 QT
47.498 -1.88 47.216 -2.154 QT
46.935 -2.427 46.935 -2.818 QT
46.935 -3.38 47.341 -3.614 QT
47.216 -3.614 L
46.357 -3.614 45.826 -2.997 QT
45.295 -2.38 45.068 -1.474 QT
44.841 -0.568 44.841 0.276 QT
44.841 3.714 L
44.841 4.386 46.873 4.386 QT
46.873 5.12 L
41.732 5.12 L
cp}def
f-1845167661
f
GR
GS
[0.75 0 0 0.75 516.8177 140.4] CT
N
/f831240522{54.775 5.354 M
53.494 5.354 52.424 4.682 QT
51.353 4.011 50.736 2.886 QT
50.119 1.761 50.119 0.511 QT
50.119 -0.708 50.681 -1.818 QT
51.244 -2.927 52.244 -3.607 QT
53.244 -4.286 54.478 -4.286 QT
55.431 -4.286 56.15 -3.966 QT
56.869 -3.646 57.33 -3.075 QT
57.791 -2.505 58.025 -1.724 QT
58.26 -0.943 58.26 -0.005 QT
58.26 0.276 58.041 0.276 QT
51.963 0.276 L
51.963 0.495 L
51.963 2.245 52.666 3.495 QT
53.369 4.745 54.963 4.745 QT
55.603 4.745 56.15 4.456 QT
56.697 4.167 57.103 3.651 QT
57.51 3.136 57.65 2.557 QT
57.666 2.479 57.728 2.425 QT
57.791 2.37 57.853 2.37 QT
58.041 2.37 L
58.26 2.37 58.26 2.636 QT
57.963 3.823 56.978 4.589 QT
55.994 5.354 54.775 5.354 QT
cp
51.978 -0.255 M
56.775 -0.255 L
56.775 -1.036 56.549 -1.849 QT
56.322 -2.661 55.814 -3.2 QT
55.306 -3.739 54.478 -3.739 QT
53.291 -3.739 52.635 -2.63 QT
51.978 -1.521 51.978 -0.255 QT
cp}def
f831240522
f
GR
GS
[0.75 0 0 0.75 516.8177 140.4] CT
N
/f-2003825523{59.647 5.12 M
59.647 4.386 L
60.366 4.386 60.827 4.268 QT
61.288 4.151 61.288 3.714 QT
61.288 -2.021 L
61.288 -2.583 61.116 -2.833 QT
60.944 -3.083 60.632 -3.138 QT
60.319 -3.193 59.647 -3.193 QT
59.647 -3.927 L
62.694 -4.161 L
62.694 -2.114 L
63.116 -3.005 63.944 -3.583 QT
64.772 -4.161 65.741 -4.161 QT
67.194 -4.161 67.929 -3.466 QT
68.663 -2.771 68.663 -1.333 QT
68.663 3.714 L
68.663 4.151 69.124 4.268 QT
69.585 4.386 70.304 4.386 QT
70.304 5.12 L
65.491 5.12 L
65.491 4.386 L
66.21 4.386 66.671 4.268 QT
67.132 4.151 67.132 3.714 QT
67.132 -1.271 L
67.132 -2.286 66.835 -2.95 QT
66.538 -3.614 65.616 -3.614 QT
64.397 -3.614 63.608 -2.638 QT
62.819 -1.661 62.819 -0.427 QT
62.819 3.714 L
62.819 4.151 63.288 4.268 QT
63.757 4.386 64.46 4.386 QT
64.46 5.12 L
59.647 5.12 L
cp}def
f-2003825523
f
GR
GS
[0.75 0 0 0.75 516.8177 140.4] CT
N
/f-621954187{76.109 5.354 M
74.827 5.354 73.796 4.69 QT
72.765 4.026 72.171 2.925 QT
71.577 1.823 71.577 0.589 QT
71.577 -0.646 72.163 -1.786 QT
72.749 -2.927 73.788 -3.607 QT
74.827 -4.286 76.109 -4.286 QT
77.327 -4.286 78.343 -3.81 QT
79.359 -3.333 79.359 -2.239 QT
79.359 -1.818 79.062 -1.521 QT
78.765 -1.224 78.343 -1.224 QT
77.937 -1.224 77.64 -1.521 QT
77.343 -1.818 77.343 -2.239 QT
77.343 -2.599 77.577 -2.872 QT
77.812 -3.146 78.171 -3.224 QT
77.437 -3.677 76.124 -3.677 QT
75.124 -3.677 74.507 -3.013 QT
73.89 -2.349 73.64 -1.364 QT
73.39 -0.38 73.39 0.589 QT
73.39 1.604 73.694 2.55 QT
73.999 3.495 74.671 4.12 QT
75.343 4.745 76.359 4.745 QT
77.359 4.745 78.054 4.136 QT
78.749 3.526 78.999 2.542 QT
78.999 2.417 79.171 2.417 QT
79.421 2.417 L
79.484 2.417 79.538 2.471 QT
79.593 2.526 79.593 2.604 QT
79.593 2.651 L
79.265 3.901 78.327 4.628 QT
77.39 5.354 76.109 5.354 QT
cp}def
f-621954187
f
GR
GS
[0.75 0 0 0.75 516.8177 140.4] CT
N
/f934607477{85.59 5.354 M
84.309 5.354 83.238 4.682 QT
82.168 4.011 81.551 2.886 QT
80.934 1.761 80.934 0.511 QT
80.934 -0.708 81.496 -1.818 QT
82.059 -2.927 83.059 -3.607 QT
84.059 -4.286 85.293 -4.286 QT
86.246 -4.286 86.965 -3.966 QT
87.684 -3.646 88.145 -3.075 QT
88.606 -2.505 88.84 -1.724 QT
89.074 -0.943 89.074 -0.005 QT
89.074 0.276 88.856 0.276 QT
82.778 0.276 L
82.778 0.495 L
82.778 2.245 83.481 3.495 QT
84.184 4.745 85.778 4.745 QT
86.418 4.745 86.965 4.456 QT
87.512 4.167 87.918 3.651 QT
88.324 3.136 88.465 2.557 QT
88.481 2.479 88.543 2.425 QT
88.606 2.37 88.668 2.37 QT
88.856 2.37 L
89.074 2.37 89.074 2.636 QT
88.778 3.823 87.793 4.589 QT
86.809 5.354 85.59 5.354 QT
cp
82.793 -0.255 M
87.59 -0.255 L
87.59 -1.036 87.363 -1.849 QT
87.137 -2.661 86.629 -3.2 QT
86.121 -3.739 85.293 -3.739 QT
84.106 -3.739 83.449 -2.63 QT
82.793 -1.521 82.793 -0.255 QT
cp}def
f934607477
f
GR
GS
[0.75 0 0 0.75 0 0] CT
1 0 0 RC
1 LJ
2.667 LW
N
646.107 187.2 M
686.091 187.2 L
S
GR
GS
[0.75 0 0 0.75 0 0] CT
0.149 GC
10.0 ML
0.667 LW
N
639 202 M
639 68 L
786 68 L
786 202 L
cp
S
GR
GS
[0.75 0 0 0.75 0 0] CT
1 GC
N
112 561 M
799 561 L
799 332 L
112 332 L
cp
f
GR
GS
[0.75 0 0 0.75 0 0] CT
0.873 GC
1 LJ
0.667 LW
N
164.846 561 M
164.846 332 L
S
GR
GS
[0.75 0 0 0.75 0 0] CT
0.873 GC
1 LJ
0.667 LW
N
270.538 561 M
270.538 332 L
S
GR
GS
[0.75 0 0 0.75 0 0] CT
0.873 GC
1 LJ
0.667 LW
N
376.231 561 M
376.231 332 L
S
GR
GS
[0.75 0 0 0.75 0 0] CT
0.873 GC
1 LJ
0.667 LW
N
481.923 561 M
481.923 332 L
S
GR
GS
[0.75 0 0 0.75 0 0] CT
0.873 GC
1 LJ
0.667 LW
N
587.615 561 M
587.615 332 L
S
GR
GS
[0.75 0 0 0.75 0 0] CT
0.873 GC
1 LJ
0.667 LW
N
693.308 561 M
693.308 332 L
S
GR
GS
[0.75 0 0 0.75 0 0] CT
0.873 GC
1 LJ
0.667 LW
N
799 561 M
799 332 L
S
GR
GS
[0.75 0 0 0.75 0 0] CT
0.873 GC
1 LJ
0.667 LW
N
799 509.463 M
112 509.463 L
S
GR
GS
[0.75 0 0 0.75 0 0] CT
0.873 GC
1 LJ
0.667 LW
N
799 445.043 M
112 445.043 L
S
GR
GS
[0.75 0 0 0.75 0 0] CT
0.873 GC
1 LJ
0.667 LW
N
799 380.622 M
112 380.622 L
S
GR
GS
[0.75 0 0 0.75 0 0] CT
0.149 GC
2 setlinecap
1 LJ
0.667 LW
N
112 561 M
799 561 L
S
GR
GS
[0.75 0 0 0.75 0 0] CT
0.149 GC
2 setlinecap
1 LJ
0.667 LW
N
112 332 M
799 332 L
S
GR
GS
[0.75 0 0 0.75 0 0] CT
0.149 GC
2 setlinecap
1 LJ
0.667 LW
N
164.846 561 M
164.846 554.13 L
S
GR
GS
[0.75 0 0 0.75 0 0] CT
0.149 GC
2 setlinecap
1 LJ
0.667 LW
N
270.538 561 M
270.538 554.13 L
S
GR
GS
[0.75 0 0 0.75 0 0] CT
0.149 GC
2 setlinecap
1 LJ
0.667 LW
N
376.231 561 M
376.231 554.13 L
S
GR
GS
[0.75 0 0 0.75 0 0] CT
0.149 GC
2 setlinecap
1 LJ
0.667 LW
N
481.923 561 M
481.923 554.13 L
S
GR
GS
[0.75 0 0 0.75 0 0] CT
0.149 GC
2 setlinecap
1 LJ
0.667 LW
N
587.615 561 M
587.615 554.13 L
S
GR
GS
[0.75 0 0 0.75 0 0] CT
0.149 GC
2 setlinecap
1 LJ
0.667 LW
N
693.308 561 M
693.308 554.13 L
S
GR
GS
[0.75 0 0 0.75 0 0] CT
0.149 GC
2 setlinecap
1 LJ
0.667 LW
N
799 561 M
799 554.13 L
S
GR
GS
[0.75 0 0 0.75 0 0] CT
0.149 GC
2 setlinecap
1 LJ
0.667 LW
N
164.846 332 M
164.846 338.87 L
S
GR
GS
[0.75 0 0 0.75 0 0] CT
0.149 GC
2 setlinecap
1 LJ
0.667 LW
N
270.538 332 M
270.538 338.87 L
S
GR
GS
[0.75 0 0 0.75 0 0] CT
0.149 GC
2 setlinecap
1 LJ
0.667 LW
N
376.231 332 M
376.231 338.87 L
S
GR
GS
[0.75 0 0 0.75 0 0] CT
0.149 GC
2 setlinecap
1 LJ
0.667 LW
N
481.923 332 M
481.923 338.87 L
S
GR
GS
[0.75 0 0 0.75 0 0] CT
0.149 GC
2 setlinecap
1 LJ
0.667 LW
N
587.615 332 M
587.615 338.87 L
S
GR
GS
[0.75 0 0 0.75 0 0] CT
0.149 GC
2 setlinecap
1 LJ
0.667 LW
N
693.308 332 M
693.308 338.87 L
S
GR
GS
[0.75 0 0 0.75 0 0] CT
0.149 GC
2 setlinecap
1 LJ
0.667 LW
N
799 332 M
799 338.87 L
S
GR
GS
[0.75 0 0 0.75 123.63462 426.35001] CT
0.149 GC
N
f-1749699357
f
GR
GS
[0.75 0 0 0.75 202.90384 426.35001] CT
0.149 GC
N
f422893355
f
GR
GS
[0.75 0 0 0.75 202.90384 426.35001] CT
0.149 GC
N
f1305826713
f
GR
GS
[0.75 0 0 0.75 282.17308 426.35001] CT
0.149 GC
N
f-336516700
f
GR
GS
[0.75 0 0 0.75 282.17308 426.35001] CT
0.149 GC
N
f-1749699357
f
GR
GS
[0.75 0 0 0.75 282.17308 426.35001] CT
0.149 GC
N
f1314376594
f
GR
GS
[0.75 0 0 0.75 361.4423 426.35001] CT
0.149 GC
N
f-336516700
f
GR
GS
[0.75 0 0 0.75 361.4423 426.35001] CT
0.149 GC
N
f-685938123
f
GR
GS
[0.75 0 0 0.75 361.4423 426.35001] CT
0.149 GC
N
f1314376594
f
GR
GS
[0.75 0 0 0.75 440.71152 426.35001] CT
0.149 GC
N
f-1749699357
f
GR
GS
[0.75 0 0 0.75 519.98076 426.35001] CT
0.149 GC
N
f422893355
f
GR
GS
[0.75 0 0 0.75 519.98076 426.35001] CT
0.149 GC
N
f1305826713
f
GR
GS
[0.75 0 0 0.75 599.25 426.35001] CT
0.149 GC
N
f-336516700
f
GR
GS
[0.75 0 0 0.75 599.25 426.35001] CT
0.149 GC
N
f-1749699357
f
GR
GS
[0.75 0 0 0.75 599.25 426.35001] CT
0.149 GC
N
f1314376594
f
GR
GS
[0.75 0 0 0.75 0 0] CT
0.149 GC
2 setlinecap
1 LJ
0.667 LW
N
112 561 M
112 332 L
S
GR
GS
[0.75 0 0 0.75 0 0] CT
0.149 GC
2 setlinecap
1 LJ
0.667 LW
N
799 561 M
799 332 L
S
GR
GS
[0.75 0 0 0.75 0 0] CT
0.149 GC
2 setlinecap
1 LJ
0.667 LW
N
112 509.463 M
118.87 509.463 L
S
GR
GS
[0.75 0 0 0.75 0 0] CT
0.149 GC
2 setlinecap
1 LJ
0.667 LW
N
112 445.043 M
118.87 445.043 L
S
GR
GS
[0.75 0 0 0.75 0 0] CT
0.149 GC
2 setlinecap
1 LJ
0.667 LW
N
112 380.622 M
118.87 380.622 L
S
GR
GS
[0.75 0 0 0.75 0 0] CT
0.149 GC
2 setlinecap
1 LJ
0.667 LW
N
799 509.463 M
792.13 509.463 L
S
GR
GS
[0.75 0 0 0.75 0 0] CT
0.149 GC
2 setlinecap
1 LJ
0.667 LW
N
799 445.043 M
792.13 445.043 L
S
GR
GS
[0.75 0 0 0.75 0 0] CT
0.149 GC
2 setlinecap
1 LJ
0.667 LW
N
799 380.622 M
792.13 380.622 L
S
GR
GS
[0.75 0 0 0.75 78.40002 382.09756] CT
0.149 GC
N
/f1974064997{-31.734 1.322 M
-31.734 -0.178 L
-25.375 -0.178 L
-25.375 1.322 L
-31.734 1.322 L
cp}def
f1974064997
f
GR
GS
[0.75 0 0 0.75 78.40002 382.09756] CT
0.149 GC
N
/f1579298569{-21.766 5.76 M
-21.766 4.916 L
-18.766 4.916 -18.766 4.151 QT
-18.766 -8.443 L
-20.016 -7.849 -21.906 -7.849 QT
-21.906 -8.693 L
-18.969 -8.693 -17.469 -10.224 QT
-17.125 -10.224 L
-17.047 -10.224 -16.969 -10.162 QT
-16.891 -10.099 -16.891 -10.021 QT
-16.891 4.151 L
-16.891 4.916 -13.891 4.916 QT
-13.891 5.76 L
-21.766 5.76 L
cp}def
f1579298569
f
GR
GS
[0.75 0 0 0.75 78.40002 382.09756] CT
0.149 GC
N
f1219663315
f
GR
GS
[0.75 0 0 0.75 78.40002 333.78202] CT
0.149 GC
N
f1219663315
f
GR
GS
[0.75 0 0 0.75 78.40002 285.46646] CT
0.149 GC
N
f1579298569
f
GR
GS
[0.75 0 0 0.75 78.40002 285.46646] CT
0.149 GC
N
f1219663315
f
GR
GS
[0 -0.75 0.75 0 51.39996 334.87491] CT
0.149 GC
N
/f703564689{-96.417 -9.504 M
-96.417 -10.426 L
-93.73 -10.426 -93.73 -11.238 QT
-93.73 -25.52 L
-93.73 -26.348 -96.417 -26.348 QT
-96.417 -27.27 L
-88.246 -27.27 L
-86.792 -27.27 -85.183 -26.738 QT
-83.574 -26.207 -82.496 -25.129 QT
-81.417 -24.051 -81.417 -22.551 QT
-81.417 -21.457 -82.074 -20.606 QT
-82.73 -19.754 -83.753 -19.176 QT
-84.777 -18.598 -85.839 -18.348 QT
-84.667 -17.942 -83.792 -17.051 QT
-82.917 -16.16 -82.746 -15.02 QT
-82.371 -12.707 L
-82.121 -11.145 -81.839 -10.379 QT
-81.558 -9.613 -80.605 -9.613 QT
-79.792 -9.613 -79.394 -10.363 QT
-78.996 -11.113 -78.996 -12.004 QT
-78.996 -12.098 -78.91 -12.168 QT
-78.824 -12.238 -78.746 -12.238 QT
-78.496 -12.238 L
-78.246 -12.238 -78.246 -11.895 QT
-78.246 -11.176 -78.527 -10.496 QT
-78.808 -9.817 -79.332 -9.371 QT
-79.855 -8.926 -80.589 -8.926 QT
-82.464 -8.926 -83.816 -9.863 QT
-85.167 -10.801 -85.167 -12.598 QT
-85.167 -14.91 L
-85.167 -16.207 -86.066 -17.137 QT
-86.964 -18.067 -88.277 -18.067 QT
-91.402 -18.067 L
-91.402 -11.238 L
-91.402 -10.426 -88.714 -10.426 QT
-88.714 -9.504 L
-96.417 -9.504 L
cp
-91.402 -18.738 M
-88.621 -18.738 L
-86.464 -18.738 -85.332 -19.606 QT
-84.199 -20.473 -84.199 -22.551 QT
-84.199 -24.629 -85.316 -25.488 QT
-86.433 -26.348 -88.621 -26.348 QT
-90.074 -26.348 L
-90.542 -26.348 -90.808 -26.309 QT
-91.074 -26.27 -91.238 -26.09 QT
-91.402 -25.91 -91.402 -25.52 QT
-91.402 -18.738 L
cp}def
f703564689
f
GR
GS
[0 -0.75 0.75 0 51.39996 334.87491] CT
0.149 GC
N
/f-2109382100{-76.797 -12.051 M
-76.797 -13.598 -75.578 -14.574 QT
-74.359 -15.551 -72.656 -15.949 QT
-70.953 -16.348 -69.406 -16.348 QT
-69.406 -17.41 L
-69.406 -18.16 -69.742 -18.863 QT
-70.078 -19.567 -70.695 -20.02 QT
-71.312 -20.473 -72.062 -20.473 QT
-73.797 -20.473 -74.687 -19.692 QT
-74.203 -19.692 -73.875 -19.324 QT
-73.547 -18.957 -73.547 -18.457 QT
-73.547 -17.942 -73.914 -17.567 QT
-74.281 -17.192 -74.797 -17.192 QT
-75.312 -17.192 -75.679 -17.567 QT
-76.047 -17.942 -76.047 -18.457 QT
-76.047 -19.832 -74.804 -20.496 QT
-73.562 -21.16 -72.062 -21.16 QT
-71.015 -21.16 -69.945 -20.707 QT
-68.875 -20.254 -68.195 -19.418 QT
-67.515 -18.582 -67.515 -17.457 QT
-67.515 -11.613 L
-67.515 -11.098 -67.304 -10.676 QT
-67.093 -10.254 -66.64 -10.254 QT
-66.203 -10.254 -65.992 -10.684 QT
-65.781 -11.113 -65.781 -11.613 QT
-65.781 -13.27 L
-65.015 -13.27 L
-65.015 -11.613 L
-65.015 -11.035 -65.32 -10.504 QT
-65.625 -9.973 -66.14 -9.66 QT
-66.656 -9.348 -67.25 -9.348 QT
-68.015 -9.348 -68.57 -9.942 QT
-69.125 -10.535 -69.187 -11.348 QT
-69.672 -10.363 -70.609 -9.785 QT
-71.547 -9.207 -72.609 -9.207 QT
-73.609 -9.207 -74.562 -9.504 QT
-75.515 -9.801 -76.156 -10.426 QT
-76.797 -11.051 -76.797 -12.051 QT
cp
-74.687 -12.051 M
-74.687 -11.145 -74.015 -10.52 QT
-73.343 -9.895 -72.437 -9.895 QT
-71.593 -9.895 -70.906 -10.317 QT
-70.218 -10.738 -69.812 -11.457 QT
-69.406 -12.176 -69.406 -12.988 QT
-69.406 -15.692 L
-70.593 -15.692 -71.828 -15.301 QT
-73.062 -14.91 -73.875 -14.09 QT
-74.687 -13.27 -74.687 -12.051 QT
cp}def
f-2109382100
f
GR
GS
[0 -0.75 0.75 0 51.39996 334.87491] CT
0.149 GC
N
/f-1302910989{-63.862 -9.504 M
-63.862 -10.426 L
-62.987 -10.426 -62.409 -10.559 QT
-61.831 -10.692 -61.831 -11.238 QT
-61.831 -18.348 L
-61.831 -19.035 -62.042 -19.348 QT
-62.253 -19.66 -62.651 -19.731 QT
-63.05 -19.801 -63.862 -19.801 QT
-63.862 -20.707 L
-60.097 -20.988 L
-60.097 -18.457 L
-59.581 -19.567 -58.558 -20.278 QT
-57.534 -20.988 -56.331 -20.988 QT
-54.518 -20.988 -53.612 -20.129 QT
-52.706 -19.27 -52.706 -17.488 QT
-52.706 -11.238 L
-52.706 -10.692 -52.136 -10.559 QT
-51.565 -10.426 -50.675 -10.426 QT
-50.675 -9.504 L
-56.628 -9.504 L
-56.628 -10.426 L
-55.737 -10.426 -55.167 -10.559 QT
-54.597 -10.692 -54.597 -11.238 QT
-54.597 -17.41 L
-54.597 -18.676 -54.964 -19.496 QT
-55.331 -20.317 -56.487 -20.317 QT
-57.987 -20.317 -58.964 -19.113 QT
-59.94 -17.91 -59.94 -16.379 QT
-59.94 -11.238 L
-59.94 -10.692 -59.362 -10.559 QT
-58.784 -10.426 -57.909 -10.426 QT
-57.909 -9.504 L
-63.862 -9.504 L
cp}def
f-1302910989
f
GR
GS
[0 -0.75 0.75 0 51.39996 334.87491] CT
0.149 GC
N
/f-172124403{-49.258 -7.473 M
-49.258 -8.395 -48.586 -9.09 QT
-47.914 -9.785 -46.977 -10.082 QT
-47.508 -10.473 -47.774 -11.067 QT
-48.039 -11.66 -48.039 -12.332 QT
-48.039 -13.551 -47.274 -14.488 QT
-48.461 -15.66 -48.461 -17.176 QT
-48.461 -17.988 -48.117 -18.699 QT
-47.774 -19.41 -47.149 -19.926 QT
-46.524 -20.442 -45.758 -20.715 QT
-44.992 -20.988 -44.195 -20.988 QT
-42.649 -20.988 -41.414 -20.098 QT
-40.883 -20.66 -40.156 -20.973 QT
-39.43 -21.285 -38.633 -21.285 QT
-38.086 -21.285 -37.727 -20.887 QT
-37.367 -20.488 -37.367 -19.926 QT
-37.367 -19.613 -37.61 -19.371 QT
-37.852 -19.129 -38.164 -19.129 QT
-38.492 -19.129 -38.735 -19.371 QT
-38.977 -19.613 -38.977 -19.926 QT
-38.977 -20.41 -38.664 -20.598 QT
-40.008 -20.598 -40.977 -19.676 QT
-40.508 -19.207 -40.219 -18.528 QT
-39.93 -17.848 -39.93 -17.176 QT
-39.93 -16.067 -40.539 -15.184 QT
-41.149 -14.301 -42.149 -13.817 QT
-43.149 -13.332 -44.195 -13.332 QT
-45.617 -13.332 -46.805 -14.098 QT
-47.164 -13.598 -47.164 -12.957 QT
-47.164 -12.27 -46.719 -11.754 QT
-46.274 -11.238 -45.586 -11.238 QT
-43.445 -11.238 L
-41.899 -11.238 -40.656 -10.965 QT
-39.414 -10.692 -38.57 -9.848 QT
-37.727 -9.004 -37.727 -7.473 QT
-37.727 -6.332 -38.688 -5.574 QT
-39.649 -4.817 -40.992 -4.481 QT
-42.336 -4.145 -43.477 -4.145 QT
-44.633 -4.145 -45.977 -4.481 QT
-47.32 -4.817 -48.289 -5.574 QT
-49.258 -6.332 -49.258 -7.473 QT
cp
-47.789 -7.473 M
-47.789 -6.598 -47.078 -6.004 QT
-46.367 -5.41 -45.367 -5.129 QT
-44.367 -4.848 -43.477 -4.848 QT
-42.602 -4.848 -41.602 -5.129 QT
-40.602 -5.41 -39.891 -6.004 QT
-39.18 -6.598 -39.18 -7.473 QT
-39.18 -8.832 -40.43 -9.231 QT
-41.68 -9.629 -43.445 -9.629 QT
-45.586 -9.629 L
-46.18 -9.629 -46.68 -9.348 QT
-47.18 -9.067 -47.485 -8.551 QT
-47.789 -8.035 -47.789 -7.473 QT
cp
-44.195 -14.02 M
-41.992 -14.02 -41.992 -17.176 QT
-41.992 -18.535 -42.461 -19.418 QT
-42.93 -20.301 -44.195 -20.301 QT
-45.477 -20.301 -45.945 -19.418 QT
-46.414 -18.535 -46.414 -17.176 QT
-46.414 -16.317 -46.235 -15.613 QT
-46.055 -14.91 -45.57 -14.465 QT
-45.086 -14.02 -44.195 -14.02 QT
cp}def
f-172124403
f
GR
GS
[0 -0.75 0.75 0 51.39996 334.87491] CT
0.149 GC
N
/f1684863706{-30.308 -9.207 M
-31.886 -9.207 -33.214 -10.043 QT
-34.542 -10.879 -35.3 -12.27 QT
-36.058 -13.66 -36.058 -15.207 QT
-36.058 -16.723 -35.363 -18.098 QT
-34.667 -19.473 -33.433 -20.317 QT
-32.199 -21.16 -30.667 -21.16 QT
-29.48 -21.16 -28.597 -20.762 QT
-27.714 -20.363 -27.144 -19.653 QT
-26.574 -18.942 -26.277 -17.973 QT
-25.98 -17.004 -25.98 -15.848 QT
-25.98 -15.504 -26.245 -15.504 QT
-33.777 -15.504 L
-33.777 -15.223 L
-33.777 -13.067 -32.91 -11.52 QT
-32.042 -9.973 -30.074 -9.973 QT
-29.277 -9.973 -28.597 -10.332 QT
-27.917 -10.692 -27.417 -11.324 QT
-26.917 -11.957 -26.73 -12.676 QT
-26.714 -12.77 -26.644 -12.84 QT
-26.574 -12.91 -26.48 -12.91 QT
-26.245 -12.91 L
-25.98 -12.91 -25.98 -12.582 QT
-26.355 -11.098 -27.574 -10.153 QT
-28.792 -9.207 -30.308 -9.207 QT
cp
-33.761 -16.16 M
-27.824 -16.16 L
-27.824 -17.129 -28.097 -18.137 QT
-28.37 -19.145 -29.003 -19.809 QT
-29.636 -20.473 -30.667 -20.473 QT
-32.136 -20.473 -32.949 -19.098 QT
-33.761 -17.723 -33.761 -16.16 QT
cp}def
f1684863706
f
GR
GS
[0 -0.75 0.75 0 51.39996 334.87491] CT
0.149 GC
N
/f531502875{-15.447 -9.504 M
-15.447 -10.426 L
-12.759 -10.426 -12.759 -11.238 QT
-12.759 -25.52 L
-12.759 -26.348 -15.447 -26.348 QT
-15.447 -27.27 L
-0.743 -27.27 L
-0.025 -21.317 L
-0.775 -21.317 L
-1.04 -23.551 -1.548 -24.567 QT
-2.056 -25.582 -3.157 -25.965 QT
-4.259 -26.348 -6.462 -26.348 QT
-9.025 -26.348 L
-9.493 -26.348 -9.751 -26.309 QT
-10.009 -26.27 -10.173 -26.09 QT
-10.337 -25.91 -10.337 -25.52 QT
-10.337 -19.176 L
-8.415 -19.176 L
-7.103 -19.176 -6.447 -19.403 QT
-5.79 -19.629 -5.548 -20.254 QT
-5.306 -20.879 -5.306 -22.207 QT
-4.54 -22.207 L
-4.54 -15.223 L
-5.306 -15.223 L
-5.306 -16.551 -5.548 -17.184 QT
-5.79 -17.817 -6.447 -18.043 QT
-7.103 -18.27 -8.415 -18.27 QT
-10.337 -18.27 L
-10.337 -11.238 L
-10.337 -10.692 -10.025 -10.559 QT
-9.712 -10.426 -9.025 -10.426 QT
-6.259 -10.426 L
-4.462 -10.426 -3.353 -10.707 QT
-2.243 -10.988 -1.626 -11.653 QT
-1.009 -12.317 -0.673 -13.379 QT
-0.337 -14.442 -0.04 -16.317 QT
0.71 -16.317 L
-0.384 -9.504 L
-15.447 -9.504 L
cp}def
f531502875
f
GR
GS
[0 -0.75 0.75 0 51.39996 334.87491] CT
0.149 GC
N
/f1413860886{2.395 -9.504 M
2.395 -10.426 L
3.286 -10.426 3.856 -10.559 QT
4.426 -10.692 4.426 -11.238 QT
4.426 -18.348 L
4.426 -19.035 4.216 -19.348 QT
4.005 -19.66 3.614 -19.731 QT
3.223 -19.801 2.395 -19.801 QT
2.395 -20.707 L
6.114 -20.988 L
6.114 -18.457 L
6.536 -19.582 7.309 -20.285 QT
8.083 -20.988 9.192 -20.988 QT
9.958 -20.988 10.567 -20.535 QT
11.176 -20.082 11.176 -19.332 QT
11.176 -18.863 10.841 -18.512 QT
10.505 -18.16 10.02 -18.16 QT
9.536 -18.16 9.192 -18.504 QT
8.848 -18.848 8.848 -19.332 QT
8.848 -20.035 9.348 -20.317 QT
9.192 -20.317 L
8.13 -20.317 7.466 -19.559 QT
6.801 -18.801 6.52 -17.668 QT
6.239 -16.535 6.239 -15.504 QT
6.239 -11.238 L
6.239 -10.426 8.77 -10.426 QT
8.77 -9.504 L
2.395 -9.504 L
cp}def
f1413860886
f
GR
GS
[0 -0.75 0.75 0 51.39996 334.87491] CT
0.149 GC
N
/f-1793373731{12.735 -9.504 M
12.735 -10.426 L
13.626 -10.426 14.196 -10.559 QT
14.766 -10.692 14.766 -11.238 QT
14.766 -18.348 L
14.766 -19.035 14.556 -19.348 QT
14.345 -19.66 13.954 -19.731 QT
13.563 -19.801 12.735 -19.801 QT
12.735 -20.707 L
16.454 -20.988 L
16.454 -18.457 L
16.876 -19.582 17.649 -20.285 QT
18.423 -20.988 19.532 -20.988 QT
20.298 -20.988 20.907 -20.535 QT
21.516 -20.082 21.516 -19.332 QT
21.516 -18.863 21.181 -18.512 QT
20.845 -18.16 20.36 -18.16 QT
19.876 -18.16 19.532 -18.504 QT
19.188 -18.848 19.188 -19.332 QT
19.188 -20.035 19.688 -20.317 QT
19.532 -20.317 L
18.47 -20.317 17.806 -19.559 QT
17.141 -18.801 16.86 -17.668 QT
16.579 -16.535 16.579 -15.504 QT
16.579 -11.238 L
16.579 -10.426 19.11 -10.426 QT
19.11 -9.504 L
12.735 -9.504 L
cp}def
f-1793373731
f
GR
GS
[0 -0.75 0.75 0 51.39996 334.87491] CT
0.149 GC
N
/f-268604579{28.903 -9.207 M
27.341 -9.207 26.005 -10.004 QT
24.669 -10.801 23.896 -12.137 QT
23.122 -13.473 23.122 -15.035 QT
23.122 -16.238 23.552 -17.34 QT
23.981 -18.442 24.771 -19.309 QT
25.56 -20.176 26.614 -20.668 QT
27.669 -21.16 28.903 -21.16 QT
30.497 -21.16 31.817 -20.317 QT
33.138 -19.473 33.896 -18.059 QT
34.653 -16.645 34.653 -15.035 QT
34.653 -13.473 33.88 -12.137 QT
33.106 -10.801 31.778 -10.004 QT
30.45 -9.207 28.903 -9.207 QT
cp
28.903 -9.973 M
30.981 -9.973 31.685 -11.481 QT
32.388 -12.988 32.388 -15.332 QT
32.388 -16.645 32.247 -17.496 QT
32.106 -18.348 31.638 -19.051 QT
31.341 -19.488 30.888 -19.809 QT
30.435 -20.129 29.935 -20.301 QT
29.435 -20.473 28.903 -20.473 QT
28.091 -20.473 27.364 -20.106 QT
26.638 -19.738 26.153 -19.051 QT
25.669 -18.317 25.536 -17.434 QT
25.403 -16.551 25.403 -15.332 QT
25.403 -13.879 25.653 -12.715 QT
25.903 -11.551 26.677 -10.762 QT
27.45 -9.973 28.903 -9.973 QT
cp}def
f-268604579
f
GR
GS
[0 -0.75 0.75 0 51.39996 334.87491] CT
0.149 GC
N
/f1873857655{36.275 -9.504 M
36.275 -10.426 L
37.166 -10.426 37.736 -10.559 QT
38.307 -10.692 38.307 -11.238 QT
38.307 -18.348 L
38.307 -19.035 38.096 -19.348 QT
37.885 -19.66 37.494 -19.731 QT
37.103 -19.801 36.275 -19.801 QT
36.275 -20.707 L
39.994 -20.988 L
39.994 -18.457 L
40.416 -19.582 41.189 -20.285 QT
41.963 -20.988 43.072 -20.988 QT
43.838 -20.988 44.447 -20.535 QT
45.057 -20.082 45.057 -19.332 QT
45.057 -18.863 44.721 -18.512 QT
44.385 -18.16 43.9 -18.16 QT
43.416 -18.16 43.072 -18.504 QT
42.728 -18.848 42.728 -19.332 QT
42.728 -20.035 43.228 -20.317 QT
43.072 -20.317 L
42.01 -20.317 41.346 -19.559 QT
40.682 -18.801 40.4 -17.668 QT
40.119 -16.535 40.119 -15.504 QT
40.119 -11.238 L
40.119 -10.426 42.65 -10.426 QT
42.65 -9.504 L
36.275 -9.504 L
cp}def
f1873857655
f
GR
GS
[0 -0.75 0.75 0 51.39996 334.87491] CT
0.149 GC
N
/f2056914992{62.806 -3.051 M
61.353 -4.192 60.306 -5.676 QT
59.259 -7.16 58.595 -8.832 QT
57.931 -10.504 57.603 -12.332 QT
57.275 -14.16 57.275 -16.004 QT
57.275 -17.863 57.603 -19.692 QT
57.931 -21.52 58.611 -23.215 QT
59.29 -24.91 60.345 -26.379 QT
61.4 -27.848 62.806 -28.957 QT
62.806 -29.004 62.931 -29.004 QT
63.181 -29.004 L
63.243 -29.004 63.314 -28.934 QT
63.384 -28.863 63.384 -28.77 QT
63.384 -28.66 63.322 -28.613 QT
62.056 -27.363 61.212 -25.942 QT
60.368 -24.52 59.853 -22.918 QT
59.337 -21.317 59.111 -19.59 QT
58.884 -17.863 58.884 -16.004 QT
58.884 -7.738 63.306 -3.442 QT
63.384 -3.379 63.384 -3.238 QT
63.384 -3.176 63.314 -3.09 QT
63.243 -3.004 63.181 -3.004 QT
62.931 -3.004 L
62.806 -3.004 62.806 -3.051 QT
cp}def
f2056914992
f
GR
GS
[0 -0.75 0.75 0 51.39996 334.87491] CT
0.149 GC
N
/f1210429505{65.791 -9.504 M
65.791 -10.426 L
66.666 -10.426 67.244 -10.559 QT
67.823 -10.692 67.823 -11.238 QT
67.823 -18.348 L
67.823 -19.035 67.612 -19.348 QT
67.401 -19.66 67.002 -19.731 QT
66.604 -19.801 65.791 -19.801 QT
65.791 -20.707 L
69.557 -20.988 L
69.557 -18.457 L
70.073 -19.567 71.096 -20.278 QT
72.119 -20.988 73.323 -20.988 QT
76.323 -20.988 76.838 -18.551 QT
77.369 -19.645 78.369 -20.317 QT
79.369 -20.988 80.557 -20.988 QT
81.744 -20.988 82.549 -20.613 QT
83.354 -20.238 83.76 -19.457 QT
84.166 -18.676 84.166 -17.488 QT
84.166 -11.238 L
84.166 -10.692 84.744 -10.559 QT
85.323 -10.426 86.198 -10.426 QT
86.198 -9.504 L
80.244 -9.504 L
80.244 -10.426 L
81.135 -10.426 81.705 -10.559 QT
82.276 -10.692 82.276 -11.238 QT
82.276 -17.41 L
82.276 -18.723 81.909 -19.52 QT
81.541 -20.317 80.401 -20.317 QT
78.901 -20.317 77.924 -19.113 QT
76.948 -17.91 76.948 -16.379 QT
76.948 -11.238 L
76.948 -10.692 77.518 -10.559 QT
78.088 -10.426 78.979 -10.426 QT
78.979 -9.504 L
73.026 -9.504 L
73.026 -10.426 L
73.916 -10.426 74.487 -10.559 QT
75.057 -10.692 75.057 -11.238 QT
75.057 -17.41 L
75.057 -18.676 74.69 -19.496 QT
74.323 -20.317 73.166 -20.317 QT
71.666 -20.317 70.69 -19.113 QT
69.713 -17.91 69.713 -16.379 QT
69.713 -11.238 L
69.713 -10.692 70.291 -10.559 QT
70.869 -10.426 71.744 -10.426 QT
71.744 -9.504 L
65.791 -9.504 L
cp}def
f1210429505
f
GR
GS
[0 -0.75 0.75 0 51.39996 334.87491] CT
0.149 GC
N
/f-870564510{88.698 -3.004 M
88.463 -3.004 88.463 -3.238 QT
88.463 -3.348 88.526 -3.395 QT
92.963 -7.738 92.963 -16.004 QT
92.963 -24.27 88.573 -28.567 QT
88.463 -28.629 88.463 -28.77 QT
88.463 -28.863 88.534 -28.934 QT
88.604 -29.004 88.698 -29.004 QT
88.948 -29.004 L
89.01 -29.004 89.073 -28.957 QT
90.932 -27.488 92.174 -25.379 QT
93.416 -23.27 93.995 -20.879 QT
94.573 -18.488 94.573 -16.004 QT
94.573 -14.16 94.26 -12.379 QT
93.948 -10.598 93.276 -8.863 QT
92.604 -7.129 91.557 -5.66 QT
90.51 -4.192 89.073 -3.051 QT
89.01 -3.004 88.948 -3.004 QT
88.698 -3.004 L
cp}def
f-870564510
f
GR
GS
[0.75 0 0 0.75 0 0] CT
1 0.843 0 RC
1 LJ
5.333 LW
N
117.285 455.446 M
122.569 480.245 L
127.854 450.642 L
133.138 488.434 L
138.423 422.543 L
143.708 460.09 L
148.992 443.239 L
154.277 442.012 L
S
GR
GS
[0.75 0 0 0.75 0 0] CT
1 0.843 0 RC
1 LJ
5.333 LW
N
164.846 472.078 M
170.131 453.25 L
175.415 498.207 L
180.7 483.947 L
185.985 486.841 L
191.269 408.795 L
196.554 413.227 L
201.838 415.125 L
S
GR
GS
[0.75 0 0 0.75 0 0] CT
1 0.843 0 RC
1 LJ
5.333 LW
N
217.692 500.518 M
222.977 500.872 L
S
GR
GS
[0.75 0 0 0.75 0 0] CT
1 0.843 0 RC
1 LJ
5.333 LW
N
244.115 534.321 M
249.4 512.624 L
254.685 506.869 L
259.969 502.792 L
265.254 505.538 L
270.538 511.038 L
275.823 505.377 L
281.108 501.474 L
286.392 499.852 L
291.677 466.521 L
S
GR
GS
[0.75 0 0 0.75 0 0] CT
1 0.843 0 RC
1 LJ
5.333 LW
N
302.246 447.448 M
307.531 443.414 L
312.815 440.339 L
S
GR
GS
[0.75 0 0 0.75 0 0] CT
1 0.843 0 RC
1 LJ
5.333 LW
N
370.946 520.835 M
376.231 406.084 L
381.515 425.225 L
386.8 449.385 L
392.085 447.708 L
397.369 444.695 L
402.654 451.268 L
407.938 456.749 L
413.223 456.903 L
418.508 457.019 L
423.792 455.934 L
429.077 456.81 L
434.362 456.918 L
439.646 472.499 L
444.931 469.869 L
S
GR
GS
[0.75 0 0 0.75 0 0] CT
1 0.843 0 RC
1 LJ
5.333 LW
N
471.354 439.145 M
476.638 436.78 L
481.923 430.621 L
487.208 439.276 L
492.492 465.966 L
497.777 437.554 L
S
GR
GS
[0.75 0 0 0.75 0 0] CT
1 0.843 0 RC
1 LJ
5.333 LW
N
577.046 455.64 M
582.331 455.897 L
587.615 454.323 L
592.9 432.659 L
598.185 449.489 L
603.469 450.008 L
608.754 441.904 L
614.038 448.18 L
619.323 426.287 L
624.608 461.803 L
629.892 453.367 L
635.177 453.54 L
640.462 453.423 L
645.746 451.797 L
651.031 455.876 L
656.315 454.651 L
661.6 452.531 L
666.885 443.524 L
672.169 434.917 L
677.454 439.302 L
682.738 449.576 L
688.023 444.372 L
693.308 495.454 L
698.592 520.731 L
703.877 482.079 L
709.162 494.545 L
714.446 457.484 L
719.731 436.169 L
725.015 434.554 L
730.3 433.826 L
735.585 429.856 L
740.869 446.977 L
746.154 507.811 L
751.438 503.555 L
756.723 495.022 L
762.008 500.634 L
767.292 524.259 L
772.577 498.829 L
777.862 520.694 L
783.146 463.996 L
788.431 464.047 L
793.715 490.342 L
799 473.807 L
799.082 473.752 L
S
GR
GS
[0.75 0 0 0.75 0 0] CT
0.929 0.694 0.125 RC
1 LJ
2.667 LW
N
117.285 435.083 M
122.569 439.358 L
127.854 439.134 L
133.138 443.764 L
138.423 448.278 L
143.708 432.398 L
148.992 425.588 L
154.277 423.621 L
159.562 434.039 L
164.846 438.23 L
170.131 419.863 L
175.415 454.281 L
180.7 443.614 L
185.985 444.689 L
191.269 423.187 L
196.554 422.803 L
201.838 424.899 L
207.123 411.864 L
212.408 438.547 L
217.692 450.986 L
222.977 450.498 L
228.262 448.681 L
233.546 447.258 L
238.831 442.014 L
244.115 457.46 L
249.4 454.462 L
254.685 448.826 L
259.969 447.96 L
265.254 451.316 L
270.538 452.343 L
275.823 447.818 L
281.108 446.208 L
286.392 448.46 L
291.677 438.147 L
296.962 401.401 L
302.246 442.32 L
307.531 435.238 L
312.815 433.486 L
318.1 415.526 L
323.385 452.543 L
328.669 455.521 L
333.954 488.608 L
S
GR
GS
[0.75 0 0 0.75 0 0] CT
0.929 0.694 0.125 RC
1 LJ
2.667 LW
N
365.662 448.743 M
370.946 445.525 L
376.231 422.035 L
381.515 434.39 L
386.8 440.632 L
392.085 441.381 L
397.369 439.076 L
402.654 442.237 L
407.938 446.948 L
413.223 447.47 L
418.508 446.353 L
423.792 445.67 L
429.077 445.644 L
434.362 445.267 L
439.646 460.864 L
444.931 458.242 L
450.215 445.735 L
455.5 445.36 L
460.785 445.652 L
466.069 442.173 L
471.354 448.223 L
476.638 448.262 L
481.923 446.662 L
487.208 444.011 L
492.492 445.094 L
497.777 445.589 L
503.062 433.195 L
508.346 457.202 L
513.631 453.672 L
518.915 447.863 L
524.2 455.032 L
529.485 470.773 L
534.769 441.852 L
540.054 459.62 L
545.338 449.702 L
550.623 451.168 L
555.908 453.208 L
561.192 464.11 L
566.477 465.157 L
571.762 464.306 L
577.046 453.346 L
582.331 456.718 L
587.615 453.673 L
592.9 432.978 L
598.185 439.656 L
603.469 441.614 L
608.754 435.89 L
614.038 445.49 L
619.323 428.682 L
624.608 444.19 L
629.892 445.039 L
635.177 446.354 L
640.462 447.357 L
645.746 447.343 L
651.031 445.356 L
656.315 444.471 L
661.6 444.98 L
666.885 458.362 L
672.169 451.21 L
677.454 455.518 L
682.738 458.22 L
688.023 457.266 L
693.308 461.975 L
698.592 467.317 L
703.877 455.095 L
709.162 454.765 L
714.446 461.057 L
719.731 467.201 L
725.015 463.119 L
730.3 450.786 L
735.585 444.746 L
740.869 458.918 L
746.154 440.22 L
751.438 436.937 L
756.723 434.572 L
762.008 448.533 L
767.292 453.576 L
772.577 458.657 L
777.862 460.648 L
783.146 428.843 L
788.431 429.203 L
793.715 462.984 L
799 454.349 L
799.082 454.226 L
S
GR
GS
[0.75 0 0 0.75 0 0] CT
0.494 0.184 0.557 RC
1 LJ
2.667 LW
N
117.285 435.083 M
122.569 439.358 L
127.854 439.134 L
133.138 443.764 L
138.423 448.278 L
143.708 432.398 L
148.992 425.588 L
154.277 423.621 L
159.562 434.039 L
164.846 438.23 L
170.131 419.863 L
175.415 454.281 L
180.7 443.614 L
185.985 444.689 L
191.269 423.187 L
196.554 422.803 L
201.838 424.899 L
207.123 411.864 L
212.408 438.547 L
217.692 450.986 L
222.977 450.498 L
228.262 448.681 L
233.546 447.258 L
238.831 442.014 L
244.115 457.46 L
249.4 454.462 L
254.685 448.826 L
259.969 447.96 L
265.254 451.316 L
270.538 452.343 L
275.823 447.818 L
281.108 446.208 L
286.392 448.46 L
291.677 438.147 L
296.962 401.401 L
302.246 442.32 L
307.531 435.238 L
312.815 433.486 L
318.1 415.526 L
323.385 452.543 L
328.669 455.521 L
333.954 488.608 L
S
GR
GS
[0.75 0 0 0.75 0 0] CT
0.494 0.184 0.557 RC
1 LJ
2.667 LW
N
365.662 448.743 M
370.946 445.525 L
376.231 422.035 L
381.515 434.39 L
386.8 440.632 L
392.085 441.381 L
397.369 439.076 L
402.654 442.237 L
407.938 446.948 L
413.223 447.47 L
418.508 446.353 L
423.792 445.67 L
429.077 445.644 L
434.362 445.267 L
439.646 460.864 L
444.931 458.242 L
450.215 445.735 L
455.5 445.36 L
460.785 445.652 L
466.069 442.173 L
471.354 448.223 L
476.638 448.262 L
481.923 446.662 L
487.208 444.011 L
492.492 445.094 L
497.777 445.589 L
503.062 433.195 L
508.346 457.202 L
513.631 453.672 L
518.915 447.863 L
524.2 455.032 L
529.485 470.773 L
534.769 441.852 L
540.054 459.62 L
545.338 449.702 L
550.623 451.168 L
555.908 453.208 L
561.192 464.11 L
566.477 465.157 L
571.762 464.306 L
577.046 453.346 L
582.331 456.718 L
587.615 453.673 L
592.9 432.978 L
598.185 439.656 L
603.469 441.614 L
608.754 435.89 L
614.038 445.49 L
619.323 428.682 L
624.608 444.19 L
629.892 445.039 L
635.177 446.354 L
640.462 447.357 L
645.746 447.343 L
651.031 445.356 L
656.315 444.471 L
661.6 444.98 L
666.885 458.362 L
672.169 451.21 L
677.454 455.518 L
682.738 458.22 L
688.023 457.266 L
693.308 461.975 L
698.592 467.317 L
703.877 455.095 L
709.162 454.765 L
714.446 461.057 L
719.731 467.201 L
725.015 463.119 L
730.3 450.786 L
735.585 444.746 L
740.869 458.918 L
746.154 440.22 L
751.438 436.937 L
756.723 434.572 L
762.008 448.533 L
767.292 453.576 L
772.577 458.657 L
777.862 460.648 L
783.146 428.843 L
788.431 429.203 L
793.715 462.984 L
799 454.349 L
799.082 454.226 L
S
GR
GS
[0.75 0 0 0.75 0 0] CT
0.467 0.675 0.188 RC
1 LJ
2.667 LW
N
117.285 409.942 M
122.569 419.013 L
127.854 401.942 L
133.138 423.725 L
138.423 410.958 L
143.708 389.752 L
148.992 393.252 L
154.277 391.627 L
S
GR
GS
[0.75 0 0 0.75 0 0] CT
0.467 0.675 0.188 RC
1 LJ
2.667 LW
N
164.846 397.403 M
170.131 380.247 L
175.415 415.695 L
180.7 405.373 L
185.985 460.165 L
191.269 368.882 L
196.554 367.712 L
201.838 370.786 L
S
GR
GS
[0.75 0 0 0.75 0 0] CT
0.467 0.675 0.188 RC
1 LJ
2.667 LW
N
217.692 437.945 M
222.977 437.494 L
S
GR
GS
[0.75 0 0 0.75 0 0] CT
0.467 0.675 0.188 RC
1 LJ
2.667 LW
N
244.115 475.884 M
249.4 456.25 L
254.685 441.604 L
259.969 440.83 L
265.254 443.898 L
270.538 444.729 L
275.823 439.887 L
281.108 438.097 L
286.392 437.936 L
291.677 468.859 L
S
GR
GS
[0.75 0 0 0.75 0 0] CT
0.467 0.675 0.188 RC
1 LJ
2.667 LW
N
302.246 477.461 M
307.531 471.089 L
312.815 470.075 L
S
GR
GS
[0.75 0 0 0.75 0 0] CT
0.467 0.675 0.188 RC
1 LJ
2.667 LW
N
370.946 464.479 M
376.231 448.361 L
381.515 460.52 L
386.8 437.647 L
392.085 443.15 L
397.369 440.797 L
402.654 436.892 L
407.938 440.929 L
413.223 441.719 L
418.508 441.331 L
423.792 440.454 L
429.077 441.121 L
434.362 440.652 L
439.646 462.634 L
444.931 460.047 L
S
GR
GS
[0.75 0 0 0.75 0 0] CT
0.467 0.675 0.188 RC
1 LJ
2.667 LW
N
471.354 481.805 M
476.638 481.583 L
481.923 480.514 L
487.208 477.789 L
492.492 466.026 L
497.777 477.158 L
S
GR
GS
[0.75 0 0 0.75 0 0] CT
0.467 0.675 0.188 RC
1 LJ
2.667 LW
N
577.046 480.598 M
582.331 484.264 L
587.615 481.244 L
592.9 428.853 L
598.185 435.931 L
603.469 437.833 L
608.754 431.038 L
614.038 471.316 L
619.323 445.236 L
624.608 462.083 L
629.892 471.002 L
635.177 472.377 L
640.462 472.857 L
645.746 472.87 L
651.031 470.035 L
656.315 469.221 L
661.6 469.467 L
666.885 462.765 L
672.169 455.294 L
677.454 458.633 L
682.738 459.612 L
688.023 459.977 L
693.308 469.456 L
698.592 472.986 L
703.877 459.486 L
709.162 461.507 L
714.446 455.633 L
719.731 467.556 L
725.015 473.659 L
730.3 455.716 L
735.585 454.799 L
740.869 468.808 L
746.154 541.32 L
751.438 478.138 L
756.723 543.536 L
762.008 432.064 L
767.292 435.504 L
772.577 481.386 L
777.862 493.108 L
783.146 424.135 L
788.431 423.179 L
793.715 456.852 L
799 434.44 L
799.082 434.337 L
S
GR
%%Trailer
%%Pages: 1
%%EOF
