%!PS-Adobe-3.0 EPSF-3.0
%%Creator: (MATLAB, The Mathworks, Inc. Version 9.5.0.944444 \(R2018b\). Operating System: Windows 10)
%%Title: (C:/Users/navsas/Dropbox/Collaborative ranging CRLB/v01_29112018/fig/theoreticalLMSvsHLMS.eps)
%%CreationDate: 2018-11-30T12:42:33
%%Pages: (atend)
%%BoundingBox: 0 0 629 293
%%LanguageLevel: 3
%%EndComments
%%BeginProlog
%%BeginResource: procset (Apache XML Graphics Std ProcSet) 1.2 0
%%Version: 1.2 0
%%Copyright: (Copyright 2001-2003,2010 The Apache Software Foundation. License terms: http://www.apache.org/licenses/LICENSE-2.0)
/bd{bind def}bind def
/ld{load def}bd
/GR/grestore ld
/GS/gsave ld
/RM/rmoveto ld
/C/curveto ld
/t/show ld
/L/lineto ld
/ML/setmiterlimit ld
/CT/concat ld
/f/fill ld
/N/newpath ld
/S/stroke ld
/CC/setcmykcolor ld
/A/ashow ld
/cp/closepath ld
/RC/setrgbcolor ld
/LJ/setlinejoin ld
/GC/setgray ld
/LW/setlinewidth ld
/M/moveto ld
/re {4 2 roll M
1 index 0 rlineto
0 exch rlineto
neg 0 rlineto
cp } bd
/_ctm matrix def
/_tm matrix def
/BT { _ctm currentmatrix pop matrix _tm copy pop 0 0 moveto } bd
/ET { _ctm setmatrix } bd
/iTm { _ctm setmatrix _tm concat } bd
/Tm { _tm astore pop iTm 0 0 moveto } bd
/ux 0.0 def
/uy 0.0 def
/F {
  /Tp exch def
  /Tf exch def
  Tf findfont Tp scalefont setfont
  /cf Tf def  /cs Tp def
} bd
/ULS {currentpoint /uy exch def /ux exch def} bd
/ULE {
  /Tcx currentpoint pop def
  gsave
  newpath
  cf findfont cs scalefont dup
  /FontMatrix get 0 get /Ts exch def /FontInfo get dup
  /UnderlinePosition get Ts mul /To exch def
  /UnderlineThickness get Ts mul /Tt exch def
  ux uy To add moveto  Tcx uy To add lineto
  Tt setlinewidth stroke
  grestore
} bd
/OLE {
  /Tcx currentpoint pop def
  gsave
  newpath
  cf findfont cs scalefont dup
  /FontMatrix get 0 get /Ts exch def /FontInfo get dup
  /UnderlinePosition get Ts mul /To exch def
  /UnderlineThickness get Ts mul /Tt exch def
  ux uy To add cs add moveto Tcx uy To add cs add lineto
  Tt setlinewidth stroke
  grestore
} bd
/SOE {
  /Tcx currentpoint pop def
  gsave
  newpath
  cf findfont cs scalefont dup
  /FontMatrix get 0 get /Ts exch def /FontInfo get dup
  /UnderlinePosition get Ts mul /To exch def
  /UnderlineThickness get Ts mul /Tt exch def
  ux uy To add cs 10 mul 26 idiv add moveto Tcx uy To add cs 10 mul 26 idiv add lineto
  Tt setlinewidth stroke
  grestore
} bd
/QT {
/Y22 exch store
/X22 exch store
/Y21 exch store
/X21 exch store
currentpoint
/Y21 load 2 mul add 3 div exch
/X21 load 2 mul add 3 div exch
/X21 load 2 mul /X22 load add 3 div
/Y21 load 2 mul /Y22 load add 3 div
/X22 load /Y22 load curveto
} bd
/SSPD {
dup length /d exch dict def
{
/v exch def
/k exch def
currentpagedevice k known {
/cpdv currentpagedevice k get def
v cpdv ne {
/upd false def
/nullv v type /nulltype eq def
/nullcpdv cpdv type /nulltype eq def
nullv nullcpdv or
{
/upd true def
} {
/sametype v type cpdv type eq def
sametype {
v type /arraytype eq {
/vlen v length def
/cpdvlen cpdv length def
vlen cpdvlen eq {
0 1 vlen 1 sub {
/i exch def
/obj v i get def
/cpdobj cpdv i get def
obj cpdobj ne {
/upd true def
exit
} if
} for
} {
/upd true def
} ifelse
} {
v type /dicttype eq {
v {
/dv exch def
/dk exch def
/cpddv cpdv dk get def
dv cpddv ne {
/upd true def
exit
} if
} forall
} {
/upd true def
} ifelse
} ifelse
} if
} ifelse
upd true eq {
d k v put
} if
} if
} if
} forall
d length 0 gt {
d setpagedevice
} if
} bd
/RE { % /NewFontName [NewEncodingArray] /FontName RE -
  findfont dup length dict begin
  {
    1 index /FID ne
    {def} {pop pop} ifelse
  } forall
  /Encoding exch def
  /FontName 1 index def
  currentdict definefont pop
  end
} bind def
%%EndResource
%%BeginResource: procset (Apache XML Graphics EPS ProcSet) 1.0 0
%%Version: 1.0 0
%%Copyright: (Copyright 2002-2003 The Apache Software Foundation. License terms: http://www.apache.org/licenses/LICENSE-2.0)
/BeginEPSF { %def
/b4_Inc_state save def         % Save state for cleanup
/dict_count countdictstack def % Count objects on dict stack
/op_count count 1 sub def      % Count objects on operand stack
userdict begin                 % Push userdict on dict stack
/showpage { } def              % Redefine showpage, { } = null proc
0 setgray 0 setlinecap         % Prepare graphics state
1 setlinewidth 0 setlinejoin
10 setmiterlimit [ ] 0 setdash newpath
/languagelevel where           % If level not equal to 1 then
{pop languagelevel             % set strokeadjust and
1 ne                           % overprint to their defaults.
{false setstrokeadjust false setoverprint
} if
} if
} bd
/EndEPSF { %def
count op_count sub {pop} repeat            % Clean up stacks
countdictstack dict_count sub {end} repeat
b4_Inc_state restore
} bd
%%EndResource
%FOPBeginFontDict
%%IncludeResource: font Courier-Oblique
%%IncludeResource: font Courier-BoldOblique
%%IncludeResource: font Courier-Bold
%%IncludeResource: font ZapfDingbats
%%IncludeResource: font Symbol
%%IncludeResource: font Helvetica
%%IncludeResource: font Helvetica-Oblique
%%IncludeResource: font Helvetica-Bold
%%IncludeResource: font Helvetica-BoldOblique
%%IncludeResource: font Times-Roman
%%IncludeResource: font Times-Italic
%%IncludeResource: font Times-Bold
%%IncludeResource: font Times-BoldItalic
%%IncludeResource: font Courier
%FOPEndFontDict
%%BeginResource: encoding WinAnsiEncoding
/WinAnsiEncoding [
/.notdef /.notdef /.notdef /.notdef /.notdef
/.notdef /.notdef /.notdef /.notdef /.notdef
/.notdef /.notdef /.notdef /.notdef /.notdef
/.notdef /.notdef /.notdef /.notdef /.notdef
/.notdef /.notdef /.notdef /.notdef /.notdef
/.notdef /.notdef /.notdef /.notdef /.notdef
/.notdef /.notdef /space /exclam /quotedbl
/numbersign /dollar /percent /ampersand /quotesingle
/parenleft /parenright /asterisk /plus /comma
/hyphen /period /slash /zero /one
/two /three /four /five /six
/seven /eight /nine /colon /semicolon
/less /equal /greater /question /at
/A /B /C /D /E
/F /G /H /I /J
/K /L /M /N /O
/P /Q /R /S /T
/U /V /W /X /Y
/Z /bracketleft /backslash /bracketright /asciicircum
/underscore /quoteleft /a /b /c
/d /e /f /g /h
/i /j /k /l /m
/n /o /p /q /r
/s /t /u /v /w
/x /y /z /braceleft /bar
/braceright /asciitilde /bullet /Euro /bullet
/quotesinglbase /florin /quotedblbase /ellipsis /dagger
/daggerdbl /circumflex /perthousand /Scaron /guilsinglleft
/OE /bullet /Zcaron /bullet /bullet
/quoteleft /quoteright /quotedblleft /quotedblright /bullet
/endash /emdash /asciitilde /trademark /scaron
/guilsinglright /oe /bullet /zcaron /Ydieresis
/space /exclamdown /cent /sterling /currency
/yen /brokenbar /section /dieresis /copyright
/ordfeminine /guillemotleft /logicalnot /sfthyphen /registered
/macron /degree /plusminus /twosuperior /threesuperior
/acute /mu /paragraph /middot /cedilla
/onesuperior /ordmasculine /guillemotright /onequarter /onehalf
/threequarters /questiondown /Agrave /Aacute /Acircumflex
/Atilde /Adieresis /Aring /AE /Ccedilla
/Egrave /Eacute /Ecircumflex /Edieresis /Igrave
/Iacute /Icircumflex /Idieresis /Eth /Ntilde
/Ograve /Oacute /Ocircumflex /Otilde /Odieresis
/multiply /Oslash /Ugrave /Uacute /Ucircumflex
/Udieresis /Yacute /Thorn /germandbls /agrave
/aacute /acircumflex /atilde /adieresis /aring
/ae /ccedilla /egrave /eacute /ecircumflex
/edieresis /igrave /iacute /icircumflex /idieresis
/eth /ntilde /ograve /oacute /ocircumflex
/otilde /odieresis /divide /oslash /ugrave
/uacute /ucircumflex /udieresis /yacute /thorn
/ydieresis
] def
%%EndResource
%FOPBeginFontReencode
/Courier-Oblique findfont
dup length dict begin
  {1 index /FID ne {def} {pop pop} ifelse} forall
  /Encoding WinAnsiEncoding def
  currentdict
end
/Courier-Oblique exch definefont pop
/Courier-BoldOblique findfont
dup length dict begin
  {1 index /FID ne {def} {pop pop} ifelse} forall
  /Encoding WinAnsiEncoding def
  currentdict
end
/Courier-BoldOblique exch definefont pop
/Courier-Bold findfont
dup length dict begin
  {1 index /FID ne {def} {pop pop} ifelse} forall
  /Encoding WinAnsiEncoding def
  currentdict
end
/Courier-Bold exch definefont pop
/Helvetica findfont
dup length dict begin
  {1 index /FID ne {def} {pop pop} ifelse} forall
  /Encoding WinAnsiEncoding def
  currentdict
end
/Helvetica exch definefont pop
/Helvetica-Oblique findfont
dup length dict begin
  {1 index /FID ne {def} {pop pop} ifelse} forall
  /Encoding WinAnsiEncoding def
  currentdict
end
/Helvetica-Oblique exch definefont pop
/Helvetica-Bold findfont
dup length dict begin
  {1 index /FID ne {def} {pop pop} ifelse} forall
  /Encoding WinAnsiEncoding def
  currentdict
end
/Helvetica-Bold exch definefont pop
/Helvetica-BoldOblique findfont
dup length dict begin
  {1 index /FID ne {def} {pop pop} ifelse} forall
  /Encoding WinAnsiEncoding def
  currentdict
end
/Helvetica-BoldOblique exch definefont pop
/Times-Roman findfont
dup length dict begin
  {1 index /FID ne {def} {pop pop} ifelse} forall
  /Encoding WinAnsiEncoding def
  currentdict
end
/Times-Roman exch definefont pop
/Times-Italic findfont
dup length dict begin
  {1 index /FID ne {def} {pop pop} ifelse} forall
  /Encoding WinAnsiEncoding def
  currentdict
end
/Times-Italic exch definefont pop
/Times-Bold findfont
dup length dict begin
  {1 index /FID ne {def} {pop pop} ifelse} forall
  /Encoding WinAnsiEncoding def
  currentdict
end
/Times-Bold exch definefont pop
/Times-BoldItalic findfont
dup length dict begin
  {1 index /FID ne {def} {pop pop} ifelse} forall
  /Encoding WinAnsiEncoding def
  currentdict
end
/Times-BoldItalic exch definefont pop
/Courier findfont
dup length dict begin
  {1 index /FID ne {def} {pop pop} ifelse} forall
  /Encoding WinAnsiEncoding def
  currentdict
end
/Courier exch definefont pop
%FOPEndFontReencode
%%EndProlog
%%Page: 1 1
%%PageBoundingBox: 0 0 629 293
%%BeginPageSetup
[1 0 0 -1 0 293] CT
%%EndPageSetup
GS
[0.75 0 0 0.75 0 -0.25] CT
N
0 0 M
838 0 L
838 391 L
0 391 L
0 0 L
cp
clip
1 GC
N
0 0 838 391 re
f
GR
GS
[0.75 0 0 0.75 0 -0.25] CT
1 GC
N
0 0 838 391 re
f
GR
GS
[0.75 0 0 0.75 0 -0.25] CT
2 setlinecap
1 LJ
0.667 LW
N
109 348 M
109 29 L
S
GR
GS
[0.75 0 0 0.75 0 -0.25] CT
2 setlinecap
1 LJ
0.667 LW
N
109 348 M
115.49 348 L
S
GR
GS
[0.75 0 0 0.75 0 -0.25] CT
2 setlinecap
1 LJ
0.667 LW
N
109 316.1 M
115.49 316.1 L
S
GR
GS
[0.75 0 0 0.75 0 -0.25] CT
2 setlinecap
1 LJ
0.667 LW
N
109 284.2 M
115.49 284.2 L
S
GR
GS
[0.75 0 0 0.75 0 -0.25] CT
2 setlinecap
1 LJ
0.667 LW
N
109 252.3 M
115.49 252.3 L
S
GR
GS
[0.75 0 0 0.75 0 -0.25] CT
2 setlinecap
1 LJ
0.667 LW
N
109 220.4 M
115.49 220.4 L
S
GR
GS
[0.75 0 0 0.75 0 -0.25] CT
2 setlinecap
1 LJ
0.667 LW
N
109 188.5 M
115.49 188.5 L
S
GR
GS
[0.75 0 0 0.75 0 -0.25] CT
2 setlinecap
1 LJ
0.667 LW
N
109 156.6 M
115.49 156.6 L
S
GR
GS
[0.75 0 0 0.75 0 -0.25] CT
2 setlinecap
1 LJ
0.667 LW
N
109 124.7 M
115.49 124.7 L
S
GR
GS
[0.75 0 0 0.75 0 -0.25] CT
2 setlinecap
1 LJ
0.667 LW
N
109 92.8 M
115.49 92.8 L
S
GR
GS
[0.75 0 0 0.75 0 -0.25] CT
2 setlinecap
1 LJ
0.667 LW
N
109 60.9 M
115.49 60.9 L
S
GR
GS
[0.75 0 0 0.75 0 -0.25] CT
2 setlinecap
1 LJ
0.667 LW
N
109 29 M
115.49 29 L
S
GR
GS
[0 -0.75 0.75 0 76.70458 133.62489] CT
N
-30.131 -8.64 M
-30.131 -9.484 L
-28.928 -9.484 -27.795 -9.617 QT
-26.662 -9.749 -26.662 -10.249 QT
-26.662 -23.437 L
-26.662 -23.953 -26.943 -24.07 QT
-27.225 -24.187 -27.881 -24.187 QT
-28.881 -24.187 L
-30.865 -24.187 -31.693 -23.328 QT
-32.131 -22.89 -32.318 -21.937 QT
-32.506 -20.984 -32.631 -19.546 QT
-33.318 -19.546 L
-32.865 -25.031 L
-18.209 -25.031 L
-17.756 -19.546 L
-18.459 -19.546 L
-18.6 -21.093 -18.764 -21.999 QT
-18.928 -22.906 -19.381 -23.328 QT
-20.225 -24.187 -22.193 -24.187 QT
-23.193 -24.187 L
-23.631 -24.187 -23.873 -24.156 QT
-24.115 -24.124 -24.264 -23.953 QT
-24.412 -23.781 -24.412 -23.437 QT
-24.412 -10.249 L
-24.412 -9.749 -23.279 -9.617 QT
-22.146 -9.484 -20.943 -9.484 QT
-20.943 -8.64 L
-30.131 -8.64 L
cp
f
GR
GS
[0 -0.75 0.75 0 76.70458 133.62489] CT
N
-18.235 -8.64 M
-18.235 -9.484 L
-17.423 -9.484 -16.891 -9.617 QT
-16.36 -9.749 -16.36 -10.249 QT
-16.36 -16.796 L
-16.36 -17.437 -16.555 -17.726 QT
-16.751 -18.015 -17.11 -18.078 QT
-17.469 -18.14 -18.235 -18.14 QT
-18.235 -18.984 L
-14.798 -19.249 L
-14.798 -16.906 L
-14.423 -17.953 -13.704 -18.601 QT
-12.985 -19.249 -11.969 -19.249 QT
-11.251 -19.249 -10.688 -18.828 QT
-10.126 -18.406 -10.126 -17.718 QT
-10.126 -17.281 -10.438 -16.96 QT
-10.751 -16.64 -11.204 -16.64 QT
-11.657 -16.64 -11.969 -16.953 QT
-12.282 -17.265 -12.282 -17.718 QT
-12.282 -18.359 -11.829 -18.624 QT
-11.969 -18.624 L
-12.938 -18.624 -13.555 -17.921 QT
-14.173 -17.218 -14.43 -16.179 QT
-14.688 -15.14 -14.688 -14.187 QT
-14.688 -10.249 L
-14.688 -9.484 -12.36 -9.484 QT
-12.36 -8.64 L
-18.235 -8.64 L
cp
f
GR
GS
[0 -0.75 0.75 0 76.70458 133.62489] CT
N
-2.022 -2.687 M
-3.351 -3.734 -4.319 -5.101 QT
-5.288 -6.468 -5.905 -8.015 QT
-6.522 -9.562 -6.827 -11.249 QT
-7.132 -12.937 -7.132 -14.64 QT
-7.132 -16.359 -6.827 -18.046 QT
-6.522 -19.734 -5.89 -21.296 QT
-5.257 -22.859 -4.288 -24.218 QT
-3.319 -25.578 -2.022 -26.593 QT
-2.022 -26.64 -1.897 -26.64 QT
-1.679 -26.64 L
-1.601 -26.64 -1.546 -26.578 QT
-1.491 -26.515 -1.491 -26.437 QT
-1.491 -26.328 -1.538 -26.281 QT
-2.71 -25.124 -3.491 -23.812 QT
-4.272 -22.499 -4.741 -21.023 QT
-5.21 -19.546 -5.421 -17.953 QT
-5.632 -16.359 -5.632 -14.64 QT
-5.632 -7.015 -1.554 -3.046 QT
-1.491 -2.984 -1.491 -2.843 QT
-1.491 -2.796 -1.554 -2.718 QT
-1.616 -2.64 -1.679 -2.64 QT
-1.897 -2.64 L
-2.022 -2.64 -2.022 -2.687 QT
cp
f
GR
GS
[0 -0.75 0.75 0 76.70458 133.62489] CT
N
0.998 -8.64 M
0.764 -8.64 0.764 -8.953 QT
0.78 -9.015 0.811 -9.164 QT
0.842 -9.312 0.912 -9.398 QT
0.983 -9.484 1.076 -9.484 QT
2.53 -9.484 3.108 -9.656 QT
3.42 -9.749 3.561 -10.296 QT
6.858 -23.484 L
6.905 -23.718 6.905 -23.812 QT
6.905 -24.062 6.608 -24.093 QT
6.17 -24.187 4.889 -24.187 QT
4.655 -24.187 4.655 -24.515 QT
4.67 -24.562 4.701 -24.71 QT
4.733 -24.859 4.803 -24.945 QT
4.873 -25.031 4.967 -25.031 QT
17.639 -25.031 L
17.873 -25.031 17.873 -24.718 QT
17.295 -19.749 L
17.295 -19.687 17.217 -19.617 QT
17.139 -19.546 17.061 -19.546 QT
16.842 -19.546 L
16.592 -19.546 16.592 -19.843 QT
16.748 -20.937 16.748 -21.624 QT
16.748 -22.828 16.233 -23.39 QT
15.717 -23.953 14.936 -24.07 QT
14.155 -24.187 12.764 -24.187 QT
10.201 -24.187 L
9.545 -24.187 9.334 -24.078 QT
9.123 -23.968 8.951 -23.374 QT
7.405 -17.249 L
9.217 -17.249 L
10.108 -17.249 10.655 -17.343 QT
11.201 -17.437 11.569 -17.71 QT
11.936 -17.984 12.178 -18.492 QT
12.42 -18.999 12.608 -19.843 QT
12.686 -20.062 12.858 -20.062 QT
13.076 -20.062 L
13.311 -20.062 13.311 -19.749 QT
11.858 -13.828 L
11.748 -13.609 11.608 -13.609 QT
11.389 -13.609 L
11.155 -13.609 11.155 -13.921 QT
11.217 -14.171 11.256 -14.335 QT
11.295 -14.499 11.342 -14.812 QT
11.389 -15.124 11.389 -15.359 QT
11.389 -16.046 10.78 -16.234 QT
10.17 -16.421 9.186 -16.421 QT
7.217 -16.421 L
5.67 -10.203 L
5.608 -9.968 5.608 -9.968 QT
5.608 -9.687 5.78 -9.656 QT
6.405 -9.484 8.233 -9.484 QT
8.467 -9.484 8.467 -9.171 QT
8.389 -8.828 8.342 -8.734 QT
8.295 -8.64 8.061 -8.64 QT
0.998 -8.64 L
cp
f
GR
GS
[0 -0.75 0.75 0 76.70458 133.62489] CT
N
18.041 -4.853 M
17.275 -4.853 16.807 -5.415 QT
16.338 -5.978 16.166 -6.774 QT
15.994 -7.571 15.994 -8.353 QT
15.994 -8.368 L
15.994 -9.212 16.15 -10.126 QT
16.307 -11.04 16.619 -11.946 QT
16.932 -12.853 17.275 -13.571 QT
17.525 -14.071 17.924 -14.689 QT
18.322 -15.306 18.807 -15.837 QT
19.291 -16.368 19.854 -16.696 QT
20.416 -17.024 20.979 -17.024 QT
20.994 -17.024 L
21.619 -17.024 22.025 -16.689 QT
22.432 -16.353 22.666 -15.821 QT
22.9 -15.29 22.986 -14.681 QT
23.072 -14.071 23.072 -13.524 QT
23.072 -12.243 22.729 -10.899 QT
22.385 -9.556 21.76 -8.306 QT
21.525 -7.837 21.119 -7.196 QT
20.713 -6.556 20.252 -6.048 QT
19.791 -5.54 19.221 -5.196 QT
18.65 -4.853 18.057 -4.853 QT
18.041 -4.853 L
cp
18.072 -5.29 M
18.65 -5.29 19.166 -5.899 QT
19.682 -6.509 20.072 -7.36 QT
20.463 -8.212 20.76 -9.118 QT
21.057 -10.024 21.197 -10.649 QT
17.729 -10.649 L
17.463 -9.587 17.307 -8.806 QT
17.15 -8.024 17.15 -7.274 QT
17.15 -5.29 18.072 -5.29 QT
cp
17.854 -11.243 M
21.338 -11.243 L
21.525 -11.993 21.635 -12.493 QT
21.744 -12.993 21.815 -13.556 QT
21.885 -14.118 21.885 -14.587 QT
21.885 -16.587 20.979 -16.587 QT
19.9 -16.587 19.119 -14.845 QT
18.338 -13.103 17.854 -11.243 QT
cp
f
GR
GS
[0 -0.75 0.75 0 76.70458 133.62489] CT
N
26.423 -2.64 M
26.204 -2.64 26.204 -2.843 QT
26.204 -2.953 26.251 -2.999 QT
30.36 -7.015 30.36 -14.64 QT
30.36 -22.265 26.298 -26.234 QT
26.204 -26.296 26.204 -26.437 QT
26.204 -26.515 26.274 -26.578 QT
26.344 -26.64 26.423 -26.64 QT
26.641 -26.64 L
26.719 -26.64 26.766 -26.593 QT
28.485 -25.234 29.633 -23.289 QT
30.782 -21.343 31.313 -19.14 QT
31.844 -16.937 31.844 -14.64 QT
31.844 -12.937 31.555 -11.296 QT
31.266 -9.656 30.641 -8.054 QT
30.016 -6.453 29.055 -5.093 QT
28.094 -3.734 26.766 -2.687 QT
26.719 -2.64 26.641 -2.64 QT
26.423 -2.64 L
cp
f
GR
GS
[0.75 0 0 0.75 0 -0.25] CT
[10 6] 0 setdash
2 LJ
1.333 LW
N
110.442 126.252 M
111.884 126.3 L
113.327 126.245 L
114.769 126.264 L
116.211 126.214 L
117.653 126.294 L
119.096 126.236 L
120.538 126.198 L
121.98 126.228 L
123.422 126.195 L
124.864 126.198 L
126.307 126.214 L
127.749 126.217 L
129.191 126.169 L
130.633 126.242 L
132.076 126.183 L
133.518 126.186 L
134.96 126.186 L
136.402 126.17 L
137.844 126.129 L
139.287 126.128 L
140.729 126.137 L
142.171 126.173 L
143.613 126.109 L
145.056 126.135 L
146.498 126.12 L
147.94 126.151 L
149.382 126.157 L
150.824 126.104 L
152.267 126.112 L
153.709 126.123 L
155.151 126.082 L
156.593 126.163 L
158.036 126.119 L
159.478 126.106 L
160.92 126.079 L
162.362 126.119 L
163.804 126.07 L
165.247 126.113 L
166.689 126.125 L
168.131 126.128 L
169.573 126.135 L
171.016 126.111 L
172.458 126.154 L
173.9 126.172 L
175.342 126.106 L
176.784 126.129 L
178.227 126.109 L
179.669 126.126 L
181.111 126.081 L
182.553 126.136 L
183.996 126.154 L
185.438 126.162 L
186.88 126.109 L
188.322 126.163 L
189.764 126.14 L
191.207 126.146 L
192.649 126.115 L
194.091 126.144 L
195.533 126.201 L
196.976 126.107 L
198.418 126.164 L
199.86 126.148 L
201.302 126.184 L
202.744 126.177 L
204.187 126.169 L
205.629 126.155 L
207.071 126.259 L
208.513 126.197 L
209.956 126.214 L
211.398 126.213 L
212.84 126.224 L
214.282 126.178 L
215.724 126.201 L
217.167 126.217 L
218.609 126.207 L
220.051 126.214 L
221.493 126.209 L
222.936 126.219 L
224.378 126.211 L
225.82 126.311 L
227.262 126.23 L
228.704 126.245 L
230.147 126.248 L
231.589 126.297 L
233.031 126.225 L
234.473 126.313 L
235.916 126.305 L
237.358 126.25 L
238.8 126.253 L
240.242 126.281 L
241.684 126.279 L
243.127 126.254 L
244.569 126.327 L
246.011 126.242 L
247.453 126.29 L
248.896 126.283 L
250.338 126.313 L
251.78 126.338 L
253.222 126.341 L
254.664 126.304 L
256.107 126.261 L
257.549 126.285 L
258.991 126.338 L
260.433 126.355 L
261.876 126.332 L
263.318 126.359 L
264.76 126.298 L
266.202 126.331 L
267.644 126.342 L
269.087 126.366 L
270.529 126.361 L
271.971 126.343 L
273.413 126.379 L
274.856 126.413 L
276.298 126.405 L
277.74 126.385 L
279.182 126.383 L
280.624 126.42 L
282.067 126.389 L
283.509 126.416 L
284.951 126.404 L
286.393 126.43 L
287.836 126.434 L
289.278 126.433 L
290.72 126.413 L
292.162 126.454 L
293.604 126.43 L
295.047 126.444 L
296.489 126.496 L
297.931 126.432 L
299.373 126.44 L
300.816 126.44 L
302.258 126.428 L
303.7 126.447 L
305.142 126.494 L
306.584 126.493 L
308.027 126.46 L
309.469 126.47 L
310.911 126.51 L
312.353 126.496 L
313.796 126.47 L
315.238 126.523 L
316.68 126.469 L
318.122 126.51 L
319.564 126.504 L
321.007 126.548 L
322.449 126.495 L
323.891 126.511 L
325.333 126.526 L
326.776 126.551 L
328.218 126.501 L
329.66 126.5 L
331.102 126.498 L
332.544 126.517 L
333.987 126.537 L
335.429 126.528 L
336.871 126.52 L
338.313 126.553 L
339.756 126.547 L
341.198 126.559 L
342.64 126.57 L
344.082 126.535 L
345.524 126.522 L
346.967 126.508 L
348.409 126.533 L
349.851 126.519 L
351.293 126.53 L
352.736 126.55 L
354.178 126.574 L
355.62 126.54 L
357.062 126.535 L
358.504 126.532 L
359.947 126.508 L
361.389 126.552 L
362.831 126.506 L
364.273 126.502 L
365.716 126.534 L
367.158 126.478 L
368.6 126.553 L
370.042 126.482 L
371.484 126.505 L
372.927 126.482 L
374.369 126.473 L
375.811 126.486 L
377.253 126.48 L
378.696 126.503 L
380.138 126.468 L
381.58 126.495 L
383.022 126.467 L
384.464 126.511 L
385.907 126.478 L
387.349 126.423 L
388.791 126.486 L
390.233 126.416 L
391.676 126.432 L
393.118 126.438 L
394.56 126.414 L
396.002 126.391 L
397.444 126.41 L
398.887 126.389 L
400.329 126.413 L
401.771 126.43 L
403.213 126.332 L
404.656 126.32 L
406.098 126.376 L
407.54 126.349 L
408.982 126.373 L
410.424 126.325 L
411.867 126.318 L
413.309 126.287 L
414.751 126.305 L
416.193 126.294 L
417.636 126.326 L
419.078 126.3 L
420.52 126.276 L
421.962 126.279 L
423.404 126.273 L
424.847 126.255 L
426.289 126.267 L
427.731 126.256 L
429.173 126.258 L
430.616 126.256 L
432.058 126.237 L
433.5 126.236 L
434.942 126.224 L
436.384 126.208 L
437.827 126.178 L
439.269 126.187 L
440.711 126.225 L
442.153 126.206 L
443.596 126.162 L
445.038 126.155 L
446.48 126.168 L
447.922 126.171 L
449.364 126.165 L
450.807 126.189 L
452.249 126.208 L
453.691 126.182 L
455.133 126.176 L
456.576 126.182 L
458.018 126.147 L
459.46 126.12 L
460.902 126.165 L
462.344 126.149 L
463.787 126.167 L
465.229 126.115 L
466.671 126.173 L
468.113 126.154 L
469.556 126.17 L
470.998 126.145 L
472.44 126.188 L
473.882 126.161 L
475.324 126.149 L
476.767 126.201 L
478.209 126.174 L
479.651 126.182 L
481.093 126.145 L
482.536 126.219 L
483.978 126.188 L
485.42 126.191 L
486.862 126.206 L
488.304 126.202 L
489.747 126.16 L
491.189 126.19 L
492.631 126.156 L
494.073 126.171 L
495.516 126.219 L
496.958 126.15 L
498.4 126.192 L
499.842 126.186 L
501.284 126.192 L
502.727 126.145 L
504.169 126.197 L
505.611 126.184 L
507.053 126.258 L
508.496 126.196 L
509.938 126.174 L
511.38 126.205 L
512.822 126.236 L
514.264 126.254 L
515.707 126.233 L
517.149 126.248 L
518.591 126.251 L
520.033 126.252 L
521.476 126.248 L
522.918 126.241 L
524.36 126.289 L
525.802 126.23 L
527.244 126.305 L
528.687 126.275 L
530.129 126.271 L
531.571 126.28 L
533.013 126.275 L
534.456 126.277 L
535.898 126.302 L
537.34 126.309 L
538.782 126.246 L
540.224 126.266 L
541.667 126.262 L
543.109 126.324 L
544.551 126.318 L
545.993 126.321 L
547.436 126.331 L
548.878 126.26 L
550.32 126.345 L
551.762 126.368 L
553.204 126.308 L
554.647 126.328 L
556.089 126.294 L
557.531 126.336 L
558.973 126.349 L
560.416 126.31 L
561.858 126.335 L
563.3 126.338 L
564.742 126.381 L
566.184 126.368 L
567.627 126.387 L
569.069 126.362 L
570.511 126.373 L
571.953 126.417 L
573.396 126.379 L
574.838 126.36 L
576.28 126.375 L
577.722 126.328 L
579.164 126.401 L
580.607 126.324 L
582.049 126.417 L
583.491 126.412 L
584.933 126.414 L
586.376 126.403 L
587.818 126.436 L
589.26 126.408 L
590.702 126.402 L
592.144 126.439 L
593.587 126.414 L
595.029 126.409 L
596.471 126.411 L
597.913 126.423 L
599.356 126.434 L
600.798 126.403 L
602.24 126.452 L
603.682 126.445 L
605.124 126.425 L
606.567 126.432 L
608.009 126.45 L
609.451 126.456 L
610.893 126.453 L
612.336 126.467 L
613.778 126.45 L
615.22 126.431 L
616.662 126.502 L
618.104 126.495 L
619.547 126.506 L
620.989 126.462 L
622.431 126.455 L
623.873 126.479 L
625.316 126.482 L
626.758 126.515 L
628.2 126.518 L
629.642 126.478 L
631.084 126.505 L
632.527 126.478 L
633.969 126.444 L
635.411 126.483 L
636.853 126.499 L
638.296 126.512 L
639.738 126.504 L
641.18 126.495 L
642.622 126.487 L
644.064 126.442 L
645.507 126.477 L
646.949 126.483 L
648.391 126.509 L
649.833 126.496 L
651.276 126.474 L
652.718 126.467 L
654.16 126.474 L
655.602 126.499 L
657.044 126.483 L
658.487 126.472 L
659.929 126.439 L
661.371 126.466 L
662.813 126.437 L
664.256 126.466 L
665.698 126.446 L
667.14 126.365 L
668.582 126.441 L
670.024 126.432 L
671.467 126.415 L
672.909 126.387 L
674.351 126.396 L
675.793 126.393 L
677.236 126.415 L
678.678 126.397 L
680.12 126.414 L
681.562 126.417 L
683.004 126.382 L
684.447 126.367 L
685.889 126.353 L
687.331 126.331 L
688.773 126.359 L
690.216 126.332 L
691.658 126.374 L
693.1 126.321 L
694.542 126.28 L
695.984 126.371 L
697.427 126.297 L
698.869 126.315 L
S
GR
GS
[0.75 0 0 0.75 0 -0.25] CT
1 LJ
1.333 LW
N
110.442 145.06 M
111.884 150.018 L
113.327 154.304 L
114.769 157.956 L
116.211 161.008 L
117.653 163.496 L
119.096 165.453 L
120.538 166.912 L
121.98 167.903 L
123.422 168.458 L
124.864 168.606 L
126.307 168.375 L
127.749 167.793 L
129.191 166.886 L
130.633 165.68 L
132.076 164.199 L
133.518 162.468 L
134.96 160.508 L
136.402 158.343 L
137.844 155.993 L
139.287 153.479 L
140.729 150.819 L
142.171 148.034 L
143.613 145.141 L
145.056 142.157 L
146.498 139.099 L
147.94 135.983 L
149.382 132.823 L
150.824 129.635 L
152.267 126.431 L
153.709 123.225 L
155.151 120.03 L
156.593 116.856 L
158.036 113.717 L
159.478 110.621 L
160.92 107.579 L
162.362 104.601 L
163.804 101.695 L
165.247 98.871 L
166.689 96.135 L
168.131 93.495 L
169.573 90.958 L
171.016 88.53 L
172.458 86.217 L
173.9 84.026 L
175.342 81.96 L
176.784 80.024 L
178.227 78.222 L
179.669 76.559 L
181.111 75.037 L
182.553 73.66 L
183.996 72.43 L
185.438 71.349 L
186.88 70.42 L
188.322 69.643 L
189.764 69.021 L
191.207 68.553 L
192.649 68.241 L
194.091 68.086 L
195.533 68.086 L
196.976 68.242 L
198.418 68.553 L
199.86 69.019 L
201.302 69.639 L
202.744 70.411 L
204.187 71.334 L
205.629 72.407 L
207.071 73.627 L
208.513 74.992 L
209.956 76.501 L
211.398 78.151 L
212.84 79.939 L
214.282 81.862 L
215.724 83.918 L
217.167 86.104 L
218.609 88.416 L
220.051 90.851 L
221.493 93.406 L
222.936 96.077 L
224.378 98.86 L
225.82 101.752 L
227.262 104.749 L
228.704 107.847 L
230.147 111.042 L
231.589 114.33 L
233.031 117.707 L
234.473 121.168 L
235.916 124.709 L
237.358 128.326 L
238.8 132.015 L
240.242 135.771 L
241.684 139.589 L
243.127 143.466 L
244.569 147.396 L
246.011 151.376 L
247.453 155.401 L
248.896 159.466 L
250.338 163.566 L
251.78 167.698 L
253.222 171.857 L
254.664 176.038 L
256.107 180.237 L
257.549 184.449 L
258.991 188.67 L
260.433 192.896 L
261.876 197.122 L
263.318 201.344 L
264.76 205.557 L
266.202 209.758 L
267.644 213.942 L
269.087 218.105 L
270.529 222.243 L
271.971 226.352 L
273.413 230.428 L
274.856 234.468 L
276.298 238.466 L
277.74 242.42 L
279.182 246.326 L
280.624 250.18 L
282.067 253.979 L
283.509 257.719 L
284.951 261.396 L
286.393 265.009 L
287.836 268.552 L
289.278 272.024 L
290.72 275.421 L
292.162 278.74 L
293.604 281.978 L
295.047 285.133 L
296.489 288.201 L
297.931 291.181 L
299.373 294.07 L
300.816 296.865 L
302.258 299.564 L
303.7 302.165 L
305.142 304.666 L
306.584 307.064 L
308.027 309.359 L
309.469 311.548 L
310.911 313.629 L
312.353 315.601 L
313.796 317.462 L
315.238 319.212 L
316.68 320.848 L
318.122 322.37 L
319.564 323.776 L
321.007 325.066 L
322.449 326.238 L
323.891 327.293 L
325.333 328.229 L
326.776 329.045 L
328.218 329.742 L
329.66 330.319 L
331.102 330.776 L
332.544 331.112 L
333.987 331.328 L
335.429 331.424 L
336.871 331.399 L
338.313 331.255 L
339.756 330.991 L
341.198 330.608 L
342.64 330.107 L
344.082 329.487 L
345.524 328.751 L
346.967 327.898 L
348.409 326.93 L
349.851 325.848 L
351.293 324.652 L
352.736 323.345 L
354.178 321.927 L
355.62 320.399 L
357.062 318.764 L
358.504 317.022 L
359.947 315.176 L
361.389 313.227 L
362.831 311.176 L
364.273 309.026 L
365.716 306.779 L
367.158 304.436 L
368.6 302 L
370.042 299.472 L
371.484 296.855 L
372.927 294.152 L
374.369 291.364 L
375.811 288.495 L
377.253 285.545 L
378.696 282.519 L
380.138 279.418 L
381.58 276.245 L
383.022 273.003 L
384.464 269.695 L
385.907 266.322 L
387.349 262.889 L
388.791 259.398 L
390.233 255.852 L
391.676 252.253 L
393.118 248.605 L
394.56 244.911 L
396.002 241.173 L
397.444 237.396 L
398.887 233.581 L
400.329 229.733 L
401.771 225.853 L
403.213 221.946 L
404.656 218.014 L
406.098 214.061 L
407.54 210.09 L
408.982 206.104 L
410.424 202.107 L
411.867 198.1 L
413.309 194.089 L
414.751 190.076 L
416.193 186.064 L
417.636 182.056 L
419.078 178.056 L
420.52 174.067 L
421.962 170.092 L
423.404 166.135 L
424.847 162.197 L
426.289 158.284 L
427.731 154.397 L
429.173 150.54 L
430.616 146.716 L
432.058 142.928 L
433.5 139.179 L
434.942 135.472 L
436.384 131.811 L
437.827 128.197 L
439.269 124.634 L
440.711 121.125 L
442.153 117.672 L
443.596 114.278 L
445.038 110.947 L
446.48 107.68 L
447.922 104.481 L
449.364 101.351 L
450.807 98.294 L
452.249 95.312 L
453.691 92.407 L
455.133 89.581 L
456.576 86.838 L
458.018 84.178 L
459.46 81.605 L
460.902 79.12 L
462.344 76.725 L
463.787 74.423 L
465.229 72.215 L
466.671 70.102 L
468.113 68.087 L
469.556 66.172 L
470.998 64.357 L
472.44 62.644 L
473.882 61.036 L
475.324 59.532 L
476.767 58.134 L
478.209 56.843 L
479.651 55.661 L
481.093 54.588 L
482.536 53.626 L
483.978 52.774 L
485.42 52.034 L
486.862 51.406 L
488.304 50.891 L
489.747 50.489 L
491.189 50.2 L
492.631 50.025 L
494.073 49.963 L
495.516 50.016 L
496.958 50.181 L
498.4 50.461 L
499.842 50.853 L
501.284 51.358 L
502.727 51.976 L
504.169 52.705 L
505.611 53.544 L
507.053 54.495 L
508.496 55.554 L
509.938 56.721 L
511.38 57.996 L
512.822 59.377 L
514.264 60.862 L
515.707 62.45 L
517.149 64.14 L
518.591 65.931 L
520.033 67.819 L
521.476 69.805 L
522.918 71.884 L
524.36 74.057 L
525.802 76.32 L
527.244 78.672 L
528.687 81.11 L
530.129 83.631 L
531.571 86.234 L
533.013 88.915 L
534.456 91.673 L
535.898 94.503 L
537.34 97.404 L
538.782 100.373 L
540.224 103.406 L
541.667 106.501 L
543.109 109.654 L
544.551 112.862 L
545.993 116.122 L
547.436 119.431 L
548.878 122.784 L
550.32 126.178 L
551.762 129.611 L
553.204 133.078 L
554.647 136.575 L
556.089 140.098 L
557.531 143.645 L
558.973 147.211 L
560.416 150.792 L
561.858 154.383 L
563.3 157.982 L
564.742 161.585 L
566.184 165.186 L
567.627 168.781 L
569.069 172.368 L
570.511 175.941 L
571.953 179.497 L
573.396 183.031 L
574.838 186.538 L
576.28 190.016 L
577.722 193.459 L
579.164 196.864 L
580.607 200.226 L
582.049 203.54 L
583.491 206.804 L
584.933 210.012 L
586.376 213.161 L
587.818 216.247 L
589.26 219.264 L
590.702 222.211 L
592.144 225.082 L
593.587 227.873 L
595.029 230.582 L
596.471 233.203 L
597.913 235.735 L
599.356 238.171 L
600.798 240.511 L
602.24 242.749 L
603.682 244.883 L
605.124 246.909 L
606.567 248.825 L
608.009 250.628 L
609.451 252.314 L
610.893 253.881 L
612.336 255.327 L
613.778 256.649 L
615.22 257.845 L
616.662 258.913 L
618.104 259.851 L
619.547 260.657 L
620.989 261.331 L
622.431 261.87 L
623.873 262.274 L
625.316 262.542 L
626.758 262.674 L
628.2 262.668 L
629.642 262.526 L
631.084 262.247 L
632.527 261.832 L
633.969 261.282 L
635.411 260.597 L
636.853 259.779 L
638.296 258.829 L
639.738 257.751 L
641.18 256.545 L
642.622 255.216 L
644.064 253.765 L
645.507 252.196 L
646.949 250.514 L
648.391 248.721 L
649.833 246.824 L
651.276 244.827 L
652.718 242.736 L
654.16 240.556 L
655.602 238.294 L
657.044 235.957 L
658.487 233.551 L
659.929 231.086 L
661.371 228.57 L
662.813 226.01 L
664.256 223.417 L
665.698 220.801 L
667.14 218.173 L
668.582 215.542 L
670.024 212.922 L
671.467 210.325 L
672.909 207.763 L
674.351 205.25 L
675.793 202.801 L
677.236 200.43 L
678.678 198.153 L
680.12 195.987 L
681.562 193.949 L
683.004 192.056 L
684.447 190.327 L
685.889 188.781 L
687.331 187.439 L
688.773 186.321 L
690.216 185.45 L
691.658 184.847 L
693.1 184.537 L
694.542 184.544 L
695.984 184.893 L
697.427 185.61 L
698.869 186.723 L
S
GR
GS
[0.75 0 0 0.75 155.30333 54.97019] CT
1 0.627 0.627 RC
N
4 0 M
4 -2.209 2.209 -4 0 -4 C
-2.209 -4 -4 -2.209 -4 0 C
-4 2.209 -2.209 4 0 4 C
2.209 4 4 2.209 4 0 C
cp
f
GR
GS
[0.75 0 0 0.75 206.14167 175.60075] CT
1 0.627 0.627 RC
N
/f351177404{4 0 M
4 -2.209 2.209 -4 0 -4 C
-2.209 -4 -4 -2.209 -4 0 C
-4 2.209 -2.209 4 0 4 C
2.209 4 4 2.209 4 0 C
cp}def
f351177404
f
GR
GS
[0.75 0 0 0.75 0 -0.25] CT
1 GC
N
/f1392506862{789 98 M
789 42 L
588 42 L
588 98 L
cp}def
f1392506862
f
GR
GS
[0.75 0 0 0.75 476.3568 42.40979] CT
N
4.828 2.87 M
5.594 3.792 6.68 4.315 QT
7.766 4.839 8.969 4.839 QT
10.125 4.839 11.078 4.245 QT
12.031 3.651 12.031 2.557 QT
12.031 0.792 L
12.031 0.12 9.406 0.12 QT
9.406 -0.614 L
15.438 -0.614 L
15.438 0.12 L
14.766 0.12 14.375 0.237 QT
13.984 0.354 13.984 0.792 QT
13.984 4.932 L
13.984 5.011 13.93 5.065 QT
13.875 5.12 13.797 5.12 QT
13.609 5.12 13.148 4.659 QT
12.688 4.198 12.422 3.839 QT
11.922 4.714 10.82 5.151 QT
9.719 5.589 8.516 5.589 QT
6.484 5.589 4.805 4.534 QT
3.125 3.479 2.148 1.721 QT
1.172 -0.036 1.172 -2.052 QT
1.172 -3.552 1.742 -4.95 QT
2.313 -6.349 3.32 -7.419 QT
4.328 -8.489 5.672 -9.091 QT
7.016 -9.693 8.516 -9.693 QT
9.609 -9.693 10.578 -9.224 QT
11.547 -8.755 12.313 -7.896 QT
13.531 -9.63 L
13.641 -9.693 13.672 -9.693 QT
13.828 -9.693 L
13.891 -9.693 13.938 -9.638 QT
13.984 -9.583 13.984 -9.505 QT
13.984 -3.849 L
13.984 -3.661 13.828 -3.661 QT
13.438 -3.661 L
13.25 -3.661 13.25 -3.849 QT
13.25 -4.443 13.008 -5.193 QT
12.766 -5.943 12.391 -6.614 QT
12.016 -7.286 11.531 -7.802 QT
10.344 -8.943 8.813 -8.943 QT
7.656 -8.943 6.586 -8.419 QT
5.516 -7.896 4.781 -6.974 QT
4.016 -5.989 3.719 -4.739 QT
3.422 -3.489 3.422 -2.052 QT
3.422 1.167 4.828 2.87 QT
cp
f
GR
GS
[0.75 0 0 0.75 476.3568 42.40979] CT
N
17.381 5.12 M
17.381 4.386 L
19.553 4.386 19.553 3.136 QT
19.553 -8.364 L
18.866 -8.489 17.381 -8.489 QT
17.381 -9.224 L
21.413 -9.224 L
21.506 -9.224 21.553 -9.146 QT
28.991 1.792 L
28.991 -7.239 L
28.991 -8.489 26.819 -8.489 QT
26.819 -9.224 L
31.819 -9.224 L
31.819 -8.489 L
29.663 -8.489 29.663 -7.239 QT
29.663 4.932 L
29.663 4.995 29.577 5.057 QT
29.491 5.12 29.444 5.12 QT
29.194 5.12 L
29.085 5.12 29.053 5.042 QT
20.225 -7.943 L
20.225 3.136 L
20.225 4.386 22.397 4.386 QT
22.397 5.12 L
17.381 5.12 L
cp
f
GR
GS
[0.75 0 0 0.75 476.3568 42.40979] CT
N
33.913 5.417 M
33.913 0.511 L
33.913 0.354 34.1 0.354 QT
34.366 0.354 L
34.428 0.354 34.475 0.401 QT
34.522 0.448 34.522 0.511 QT
34.522 2.573 35.803 3.706 QT
37.085 4.839 39.147 4.839 QT
39.881 4.839 40.499 4.417 QT
41.116 3.995 41.452 3.315 QT
41.788 2.636 41.788 1.917 QT
41.788 1.276 41.538 0.675 QT
41.288 0.073 40.803 -0.364 QT
40.319 -0.802 39.71 -0.958 QT
36.991 -1.614 L
35.631 -1.974 34.772 -3.091 QT
33.913 -4.208 33.913 -5.583 QT
33.913 -6.677 34.467 -7.63 QT
35.022 -8.583 35.96 -9.138 QT
36.897 -9.693 37.991 -9.693 QT
40.1 -9.693 41.335 -8.255 QT
42.194 -9.63 L
42.256 -9.693 42.335 -9.693 QT
42.475 -9.693 L
42.538 -9.693 42.6 -9.646 QT
42.663 -9.599 42.663 -9.505 QT
42.663 -4.646 L
42.663 -4.458 42.475 -4.458 QT
42.241 -4.458 L
42.038 -4.458 42.038 -4.646 QT
42.038 -5.177 41.858 -5.81 QT
41.678 -6.443 41.366 -7.029 QT
41.053 -7.614 40.678 -7.989 QT
39.663 -9.005 37.991 -9.005 QT
37.272 -9.005 36.67 -8.646 QT
36.069 -8.286 35.71 -7.661 QT
35.35 -7.036 35.35 -6.349 QT
35.35 -5.443 35.905 -4.708 QT
36.46 -3.974 37.366 -3.739 QT
40.1 -3.068 L
40.772 -2.911 41.374 -2.482 QT
41.975 -2.052 42.374 -1.489 QT
42.772 -0.927 42.999 -0.239 QT
43.225 0.448 43.225 1.198 QT
43.225 2.323 42.702 3.339 QT
42.178 4.354 41.225 4.971 QT
40.272 5.589 39.147 5.589 QT
38.46 5.589 37.725 5.432 QT
36.991 5.276 36.381 4.956 QT
35.772 4.636 35.256 4.136 QT
34.381 5.526 L
34.319 5.589 34.225 5.589 QT
34.1 5.589 L
33.913 5.589 33.913 5.417 QT
cp
f
GR
GS
[0.75 0 0 0.75 476.3568 42.40979] CT
N
45.765 5.417 M
45.765 0.511 L
45.765 0.354 45.952 0.354 QT
46.218 0.354 L
46.28 0.354 46.327 0.401 QT
46.374 0.448 46.374 0.511 QT
46.374 2.573 47.655 3.706 QT
48.936 4.839 50.999 4.839 QT
51.733 4.839 52.35 4.417 QT
52.968 3.995 53.304 3.315 QT
53.64 2.636 53.64 1.917 QT
53.64 1.276 53.39 0.675 QT
53.14 0.073 52.655 -0.364 QT
52.171 -0.802 51.561 -0.958 QT
48.843 -1.614 L
47.483 -1.974 46.624 -3.091 QT
45.765 -4.208 45.765 -5.583 QT
45.765 -6.677 46.319 -7.63 QT
46.874 -8.583 47.811 -9.138 QT
48.749 -9.693 49.843 -9.693 QT
51.952 -9.693 53.186 -8.255 QT
54.046 -9.63 L
54.108 -9.693 54.186 -9.693 QT
54.327 -9.693 L
54.39 -9.693 54.452 -9.646 QT
54.515 -9.599 54.515 -9.505 QT
54.515 -4.646 L
54.515 -4.458 54.327 -4.458 QT
54.093 -4.458 L
53.89 -4.458 53.89 -4.646 QT
53.89 -5.177 53.71 -5.81 QT
53.53 -6.443 53.218 -7.029 QT
52.905 -7.614 52.53 -7.989 QT
51.515 -9.005 49.843 -9.005 QT
49.124 -9.005 48.522 -8.646 QT
47.921 -8.286 47.561 -7.661 QT
47.202 -7.036 47.202 -6.349 QT
47.202 -5.443 47.757 -4.708 QT
48.311 -3.974 49.218 -3.739 QT
51.952 -3.068 L
52.624 -2.911 53.225 -2.482 QT
53.827 -2.052 54.225 -1.489 QT
54.624 -0.927 54.85 -0.239 QT
55.077 0.448 55.077 1.198 QT
55.077 2.323 54.554 3.339 QT
54.03 4.354 53.077 4.971 QT
52.124 5.589 50.999 5.589 QT
50.311 5.589 49.577 5.432 QT
48.843 5.276 48.233 4.956 QT
47.624 4.636 47.108 4.136 QT
46.233 5.526 L
46.171 5.589 46.077 5.589 QT
45.952 5.589 L
45.765 5.589 45.765 5.417 QT
cp
f
GR
GS
[0.75 0 0 0.75 476.3568 42.40979] CT
N
68.806 5.354 M
67.54 5.354 66.462 4.714 QT
65.384 4.073 64.759 2.995 QT
64.134 1.917 64.134 0.651 QT
64.134 -0.318 64.478 -1.208 QT
64.821 -2.099 65.462 -2.802 QT
66.103 -3.505 66.954 -3.896 QT
67.806 -4.286 68.806 -4.286 QT
70.103 -4.286 71.165 -3.607 QT
72.228 -2.927 72.837 -1.786 QT
73.446 -0.646 73.446 0.651 QT
73.446 1.917 72.821 2.995 QT
72.196 4.073 71.126 4.714 QT
70.056 5.354 68.806 5.354 QT
cp
68.806 4.745 M
70.493 4.745 71.056 3.526 QT
71.618 2.307 71.618 0.417 QT
71.618 -0.646 71.501 -1.333 QT
71.384 -2.021 71.009 -2.599 QT
70.774 -2.943 70.407 -3.2 QT
70.04 -3.458 69.642 -3.599 QT
69.243 -3.739 68.806 -3.739 QT
68.149 -3.739 67.563 -3.443 QT
66.978 -3.146 66.587 -2.599 QT
66.196 -1.989 66.087 -1.279 QT
65.978 -0.568 65.978 0.417 QT
65.978 1.589 66.181 2.526 QT
66.384 3.464 67.009 4.104 QT
67.634 4.745 68.806 4.745 QT
cp
f
GR
GS
[0.75 0 0 0.75 476.3568 42.40979] CT
N
74.847 5.12 M
74.847 4.386 L
75.566 4.386 76.027 4.268 QT
76.488 4.151 76.488 3.714 QT
76.488 -2.021 L
76.488 -2.583 76.316 -2.833 QT
76.144 -3.083 75.832 -3.138 QT
75.519 -3.193 74.847 -3.193 QT
74.847 -3.927 L
77.894 -4.161 L
77.894 -2.114 L
78.316 -3.005 79.144 -3.583 QT
79.972 -4.161 80.941 -4.161 QT
82.394 -4.161 83.129 -3.466 QT
83.863 -2.771 83.863 -1.333 QT
83.863 3.714 L
83.863 4.151 84.324 4.268 QT
84.785 4.386 85.504 4.386 QT
85.504 5.12 L
80.691 5.12 L
80.691 4.386 L
81.41 4.386 81.871 4.268 QT
82.332 4.151 82.332 3.714 QT
82.332 -1.271 L
82.332 -2.286 82.035 -2.95 QT
81.738 -3.614 80.816 -3.614 QT
79.597 -3.614 78.808 -2.638 QT
78.019 -1.661 78.019 -0.427 QT
78.019 3.714 L
78.019 4.151 78.488 4.268 QT
78.957 4.386 79.66 4.386 QT
79.66 5.12 L
74.847 5.12 L
cp
f
GR
GS
[0.75 0 0 0.75 476.3568 42.40979] CT
N
86.715 5.12 M
86.715 4.386 L
87.434 4.386 87.895 4.268 QT
88.356 4.151 88.356 3.714 QT
88.356 -7.302 L
88.356 -7.864 88.191 -8.122 QT
88.027 -8.38 87.707 -8.435 QT
87.387 -8.489 86.715 -8.489 QT
86.715 -9.224 L
89.84 -9.458 L
89.84 3.714 L
89.84 4.151 90.301 4.268 QT
90.762 4.386 91.465 4.386 QT
91.465 5.12 L
86.715 5.12 L
cp
f
GR
GS
[0.75 0 0 0.75 476.3568 42.40979] CT
N
93.453 8.573 M
93.844 8.886 94.328 8.886 QT
95.656 8.886 96.485 6.886 QT
97.203 5.12 L
94.063 -2.599 L
93.86 -2.974 93.461 -3.083 QT
93.063 -3.193 92.406 -3.193 QT
92.406 -3.927 L
96.813 -3.927 L
96.813 -3.193 L
95.656 -3.193 95.656 -2.693 QT
95.656 -2.614 95.672 -2.568 QT
98.016 3.167 L
100.11 -1.989 L
100.172 -2.161 100.172 -2.349 QT
100.172 -2.614 100.031 -2.802 QT
99.891 -2.989 99.672 -3.091 QT
99.453 -3.193 99.172 -3.193 QT
99.172 -3.927 L
102.672 -3.927 L
102.672 -3.193 L
102.016 -3.193 101.531 -2.896 QT
101.047 -2.599 100.781 -2.021 QT
97.141 6.886 L
96.86 7.557 96.477 8.128 QT
96.094 8.698 95.539 9.065 QT
94.985 9.432 94.328 9.432 QT
93.563 9.432 92.985 8.925 QT
92.406 8.417 92.406 7.667 QT
92.406 7.276 92.672 7.011 QT
92.938 6.745 93.328 6.745 QT
93.594 6.745 93.805 6.862 QT
94.016 6.979 94.133 7.182 QT
94.25 7.386 94.25 7.667 QT
94.25 7.995 94.024 8.268 QT
93.797 8.542 93.453 8.573 QT
cp
f
GR
GS
[0.75 0 0 0.75 0 -0.25] CT
[10 6] 0 setdash
2 LJ
1.333 LW
N
592.012 56.88 M
632.133 56.88 L
S
GR
GS
[0.75 0 0 0.75 476.3568 62.09021] CT
N
0.641 5.12 M
0.641 4.386 L
2.813 4.386 2.813 3.714 QT
2.813 -7.818 L
2.813 -8.489 0.641 -8.489 QT
0.641 -9.224 L
6.938 -9.224 L
6.938 -8.489 L
4.766 -8.489 4.766 -7.818 QT
4.766 -2.708 L
10.969 -2.708 L
10.969 -7.818 L
10.969 -8.489 8.797 -8.489 QT
8.797 -9.224 L
15.078 -9.224 L
15.078 -8.489 L
12.922 -8.489 12.922 -7.818 QT
12.922 3.714 L
12.922 4.386 15.078 4.386 QT
15.078 5.12 L
8.797 5.12 L
8.797 4.386 L
10.969 4.386 10.969 3.714 QT
10.969 -1.974 L
4.766 -1.974 L
4.766 3.714 L
4.766 4.386 6.938 4.386 QT
6.938 5.12 L
0.641 5.12 L
cp
f
GR
GS
[0.75 0 0 0.75 476.3568 62.09021] CT
N
17.453 8.573 M
17.844 8.886 18.328 8.886 QT
19.656 8.886 20.484 6.886 QT
21.203 5.12 L
18.063 -2.599 L
17.859 -2.974 17.461 -3.083 QT
17.063 -3.193 16.406 -3.193 QT
16.406 -3.927 L
20.813 -3.927 L
20.813 -3.193 L
19.656 -3.193 19.656 -2.693 QT
19.656 -2.614 19.672 -2.568 QT
22.016 3.167 L
24.109 -1.989 L
24.172 -2.161 24.172 -2.349 QT
24.172 -2.614 24.031 -2.802 QT
23.891 -2.989 23.672 -3.091 QT
23.453 -3.193 23.172 -3.193 QT
23.172 -3.927 L
26.672 -3.927 L
26.672 -3.193 L
26.016 -3.193 25.531 -2.896 QT
25.047 -2.599 24.781 -2.021 QT
21.141 6.886 L
20.859 7.557 20.477 8.128 QT
20.094 8.698 19.539 9.065 QT
18.984 9.432 18.328 9.432 QT
17.563 9.432 16.984 8.925 QT
16.406 8.417 16.406 7.667 QT
16.406 7.276 16.672 7.011 QT
16.938 6.745 17.328 6.745 QT
17.594 6.745 17.805 6.862 QT
18.016 6.979 18.133 7.182 QT
18.25 7.386 18.25 7.667 QT
18.25 7.995 18.023 8.268 QT
17.797 8.542 17.453 8.573 QT
cp
f
GR
GS
[0.75 0 0 0.75 476.3568 62.09021] CT
N
29.447 5.12 M
29.447 -7.302 L
29.447 -7.864 29.275 -8.122 QT
29.103 -8.38 28.783 -8.435 QT
28.462 -8.489 27.806 -8.489 QT
27.806 -9.224 L
30.916 -9.458 L
30.916 -2.88 L
31.259 -3.271 31.728 -3.56 QT
32.197 -3.849 32.728 -4.005 QT
33.259 -4.161 33.806 -4.161 QT
34.759 -4.161 35.564 -3.779 QT
36.369 -3.396 36.962 -2.732 QT
37.556 -2.068 37.892 -1.2 QT
38.228 -0.333 38.228 0.589 QT
38.228 1.854 37.603 2.956 QT
36.978 4.057 35.908 4.706 QT
34.837 5.354 33.556 5.354 QT
32.759 5.354 32.009 4.948 QT
31.259 4.542 30.759 3.854 QT
30.056 5.12 L
29.447 5.12 L
cp
30.978 3.057 M
31.322 3.823 31.978 4.315 QT
32.634 4.807 33.431 4.807 QT
34.525 4.807 35.197 4.182 QT
35.869 3.557 36.134 2.604 QT
36.4 1.651 36.4 0.589 QT
36.4 -1.193 35.931 -2.114 QT
35.728 -2.521 35.377 -2.872 QT
35.025 -3.224 34.587 -3.419 QT
34.15 -3.614 33.666 -3.614 QT
32.822 -3.614 32.103 -3.169 QT
31.384 -2.724 30.978 -1.974 QT
30.978 3.057 L
cp
f
GR
GS
[0.75 0 0 0.75 476.3568 62.09021] CT
N
39.658 5.12 M
39.658 4.386 L
40.377 4.386 40.838 4.268 QT
41.299 4.151 41.299 3.714 QT
41.299 -2.021 L
41.299 -2.583 41.127 -2.833 QT
40.955 -3.083 40.635 -3.138 QT
40.314 -3.193 39.658 -3.193 QT
39.658 -3.927 L
42.658 -4.161 L
42.658 -2.114 L
43.002 -3.021 43.627 -3.591 QT
44.252 -4.161 45.142 -4.161 QT
45.767 -4.161 46.26 -3.794 QT
46.752 -3.427 46.752 -2.818 QT
46.752 -2.443 46.478 -2.161 QT
46.205 -1.88 45.814 -1.88 QT
45.424 -1.88 45.142 -2.154 QT
44.861 -2.427 44.861 -2.818 QT
44.861 -3.38 45.267 -3.614 QT
45.142 -3.614 L
44.283 -3.614 43.752 -2.997 QT
43.221 -2.38 42.994 -1.474 QT
42.767 -0.568 42.767 0.276 QT
42.767 3.714 L
42.767 4.386 44.799 4.386 QT
44.799 5.12 L
39.658 5.12 L
cp
f
GR
GS
[0.75 0 0 0.75 476.3568 62.09021] CT
N
48.107 5.12 M
48.107 4.386 L
48.826 4.386 49.287 4.268 QT
49.748 4.151 49.748 3.714 QT
49.748 -2.021 L
49.748 -2.833 49.436 -3.013 QT
49.123 -3.193 48.201 -3.193 QT
48.201 -3.927 L
51.232 -4.161 L
51.232 3.714 L
51.232 4.151 51.631 4.268 QT
52.029 4.386 52.701 4.386 QT
52.701 5.12 L
48.107 5.12 L
cp
48.998 -7.771 M
48.998 -8.224 49.35 -8.575 QT
49.701 -8.927 50.154 -8.927 QT
50.451 -8.927 50.725 -8.771 QT
50.998 -8.614 51.154 -8.341 QT
51.311 -8.068 51.311 -7.771 QT
51.311 -7.318 50.959 -6.966 QT
50.607 -6.614 50.154 -6.614 QT
49.701 -6.614 49.35 -6.966 QT
48.998 -7.318 48.998 -7.771 QT
cp
f
GR
GS
[0.75 0 0 0.75 476.3568 62.09021] CT
N
58.518 5.354 M
57.283 5.354 56.252 4.682 QT
55.221 4.011 54.658 2.917 QT
54.096 1.823 54.096 0.589 QT
54.096 -0.677 54.713 -1.771 QT
55.33 -2.864 56.401 -3.513 QT
57.471 -4.161 58.752 -4.161 QT
59.518 -4.161 60.205 -3.841 QT
60.893 -3.521 61.393 -2.943 QT
61.393 -7.302 L
61.393 -7.864 61.221 -8.122 QT
61.049 -8.38 60.736 -8.435 QT
60.424 -8.489 59.768 -8.489 QT
59.768 -9.224 L
62.861 -9.458 L
62.861 3.214 L
62.861 3.761 63.033 4.018 QT
63.205 4.276 63.518 4.331 QT
63.83 4.386 64.502 4.386 QT
64.502 5.12 L
61.33 5.354 L
61.33 4.026 L
60.783 4.651 60.033 5.003 QT
59.283 5.354 58.518 5.354 QT
cp
56.377 3.292 M
56.736 3.979 57.338 4.393 QT
57.94 4.807 58.643 4.807 QT
59.518 4.807 60.244 4.3 QT
60.971 3.792 61.33 2.995 QT
61.33 -2.036 L
61.08 -2.505 60.705 -2.864 QT
60.33 -3.224 59.869 -3.419 QT
59.408 -3.614 58.877 -3.614 QT
57.783 -3.614 57.119 -2.997 QT
56.455 -2.38 56.182 -1.411 QT
55.908 -0.443 55.908 0.604 QT
55.908 1.448 56.002 2.073 QT
56.096 2.698 56.377 3.292 QT
cp
f
GR
GS
[0.75 0 0 0.75 476.3568 62.09021] CT
N
73.528 5.417 M
73.528 0.511 L
73.528 0.354 73.715 0.354 QT
73.981 0.354 L
74.043 0.354 74.09 0.401 QT
74.137 0.448 74.137 0.511 QT
74.137 2.573 75.418 3.706 QT
76.699 4.839 78.762 4.839 QT
79.496 4.839 80.114 4.417 QT
80.731 3.995 81.067 3.315 QT
81.403 2.636 81.403 1.917 QT
81.403 1.276 81.153 0.675 QT
80.903 0.073 80.418 -0.364 QT
79.934 -0.802 79.324 -0.958 QT
76.606 -1.614 L
75.246 -1.974 74.387 -3.091 QT
73.528 -4.208 73.528 -5.583 QT
73.528 -6.677 74.082 -7.63 QT
74.637 -8.583 75.574 -9.138 QT
76.512 -9.693 77.606 -9.693 QT
79.715 -9.693 80.949 -8.255 QT
81.809 -9.63 L
81.871 -9.693 81.949 -9.693 QT
82.09 -9.693 L
82.153 -9.693 82.215 -9.646 QT
82.278 -9.599 82.278 -9.505 QT
82.278 -4.646 L
82.278 -4.458 82.09 -4.458 QT
81.856 -4.458 L
81.653 -4.458 81.653 -4.646 QT
81.653 -5.177 81.473 -5.81 QT
81.293 -6.443 80.981 -7.029 QT
80.668 -7.614 80.293 -7.989 QT
79.278 -9.005 77.606 -9.005 QT
76.887 -9.005 76.285 -8.646 QT
75.684 -8.286 75.324 -7.661 QT
74.965 -7.036 74.965 -6.349 QT
74.965 -5.443 75.52 -4.708 QT
76.074 -3.974 76.981 -3.739 QT
79.715 -3.068 L
80.387 -2.911 80.989 -2.482 QT
81.59 -2.052 81.989 -1.489 QT
82.387 -0.927 82.614 -0.239 QT
82.84 0.448 82.84 1.198 QT
82.84 2.323 82.317 3.339 QT
81.793 4.354 80.84 4.971 QT
79.887 5.589 78.762 5.589 QT
78.074 5.589 77.34 5.432 QT
76.606 5.276 75.996 4.956 QT
75.387 4.636 74.871 4.136 QT
73.996 5.526 L
73.934 5.589 73.84 5.589 QT
73.715 5.589 L
73.528 5.589 73.528 5.417 QT
cp
f
GR
GS
[0.75 0 0 0.75 476.3568 62.09021] CT
N
89.458 5.354 M
88.192 5.354 87.114 4.714 QT
86.036 4.073 85.411 2.995 QT
84.786 1.917 84.786 0.651 QT
84.786 -0.318 85.129 -1.208 QT
85.473 -2.099 86.114 -2.802 QT
86.754 -3.505 87.606 -3.896 QT
88.458 -4.286 89.458 -4.286 QT
90.754 -4.286 91.817 -3.607 QT
92.879 -2.927 93.489 -1.786 QT
94.098 -0.646 94.098 0.651 QT
94.098 1.917 93.473 2.995 QT
92.848 4.073 91.778 4.714 QT
90.708 5.354 89.458 5.354 QT
cp
89.458 4.745 M
91.145 4.745 91.708 3.526 QT
92.27 2.307 92.27 0.417 QT
92.27 -0.646 92.153 -1.333 QT
92.036 -2.021 91.661 -2.599 QT
91.426 -2.943 91.059 -3.2 QT
90.692 -3.458 90.294 -3.599 QT
89.895 -3.739 89.458 -3.739 QT
88.801 -3.739 88.215 -3.443 QT
87.629 -3.146 87.239 -2.599 QT
86.848 -1.989 86.739 -1.279 QT
86.629 -0.568 86.629 0.417 QT
86.629 1.589 86.833 2.526 QT
87.036 3.464 87.661 4.104 QT
88.286 4.745 89.458 4.745 QT
cp
f
GR
GS
[0.75 0 0 0.75 476.3568 62.09021] CT
N
95.515 5.12 M
95.515 4.386 L
96.234 4.386 96.695 4.268 QT
97.156 4.151 97.156 3.714 QT
97.156 -7.302 L
97.156 -7.864 96.992 -8.122 QT
96.827 -8.38 96.507 -8.435 QT
96.187 -8.489 95.515 -8.489 QT
95.515 -9.224 L
98.64 -9.458 L
98.64 3.714 L
98.64 4.151 99.101 4.268 QT
99.562 4.386 100.265 4.386 QT
100.265 5.12 L
95.515 5.12 L
cp
f
GR
GS
[0.75 0 0 0.75 476.3568 62.09021] CT
N
103.066 2.62 M
103.066 -2.021 L
103.066 -2.583 102.894 -2.833 QT
102.722 -3.083 102.41 -3.138 QT
102.097 -3.193 101.425 -3.193 QT
101.425 -3.927 L
104.597 -4.161 L
104.597 2.62 L
104.597 3.432 104.722 3.893 QT
104.847 4.354 105.23 4.581 QT
105.613 4.807 106.457 4.807 QT
107.582 4.807 108.246 3.862 QT
108.91 2.917 108.91 1.714 QT
108.91 -2.021 L
108.91 -2.583 108.738 -2.833 QT
108.566 -3.083 108.253 -3.138 QT
107.941 -3.193 107.269 -3.193 QT
107.269 -3.927 L
110.441 -4.161 L
110.441 3.214 L
110.441 3.761 110.613 4.018 QT
110.785 4.276 111.097 4.331 QT
111.41 4.386 112.082 4.386 QT
112.082 5.12 L
108.972 5.354 L
108.972 3.589 L
108.582 4.37 107.886 4.862 QT
107.191 5.354 106.347 5.354 QT
104.847 5.354 103.957 4.714 QT
103.066 4.073 103.066 2.62 QT
cp
f
GR
GS
[0.75 0 0 0.75 476.3568 62.09021] CT
N
114.793 2.604 M
114.793 -3.193 L
113.058 -3.193 L
113.058 -3.739 L
114.433 -3.739 115.074 -5.021 QT
115.715 -6.302 115.715 -7.802 QT
116.324 -7.802 L
116.324 -3.927 L
119.293 -3.927 L
119.293 -3.193 L
116.324 -3.193 L
116.324 2.557 L
116.324 3.432 116.613 4.089 QT
116.902 4.745 117.668 4.745 QT
118.387 4.745 118.707 4.05 QT
119.027 3.354 119.027 2.557 QT
119.027 1.323 L
119.621 1.323 L
119.621 2.604 L
119.621 3.261 119.379 3.901 QT
119.137 4.542 118.668 4.948 QT
118.199 5.354 117.527 5.354 QT
116.262 5.354 115.527 4.604 QT
114.793 3.854 114.793 2.604 QT
cp
f
GR
GS
[0.75 0 0 0.75 476.3568 62.09021] CT
N
121.589 5.12 M
121.589 4.386 L
122.308 4.386 122.769 4.268 QT
123.23 4.151 123.23 3.714 QT
123.23 -2.021 L
123.23 -2.833 122.917 -3.013 QT
122.605 -3.193 121.683 -3.193 QT
121.683 -3.927 L
124.714 -4.161 L
124.714 3.714 L
124.714 4.151 125.113 4.268 QT
125.511 4.386 126.183 4.386 QT
126.183 5.12 L
121.589 5.12 L
cp
122.48 -7.771 M
122.48 -8.224 122.831 -8.575 QT
123.183 -8.927 123.636 -8.927 QT
123.933 -8.927 124.206 -8.771 QT
124.48 -8.614 124.636 -8.341 QT
124.792 -8.068 124.792 -7.771 QT
124.792 -7.318 124.441 -6.966 QT
124.089 -6.614 123.636 -6.614 QT
123.183 -6.614 122.831 -6.966 QT
122.48 -7.318 122.48 -7.771 QT
cp
f
GR
GS
[0.75 0 0 0.75 476.3568 62.09021] CT
N
132.124 5.354 M
130.859 5.354 129.781 4.714 QT
128.703 4.073 128.078 2.995 QT
127.453 1.917 127.453 0.651 QT
127.453 -0.318 127.796 -1.208 QT
128.14 -2.099 128.781 -2.802 QT
129.421 -3.505 130.273 -3.896 QT
131.124 -4.286 132.124 -4.286 QT
133.421 -4.286 134.484 -3.607 QT
135.546 -2.927 136.156 -1.786 QT
136.765 -0.646 136.765 0.651 QT
136.765 1.917 136.14 2.995 QT
135.515 4.073 134.445 4.714 QT
133.374 5.354 132.124 5.354 QT
cp
132.124 4.745 M
133.812 4.745 134.374 3.526 QT
134.937 2.307 134.937 0.417 QT
134.937 -0.646 134.82 -1.333 QT
134.703 -2.021 134.328 -2.599 QT
134.093 -2.943 133.726 -3.2 QT
133.359 -3.458 132.96 -3.599 QT
132.562 -3.739 132.124 -3.739 QT
131.468 -3.739 130.882 -3.443 QT
130.296 -3.146 129.906 -2.599 QT
129.515 -1.989 129.406 -1.279 QT
129.296 -0.568 129.296 0.417 QT
129.296 1.589 129.499 2.526 QT
129.703 3.464 130.328 4.104 QT
130.953 4.745 132.124 4.745 QT
cp
f
GR
GS
[0.75 0 0 0.75 476.3568 62.09021] CT
N
138.166 5.12 M
138.166 4.386 L
138.885 4.386 139.346 4.268 QT
139.807 4.151 139.807 3.714 QT
139.807 -2.021 L
139.807 -2.583 139.635 -2.833 QT
139.463 -3.083 139.15 -3.138 QT
138.838 -3.193 138.166 -3.193 QT
138.166 -3.927 L
141.213 -4.161 L
141.213 -2.114 L
141.635 -3.005 142.463 -3.583 QT
143.291 -4.161 144.26 -4.161 QT
145.713 -4.161 146.447 -3.466 QT
147.182 -2.771 147.182 -1.333 QT
147.182 3.714 L
147.182 4.151 147.643 4.268 QT
148.104 4.386 148.822 4.386 QT
148.822 5.12 L
144.01 5.12 L
144.01 4.386 L
144.729 4.386 145.19 4.268 QT
145.65 4.151 145.65 3.714 QT
145.65 -1.271 L
145.65 -2.286 145.354 -2.95 QT
145.057 -3.614 144.135 -3.614 QT
142.916 -3.614 142.127 -2.638 QT
141.338 -1.661 141.338 -0.427 QT
141.338 3.714 L
141.338 4.151 141.807 4.268 QT
142.275 4.386 142.979 4.386 QT
142.979 5.12 L
138.166 5.12 L
cp
f
GR
GS
[0.75 0 0 0.75 0 -0.25] CT
1 LJ
1.333 LW
N
592.012 83.12 M
632.133 83.12 L
S
GR
GS
[0.75 0 0 0.75 0 -0.25] CT
1 GC
10.0 ML
0.667 LW
N
588 98 M
588 42 L
789 42 L
789 98 L
cp
S
GR
GS
[0.75 0 0 0.75 0 -0.25] CT
1 LJ
0.667 LW
N
96.976 347.236 M
722.87 347.236 L
S
GR
GS
[0.75 0 0 0.75 0 -0.25] CT
1 LJ
0.667 LW
N
718.204 342.236 M
731.537 347.236 L
722.87 347.236 L
718.204 342.236 L
S
GR
GS
[0.75 0 0 0.75 0 -0.25] CT
1 LJ
0.667 LW
N
731.537 347.236 M
718.204 352.236 L
722.87 347.236 L
731.537 347.236 L
S
GR
GS
[0.75 0 0 0.75 0 -0.25] CT
N
/f573765369{731.537 347.236 M
718.204 342.236 L
722.87 347.236 L
718.204 352.236 L
cp}def
f573765369
f
GR
GS
[0.75 0 0 0.75 0 -0.25] CT
1 LJ
0.667 LW
N
109.683 345.738 M
109.478 19.667 L
S
GR
GS
[0.75 0 0 0.75 0 -0.25] CT
1 LJ
0.667 LW
N
104.481 24.336 M
109.472 11 L
109.478 19.667 L
104.481 24.336 L
S
GR
GS
[0.75 0 0 0.75 0 -0.25] CT
1 LJ
0.667 LW
N
109.472 11 M
114.481 24.33 L
109.478 19.667 L
109.472 11 L
S
GR
GS
[0.75 0 0 0.75 0 -0.25] CT
N
/f1610411274{109.472 11 M
104.481 24.336 L
109.478 19.667 L
114.481 24.33 L
cp}def
f1610411274
f
GR
GS
[0.75 0 0 0.75 0 -0.25] CT
1 LJ
0.667 LW
N
238 272 M
258.215 249.453 L
S
GR
GS
[0.75 0 0 0.75 178.5 203.75] CT
/Helvetica 18.667 F
GS
[1 0 0 1 0 0] CT
-79 19 moveto 
1 -1 scale
(Profitable) t 
GR
GR
GS
[0.75 0 0 0.75 0 -0.25] CT
1 LJ
0.667 LW
N
251.377 249.59 M
264 243 L
258.215 249.453 L
251.377 249.59 L
S
GR
GS
[0.75 0 0 0.75 0 -0.25] CT
1 LJ
0.667 LW
N
264 243 M
258.822 256.265 L
258.215 249.453 L
264 243 L
S
GR
GS
[0.75 0 0 0.75 0 -0.25] CT
N
/f-603898826{264 243 M
251.377 249.59 L
258.215 249.453 L
258.822 256.265 L
cp}def
f-603898826
f
GR
GS
[0.75 0 0 0.75 0 -0.25] CT
1 LJ
0.667 LW
N
260 54 M
221.948 70.544 L
S
GR
GS
[0.75 0 0 0.75 286.75001 40.25] CT
/Helvetica 18.667 F
GS
[1 0 0 1 0 0] CT
-117 7 moveto 
1 -1 scale
(Non profitable) t 
GR
GR
GS
[0.75 0 0 0.75 0 -0.25] CT
1 LJ
0.667 LW
N
228.221 73.269 M
214 74 L
221.948 70.544 L
228.221 73.269 L
S
GR
GS
[0.75 0 0 0.75 0 -0.25] CT
1 LJ
0.667 LW
N
214 74 M
224.234 64.098 L
221.948 70.544 L
214 74 L
S
GR
GS
[0.75 0 0 0.75 0 -0.25] CT
N
/f1640238280{214 74 M
228.221 73.269 L
221.948 70.544 L
224.234 64.098 L
cp}def
f1640238280
f
GR
GS
[0.75 0 0 0.75 297.96938 261.34445] CT
N
-8.962 20.212 M
-8.962 19.822 -8.884 19.462 QT
-6.931 11.712 L
-9.759 11.712 L
-10.04 11.712 -10.04 11.353 QT
-9.931 10.759 -9.681 10.759 QT
-6.697 10.759 L
-5.619 6.353 L
-5.509 5.994 -5.189 5.744 QT
-4.869 5.494 -4.478 5.494 QT
-4.134 5.494 -3.9 5.697 QT
-3.665 5.9 -3.665 6.244 QT
-3.665 6.322 -3.673 6.369 QT
-3.681 6.416 -3.697 6.478 QT
-4.775 10.759 L
-1.994 10.759 L
-1.728 10.759 -1.728 11.119 QT
-1.728 11.181 -1.775 11.337 QT
-1.822 11.494 -1.884 11.603 QT
-1.947 11.712 -2.072 11.712 QT
-5.025 11.712 L
-6.962 19.509 L
-7.15 20.275 -7.15 20.837 QT
-7.15 21.994 -6.369 21.994 QT
-5.181 21.994 -4.259 20.876 QT
-3.337 19.759 -2.853 18.431 QT
-2.744 18.275 -2.65 18.275 QT
-2.322 18.275 L
-2.212 18.275 -2.142 18.345 QT
-2.072 18.416 -2.072 18.509 QT
-2.072 18.556 -2.103 18.587 QT
-2.697 20.228 -3.83 21.462 QT
-4.962 22.697 -6.431 22.697 QT
-7.494 22.697 -8.228 22.001 QT
-8.962 21.306 -8.962 20.212 QT
cp
f
GR
GS
[0.75 0 0 0.75 297.96938 261.34445] CT
N
0.011 26.056 M
0.011 25.947 0.027 25.884 QT
2.777 14.9 L
2.855 14.587 2.87 14.4 QT
2.87 14.087 1.636 14.087 QT
1.449 14.087 1.449 13.837 QT
1.449 13.79 1.488 13.673 QT
1.527 13.556 1.574 13.486 QT
1.62 13.415 1.714 13.415 QT
4.277 13.212 L
4.324 13.212 L
4.324 13.228 4.394 13.267 QT
4.464 13.306 4.464 13.306 QT
4.511 13.4 4.511 13.462 QT
2.511 21.4 L
3.199 21.119 4.245 20.033 QT
5.292 18.947 5.878 18.478 QT
6.464 18.009 7.355 18.009 QT
7.886 18.009 8.253 18.369 QT
8.62 18.728 8.62 19.259 QT
8.62 19.587 8.488 19.869 QT
8.355 20.15 8.097 20.33 QT
7.839 20.509 7.511 20.509 QT
7.199 20.509 6.995 20.322 QT
6.792 20.134 6.792 19.822 QT
6.792 19.369 7.113 19.056 QT
7.433 18.744 7.886 18.744 QT
7.699 18.494 7.324 18.494 QT
6.745 18.494 6.222 18.822 QT
5.699 19.15 5.097 19.751 QT
4.495 20.353 3.988 20.861 QT
3.48 21.369 3.058 21.634 QT
4.183 21.759 5.011 22.22 QT
5.839 22.681 5.839 23.619 QT
5.839 23.822 5.761 24.119 QT
5.589 24.837 5.589 25.259 QT
5.589 26.119 6.183 26.119 QT
6.87 26.119 7.222 25.361 QT
7.574 24.603 7.808 23.603 QT
7.839 23.494 7.964 23.494 QT
8.183 23.494 L
8.261 23.494 8.316 23.54 QT
8.37 23.587 8.37 23.665 QT
8.37 23.681 8.355 23.712 QT
7.636 26.619 6.136 26.619 QT
5.605 26.619 5.191 26.369 QT
4.777 26.119 4.55 25.681 QT
4.324 25.244 4.324 24.712 QT
4.324 24.4 4.417 24.087 QT
4.464 23.853 4.464 23.665 QT
4.464 22.931 3.816 22.548 QT
3.167 22.165 2.339 22.087 QT
1.37 25.962 L
1.292 26.244 1.081 26.431 QT
0.87 26.619 0.589 26.619 QT
0.355 26.619 0.183 26.455 QT
0.011 26.29 0.011 26.056 QT
cp
f
GR
%%Trailer
%%Pages: 1
%%EOF
