%!PS-Adobe-3.0 EPSF-3.0
%%Creator: (MATLAB, The Mathworks, Inc. Version 9.5.0.944444 \(R2018b\). Operating System: Windows 10)
%%Title: (C:/Users/navsas/Dropbox/Collaborative ranging CRLB/fig/skplotExp.eps)
%%CreationDate: 2018-11-19T11:54:21
%%Pages: (atend)
%%BoundingBox: 0 0 571 452
%%LanguageLevel: 3
%%EndComments
%%BeginProlog
%%BeginResource: procset (Apache XML Graphics Std ProcSet) 1.2 0
%%Version: 1.2 0
%%Copyright: (Copyright 2001-2003,2010 The Apache Software Foundation. License terms: http://www.apache.org/licenses/LICENSE-2.0)
/bd{bind def}bind def
/ld{load def}bd
/GR/grestore ld
/GS/gsave ld
/RM/rmoveto ld
/C/curveto ld
/t/show ld
/L/lineto ld
/ML/setmiterlimit ld
/CT/concat ld
/f/fill ld
/N/newpath ld
/S/stroke ld
/CC/setcmykcolor ld
/A/ashow ld
/cp/closepath ld
/RC/setrgbcolor ld
/LJ/setlinejoin ld
/GC/setgray ld
/LW/setlinewidth ld
/M/moveto ld
/re {4 2 roll M
1 index 0 rlineto
0 exch rlineto
neg 0 rlineto
cp } bd
/_ctm matrix def
/_tm matrix def
/BT { _ctm currentmatrix pop matrix _tm copy pop 0 0 moveto } bd
/ET { _ctm setmatrix } bd
/iTm { _ctm setmatrix _tm concat } bd
/Tm { _tm astore pop iTm 0 0 moveto } bd
/ux 0.0 def
/uy 0.0 def
/F {
  /Tp exch def
  /Tf exch def
  Tf findfont Tp scalefont setfont
  /cf Tf def  /cs Tp def
} bd
/ULS {currentpoint /uy exch def /ux exch def} bd
/ULE {
  /Tcx currentpoint pop def
  gsave
  newpath
  cf findfont cs scalefont dup
  /FontMatrix get 0 get /Ts exch def /FontInfo get dup
  /UnderlinePosition get Ts mul /To exch def
  /UnderlineThickness get Ts mul /Tt exch def
  ux uy To add moveto  Tcx uy To add lineto
  Tt setlinewidth stroke
  grestore
} bd
/OLE {
  /Tcx currentpoint pop def
  gsave
  newpath
  cf findfont cs scalefont dup
  /FontMatrix get 0 get /Ts exch def /FontInfo get dup
  /UnderlinePosition get Ts mul /To exch def
  /UnderlineThickness get Ts mul /Tt exch def
  ux uy To add cs add moveto Tcx uy To add cs add lineto
  Tt setlinewidth stroke
  grestore
} bd
/SOE {
  /Tcx currentpoint pop def
  gsave
  newpath
  cf findfont cs scalefont dup
  /FontMatrix get 0 get /Ts exch def /FontInfo get dup
  /UnderlinePosition get Ts mul /To exch def
  /UnderlineThickness get Ts mul /Tt exch def
  ux uy To add cs 10 mul 26 idiv add moveto Tcx uy To add cs 10 mul 26 idiv add lineto
  Tt setlinewidth stroke
  grestore
} bd
/QT {
/Y22 exch store
/X22 exch store
/Y21 exch store
/X21 exch store
currentpoint
/Y21 load 2 mul add 3 div exch
/X21 load 2 mul add 3 div exch
/X21 load 2 mul /X22 load add 3 div
/Y21 load 2 mul /Y22 load add 3 div
/X22 load /Y22 load curveto
} bd
/SSPD {
dup length /d exch dict def
{
/v exch def
/k exch def
currentpagedevice k known {
/cpdv currentpagedevice k get def
v cpdv ne {
/upd false def
/nullv v type /nulltype eq def
/nullcpdv cpdv type /nulltype eq def
nullv nullcpdv or
{
/upd true def
} {
/sametype v type cpdv type eq def
sametype {
v type /arraytype eq {
/vlen v length def
/cpdvlen cpdv length def
vlen cpdvlen eq {
0 1 vlen 1 sub {
/i exch def
/obj v i get def
/cpdobj cpdv i get def
obj cpdobj ne {
/upd true def
exit
} if
} for
} {
/upd true def
} ifelse
} {
v type /dicttype eq {
v {
/dv exch def
/dk exch def
/cpddv cpdv dk get def
dv cpddv ne {
/upd true def
exit
} if
} forall
} {
/upd true def
} ifelse
} ifelse
} if
} ifelse
upd true eq {
d k v put
} if
} if
} if
} forall
d length 0 gt {
d setpagedevice
} if
} bd
/RE { % /NewFontName [NewEncodingArray] /FontName RE -
  findfont dup length dict begin
  {
    1 index /FID ne
    {def} {pop pop} ifelse
  } forall
  /Encoding exch def
  /FontName 1 index def
  currentdict definefont pop
  end
} bind def
%%EndResource
%%BeginResource: procset (Apache XML Graphics EPS ProcSet) 1.0 0
%%Version: 1.0 0
%%Copyright: (Copyright 2002-2003 The Apache Software Foundation. License terms: http://www.apache.org/licenses/LICENSE-2.0)
/BeginEPSF { %def
/b4_Inc_state save def         % Save state for cleanup
/dict_count countdictstack def % Count objects on dict stack
/op_count count 1 sub def      % Count objects on operand stack
userdict begin                 % Push userdict on dict stack
/showpage { } def              % Redefine showpage, { } = null proc
0 setgray 0 setlinecap         % Prepare graphics state
1 setlinewidth 0 setlinejoin
10 setmiterlimit [ ] 0 setdash newpath
/languagelevel where           % If level not equal to 1 then
{pop languagelevel             % set strokeadjust and
1 ne                           % overprint to their defaults.
{false setstrokeadjust false setoverprint
} if
} if
} bd
/EndEPSF { %def
count op_count sub {pop} repeat            % Clean up stacks
countdictstack dict_count sub {end} repeat
b4_Inc_state restore
} bd
%%EndResource
%FOPBeginFontDict
%%IncludeResource: font Courier-Oblique
%%IncludeResource: font Courier-BoldOblique
%%IncludeResource: font Courier-Bold
%%IncludeResource: font ZapfDingbats
%%IncludeResource: font Symbol
%%IncludeResource: font Helvetica
%%IncludeResource: font Helvetica-Oblique
%%IncludeResource: font Helvetica-Bold
%%IncludeResource: font Helvetica-BoldOblique
%%IncludeResource: font Times-Roman
%%IncludeResource: font Times-Italic
%%IncludeResource: font Times-Bold
%%IncludeResource: font Times-BoldItalic
%%IncludeResource: font Courier
%FOPEndFontDict
%%BeginResource: encoding WinAnsiEncoding
/WinAnsiEncoding [
/.notdef /.notdef /.notdef /.notdef /.notdef
/.notdef /.notdef /.notdef /.notdef /.notdef
/.notdef /.notdef /.notdef /.notdef /.notdef
/.notdef /.notdef /.notdef /.notdef /.notdef
/.notdef /.notdef /.notdef /.notdef /.notdef
/.notdef /.notdef /.notdef /.notdef /.notdef
/.notdef /.notdef /space /exclam /quotedbl
/numbersign /dollar /percent /ampersand /quotesingle
/parenleft /parenright /asterisk /plus /comma
/hyphen /period /slash /zero /one
/two /three /four /five /six
/seven /eight /nine /colon /semicolon
/less /equal /greater /question /at
/A /B /C /D /E
/F /G /H /I /J
/K /L /M /N /O
/P /Q /R /S /T
/U /V /W /X /Y
/Z /bracketleft /backslash /bracketright /asciicircum
/underscore /quoteleft /a /b /c
/d /e /f /g /h
/i /j /k /l /m
/n /o /p /q /r
/s /t /u /v /w
/x /y /z /braceleft /bar
/braceright /asciitilde /bullet /Euro /bullet
/quotesinglbase /florin /quotedblbase /ellipsis /dagger
/daggerdbl /circumflex /perthousand /Scaron /guilsinglleft
/OE /bullet /Zcaron /bullet /bullet
/quoteleft /quoteright /quotedblleft /quotedblright /bullet
/endash /emdash /asciitilde /trademark /scaron
/guilsinglright /oe /bullet /zcaron /Ydieresis
/space /exclamdown /cent /sterling /currency
/yen /brokenbar /section /dieresis /copyright
/ordfeminine /guillemotleft /logicalnot /sfthyphen /registered
/macron /degree /plusminus /twosuperior /threesuperior
/acute /mu /paragraph /middot /cedilla
/onesuperior /ordmasculine /guillemotright /onequarter /onehalf
/threequarters /questiondown /Agrave /Aacute /Acircumflex
/Atilde /Adieresis /Aring /AE /Ccedilla
/Egrave /Eacute /Ecircumflex /Edieresis /Igrave
/Iacute /Icircumflex /Idieresis /Eth /Ntilde
/Ograve /Oacute /Ocircumflex /Otilde /Odieresis
/multiply /Oslash /Ugrave /Uacute /Ucircumflex
/Udieresis /Yacute /Thorn /germandbls /agrave
/aacute /acircumflex /atilde /adieresis /aring
/ae /ccedilla /egrave /eacute /ecircumflex
/edieresis /igrave /iacute /icircumflex /idieresis
/eth /ntilde /ograve /oacute /ocircumflex
/otilde /odieresis /divide /oslash /ugrave
/uacute /ucircumflex /udieresis /yacute /thorn
/ydieresis
] def
%%EndResource
%FOPBeginFontReencode
/Courier-Oblique findfont
dup length dict begin
  {1 index /FID ne {def} {pop pop} ifelse} forall
  /Encoding WinAnsiEncoding def
  currentdict
end
/Courier-Oblique exch definefont pop
/Courier-BoldOblique findfont
dup length dict begin
  {1 index /FID ne {def} {pop pop} ifelse} forall
  /Encoding WinAnsiEncoding def
  currentdict
end
/Courier-BoldOblique exch definefont pop
/Courier-Bold findfont
dup length dict begin
  {1 index /FID ne {def} {pop pop} ifelse} forall
  /Encoding WinAnsiEncoding def
  currentdict
end
/Courier-Bold exch definefont pop
/Helvetica findfont
dup length dict begin
  {1 index /FID ne {def} {pop pop} ifelse} forall
  /Encoding WinAnsiEncoding def
  currentdict
end
/Helvetica exch definefont pop
/Helvetica-Oblique findfont
dup length dict begin
  {1 index /FID ne {def} {pop pop} ifelse} forall
  /Encoding WinAnsiEncoding def
  currentdict
end
/Helvetica-Oblique exch definefont pop
/Helvetica-Bold findfont
dup length dict begin
  {1 index /FID ne {def} {pop pop} ifelse} forall
  /Encoding WinAnsiEncoding def
  currentdict
end
/Helvetica-Bold exch definefont pop
/Helvetica-BoldOblique findfont
dup length dict begin
  {1 index /FID ne {def} {pop pop} ifelse} forall
  /Encoding WinAnsiEncoding def
  currentdict
end
/Helvetica-BoldOblique exch definefont pop
/Times-Roman findfont
dup length dict begin
  {1 index /FID ne {def} {pop pop} ifelse} forall
  /Encoding WinAnsiEncoding def
  currentdict
end
/Times-Roman exch definefont pop
/Times-Italic findfont
dup length dict begin
  {1 index /FID ne {def} {pop pop} ifelse} forall
  /Encoding WinAnsiEncoding def
  currentdict
end
/Times-Italic exch definefont pop
/Times-Bold findfont
dup length dict begin
  {1 index /FID ne {def} {pop pop} ifelse} forall
  /Encoding WinAnsiEncoding def
  currentdict
end
/Times-Bold exch definefont pop
/Times-BoldItalic findfont
dup length dict begin
  {1 index /FID ne {def} {pop pop} ifelse} forall
  /Encoding WinAnsiEncoding def
  currentdict
end
/Times-BoldItalic exch definefont pop
/Courier findfont
dup length dict begin
  {1 index /FID ne {def} {pop pop} ifelse} forall
  /Encoding WinAnsiEncoding def
  currentdict
end
/Courier exch definefont pop
%FOPEndFontReencode
%%EndProlog
%%Page: 1 1
%%PageBoundingBox: 0 0 571 452
%%BeginPageSetup
[1 0 0 -1 0 452] CT
%%EndPageSetup
GS
[0.75 0 0 0.75 0 0.5] CT
1 GC
N
0 0 761 602 re
f
GR
GS
[0.75 0 0 0.75 0 0.5] CT
1 GC
N
0 0 761 602 re
f
GR
GS
[0.75 0 0 0.75 0 0.5] CT
1 GC
N
174.73 303.9 M
175.2 318.241 L
176.606 332.52 L
178.944 346.677 L
182.202 360.651 L
186.367 374.382 L
191.421 387.811 L
197.343 400.88 L
204.107 413.535 L
211.684 425.719 L
220.042 437.383 L
229.144 448.474 L
238.953 458.947 L
249.426 468.755 L
260.517 477.858 L
272.18 486.216 L
284.365 493.793 L
297.02 500.557 L
310.089 506.478 L
323.518 511.533 L
337.249 515.698 L
351.223 518.956 L
365.38 521.293 L
379.659 522.7 L
394 523.169 L
408.341 522.7 L
422.62 521.293 L
436.777 518.956 L
450.751 515.698 L
464.482 511.533 L
477.911 506.478 L
490.98 500.557 L
503.635 493.793 L
515.82 486.216 L
527.483 477.858 L
538.574 468.755 L
549.047 458.947 L
558.856 448.474 L
567.958 437.383 L
576.316 425.719 L
583.893 413.535 L
590.657 400.88 L
596.579 387.811 L
601.633 374.382 L
605.798 360.651 L
609.056 346.677 L
611.394 332.52 L
612.8 318.241 L
613.27 303.9 L
612.8 289.559 L
611.394 275.279 L
609.056 261.122 L
605.798 247.149 L
601.633 233.418 L
596.579 219.989 L
590.657 206.919 L
583.893 194.265 L
576.316 182.08 L
567.958 170.417 L
558.856 159.325 L
549.047 148.853 L
538.574 139.044 L
527.483 129.942 L
515.82 121.584 L
503.635 114.007 L
490.98 107.243 L
477.911 101.321 L
464.482 96.267 L
450.751 92.102 L
436.777 88.843 L
422.62 86.506 L
408.341 85.1 L
394 84.63 L
379.659 85.1 L
365.38 86.506 L
351.223 88.843 L
337.249 92.102 L
323.518 96.267 L
310.089 101.321 L
297.02 107.243 L
284.365 114.007 L
272.18 121.584 L
260.517 129.942 L
249.426 139.044 L
238.953 148.853 L
229.144 159.325 L
220.042 170.417 L
211.684 182.08 L
204.107 194.265 L
197.343 206.919 L
191.421 219.989 L
186.367 233.418 L
182.202 247.149 L
178.944 261.122 L
176.606 275.279 L
175.2 289.559 L
cp
f
GR
GS
[0.75 0 0 0.75 0 0.5] CT
0.149 GC
1 LJ
0.667 LW
N
174.73 303.9 M
175.2 318.241 L
176.606 332.52 L
178.944 346.677 L
182.202 360.651 L
186.367 374.382 L
191.421 387.811 L
197.343 400.88 L
204.107 413.535 L
211.684 425.719 L
220.042 437.383 L
229.144 448.474 L
238.953 458.947 L
249.426 468.755 L
260.517 477.858 L
272.18 486.216 L
284.365 493.793 L
297.02 500.557 L
310.089 506.478 L
323.518 511.533 L
337.249 515.698 L
351.223 518.956 L
365.38 521.293 L
379.659 522.7 L
394 523.169 L
394 523.169 L
408.341 522.7 L
422.62 521.293 L
436.777 518.956 L
450.751 515.698 L
464.482 511.533 L
477.911 506.478 L
490.98 500.557 L
503.635 493.793 L
515.82 486.216 L
527.483 477.858 L
538.574 468.755 L
549.047 458.947 L
558.856 448.474 L
567.958 437.383 L
576.316 425.719 L
583.893 413.535 L
590.657 400.88 L
596.579 387.811 L
601.633 374.382 L
605.798 360.651 L
609.056 346.677 L
611.394 332.52 L
612.8 318.241 L
613.27 303.9 L
613.27 303.9 L
612.8 289.559 L
611.394 275.279 L
609.056 261.122 L
605.798 247.149 L
601.633 233.418 L
596.579 219.989 L
590.657 206.919 L
583.893 194.265 L
576.316 182.08 L
567.958 170.417 L
558.856 159.325 L
549.047 148.853 L
538.574 139.044 L
527.483 129.942 L
515.82 121.584 L
503.635 114.007 L
490.98 107.243 L
477.911 101.321 L
464.482 96.267 L
450.751 92.102 L
436.777 88.843 L
422.62 86.506 L
408.341 85.1 L
394 84.63 L
394 84.63 L
379.659 85.1 L
365.38 86.506 L
351.223 88.843 L
337.249 92.102 L
323.518 96.267 L
310.089 101.321 L
297.02 107.243 L
284.365 114.007 L
272.18 121.584 L
260.517 129.942 L
249.426 139.044 L
238.953 148.853 L
229.144 159.325 L
220.042 170.417 L
211.684 182.08 L
204.107 194.265 L
197.343 206.919 L
191.421 219.989 L
186.367 233.418 L
182.202 247.149 L
178.944 261.122 L
176.606 275.279 L
175.2 289.559 L
174.73 303.9 L
cp
S
GR
GS
[0.75 0 0 0.75 0 0.5] CT
0.149 GC
[1 3] 0 setdash
2 LJ
0.667 LW
N
503.635 114.007 M
284.365 493.793 L
S
GR
GS
[0.75 0 0 0.75 0 0.5] CT
0.149 GC
[1 3] 0 setdash
2 LJ
0.667 LW
N
583.893 194.265 M
204.107 413.535 L
S
GR
GS
[0.75 0 0 0.75 0 0.5] CT
0.149 GC
[1 3] 0 setdash
2 LJ
0.667 LW
N
613.27 303.9 M
174.73 303.9 L
S
GR
GS
[0.75 0 0 0.75 0 0.5] CT
0.149 GC
[1 3] 0 setdash
2 LJ
0.667 LW
N
583.893 413.535 M
204.107 194.265 L
S
GR
GS
[0.75 0 0 0.75 0 0.5] CT
0.149 GC
[1 3] 0 setdash
2 LJ
0.667 LW
N
503.635 493.793 M
284.365 114.007 L
S
GR
GS
[0.75 0 0 0.75 0 0.5] CT
0.149 GC
[1 3] 0 setdash
2 LJ
0.667 LW
N
394 523.169 M
394 84.63 L
S
GR
GS
[0.75 0 0 0.75 385.9487 71.76314] CT
N
-8.667 3.495 M
-8.182 4.214 -7.346 4.565 QT
-6.51 4.917 -5.557 4.917 QT
-4.339 4.917 -3.823 3.878 QT
-3.307 2.839 -3.307 1.511 QT
-3.307 0.917 -3.417 0.323 QT
-3.526 -0.271 -3.784 -0.786 QT
-4.042 -1.302 -4.487 -1.607 QT
-4.932 -1.911 -5.573 -1.911 QT
-6.979 -1.911 L
-7.167 -1.911 -7.167 -2.114 QT
-7.167 -2.286 L
-7.167 -2.458 -6.979 -2.458 QT
-5.823 -2.552 L
-5.073 -2.552 -4.589 -3.107 QT
-4.104 -3.661 -3.878 -4.45 QT
-3.651 -5.239 -3.651 -5.958 QT
-3.651 -6.974 -4.12 -7.614 QT
-4.589 -8.255 -5.557 -8.255 QT
-6.354 -8.255 -7.089 -7.958 QT
-7.823 -7.661 -8.245 -7.036 QT
-8.198 -7.052 -8.175 -7.06 QT
-8.151 -7.068 -8.104 -7.068 QT
-7.635 -7.068 -7.315 -6.739 QT
-6.995 -6.411 -6.995 -5.943 QT
-6.995 -5.489 -7.315 -5.161 QT
-7.635 -4.833 -8.104 -4.833 QT
-8.557 -4.833 -8.885 -5.161 QT
-9.214 -5.489 -9.214 -5.943 QT
-9.214 -6.849 -8.675 -7.513 QT
-8.135 -8.177 -7.276 -8.521 QT
-6.417 -8.864 -5.557 -8.864 QT
-4.917 -8.864 -4.214 -8.677 QT
-3.51 -8.489 -2.932 -8.138 QT
-2.354 -7.786 -1.995 -7.232 QT
-1.635 -6.677 -1.635 -5.958 QT
-1.635 -5.083 -2.026 -4.333 QT
-2.417 -3.583 -3.104 -3.044 QT
-3.792 -2.505 -4.62 -2.239 QT
-3.698 -2.052 -2.878 -1.544 QT
-2.057 -1.036 -1.565 -0.232 QT
-1.073 0.573 -1.073 1.495 QT
-1.073 2.651 -1.706 3.589 QT
-2.339 4.526 -3.378 5.057 QT
-4.417 5.589 -5.557 5.589 QT
-6.542 5.589 -7.534 5.214 QT
-8.526 4.839 -9.159 4.089 QT
-9.792 3.339 -9.792 2.292 QT
-9.792 1.761 -9.44 1.417 QT
-9.089 1.073 -8.557 1.073 QT
-8.229 1.073 -7.948 1.229 QT
-7.667 1.386 -7.503 1.675 QT
-7.339 1.964 -7.339 2.292 QT
-7.339 2.807 -7.698 3.151 QT
-8.057 3.495 -8.557 3.495 QT
-8.667 3.495 L
cp
f
GR
GS
[0.75 0 0 0.75 385.9487 71.76314] CT
N
5.25 5.589 M
2.672 5.589 1.75 3.464 QT
0.828 1.339 0.828 -1.583 QT
0.828 -3.396 1.156 -5.005 QT
1.484 -6.614 2.477 -7.739 QT
3.469 -8.864 5.25 -8.864 QT
6.641 -8.864 7.516 -8.193 QT
8.391 -7.521 8.859 -6.443 QT
9.328 -5.364 9.492 -4.146 QT
9.656 -2.927 9.656 -1.583 QT
9.656 0.229 9.328 1.8 QT
9 3.37 8.023 4.479 QT
7.047 5.589 5.25 5.589 QT
cp
5.25 5.042 M
6.422 5.042 6.992 3.839 QT
7.563 2.636 7.695 1.182 QT
7.828 -0.271 7.828 -1.911 QT
7.828 -3.489 7.695 -4.825 QT
7.563 -6.161 6.992 -7.239 QT
6.422 -8.318 5.25 -8.318 QT
4.063 -8.318 3.484 -7.232 QT
2.906 -6.146 2.773 -4.818 QT
2.641 -3.489 2.641 -1.911 QT
2.641 -0.739 2.703 0.292 QT
2.766 1.323 3.008 2.425 QT
3.25 3.526 3.797 4.284 QT
4.344 5.042 5.25 5.042 QT
cp
f
GR
GS
[0.75 0 0 0.75 205.0513 385.08658] CT
N
-14.953 5.12 M
-14.953 4.557 L
-14.953 4.511 -14.906 4.448 QT
-11.656 0.839 L
-10.906 0.026 -10.445 -0.513 QT
-9.984 -1.052 -9.539 -1.763 QT
-9.094 -2.474 -8.828 -3.2 QT
-8.563 -3.927 -8.563 -4.755 QT
-8.563 -5.614 -8.883 -6.404 QT
-9.203 -7.193 -9.836 -7.661 QT
-10.469 -8.13 -11.359 -8.13 QT
-12.266 -8.13 -12.992 -7.583 QT
-13.719 -7.036 -14.016 -6.161 QT
-13.938 -6.177 -13.797 -6.177 QT
-13.328 -6.177 -12.992 -5.864 QT
-12.656 -5.552 -12.656 -5.036 QT
-12.656 -4.568 -12.992 -4.232 QT
-13.328 -3.896 -13.797 -3.896 QT
-14.281 -3.896 -14.617 -4.239 QT
-14.953 -4.583 -14.953 -5.036 QT
-14.953 -5.833 -14.656 -6.521 QT
-14.359 -7.208 -13.797 -7.747 QT
-13.234 -8.286 -12.539 -8.575 QT
-11.844 -8.864 -11.047 -8.864 QT
-9.844 -8.864 -8.813 -8.357 QT
-7.781 -7.849 -7.172 -6.919 QT
-6.563 -5.989 -6.563 -4.755 QT
-6.563 -3.849 -6.961 -3.029 QT
-7.359 -2.208 -7.984 -1.536 QT
-8.609 -0.864 -9.586 -0.013 QT
-10.563 0.839 -10.875 1.136 QT
-13.25 3.417 L
-11.234 3.417 L
-9.75 3.417 -8.75 3.393 QT
-7.75 3.37 -7.688 3.307 QT
-7.438 3.042 -7.188 1.37 QT
-6.563 1.37 L
-7.156 5.12 L
-14.953 5.12 L
cp
f
GR
GS
[0.75 0 0 0.75 205.0513 385.08658] CT
N
-3.38 5.12 M
-3.38 4.386 L
-0.755 4.386 -0.755 3.714 QT
-0.755 -7.302 L
-1.849 -6.786 -3.505 -6.786 QT
-3.505 -7.521 L
-0.927 -7.521 0.385 -8.864 QT
0.682 -8.864 L
0.745 -8.864 0.815 -8.81 QT
0.885 -8.755 0.885 -8.677 QT
0.885 3.714 L
0.885 4.386 3.51 4.386 QT
3.51 5.12 L
-3.38 5.12 L
cp
f
GR
GS
[0.75 0 0 0.75 205.0513 385.08658] CT
N
10.583 5.589 M
8.005 5.589 7.083 3.464 QT
6.161 1.339 6.161 -1.583 QT
6.161 -3.396 6.49 -5.005 QT
6.818 -6.614 7.81 -7.739 QT
8.802 -8.864 10.583 -8.864 QT
11.974 -8.864 12.849 -8.193 QT
13.724 -7.521 14.193 -6.443 QT
14.661 -5.364 14.826 -4.146 QT
14.99 -2.927 14.99 -1.583 QT
14.99 0.229 14.661 1.8 QT
14.333 3.37 13.357 4.479 QT
12.38 5.589 10.583 5.589 QT
cp
10.583 5.042 M
11.755 5.042 12.326 3.839 QT
12.896 2.636 13.029 1.182 QT
13.161 -0.271 13.161 -1.911 QT
13.161 -3.489 13.029 -4.825 QT
12.896 -6.161 12.326 -7.239 QT
11.755 -8.318 10.583 -8.318 QT
9.396 -8.318 8.818 -7.232 QT
8.24 -6.146 8.107 -4.818 QT
7.974 -3.489 7.974 -1.911 QT
7.974 -0.739 8.036 0.292 QT
8.099 1.323 8.341 2.425 QT
8.583 3.526 9.13 4.284 QT
9.677 5.042 10.583 5.042 QT
cp
f
GR
GS
[0.75 0 0 0.75 452.1617 137.97617] CT
N
-5.417 5.589 M
-6.714 5.589 -7.589 4.893 QT
-8.464 4.198 -8.94 3.096 QT
-9.417 1.995 -9.604 0.784 QT
-9.792 -0.427 -9.792 -1.661 QT
-9.792 -3.333 -9.143 -5.005 QT
-8.495 -6.677 -7.237 -7.771 QT
-5.979 -8.864 -4.26 -8.864 QT
-3.542 -8.864 -2.917 -8.591 QT
-2.292 -8.318 -1.94 -7.794 QT
-1.589 -7.271 -1.589 -6.521 QT
-1.589 -6.083 -1.885 -5.794 QT
-2.182 -5.505 -2.604 -5.505 QT
-3.01 -5.505 -3.307 -5.802 QT
-3.604 -6.099 -3.604 -6.521 QT
-3.604 -6.927 -3.307 -7.224 QT
-3.01 -7.521 -2.604 -7.521 QT
-2.495 -7.521 L
-2.76 -7.896 -3.245 -8.075 QT
-3.729 -8.255 -4.26 -8.255 QT
-4.901 -8.255 -5.432 -7.982 QT
-5.964 -7.708 -6.401 -7.239 QT
-6.839 -6.771 -7.12 -6.2 QT
-7.401 -5.63 -7.565 -4.904 QT
-7.729 -4.177 -7.768 -3.536 QT
-7.807 -2.896 -7.807 -1.943 QT
-7.432 -2.802 -6.76 -3.349 QT
-6.089 -3.896 -5.229 -3.896 QT
-4.292 -3.896 -3.526 -3.513 QT
-2.76 -3.13 -2.206 -2.458 QT
-1.651 -1.786 -1.362 -0.927 QT
-1.073 -0.068 -1.073 0.807 QT
-1.073 2.042 -1.62 3.159 QT
-2.167 4.276 -3.159 4.932 QT
-4.151 5.589 -5.417 5.589 QT
cp
-5.417 4.917 M
-4.604 4.917 -4.112 4.55 QT
-3.62 4.182 -3.393 3.573 QT
-3.167 2.964 -3.104 2.339 QT
-3.042 1.714 -3.042 0.807 QT
-3.042 -0.38 -3.159 -1.216 QT
-3.276 -2.052 -3.776 -2.693 QT
-4.276 -3.333 -5.307 -3.333 QT
-6.167 -3.333 -6.714 -2.763 QT
-7.26 -2.193 -7.51 -1.318 QT
-7.76 -0.443 -7.76 0.37 QT
-7.76 0.651 -7.745 0.792 QT
-7.745 0.823 -7.753 0.846 QT
-7.76 0.87 -7.76 0.901 QT
-7.76 1.792 -7.581 2.714 QT
-7.401 3.636 -6.878 4.276 QT
-6.354 4.917 -5.417 4.917 QT
cp
f
GR
GS
[0.75 0 0 0.75 452.1617 137.97617] CT
N
/f1776739717{5.25 5.589 M
2.672 5.589 1.75 3.464 QT
0.828 1.339 0.828 -1.583 QT
0.828 -3.396 1.156 -5.005 QT
1.484 -6.614 2.477 -7.739 QT
3.469 -8.864 5.25 -8.864 QT
6.641 -8.864 7.516 -8.193 QT
8.391 -7.521 8.859 -6.443 QT
9.328 -5.364 9.492 -4.146 QT
9.656 -2.927 9.656 -1.583 QT
9.656 0.229 9.328 1.8 QT
9 3.37 8.023 4.479 QT
7.047 5.589 5.25 5.589 QT
cp
5.25 5.042 M
6.422 5.042 6.992 3.839 QT
7.563 2.636 7.695 1.182 QT
7.828 -0.271 7.828 -1.911 QT
7.828 -3.489 7.695 -4.825 QT
7.563 -6.161 6.992 -7.239 QT
6.422 -8.318 5.25 -8.318 QT
4.063 -8.318 3.484 -7.232 QT
2.906 -6.146 2.773 -4.818 QT
2.641 -3.489 2.641 -1.911 QT
2.641 -0.739 2.703 0.292 QT
2.766 1.323 3.008 2.425 QT
3.25 3.526 3.797 4.284 QT
4.344 5.042 5.25 5.042 QT
cp}def
f1776739717
f
GR
GS
[0.75 0 0 0.75 138.83828 318.87354] CT
N
/f1390903136{-14.953 5.12 M
-14.953 4.557 L
-14.953 4.511 -14.906 4.448 QT
-11.656 0.839 L
-10.906 0.026 -10.445 -0.513 QT
-9.984 -1.052 -9.539 -1.763 QT
-9.094 -2.474 -8.828 -3.2 QT
-8.563 -3.927 -8.563 -4.755 QT
-8.563 -5.614 -8.883 -6.404 QT
-9.203 -7.193 -9.836 -7.661 QT
-10.469 -8.13 -11.359 -8.13 QT
-12.266 -8.13 -12.992 -7.583 QT
-13.719 -7.036 -14.016 -6.161 QT
-13.938 -6.177 -13.797 -6.177 QT
-13.328 -6.177 -12.992 -5.864 QT
-12.656 -5.552 -12.656 -5.036 QT
-12.656 -4.568 -12.992 -4.232 QT
-13.328 -3.896 -13.797 -3.896 QT
-14.281 -3.896 -14.617 -4.239 QT
-14.953 -4.583 -14.953 -5.036 QT
-14.953 -5.833 -14.656 -6.521 QT
-14.359 -7.208 -13.797 -7.747 QT
-13.234 -8.286 -12.539 -8.575 QT
-11.844 -8.864 -11.047 -8.864 QT
-9.844 -8.864 -8.813 -8.357 QT
-7.781 -7.849 -7.172 -6.919 QT
-6.563 -5.989 -6.563 -4.755 QT
-6.563 -3.849 -6.961 -3.029 QT
-7.359 -2.208 -7.984 -1.536 QT
-8.609 -0.864 -9.586 -0.013 QT
-10.563 0.839 -10.875 1.136 QT
-13.25 3.417 L
-11.234 3.417 L
-9.75 3.417 -8.75 3.393 QT
-7.75 3.37 -7.688 3.307 QT
-7.438 3.042 -7.188 1.37 QT
-6.563 1.37 L
-7.156 5.12 L
-14.953 5.12 L
cp}def
f1390903136
f
GR
GS
[0.75 0 0 0.75 138.83828 318.87354] CT
N
/f346431540{-4.755 1.651 M
-4.755 0.917 L
1.745 -8.771 L
1.807 -8.864 1.964 -8.864 QT
2.26 -8.864 L
2.495 -8.864 2.495 -8.63 QT
2.495 0.917 L
4.557 0.917 L
4.557 1.651 L
2.495 1.651 L
2.495 3.714 L
2.495 4.151 3.112 4.268 QT
3.729 4.386 4.542 4.386 QT
4.542 5.12 L
-1.24 5.12 L
-1.24 4.386 L
-0.427 4.386 0.182 4.268 QT
0.792 4.151 0.792 3.714 QT
0.792 1.651 L
-4.755 1.651 L
cp
-4.052 0.917 M
0.917 0.917 L
0.917 -6.521 L
-4.052 0.917 L
cp}def
f346431540
f
GR
GS
[0.75 0 0 0.75 138.83828 318.87354] CT
N
/f-485083074{10.583 5.589 M
8.005 5.589 7.083 3.464 QT
6.161 1.339 6.161 -1.583 QT
6.161 -3.396 6.49 -5.005 QT
6.818 -6.614 7.81 -7.739 QT
8.802 -8.864 10.583 -8.864 QT
11.974 -8.864 12.849 -8.193 QT
13.724 -7.521 14.193 -6.443 QT
14.661 -5.364 14.826 -4.146 QT
14.99 -2.927 14.99 -1.583 QT
14.99 0.229 14.661 1.8 QT
14.333 3.37 13.357 4.479 QT
12.38 5.589 10.583 5.589 QT
cp
10.583 5.042 M
11.755 5.042 12.326 3.839 QT
12.896 2.636 13.029 1.182 QT
13.161 -0.271 13.161 -1.911 QT
13.161 -3.489 13.029 -4.825 QT
12.896 -6.161 12.326 -7.239 QT
11.755 -8.318 10.583 -8.318 QT
9.396 -8.318 8.818 -7.232 QT
8.24 -6.146 8.107 -4.818 QT
7.974 -3.489 7.974 -1.911 QT
7.974 -0.739 8.036 0.292 QT
8.099 1.323 8.341 2.425 QT
8.583 3.526 9.13 4.284 QT
9.677 5.042 10.583 5.042 QT
cp}def
f-485083074
f
GR
GS
[0.75 0 0 0.75 476.3974 228.42486] CT
N
/f1208957343{-8.292 4.245 M
-7.729 4.917 -6.292 4.917 QT
-5.495 4.917 -4.807 4.37 QT
-4.12 3.823 -3.729 3.042 QT
-3.292 2.151 -3.167 1.136 QT
-3.042 0.12 -3.042 -1.364 QT
-3.401 -0.521 -4.073 0.026 QT
-4.745 0.573 -5.62 0.573 QT
-6.839 0.573 -7.8 -0.091 QT
-8.76 -0.755 -9.276 -1.841 QT
-9.792 -2.927 -9.792 -4.146 QT
-9.792 -5.396 -9.214 -6.489 QT
-8.635 -7.583 -7.62 -8.224 QT
-6.604 -8.864 -5.307 -8.864 QT
-4.042 -8.864 -3.182 -8.177 QT
-2.323 -7.489 -1.878 -6.396 QT
-1.432 -5.302 -1.253 -4.083 QT
-1.073 -2.864 -1.073 -1.661 QT
-1.073 -0.052 -1.667 1.636 QT
-2.26 3.323 -3.44 4.456 QT
-4.62 5.589 -6.292 5.589 QT
-7.542 5.589 -8.401 5.003 QT
-9.26 4.417 -9.26 3.229 QT
-9.26 2.807 -8.971 2.511 QT
-8.682 2.214 -8.245 2.214 QT
-7.823 2.214 -7.534 2.511 QT
-7.245 2.807 -7.245 3.229 QT
-7.245 3.636 -7.542 3.94 QT
-7.839 4.245 -8.245 4.245 QT
-8.292 4.245 L
cp
-5.542 0.011 M
-4.682 0.011 -4.135 -0.568 QT
-3.589 -1.146 -3.339 -2.005 QT
-3.089 -2.864 -3.089 -3.724 QT
-3.089 -4.114 L
-3.089 -4.208 L
-3.089 -5.786 -3.55 -7.021 QT
-4.01 -8.255 -5.307 -8.255 QT
-6.151 -8.255 -6.667 -7.896 QT
-7.182 -7.536 -7.425 -6.927 QT
-7.667 -6.318 -7.737 -5.63 QT
-7.807 -4.943 -7.807 -4.146 QT
-7.807 -2.943 -7.69 -2.107 QT
-7.573 -1.271 -7.073 -0.63 QT
-6.573 0.011 -5.542 0.011 QT
cp}def
f1208957343
f
GR
GS
[0.75 0 0 0.75 476.3974 228.42486] CT
N
f1776739717
f
GR
GS
[0.75 0 0 0.75 114.60262 228.42486] CT
N
f1390903136
f
GR
GS
[0.75 0 0 0.75 114.60262 228.42486] CT
N
/f1371073443{-1.677 4.573 M
-1.677 3.401 -1.474 2.284 QT
-1.271 1.167 -0.88 0.081 QT
-0.49 -1.005 0.073 -2.06 QT
0.635 -3.114 1.307 -4.036 QT
3.214 -6.708 L
0.823 -6.708 L
-2.911 -6.708 -3.021 -6.599 QT
-3.302 -6.255 -3.552 -4.661 QT
-4.161 -4.661 L
-3.474 -9.068 L
-2.849 -9.068 L
-2.849 -9.005 L
-2.849 -8.63 -1.568 -8.521 QT
-0.286 -8.411 0.948 -8.411 QT
4.854 -8.411 L
4.854 -7.864 L
4.854 -7.849 4.846 -7.833 QT
4.839 -7.818 4.823 -7.802 QT
1.932 -3.739 L
0.87 -2.161 0.604 -0.232 QT
0.339 1.698 0.339 4.573 QT
0.339 4.979 0.042 5.284 QT
-0.255 5.589 -0.661 5.589 QT
-1.083 5.589 -1.38 5.284 QT
-1.677 4.979 -1.677 4.573 QT
cp}def
f1371073443
f
GR
GS
[0.75 0 0 0.75 114.60262 228.42486] CT
N
f-485083074
f
GR
GS
[0.75 0 0 0.75 452.1617 318.87354] CT
N
/f-150821628{-14.047 5.12 M
-14.047 4.386 L
-11.422 4.386 -11.422 3.714 QT
-11.422 -7.302 L
-12.516 -6.786 -14.172 -6.786 QT
-14.172 -7.521 L
-11.594 -7.521 -10.281 -8.864 QT
-9.984 -8.864 L
-9.922 -8.864 -9.852 -8.81 QT
-9.781 -8.755 -9.781 -8.677 QT
-9.781 3.714 L
-9.781 4.386 -7.156 4.386 QT
-7.156 5.12 L
-14.047 5.12 L
cp}def
f-150821628
f
GR
GS
[0.75 0 0 0.75 452.1617 318.87354] CT
N
/f-1774948328{-4.286 5.12 M
-4.286 4.557 L
-4.286 4.511 -4.24 4.448 QT
-0.99 0.839 L
-0.24 0.026 0.221 -0.513 QT
0.682 -1.052 1.128 -1.763 QT
1.573 -2.474 1.839 -3.2 QT
2.104 -3.927 2.104 -4.755 QT
2.104 -5.614 1.784 -6.404 QT
1.464 -7.193 0.831 -7.661 QT
0.198 -8.13 -0.693 -8.13 QT
-1.599 -8.13 -2.326 -7.583 QT
-3.052 -7.036 -3.349 -6.161 QT
-3.271 -6.177 -3.13 -6.177 QT
-2.661 -6.177 -2.326 -5.864 QT
-1.99 -5.552 -1.99 -5.036 QT
-1.99 -4.568 -2.326 -4.232 QT
-2.661 -3.896 -3.13 -3.896 QT
-3.615 -3.896 -3.951 -4.239 QT
-4.286 -4.583 -4.286 -5.036 QT
-4.286 -5.833 -3.99 -6.521 QT
-3.693 -7.208 -3.13 -7.747 QT
-2.568 -8.286 -1.872 -8.575 QT
-1.177 -8.864 -0.38 -8.864 QT
0.823 -8.864 1.854 -8.357 QT
2.885 -7.849 3.495 -6.919 QT
4.104 -5.989 4.104 -4.755 QT
4.104 -3.849 3.706 -3.029 QT
3.307 -2.208 2.682 -1.536 QT
2.057 -0.864 1.081 -0.013 QT
0.104 0.839 -0.208 1.136 QT
-2.583 3.417 L
-0.568 3.417 L
0.917 3.417 1.917 3.393 QT
2.917 3.37 2.979 3.307 QT
3.229 3.042 3.479 1.37 QT
4.104 1.37 L
3.51 5.12 L
-4.286 5.12 L
cp}def
f-1774948328
f
GR
GS
[0.75 0 0 0.75 452.1617 318.87354] CT
N
f-485083074
f
GR
GS
[0.75 0 0 0.75 138.83828 137.97617] CT
N
/f-211614979{-14 3.495 M
-13.516 4.214 -12.68 4.565 QT
-11.844 4.917 -10.891 4.917 QT
-9.672 4.917 -9.156 3.878 QT
-8.641 2.839 -8.641 1.511 QT
-8.641 0.917 -8.75 0.323 QT
-8.859 -0.271 -9.117 -0.786 QT
-9.375 -1.302 -9.82 -1.607 QT
-10.266 -1.911 -10.906 -1.911 QT
-12.313 -1.911 L
-12.5 -1.911 -12.5 -2.114 QT
-12.5 -2.286 L
-12.5 -2.458 -12.313 -2.458 QT
-11.156 -2.552 L
-10.406 -2.552 -9.922 -3.107 QT
-9.438 -3.661 -9.211 -4.45 QT
-8.984 -5.239 -8.984 -5.958 QT
-8.984 -6.974 -9.453 -7.614 QT
-9.922 -8.255 -10.891 -8.255 QT
-11.688 -8.255 -12.422 -7.958 QT
-13.156 -7.661 -13.578 -7.036 QT
-13.531 -7.052 -13.508 -7.06 QT
-13.484 -7.068 -13.438 -7.068 QT
-12.969 -7.068 -12.648 -6.739 QT
-12.328 -6.411 -12.328 -5.943 QT
-12.328 -5.489 -12.648 -5.161 QT
-12.969 -4.833 -13.438 -4.833 QT
-13.891 -4.833 -14.219 -5.161 QT
-14.547 -5.489 -14.547 -5.943 QT
-14.547 -6.849 -14.008 -7.513 QT
-13.469 -8.177 -12.609 -8.521 QT
-11.75 -8.864 -10.891 -8.864 QT
-10.25 -8.864 -9.547 -8.677 QT
-8.844 -8.489 -8.266 -8.138 QT
-7.688 -7.786 -7.328 -7.232 QT
-6.969 -6.677 -6.969 -5.958 QT
-6.969 -5.083 -7.359 -4.333 QT
-7.75 -3.583 -8.438 -3.044 QT
-9.125 -2.505 -9.953 -2.239 QT
-9.031 -2.052 -8.211 -1.544 QT
-7.391 -1.036 -6.898 -0.232 QT
-6.406 0.573 -6.406 1.495 QT
-6.406 2.651 -7.039 3.589 QT
-7.672 4.526 -8.711 5.057 QT
-9.75 5.589 -10.891 5.589 QT
-11.875 5.589 -12.867 5.214 QT
-13.859 4.839 -14.492 4.089 QT
-15.125 3.339 -15.125 2.292 QT
-15.125 1.761 -14.773 1.417 QT
-14.422 1.073 -13.891 1.073 QT
-13.563 1.073 -13.281 1.229 QT
-13 1.386 -12.836 1.675 QT
-12.672 1.964 -12.672 2.292 QT
-12.672 2.807 -13.031 3.151 QT
-13.391 3.495 -13.891 3.495 QT
-14 3.495 L
cp}def
f-211614979
f
GR
GS
[0.75 0 0 0.75 138.83828 137.97617] CT
N
/f879674892{-0.083 5.589 M
-2.661 5.589 -3.583 3.464 QT
-4.505 1.339 -4.505 -1.583 QT
-4.505 -3.396 -4.177 -5.005 QT
-3.849 -6.614 -2.857 -7.739 QT
-1.865 -8.864 -0.083 -8.864 QT
1.307 -8.864 2.182 -8.193 QT
3.057 -7.521 3.526 -6.443 QT
3.995 -5.364 4.159 -4.146 QT
4.323 -2.927 4.323 -1.583 QT
4.323 0.229 3.995 1.8 QT
3.667 3.37 2.69 4.479 QT
1.714 5.589 -0.083 5.589 QT
cp
-0.083 5.042 M
1.089 5.042 1.659 3.839 QT
2.229 2.636 2.362 1.182 QT
2.495 -0.271 2.495 -1.911 QT
2.495 -3.489 2.362 -4.825 QT
2.229 -6.161 1.659 -7.239 QT
1.089 -8.318 -0.083 -8.318 QT
-1.271 -8.318 -1.849 -7.232 QT
-2.427 -6.146 -2.56 -4.818 QT
-2.693 -3.489 -2.693 -1.911 QT
-2.693 -0.739 -2.63 0.292 QT
-2.568 1.323 -2.326 2.425 QT
-2.083 3.526 -1.536 4.284 QT
-0.99 5.042 -0.083 5.042 QT
cp}def
f879674892
f
GR
GS
[0.75 0 0 0.75 138.83828 137.97617] CT
N
f-485083074
f
GR
GS
[0.75 0 0 0.75 385.9487 385.08658] CT
N
f-150821628
f
GR
GS
[0.75 0 0 0.75 385.9487 385.08658] CT
N
/f-1242808361{-3.505 2.729 M
-3.286 3.339 -2.841 3.846 QT
-2.396 4.354 -1.786 4.636 QT
-1.177 4.917 -0.521 4.917 QT
0.995 4.917 1.565 3.737 QT
2.135 2.557 2.135 0.87 QT
2.135 0.151 2.112 -0.349 QT
2.089 -0.849 1.979 -1.302 QT
1.776 -2.052 1.292 -2.607 QT
0.807 -3.161 0.104 -3.161 QT
-0.599 -3.161 -1.107 -2.943 QT
-1.615 -2.724 -1.935 -2.435 QT
-2.255 -2.146 -2.505 -1.833 QT
-2.755 -1.521 -2.818 -1.489 QT
-3.052 -1.489 L
-3.099 -1.489 -3.177 -1.56 QT
-3.255 -1.63 -3.255 -1.693 QT
-3.255 -8.708 L
-3.255 -8.755 -3.185 -8.81 QT
-3.115 -8.864 -3.052 -8.864 QT
-2.99 -8.864 L
-1.568 -8.193 0.026 -8.193 QT
1.573 -8.193 3.026 -8.864 QT
3.089 -8.864 L
3.151 -8.864 3.214 -8.818 QT
3.276 -8.771 3.276 -8.708 QT
3.276 -8.505 L
3.276 -8.411 3.245 -8.411 QT
2.526 -7.458 1.44 -6.919 QT
0.354 -6.38 -0.802 -6.38 QT
-1.646 -6.38 -2.521 -6.614 QT
-2.521 -2.646 L
-1.833 -3.224 -1.279 -3.458 QT
-0.724 -3.693 0.12 -3.693 QT
1.276 -3.693 2.198 -3.029 QT
3.12 -2.364 3.612 -1.294 QT
4.104 -0.224 4.104 0.901 QT
4.104 2.151 3.479 3.229 QT
2.854 4.307 1.792 4.948 QT
0.729 5.589 -0.521 5.589 QT
-1.552 5.589 -2.419 5.05 QT
-3.286 4.511 -3.786 3.612 QT
-4.286 2.714 -4.286 1.698 QT
-4.286 1.229 -3.982 0.932 QT
-3.677 0.636 -3.208 0.636 QT
-2.755 0.636 -2.443 0.932 QT
-2.13 1.229 -2.13 1.698 QT
-2.13 2.151 -2.443 2.464 QT
-2.755 2.776 -3.208 2.776 QT
-3.286 2.776 -3.38 2.761 QT
-3.474 2.745 -3.505 2.729 QT
cp}def
f-1242808361
f
GR
GS
[0.75 0 0 0.75 385.9487 385.08658] CT
N
f-485083074
f
GR
GS
[0.75 0 0 0.75 205.0513 71.76314] CT
N
f-211614979
f
GR
GS
[0.75 0 0 0.75 205.0513 71.76314] CT
N
/f-1112969129{-3.333 3.495 M
-2.849 4.214 -2.013 4.565 QT
-1.177 4.917 -0.224 4.917 QT
0.995 4.917 1.51 3.878 QT
2.026 2.839 2.026 1.511 QT
2.026 0.917 1.917 0.323 QT
1.807 -0.271 1.549 -0.786 QT
1.292 -1.302 0.846 -1.607 QT
0.401 -1.911 -0.24 -1.911 QT
-1.646 -1.911 L
-1.833 -1.911 -1.833 -2.114 QT
-1.833 -2.286 L
-1.833 -2.458 -1.646 -2.458 QT
-0.49 -2.552 L
0.26 -2.552 0.745 -3.107 QT
1.229 -3.661 1.456 -4.45 QT
1.682 -5.239 1.682 -5.958 QT
1.682 -6.974 1.214 -7.614 QT
0.745 -8.255 -0.224 -8.255 QT
-1.021 -8.255 -1.755 -7.958 QT
-2.49 -7.661 -2.911 -7.036 QT
-2.865 -7.052 -2.841 -7.06 QT
-2.818 -7.068 -2.771 -7.068 QT
-2.302 -7.068 -1.982 -6.739 QT
-1.661 -6.411 -1.661 -5.943 QT
-1.661 -5.489 -1.982 -5.161 QT
-2.302 -4.833 -2.771 -4.833 QT
-3.224 -4.833 -3.552 -5.161 QT
-3.88 -5.489 -3.88 -5.943 QT
-3.88 -6.849 -3.341 -7.513 QT
-2.802 -8.177 -1.943 -8.521 QT
-1.083 -8.864 -0.224 -8.864 QT
0.417 -8.864 1.12 -8.677 QT
1.823 -8.489 2.401 -8.138 QT
2.979 -7.786 3.339 -7.232 QT
3.698 -6.677 3.698 -5.958 QT
3.698 -5.083 3.307 -4.333 QT
2.917 -3.583 2.229 -3.044 QT
1.542 -2.505 0.714 -2.239 QT
1.635 -2.052 2.456 -1.544 QT
3.276 -1.036 3.768 -0.232 QT
4.26 0.573 4.26 1.495 QT
4.26 2.651 3.628 3.589 QT
2.995 4.526 1.956 5.057 QT
0.917 5.589 -0.224 5.589 QT
-1.208 5.589 -2.201 5.214 QT
-3.193 4.839 -3.826 4.089 QT
-4.458 3.339 -4.458 2.292 QT
-4.458 1.761 -4.107 1.417 QT
-3.755 1.073 -3.224 1.073 QT
-2.896 1.073 -2.615 1.229 QT
-2.333 1.386 -2.169 1.675 QT
-2.005 1.964 -2.005 2.292 QT
-2.005 2.807 -2.365 3.151 QT
-2.724 3.495 -3.224 3.495 QT
-3.333 3.495 L
cp}def
f-1112969129
f
GR
GS
[0.75 0 0 0.75 205.0513 71.76314] CT
N
f-485083074
f
GR
GS
[0.75 0 0 0.75 295.5 409.32224] CT
N
/f-1384251478{-5.892 6.775 M
-5.892 0.478 L
-5.892 0.275 -5.657 0.275 QT
-5.329 0.275 L
-5.251 0.275 -5.181 0.337 QT
-5.111 0.4 -5.111 0.478 QT
-5.111 3.134 -3.47 4.587 QT
-1.829 6.041 0.827 6.041 QT
1.764 6.041 2.561 5.501 QT
3.358 4.962 3.796 4.087 QT
4.233 3.212 4.233 2.275 QT
4.233 1.462 3.905 0.689 QT
3.577 -0.084 2.96 -0.655 QT
2.343 -1.225 1.561 -1.413 QT
-1.954 -2.256 L
-3.689 -2.725 -4.79 -4.155 QT
-5.892 -5.584 -5.892 -7.366 QT
-5.892 -8.756 -5.181 -9.983 QT
-4.47 -11.209 -3.259 -11.92 QT
-2.048 -12.631 -0.657 -12.631 QT
2.046 -12.631 3.639 -10.803 QT
4.749 -12.553 L
4.827 -12.631 4.936 -12.631 QT
5.124 -12.631 L
5.202 -12.631 5.272 -12.577 QT
5.343 -12.522 5.343 -12.413 QT
5.343 -6.147 L
5.343 -5.913 5.124 -5.913 QT
4.796 -5.913 L
4.546 -5.913 4.546 -6.147 QT
4.546 -6.834 4.319 -7.655 QT
4.093 -8.475 3.679 -9.225 QT
3.264 -9.975 2.796 -10.444 QT
1.499 -11.772 -0.657 -11.772 QT
-1.579 -11.772 -2.361 -11.303 QT
-3.142 -10.834 -3.603 -10.03 QT
-4.064 -9.225 -4.064 -8.334 QT
-4.064 -7.178 -3.345 -6.233 QT
-2.626 -5.288 -1.454 -4.991 QT
2.046 -4.131 L
2.921 -3.928 3.686 -3.381 QT
4.452 -2.834 4.968 -2.108 QT
5.483 -1.381 5.772 -0.491 QT
6.061 0.4 6.061 1.353 QT
6.061 2.806 5.389 4.111 QT
4.718 5.416 3.499 6.205 QT
2.28 6.994 0.827 6.994 QT
-0.064 6.994 -1.001 6.798 QT
-1.939 6.603 -2.728 6.189 QT
-3.517 5.775 -4.157 5.134 QT
-5.298 6.916 L
-5.376 6.994 -5.501 6.994 QT
-5.657 6.994 L
-5.892 6.994 -5.892 6.775 QT
cp}def
f-1384251478
f
GR
GS
[0.75 0 0 0.75 295.5 47.52748] CT
N
/f2079878726{-9.172 6.4 M
-9.172 5.447 L
-6.391 5.447 -6.391 3.853 QT
-6.391 -10.944 L
-7.266 -11.1 -9.172 -11.1 QT
-9.172 -12.038 L
-4 -12.038 L
-3.875 -12.038 -3.813 -11.944 QT
5.734 2.134 L
5.734 -9.506 L
5.734 -11.1 2.953 -11.1 QT
2.953 -12.038 L
9.375 -12.038 L
9.375 -11.1 L
6.609 -11.1 6.609 -9.506 QT
6.609 6.166 L
6.609 6.244 6.508 6.322 QT
6.406 6.4 6.328 6.4 QT
6 6.4 L
5.875 6.4 5.828 6.291 QT
-5.516 -10.397 L
-5.516 3.853 L
-5.516 5.447 -2.734 5.447 QT
-2.734 6.4 L
-9.172 6.4 L
cp}def
f2079878726
f
GR
GS
[0.75 0 0 0.75 0 0.5] CT
0.149 GC
[1 3] 0 setdash
2 LJ
0.667 LW
N
394 92.102 M
407.299 92.52 L
420.545 93.772 L
433.687 95.853 L
446.672 98.756 L
459.449 102.468 L
471.968 106.975 L
484.179 112.259 L
496.035 118.3 L
507.487 125.073 L
518.492 132.552 L
529.005 140.707 L
538.986 149.506 L
548.394 158.914 L
557.193 168.895 L
565.348 179.408 L
572.827 190.413 L
579.6 201.865 L
585.641 213.721 L
590.925 225.932 L
595.432 238.451 L
599.144 251.228 L
602.047 264.213 L
604.128 277.354 L
605.38 290.601 L
605.798 303.9 L
605.38 317.199 L
604.128 330.445 L
602.047 343.587 L
599.144 356.572 L
595.432 369.349 L
590.925 381.868 L
585.641 394.079 L
579.6 405.934 L
572.827 417.387 L
565.348 428.392 L
557.193 438.905 L
548.394 448.886 L
538.986 458.294 L
529.005 467.093 L
518.492 475.248 L
507.487 482.727 L
496.035 489.5 L
484.179 495.54 L
471.968 500.825 L
459.449 505.332 L
446.672 509.044 L
433.687 511.946 L
420.545 514.028 L
407.299 515.28 L
394 515.698 L
380.701 515.28 L
367.455 514.028 L
354.313 511.946 L
341.328 509.044 L
328.551 505.332 L
316.032 500.825 L
303.821 495.54 L
291.965 489.5 L
280.513 482.727 L
269.508 475.248 L
258.995 467.093 L
249.014 458.294 L
239.606 448.886 L
230.807 438.905 L
222.652 428.392 L
215.173 417.387 L
208.4 405.934 L
202.359 394.079 L
197.075 381.868 L
192.568 369.349 L
188.856 356.572 L
185.953 343.587 L
183.872 330.445 L
182.62 317.199 L
182.202 303.9 L
182.62 290.601 L
183.872 277.354 L
185.953 264.213 L
188.856 251.228 L
192.568 238.451 L
197.075 225.932 L
202.359 213.721 L
208.4 201.865 L
215.173 190.413 L
222.652 179.408 L
230.807 168.895 L
239.606 158.914 L
249.014 149.506 L
258.995 140.707 L
269.508 132.552 L
280.513 125.073 L
291.965 118.3 L
303.821 112.259 L
316.032 106.975 L
328.551 102.468 L
341.328 98.756 L
354.313 95.853 L
367.455 93.772 L
380.701 92.52 L
394 92.102 L
S
GR
GS
[0.75 0 0 0.75 0 0.5] CT
0.149 GC
[1 3] 0 setdash
2 LJ
0.667 LW
N
394 114.007 M
405.923 114.382 L
417.8 115.504 L
429.582 117.37 L
441.224 119.973 L
452.68 123.301 L
463.904 127.342 L
474.853 132.079 L
485.482 137.495 L
495.75 143.568 L
505.616 150.273 L
515.042 157.585 L
523.991 165.474 L
532.426 173.909 L
540.315 182.857 L
547.627 192.283 L
554.332 202.15 L
560.404 212.418 L
565.82 223.047 L
570.558 233.996 L
574.599 245.22 L
577.927 256.675 L
580.529 268.317 L
582.396 280.1 L
583.518 291.976 L
583.893 303.9 L
583.518 315.823 L
582.396 327.7 L
580.529 339.482 L
577.927 351.124 L
574.599 362.58 L
570.558 373.804 L
565.82 384.752 L
560.404 395.381 L
554.332 405.65 L
547.627 415.516 L
540.315 424.942 L
532.426 433.891 L
523.991 442.326 L
515.042 450.215 L
505.616 457.526 L
495.75 464.232 L
485.482 470.304 L
474.853 475.72 L
463.904 480.458 L
452.68 484.499 L
441.224 487.827 L
429.582 490.429 L
417.8 492.295 L
405.923 493.418 L
394 493.793 L
382.077 493.418 L
370.2 492.295 L
358.418 490.429 L
346.776 487.827 L
335.32 484.499 L
324.096 480.458 L
313.147 475.72 L
302.518 470.304 L
292.25 464.232 L
282.384 457.526 L
272.958 450.215 L
264.009 442.326 L
255.574 433.891 L
247.685 424.942 L
240.373 415.516 L
233.668 405.65 L
227.595 395.381 L
222.18 384.752 L
217.442 373.804 L
213.401 362.58 L
210.073 351.124 L
207.471 339.482 L
205.604 327.7 L
204.482 315.823 L
204.107 303.9 L
204.482 291.976 L
205.604 280.1 L
207.471 268.317 L
210.073 256.675 L
213.401 245.22 L
217.442 233.996 L
222.18 223.047 L
227.595 212.418 L
233.668 202.15 L
240.373 192.283 L
247.685 182.857 L
255.574 173.909 L
264.009 165.474 L
272.958 157.585 L
282.384 150.273 L
292.25 143.568 L
302.518 137.495 L
313.147 132.079 L
324.096 127.342 L
335.32 123.301 L
346.776 119.973 L
358.418 117.37 L
370.2 115.504 L
382.077 114.382 L
394 114.007 L
S
GR
GS
[0.75 0 0 0.75 302.25 81.50511] CT
N
/f-2102542514{-6.469 2.606 M
-6.094 3.152 -5.461 3.418 QT
-4.828 3.684 -4.109 3.684 QT
-3.172 3.684 -2.781 2.887 QT
-2.391 2.09 -2.391 1.09 QT
-2.391 0.637 -2.477 0.184 QT
-2.563 -0.269 -2.758 -0.66 QT
-2.953 -1.051 -3.289 -1.285 QT
-3.625 -1.519 -4.125 -1.519 QT
-5.188 -1.519 L
-5.328 -1.519 -5.328 -1.676 QT
-5.328 -1.816 L
-5.328 -1.941 -5.188 -1.941 QT
-4.297 -2.004 L
-3.734 -2.004 -3.367 -2.426 QT
-3 -2.848 -2.828 -3.457 QT
-2.656 -4.066 -2.656 -4.613 QT
-2.656 -5.379 -3.016 -5.871 QT
-3.375 -6.363 -4.109 -6.363 QT
-4.719 -6.363 -5.273 -6.129 QT
-5.828 -5.894 -6.156 -5.426 QT
-6.125 -5.441 -6.102 -5.441 QT
-6.078 -5.441 -6.047 -5.441 QT
-5.688 -5.441 -5.445 -5.191 QT
-5.203 -4.941 -5.203 -4.598 QT
-5.203 -4.254 -5.445 -4.004 QT
-5.688 -3.754 -6.047 -3.754 QT
-6.391 -3.754 -6.641 -4.004 QT
-6.891 -4.254 -6.891 -4.598 QT
-6.891 -5.285 -6.477 -5.793 QT
-6.063 -6.301 -5.414 -6.558 QT
-4.766 -6.816 -4.109 -6.816 QT
-3.625 -6.816 -3.086 -6.676 QT
-2.547 -6.535 -2.109 -6.262 QT
-1.672 -5.988 -1.391 -5.566 QT
-1.109 -5.144 -1.109 -4.613 QT
-1.109 -3.941 -1.414 -3.371 QT
-1.719 -2.801 -2.242 -2.387 QT
-2.766 -1.973 -3.391 -1.769 QT
-2.688 -1.629 -2.063 -1.238 QT
-1.438 -0.848 -1.063 -0.238 QT
-0.688 0.371 -0.688 1.074 QT
-0.688 1.949 -1.172 2.668 QT
-1.656 3.387 -2.445 3.793 QT
-3.234 4.199 -4.109 4.199 QT
-4.859 4.199 -5.609 3.91 QT
-6.359 3.621 -6.844 3.051 QT
-7.328 2.481 -7.328 1.684 QT
-7.328 1.277 -7.063 1.012 QT
-6.797 0.746 -6.391 0.746 QT
-6.141 0.746 -5.922 0.871 QT
-5.703 0.996 -5.586 1.215 QT
-5.469 1.434 -5.469 1.684 QT
-5.469 2.074 -5.742 2.34 QT
-6.016 2.606 -6.391 2.606 QT
-6.469 2.606 L
cp}def
f-2102542514
f
GR
GS
[0.75 0 0 0.75 302.25 81.50511] CT
N
/f-1692182862{4 4.199 M
2.047 4.199 1.336 2.582 QT
0.625 0.965 0.625 -1.269 QT
0.625 -2.66 0.883 -3.887 QT
1.141 -5.113 1.891 -5.965 QT
2.641 -6.816 4 -6.816 QT
5.063 -6.816 5.734 -6.301 QT
6.406 -5.785 6.758 -4.973 QT
7.109 -4.16 7.234 -3.223 QT
7.359 -2.285 7.359 -1.269 QT
7.359 0.106 7.109 1.309 QT
6.859 2.512 6.117 3.356 QT
5.375 4.199 4 4.199 QT
cp
4 3.777 M
4.891 3.777 5.328 2.863 QT
5.766 1.949 5.867 0.84 QT
5.969 -0.269 5.969 -1.519 QT
5.969 -2.723 5.867 -3.738 QT
5.766 -4.754 5.336 -5.582 QT
4.906 -6.41 4 -6.41 QT
3.094 -6.41 2.656 -5.582 QT
2.219 -4.754 2.117 -3.738 QT
2.016 -2.723 2.016 -1.519 QT
2.016 -0.629 2.063 0.16 QT
2.109 0.949 2.297 1.785 QT
2.484 2.621 2.898 3.199 QT
3.313 3.777 4 3.777 QT
cp}def
f-1692182862
f
GR
GS
[0.75 0 0 0.75 0 0.5] CT
0.149 GC
[1 3] 0 setdash
2 LJ
0.667 LW
N
394 148.853 M
403.735 149.159 L
413.433 150.075 L
423.053 151.599 L
432.559 153.724 L
441.912 156.441 L
451.077 159.741 L
460.016 163.609 L
468.694 168.031 L
477.078 172.989 L
485.134 178.464 L
492.831 184.434 L
500.137 190.875 L
507.024 197.763 L
513.466 205.069 L
519.436 212.765 L
524.911 220.821 L
529.869 229.205 L
534.291 237.884 L
538.159 246.823 L
541.458 255.988 L
544.176 265.341 L
546.301 274.847 L
547.824 284.467 L
548.741 294.164 L
549.047 303.9 L
548.741 313.635 L
547.824 323.332 L
546.301 332.953 L
544.176 342.458 L
541.458 351.812 L
538.159 360.976 L
534.291 369.916 L
529.869 378.594 L
524.911 386.978 L
519.436 395.034 L
513.466 402.73 L
507.024 410.037 L
500.137 416.924 L
492.831 423.366 L
485.134 429.335 L
477.078 434.81 L
468.694 439.769 L
460.016 444.191 L
451.077 448.059 L
441.912 451.358 L
432.559 454.076 L
423.053 456.2 L
413.433 457.724 L
403.735 458.641 L
394 458.947 L
384.265 458.641 L
374.567 457.724 L
364.947 456.2 L
355.441 454.076 L
346.088 451.358 L
336.923 448.059 L
327.984 444.191 L
319.306 439.769 L
310.922 434.81 L
302.866 429.335 L
295.169 423.366 L
287.863 416.924 L
280.976 410.037 L
274.534 402.73 L
268.564 395.034 L
263.09 386.978 L
258.131 378.594 L
253.709 369.916 L
249.841 360.976 L
246.542 351.812 L
243.824 342.458 L
241.699 332.953 L
240.176 323.332 L
239.259 313.635 L
238.953 303.9 L
239.259 294.164 L
240.176 284.467 L
241.699 274.847 L
243.824 265.341 L
246.542 255.988 L
249.841 246.823 L
253.709 237.884 L
258.131 229.205 L
263.09 220.821 L
268.564 212.765 L
274.534 205.069 L
280.976 197.763 L
287.863 190.875 L
295.169 184.434 L
302.866 178.464 L
310.922 172.989 L
319.306 168.031 L
327.984 163.609 L
336.923 159.741 L
346.088 156.441 L
355.441 153.724 L
364.947 151.599 L
374.567 150.075 L
384.265 149.159 L
394 148.853 L
S
GR
GS
[0.75 0 0 0.75 302.25 106.88961] CT
N
/f42575179{-7.547 1.199 M
-7.547 0.637 L
-2.609 -6.738 L
-2.547 -6.816 -2.438 -6.816 QT
-2.203 -6.816 L
-2.031 -6.816 -2.031 -6.644 QT
-2.031 0.637 L
-0.453 0.637 L
-0.453 1.199 L
-2.031 1.199 L
-2.031 2.762 L
-2.031 3.09 -1.563 3.184 QT
-1.094 3.277 -0.469 3.277 QT
-0.469 3.84 L
-4.875 3.84 L
-4.875 3.277 L
-4.266 3.277 -3.797 3.184 QT
-3.328 3.09 -3.328 2.762 QT
-3.328 1.199 L
-7.547 1.199 L
cp
-7.016 0.637 M
-3.234 0.637 L
-3.234 -5.035 L
-7.016 0.637 L
cp}def
f42575179
f
GR
GS
[0.75 0 0 0.75 302.25 106.88961] CT
N
/f919121033{1.391 2.012 M
1.563 2.481 1.898 2.863 QT
2.234 3.246 2.703 3.465 QT
3.172 3.684 3.672 3.684 QT
4.828 3.684 5.266 2.785 QT
5.703 1.887 5.703 0.606 QT
5.703 0.043 5.68 -0.332 QT
5.656 -0.707 5.578 -1.066 QT
5.422 -1.629 5.055 -2.051 QT
4.688 -2.473 4.141 -2.473 QT
3.609 -2.473 3.219 -2.308 QT
2.828 -2.144 2.586 -1.926 QT
2.344 -1.707 2.156 -1.465 QT
1.969 -1.223 1.922 -1.207 QT
1.75 -1.207 L
1.703 -1.207 1.648 -1.254 QT
1.594 -1.301 1.594 -1.348 QT
1.594 -6.691 L
1.594 -6.738 1.641 -6.777 QT
1.688 -6.816 1.75 -6.816 QT
1.797 -6.816 L
2.875 -6.301 4.078 -6.301 QT
5.266 -6.301 6.375 -6.816 QT
6.422 -6.816 L
6.469 -6.816 6.516 -6.777 QT
6.563 -6.738 6.563 -6.691 QT
6.563 -6.551 L
6.563 -6.473 6.531 -6.473 QT
5.984 -5.738 5.164 -5.332 QT
4.344 -4.926 3.453 -4.926 QT
2.813 -4.926 2.141 -5.113 QT
2.141 -2.082 L
2.672 -2.519 3.094 -2.699 QT
3.516 -2.879 4.156 -2.879 QT
5.047 -2.879 5.742 -2.371 QT
6.438 -1.863 6.813 -1.051 QT
7.188 -0.238 7.188 0.621 QT
7.188 1.574 6.719 2.395 QT
6.25 3.215 5.438 3.707 QT
4.625 4.199 3.672 4.199 QT
2.875 4.199 2.219 3.785 QT
1.563 3.371 1.18 2.684 QT
0.797 1.996 0.797 1.231 QT
0.797 0.871 1.031 0.645 QT
1.266 0.418 1.625 0.418 QT
1.969 0.418 2.211 0.645 QT
2.453 0.871 2.453 1.231 QT
2.453 1.574 2.211 1.809 QT
1.969 2.043 1.625 2.043 QT
1.563 2.043 1.492 2.035 QT
1.422 2.027 1.391 2.012 QT
cp}def
f919121033
f
GR
GS
[0.75 0 0 0.75 0 0.5] CT
0.149 GC
[1 3] 0 setdash
2 LJ
0.667 LW
N
394 194.265 M
400.884 194.481 L
407.741 195.13 L
414.544 196.207 L
421.265 197.709 L
427.879 199.631 L
434.359 201.964 L
440.68 204.699 L
446.817 207.826 L
452.745 211.332 L
458.442 215.203 L
463.884 219.425 L
469.05 223.979 L
473.92 228.85 L
478.475 234.016 L
482.696 239.458 L
486.568 245.155 L
490.074 251.083 L
493.201 257.22 L
495.936 263.541 L
498.269 270.021 L
500.19 276.635 L
501.693 283.356 L
502.77 290.159 L
503.418 297.016 L
503.635 303.9 L
503.418 310.784 L
502.77 317.641 L
501.693 324.443 L
500.19 331.165 L
498.269 337.779 L
495.936 344.259 L
493.201 350.58 L
490.074 356.717 L
486.568 362.645 L
482.696 368.342 L
478.475 373.784 L
473.92 378.95 L
469.05 383.82 L
463.884 388.375 L
458.442 392.596 L
452.745 396.467 L
446.817 399.973 L
440.68 403.1 L
434.359 405.836 L
427.879 408.169 L
421.265 410.09 L
414.544 411.593 L
407.741 412.67 L
400.884 413.318 L
394 413.535 L
387.116 413.318 L
380.259 412.67 L
373.456 411.593 L
366.735 410.09 L
360.121 408.169 L
353.641 405.836 L
347.32 403.1 L
341.183 399.973 L
335.255 396.467 L
329.558 392.596 L
324.116 388.375 L
318.95 383.82 L
314.08 378.95 L
309.525 373.784 L
305.304 368.342 L
301.432 362.645 L
297.926 356.717 L
294.799 350.58 L
292.064 344.259 L
289.731 337.779 L
287.81 331.165 L
286.307 324.443 L
285.23 317.641 L
284.582 310.784 L
284.365 303.9 L
284.582 297.016 L
285.23 290.159 L
286.307 283.356 L
287.81 276.635 L
289.731 270.021 L
292.064 263.541 L
294.799 257.22 L
297.926 251.083 L
301.432 245.155 L
305.304 239.458 L
309.525 234.016 L
314.08 228.85 L
318.95 223.979 L
324.116 219.425 L
329.558 215.203 L
335.255 211.332 L
341.183 207.826 L
347.32 204.699 L
353.641 201.964 L
360.121 199.631 L
366.735 197.709 L
373.456 196.207 L
380.259 195.13 L
387.116 194.481 L
394 194.265 L
S
GR
GS
[0.75 0 0 0.75 302.25 140.19877] CT
N
/f359229147{-4 4.199 M
-4.984 4.199 -5.648 3.668 QT
-6.313 3.137 -6.68 2.293 QT
-7.047 1.449 -7.188 0.527 QT
-7.328 -0.394 -7.328 -1.332 QT
-7.328 -2.598 -6.836 -3.871 QT
-6.344 -5.144 -5.383 -5.98 QT
-4.422 -6.816 -3.109 -6.816 QT
-2.563 -6.816 -2.094 -6.613 QT
-1.625 -6.41 -1.352 -6.004 QT
-1.078 -5.598 -1.078 -5.035 QT
-1.078 -4.707 -1.305 -4.48 QT
-1.531 -4.254 -1.859 -4.254 QT
-2.172 -4.254 -2.398 -4.48 QT
-2.625 -4.707 -2.625 -5.035 QT
-2.625 -5.348 -2.398 -5.574 QT
-2.172 -5.801 -1.859 -5.801 QT
-1.766 -5.801 L
-1.969 -6.082 -2.344 -6.223 QT
-2.719 -6.363 -3.109 -6.363 QT
-3.594 -6.363 -4.008 -6.152 QT
-4.422 -5.941 -4.75 -5.582 QT
-5.078 -5.223 -5.297 -4.785 QT
-5.516 -4.348 -5.633 -3.793 QT
-5.75 -3.238 -5.781 -2.754 QT
-5.813 -2.269 -5.813 -1.535 QT
-5.531 -2.191 -5.016 -2.613 QT
-4.5 -3.035 -3.859 -3.035 QT
-3.141 -3.035 -2.555 -2.746 QT
-1.969 -2.457 -1.547 -1.941 QT
-1.125 -1.426 -0.906 -0.769 QT
-0.688 -0.113 -0.688 0.559 QT
-0.688 1.496 -1.102 2.34 QT
-1.516 3.184 -2.273 3.692 QT
-3.031 4.199 -4 4.199 QT
cp
-4 3.684 M
-3.375 3.684 -3 3.402 QT
-2.625 3.121 -2.453 2.652 QT
-2.281 2.184 -2.234 1.715 QT
-2.188 1.246 -2.188 0.559 QT
-2.188 -0.348 -2.273 -0.988 QT
-2.359 -1.629 -2.742 -2.121 QT
-3.125 -2.613 -3.922 -2.613 QT
-4.563 -2.613 -4.984 -2.176 QT
-5.406 -1.738 -5.594 -1.066 QT
-5.781 -0.394 -5.781 0.215 QT
-5.781 0.434 -5.766 0.543 QT
-5.766 0.559 -5.773 0.574 QT
-5.781 0.59 -5.781 0.621 QT
-5.781 1.309 -5.641 2.012 QT
-5.5 2.715 -5.102 3.199 QT
-4.703 3.684 -4 3.684 QT
cp}def
f359229147
f
GR
GS
[0.75 0 0 0.75 302.25 140.19877] CT
N
f-1692182862
f
GR
GS
[0.75 0 0 0.75 0 0.5] CT
0.149 GC
[1 3] 0 setdash
2 LJ
0.667 LW
N
394 247.149 M
397.563 247.261 L
401.113 247.596 L
404.634 248.154 L
408.113 248.932 L
411.537 249.926 L
414.891 251.134 L
418.163 252.55 L
421.34 254.168 L
424.409 255.983 L
427.357 257.987 L
430.175 260.172 L
432.849 262.53 L
435.37 265.051 L
437.728 267.725 L
439.913 270.542 L
441.917 273.491 L
443.731 276.56 L
445.35 279.736 L
446.766 283.008 L
447.974 286.363 L
448.968 289.786 L
449.746 293.266 L
450.304 296.787 L
450.639 300.336 L
450.751 303.9 L
450.639 307.463 L
450.304 311.013 L
449.746 314.534 L
448.968 318.013 L
447.974 321.437 L
446.766 324.791 L
445.35 328.063 L
443.731 331.24 L
441.917 334.309 L
439.913 337.257 L
437.728 340.074 L
435.37 342.749 L
432.849 345.27 L
430.175 347.627 L
427.357 349.812 L
424.409 351.816 L
421.34 353.631 L
418.163 355.25 L
414.891 356.666 L
411.537 357.873 L
408.113 358.868 L
404.634 359.646 L
401.113 360.203 L
397.563 360.539 L
394 360.651 L
390.437 360.539 L
386.887 360.203 L
383.366 359.646 L
379.887 358.868 L
376.463 357.873 L
373.109 356.666 L
369.837 355.25 L
366.66 353.631 L
363.591 351.816 L
360.643 349.812 L
357.825 347.627 L
355.151 345.27 L
352.63 342.749 L
350.272 340.074 L
348.087 337.257 L
346.083 334.309 L
344.269 331.24 L
342.65 328.063 L
341.234 324.791 L
340.026 321.437 L
339.032 318.013 L
338.254 314.534 L
337.696 311.013 L
337.361 307.463 L
337.249 303.9 L
337.361 300.336 L
337.696 296.787 L
338.254 293.266 L
339.032 289.786 L
340.026 286.363 L
341.234 283.008 L
342.65 279.736 L
344.269 276.56 L
346.083 273.491 L
348.087 270.542 L
350.272 267.725 L
352.63 265.051 L
355.151 262.53 L
357.825 260.172 L
360.643 257.987 L
363.591 255.983 L
366.66 254.168 L
369.837 252.55 L
373.109 251.134 L
376.463 249.926 L
379.887 248.932 L
383.366 248.154 L
386.887 247.596 L
390.437 247.261 L
394 247.149 L
S
GR
GS
[0.75 0 0 0.75 302.25 180.6115] CT
N
/f967907560{-5.219 3.418 M
-5.219 2.527 -5.063 1.676 QT
-4.906 0.824 -4.602 -0.004 QT
-4.297 -0.832 -3.875 -1.637 QT
-3.453 -2.441 -2.938 -3.144 QT
-1.484 -5.176 L
-3.313 -5.176 L
-6.156 -5.176 -6.234 -5.098 QT
-6.453 -4.832 -6.641 -3.613 QT
-7.094 -3.613 L
-6.578 -6.973 L
-6.109 -6.973 L
-6.109 -6.926 L
-6.109 -6.644 -5.133 -6.558 QT
-4.156 -6.473 -3.219 -6.473 QT
-0.234 -6.473 L
-0.234 -6.051 L
-0.234 -6.035 -0.242 -6.027 QT
-0.25 -6.019 -0.25 -6.004 QT
-2.453 -2.91 L
-3.266 -1.707 -3.469 -0.238 QT
-3.672 1.231 -3.672 3.418 QT
-3.672 3.731 -3.898 3.965 QT
-4.125 4.199 -4.438 4.199 QT
-4.766 4.199 -4.992 3.965 QT
-5.219 3.731 -5.219 3.418 QT
cp}def
f967907560
f
GR
GS
[0.75 0 0 0.75 302.25 180.6115] CT
N
f919121033
f
GR
GS
[0.75 0 0 0.75 0 0.5] CT
0.149 GC
[1 3] 0 setdash
2 LJ
0.667 LW
N
394 303.9 M
394 303.9 L
394 303.9 L
394 303.9 L
394 303.9 L
394 303.9 L
394 303.9 L
394 303.9 L
394 303.9 L
394 303.9 L
394 303.9 L
394 303.9 L
394 303.9 L
394 303.9 L
394 303.9 L
394 303.9 L
394 303.9 L
394 303.9 L
394 303.9 L
394 303.9 L
394 303.9 L
394 303.9 L
394 303.9 L
394 303.9 L
394 303.9 L
394 303.9 L
394 303.9 L
394 303.9 L
394 303.9 L
394 303.9 L
394 303.9 L
394 303.9 L
394 303.9 L
394 303.9 L
394 303.9 L
394 303.9 L
394 303.9 L
394 303.9 L
394 303.9 L
394 303.9 L
394 303.9 L
394 303.9 L
394 303.9 L
394 303.9 L
394 303.9 L
394 303.9 L
394 303.9 L
394 303.9 L
394 303.9 L
394 303.9 L
394 303.9 L
394 303.9 L
394 303.9 L
394 303.9 L
394 303.9 L
394 303.9 L
394 303.9 L
394 303.9 L
394 303.9 L
394 303.9 L
394 303.9 L
394 303.9 L
394 303.9 L
394 303.9 L
394 303.9 L
394 303.9 L
394 303.9 L
394 303.9 L
394 303.9 L
394 303.9 L
394 303.9 L
394 303.9 L
394 303.9 L
394 303.9 L
394 303.9 L
394 303.9 L
394 303.9 L
394 303.9 L
394 303.9 L
394 303.9 L
394 303.9 L
394 303.9 L
394 303.9 L
394 303.9 L
394 303.9 L
394 303.9 L
394 303.9 L
394 303.9 L
394 303.9 L
394 303.9 L
394 303.9 L
394 303.9 L
394 303.9 L
394 303.9 L
394 303.9 L
394 303.9 L
394 303.9 L
394 303.9 L
394 303.9 L
394 303.9 L
394 303.9 L
S
GR
GS
[0.75 0 0 0.75 301.5 216.42486] CT
N
/f-1341065651{-6.188 3.168 M
-5.75 3.684 -4.672 3.684 QT
-4.063 3.684 -3.531 3.27 QT
-3 2.856 -2.719 2.246 QT
-2.375 1.574 -2.281 0.801 QT
-2.188 0.027 -2.188 -1.113 QT
-2.469 -0.457 -2.977 -0.043 QT
-3.484 0.371 -4.156 0.371 QT
-5.078 0.371 -5.813 -0.137 QT
-6.547 -0.644 -6.938 -1.465 QT
-7.328 -2.285 -7.328 -3.223 QT
-7.328 -4.176 -6.891 -5.012 QT
-6.453 -5.848 -5.68 -6.332 QT
-4.906 -6.816 -3.922 -6.816 QT
-2.953 -6.816 -2.297 -6.293 QT
-1.641 -5.769 -1.297 -4.933 QT
-0.953 -4.098 -0.82 -3.168 QT
-0.688 -2.238 -0.688 -1.332 QT
-0.688 -0.098 -1.141 1.184 QT
-1.594 2.465 -2.492 3.332 QT
-3.391 4.199 -4.672 4.199 QT
-5.609 4.199 -6.266 3.746 QT
-6.922 3.293 -6.922 2.402 QT
-6.922 2.074 -6.703 1.848 QT
-6.484 1.621 -6.156 1.621 QT
-5.828 1.621 -5.609 1.848 QT
-5.391 2.074 -5.391 2.402 QT
-5.391 2.715 -5.617 2.942 QT
-5.844 3.168 -6.156 3.168 QT
-6.188 3.168 L
cp
-4.094 -0.051 M
-3.438 -0.051 -3.016 -0.496 QT
-2.594 -0.941 -2.406 -1.598 QT
-2.219 -2.254 -2.219 -2.894 QT
-2.219 -3.207 L
-2.219 -3.269 L
-2.219 -4.473 -2.57 -5.418 QT
-2.922 -6.363 -3.922 -6.363 QT
-4.547 -6.363 -4.945 -6.082 QT
-5.344 -5.801 -5.531 -5.34 QT
-5.719 -4.879 -5.766 -4.355 QT
-5.813 -3.832 -5.813 -3.223 QT
-5.813 -2.316 -5.727 -1.676 QT
-5.641 -1.035 -5.258 -0.543 QT
-4.875 -0.051 -4.094 -0.051 QT
cp}def
f-1341065651
f
GR
GS
[0.75 0 0 0.75 301.5 216.42486] CT
N
f-1692182862
f
GR
GS
[0.75 0 0 0.75 295.5 255.49279] CT
1 GC
N
10 0 M
10 -5.523 5.523 -10 0 -10 C
-5.523 -10 -10 -5.523 -10 0 C
-10 5.523 -5.523 10 0 10 C
5.523 10 10 5.523 10 0 C
cp
f
GR
GS
[0.75 0 0 0.75 295.5 255.49279] CT
10.0 ML
2.667 LW
N
10 0 M
10 -5.523 5.523 -10 0 -10 C
-5.523 -10 -10 -5.523 -10 0 C
-10 5.523 -5.523 10 0 10 C
5.523 10 10 5.523 10 0 C
cp
S
GR
GS
[0.75 0 0 0.75 257.32738 349.49289] CT
1 GC
N
/f-1017779695{10 0 M
10 -5.523 5.523 -10 0 -10 C
-5.523 -10 -10 -5.523 -10 0 C
-10 5.523 -5.523 10 0 10 C
5.523 10 10 5.523 10 0 C
cp}def
f-1017779695
f
GR
GS
[0.75 0 0 0.75 257.32738 349.49289] CT
10.0 ML
2.667 LW
N
10 0 M
10 -5.523 5.523 -10 0 -10 C
-5.523 -10 -10 -5.523 -10 0 C
-10 5.523 -5.523 10 0 10 C
5.523 10 10 5.523 10 0 C
cp
S
GR
GS
[0.75 0 0 0.75 216.53352 341.20066] CT
1 GC
N
f-1017779695
f
GR
GS
[0.75 0 0 0.75 216.53352 341.20066] CT
10.0 ML
2.667 LW
N
10 0 M
10 -5.523 5.523 -10 0 -10 C
-5.523 -10 -10 -5.523 -10 0 C
-10 5.523 -5.523 10 0 10 C
5.523 10 10 5.523 10 0 C
cp
S
GR
GS
[0.75 0 0 0.75 215.36449 289.91499] CT
1 GC
N
f-1017779695
f
GR
GS
[0.75 0 0 0.75 215.36449 289.91499] CT
10.0 ML
2.667 LW
N
10 0 M
10 -5.523 5.523 -10 0 -10 C
-5.523 -10 -10 -5.523 -10 0 C
-10 5.523 -5.523 10 0 10 C
5.523 10 10 5.523 10 0 C
cp
S
GR
GS
[0.75 0 0 0.75 187.7436 267.64497] CT
1 GC
N
f-1017779695
f
GR
GS
[0.75 0 0 0.75 187.7436 267.64497] CT
10.0 ML
2.667 LW
N
10 0 M
10 -5.523 5.523 -10 0 -10 C
-5.523 -10 -10 -5.523 -10 0 C
-10 5.523 -5.523 10 0 10 C
5.523 10 10 5.523 10 0 C
cp
S
GR
GS
[0.75 0 0 0.75 0 0.5] CT
1 0 0 RC
N
/f-160915382{186.958 303.018 M
187 302 L
186.958 300.982 L
186.833 299.972 L
186.625 298.976 L
186.336 298.002 L
185.969 297.057 L
185.524 296.148 L
185.007 295.28 L
184.421 294.461 L
183.769 293.697 L
183.057 292.992 L
182.29 292.352 L
181.473 291.782 L
180.612 291.285 L
179.713 290.865 L
178.783 290.526 L
177.828 290.269 L
176.856 290.097 L
175.874 290.011 L
174.887 290.011 L
173.905 290.097 L
172.933 290.269 L
171.978 290.526 L
171.048 290.865 L
170.149 291.285 L
169.288 291.782 L
168.471 292.352 L
167.704 292.992 L
166.992 293.697 L
166.34 294.461 L
165.754 295.28 L
165.237 296.148 L
164.792 297.057 L
164.425 298.002 L
164.136 298.976 L
163.928 299.972 L
163.803 300.982 L
163.761 302 L
163.803 303.018 L
163.928 304.028 L
164.136 305.024 L
164.425 305.998 L
164.792 306.943 L
165.237 307.852 L
165.754 308.72 L
166.34 309.539 L
166.992 310.303 L
167.704 311.008 L
168.471 311.648 L
169.288 312.218 L
170.149 312.715 L
171.048 313.135 L
171.978 313.474 L
172.933 313.731 L
173.905 313.903 L
174.887 313.989 L
175.874 313.989 L
176.856 313.903 L
177.828 313.731 L
178.783 313.474 L
179.713 313.135 L
180.612 312.715 L
181.473 312.218 L
182.29 311.648 L
183.057 311.008 L
183.769 310.303 L
184.421 309.539 L
185.007 308.72 L
185.524 307.852 L
185.969 306.943 L
186.336 305.998 L
186.625 305.024 L
186.833 304.028 L
cp}def
f-160915382
f
GR
GS
[0.75 0 0 0.75 0 0.5] CT
1 0 0 RC
1 LJ
0.667 LW
N
187 302 M
186.958 300.982 L
186.833 299.972 L
186.625 298.976 L
186.336 298.002 L
185.969 297.057 L
185.524 296.148 L
185.007 295.28 L
184.421 294.461 L
183.769 293.697 L
183.057 292.992 L
182.29 292.352 L
181.473 291.782 L
180.612 291.285 L
179.713 290.865 L
178.783 290.526 L
177.828 290.269 L
176.856 290.097 L
175.874 290.011 L
174.887 290.011 L
173.905 290.097 L
172.933 290.269 L
171.978 290.526 L
171.048 290.865 L
170.149 291.285 L
169.288 291.782 L
168.471 292.352 L
167.704 292.992 L
166.992 293.697 L
166.34 294.461 L
165.754 295.28 L
165.237 296.148 L
164.792 297.057 L
164.425 298.002 L
164.136 298.976 L
163.928 299.972 L
163.803 300.982 L
163.761 302 L
163.803 303.018 L
163.928 304.028 L
164.136 305.024 L
164.425 305.998 L
164.792 306.943 L
165.237 307.852 L
165.754 308.72 L
166.34 309.539 L
166.992 310.303 L
167.704 311.008 L
168.471 311.648 L
169.288 312.218 L
170.149 312.715 L
171.048 313.135 L
171.978 313.474 L
172.933 313.731 L
173.905 313.903 L
174.887 313.989 L
175.874 313.989 L
176.856 313.903 L
177.828 313.731 L
178.783 313.474 L
179.713 313.135 L
180.612 312.715 L
181.473 312.218 L
182.29 311.648 L
183.057 311.008 L
183.769 310.303 L
184.421 309.539 L
185.007 308.72 L
185.524 307.852 L
185.969 306.943 L
186.336 305.998 L
186.625 305.024 L
186.833 304.028 L
186.958 303.018 L
187 302 L
cp
S
GR
%%Trailer
%%Pages: 1
%%EOF
