%!PS-Adobe-3.0 EPSF-3.0
%%Creator: (MATLAB, The Mathworks, Inc. Version 9.5.0.944444 \(R2018b\). Operating System: Windows 10)
%%Title: (C:/Users/navsas/Dropbox/Collaborative ranging CRLB/fig/biasCDF_B.eps)
%%CreationDate: 2018-11-28T10:16:51
%%Pages: (atend)
%%BoundingBox: 0 0 703 278
%%LanguageLevel: 3
%%EndComments
%%BeginProlog
%%BeginResource: procset (Apache XML Graphics Std ProcSet) 1.2 0
%%Version: 1.2 0
%%Copyright: (Copyright 2001-2003,2010 The Apache Software Foundation. License terms: http://www.apache.org/licenses/LICENSE-2.0)
/bd{bind def}bind def
/ld{load def}bd
/GR/grestore ld
/GS/gsave ld
/RM/rmoveto ld
/C/curveto ld
/t/show ld
/L/lineto ld
/ML/setmiterlimit ld
/CT/concat ld
/f/fill ld
/N/newpath ld
/S/stroke ld
/CC/setcmykcolor ld
/A/ashow ld
/cp/closepath ld
/RC/setrgbcolor ld
/LJ/setlinejoin ld
/GC/setgray ld
/LW/setlinewidth ld
/M/moveto ld
/re {4 2 roll M
1 index 0 rlineto
0 exch rlineto
neg 0 rlineto
cp } bd
/_ctm matrix def
/_tm matrix def
/BT { _ctm currentmatrix pop matrix _tm copy pop 0 0 moveto } bd
/ET { _ctm setmatrix } bd
/iTm { _ctm setmatrix _tm concat } bd
/Tm { _tm astore pop iTm 0 0 moveto } bd
/ux 0.0 def
/uy 0.0 def
/F {
  /Tp exch def
  /Tf exch def
  Tf findfont Tp scalefont setfont
  /cf Tf def  /cs Tp def
} bd
/ULS {currentpoint /uy exch def /ux exch def} bd
/ULE {
  /Tcx currentpoint pop def
  gsave
  newpath
  cf findfont cs scalefont dup
  /FontMatrix get 0 get /Ts exch def /FontInfo get dup
  /UnderlinePosition get Ts mul /To exch def
  /UnderlineThickness get Ts mul /Tt exch def
  ux uy To add moveto  Tcx uy To add lineto
  Tt setlinewidth stroke
  grestore
} bd
/OLE {
  /Tcx currentpoint pop def
  gsave
  newpath
  cf findfont cs scalefont dup
  /FontMatrix get 0 get /Ts exch def /FontInfo get dup
  /UnderlinePosition get Ts mul /To exch def
  /UnderlineThickness get Ts mul /Tt exch def
  ux uy To add cs add moveto Tcx uy To add cs add lineto
  Tt setlinewidth stroke
  grestore
} bd
/SOE {
  /Tcx currentpoint pop def
  gsave
  newpath
  cf findfont cs scalefont dup
  /FontMatrix get 0 get /Ts exch def /FontInfo get dup
  /UnderlinePosition get Ts mul /To exch def
  /UnderlineThickness get Ts mul /Tt exch def
  ux uy To add cs 10 mul 26 idiv add moveto Tcx uy To add cs 10 mul 26 idiv add lineto
  Tt setlinewidth stroke
  grestore
} bd
/QT {
/Y22 exch store
/X22 exch store
/Y21 exch store
/X21 exch store
currentpoint
/Y21 load 2 mul add 3 div exch
/X21 load 2 mul add 3 div exch
/X21 load 2 mul /X22 load add 3 div
/Y21 load 2 mul /Y22 load add 3 div
/X22 load /Y22 load curveto
} bd
/SSPD {
dup length /d exch dict def
{
/v exch def
/k exch def
currentpagedevice k known {
/cpdv currentpagedevice k get def
v cpdv ne {
/upd false def
/nullv v type /nulltype eq def
/nullcpdv cpdv type /nulltype eq def
nullv nullcpdv or
{
/upd true def
} {
/sametype v type cpdv type eq def
sametype {
v type /arraytype eq {
/vlen v length def
/cpdvlen cpdv length def
vlen cpdvlen eq {
0 1 vlen 1 sub {
/i exch def
/obj v i get def
/cpdobj cpdv i get def
obj cpdobj ne {
/upd true def
exit
} if
} for
} {
/upd true def
} ifelse
} {
v type /dicttype eq {
v {
/dv exch def
/dk exch def
/cpddv cpdv dk get def
dv cpddv ne {
/upd true def
exit
} if
} forall
} {
/upd true def
} ifelse
} ifelse
} if
} ifelse
upd true eq {
d k v put
} if
} if
} if
} forall
d length 0 gt {
d setpagedevice
} if
} bd
/RE { % /NewFontName [NewEncodingArray] /FontName RE -
  findfont dup length dict begin
  {
    1 index /FID ne
    {def} {pop pop} ifelse
  } forall
  /Encoding exch def
  /FontName 1 index def
  currentdict definefont pop
  end
} bind def
%%EndResource
%%BeginResource: procset (Apache XML Graphics EPS ProcSet) 1.0 0
%%Version: 1.0 0
%%Copyright: (Copyright 2002-2003 The Apache Software Foundation. License terms: http://www.apache.org/licenses/LICENSE-2.0)
/BeginEPSF { %def
/b4_Inc_state save def         % Save state for cleanup
/dict_count countdictstack def % Count objects on dict stack
/op_count count 1 sub def      % Count objects on operand stack
userdict begin                 % Push userdict on dict stack
/showpage { } def              % Redefine showpage, { } = null proc
0 setgray 0 setlinecap         % Prepare graphics state
1 setlinewidth 0 setlinejoin
10 setmiterlimit [ ] 0 setdash newpath
/languagelevel where           % If level not equal to 1 then
{pop languagelevel             % set strokeadjust and
1 ne                           % overprint to their defaults.
{false setstrokeadjust false setoverprint
} if
} if
} bd
/EndEPSF { %def
count op_count sub {pop} repeat            % Clean up stacks
countdictstack dict_count sub {end} repeat
b4_Inc_state restore
} bd
%%EndResource
%FOPBeginFontDict
%%IncludeResource: font Courier-Oblique
%%IncludeResource: font Courier-BoldOblique
%%IncludeResource: font Courier-Bold
%%IncludeResource: font ZapfDingbats
%%IncludeResource: font Symbol
%%IncludeResource: font Helvetica
%%IncludeResource: font Helvetica-Oblique
%%IncludeResource: font Helvetica-Bold
%%IncludeResource: font Helvetica-BoldOblique
%%IncludeResource: font Times-Roman
%%IncludeResource: font Times-Italic
%%IncludeResource: font Times-Bold
%%IncludeResource: font Times-BoldItalic
%%IncludeResource: font Courier
%FOPEndFontDict
%%BeginResource: encoding WinAnsiEncoding
/WinAnsiEncoding [
/.notdef /.notdef /.notdef /.notdef /.notdef
/.notdef /.notdef /.notdef /.notdef /.notdef
/.notdef /.notdef /.notdef /.notdef /.notdef
/.notdef /.notdef /.notdef /.notdef /.notdef
/.notdef /.notdef /.notdef /.notdef /.notdef
/.notdef /.notdef /.notdef /.notdef /.notdef
/.notdef /.notdef /space /exclam /quotedbl
/numbersign /dollar /percent /ampersand /quotesingle
/parenleft /parenright /asterisk /plus /comma
/hyphen /period /slash /zero /one
/two /three /four /five /six
/seven /eight /nine /colon /semicolon
/less /equal /greater /question /at
/A /B /C /D /E
/F /G /H /I /J
/K /L /M /N /O
/P /Q /R /S /T
/U /V /W /X /Y
/Z /bracketleft /backslash /bracketright /asciicircum
/underscore /quoteleft /a /b /c
/d /e /f /g /h
/i /j /k /l /m
/n /o /p /q /r
/s /t /u /v /w
/x /y /z /braceleft /bar
/braceright /asciitilde /bullet /Euro /bullet
/quotesinglbase /florin /quotedblbase /ellipsis /dagger
/daggerdbl /circumflex /perthousand /Scaron /guilsinglleft
/OE /bullet /Zcaron /bullet /bullet
/quoteleft /quoteright /quotedblleft /quotedblright /bullet
/endash /emdash /asciitilde /trademark /scaron
/guilsinglright /oe /bullet /zcaron /Ydieresis
/space /exclamdown /cent /sterling /currency
/yen /brokenbar /section /dieresis /copyright
/ordfeminine /guillemotleft /logicalnot /sfthyphen /registered
/macron /degree /plusminus /twosuperior /threesuperior
/acute /mu /paragraph /middot /cedilla
/onesuperior /ordmasculine /guillemotright /onequarter /onehalf
/threequarters /questiondown /Agrave /Aacute /Acircumflex
/Atilde /Adieresis /Aring /AE /Ccedilla
/Egrave /Eacute /Ecircumflex /Edieresis /Igrave
/Iacute /Icircumflex /Idieresis /Eth /Ntilde
/Ograve /Oacute /Ocircumflex /Otilde /Odieresis
/multiply /Oslash /Ugrave /Uacute /Ucircumflex
/Udieresis /Yacute /Thorn /germandbls /agrave
/aacute /acircumflex /atilde /adieresis /aring
/ae /ccedilla /egrave /eacute /ecircumflex
/edieresis /igrave /iacute /icircumflex /idieresis
/eth /ntilde /ograve /oacute /ocircumflex
/otilde /odieresis /divide /oslash /ugrave
/uacute /ucircumflex /udieresis /yacute /thorn
/ydieresis
] def
%%EndResource
%FOPBeginFontReencode
/Courier-Oblique findfont
dup length dict begin
  {1 index /FID ne {def} {pop pop} ifelse} forall
  /Encoding WinAnsiEncoding def
  currentdict
end
/Courier-Oblique exch definefont pop
/Courier-BoldOblique findfont
dup length dict begin
  {1 index /FID ne {def} {pop pop} ifelse} forall
  /Encoding WinAnsiEncoding def
  currentdict
end
/Courier-BoldOblique exch definefont pop
/Courier-Bold findfont
dup length dict begin
  {1 index /FID ne {def} {pop pop} ifelse} forall
  /Encoding WinAnsiEncoding def
  currentdict
end
/Courier-Bold exch definefont pop
/Helvetica findfont
dup length dict begin
  {1 index /FID ne {def} {pop pop} ifelse} forall
  /Encoding WinAnsiEncoding def
  currentdict
end
/Helvetica exch definefont pop
/Helvetica-Oblique findfont
dup length dict begin
  {1 index /FID ne {def} {pop pop} ifelse} forall
  /Encoding WinAnsiEncoding def
  currentdict
end
/Helvetica-Oblique exch definefont pop
/Helvetica-Bold findfont
dup length dict begin
  {1 index /FID ne {def} {pop pop} ifelse} forall
  /Encoding WinAnsiEncoding def
  currentdict
end
/Helvetica-Bold exch definefont pop
/Helvetica-BoldOblique findfont
dup length dict begin
  {1 index /FID ne {def} {pop pop} ifelse} forall
  /Encoding WinAnsiEncoding def
  currentdict
end
/Helvetica-BoldOblique exch definefont pop
/Times-Roman findfont
dup length dict begin
  {1 index /FID ne {def} {pop pop} ifelse} forall
  /Encoding WinAnsiEncoding def
  currentdict
end
/Times-Roman exch definefont pop
/Times-Italic findfont
dup length dict begin
  {1 index /FID ne {def} {pop pop} ifelse} forall
  /Encoding WinAnsiEncoding def
  currentdict
end
/Times-Italic exch definefont pop
/Times-Bold findfont
dup length dict begin
  {1 index /FID ne {def} {pop pop} ifelse} forall
  /Encoding WinAnsiEncoding def
  currentdict
end
/Times-Bold exch definefont pop
/Times-BoldItalic findfont
dup length dict begin
  {1 index /FID ne {def} {pop pop} ifelse} forall
  /Encoding WinAnsiEncoding def
  currentdict
end
/Times-BoldItalic exch definefont pop
/Courier findfont
dup length dict begin
  {1 index /FID ne {def} {pop pop} ifelse} forall
  /Encoding WinAnsiEncoding def
  currentdict
end
/Courier exch definefont pop
%FOPEndFontReencode
%%EndProlog
%%Page: 1 1
%%PageBoundingBox: 0 0 703 278
%%BeginPageSetup
[1 0 0 -1 0 278] CT
%%EndPageSetup
GS
[0.75 0 0 0.75 0 -0.25] CT
N
0 0 M
937 0 L
937 371 L
0 371 L
0 0 L
cp
clip
1 GC
N
0 0 937 371 re
f
GR
GS
[0.75 0 0 0.75 0 -0.25] CT
1 GC
N
0 0 937 371 re
f
GR
GS
[0.75 0 0 0.75 0 -0.25] CT
1 GC
N
122 305 M
848 305 L
848 41 L
122 41 L
cp
f
GR
GS
[0.75 0 0 0.75 0 -0.25] CT
0.873 GC
1 LJ
0.667 LW
N
122 305 M
122 41 L
S
GR
GS
[0.75 0 0 0.75 0 -0.25] CT
0.873 GC
1 LJ
0.667 LW
N
276.277 305 M
276.277 41 L
S
GR
GS
[0.75 0 0 0.75 0 -0.25] CT
0.873 GC
1 LJ
0.667 LW
N
430.555 305 M
430.555 41 L
S
GR
GS
[0.75 0 0 0.75 0 -0.25] CT
0.873 GC
1 LJ
0.667 LW
N
584.832 305 M
584.832 41 L
S
GR
GS
[0.75 0 0 0.75 0 -0.25] CT
0.873 GC
1 LJ
0.667 LW
N
739.109 305 M
739.109 41 L
S
GR
GS
[0.75 0 0 0.75 0 -0.25] CT
0.873 GC
1 LJ
0.667 LW
N
848 254.995 M
122 254.995 L
S
GR
GS
[0.75 0 0 0.75 0 -0.25] CT
0.873 GC
1 LJ
0.667 LW
N
848 201.496 M
122 201.496 L
S
GR
GS
[0.75 0 0 0.75 0 -0.25] CT
0.873 GC
1 LJ
0.667 LW
N
848 147.998 M
122 147.998 L
S
GR
GS
[0.75 0 0 0.75 0 -0.25] CT
0.873 GC
1 LJ
0.667 LW
N
848 94.499 M
122 94.499 L
S
GR
GS
[0.75 0 0 0.75 0 -0.25] CT
0.873 GC
1 LJ
0.667 LW
N
848 41 M
122 41 L
S
GR
GS
[0.75 0 0 0.75 0 -0.25] CT
0.149 GC
2 setlinecap
1 LJ
0.667 LW
N
122 305 M
848 305 L
S
GR
GS
[0.75 0 0 0.75 0 -0.25] CT
0.149 GC
2 setlinecap
1 LJ
0.667 LW
N
122 41 M
848 41 L
S
GR
GS
[0.75 0 0 0.75 0 -0.25] CT
0.149 GC
2 setlinecap
1 LJ
0.667 LW
N
122 305 M
122 297.74 L
S
GR
GS
[0.75 0 0 0.75 0 -0.25] CT
0.149 GC
2 setlinecap
1 LJ
0.667 LW
N
276.277 305 M
276.277 297.74 L
S
GR
GS
[0.75 0 0 0.75 0 -0.25] CT
0.149 GC
2 setlinecap
1 LJ
0.667 LW
N
430.555 305 M
430.555 297.74 L
S
GR
GS
[0.75 0 0 0.75 0 -0.25] CT
0.149 GC
2 setlinecap
1 LJ
0.667 LW
N
584.832 305 M
584.832 297.74 L
S
GR
GS
[0.75 0 0 0.75 0 -0.25] CT
0.149 GC
2 setlinecap
1 LJ
0.667 LW
N
739.109 305 M
739.109 297.74 L
S
GR
GS
[0.75 0 0 0.75 0 -0.25] CT
0.149 GC
2 setlinecap
1 LJ
0.667 LW
N
122 41 M
122 48.26 L
S
GR
GS
[0.75 0 0 0.75 0 -0.25] CT
0.149 GC
2 setlinecap
1 LJ
0.667 LW
N
276.277 41 M
276.277 48.26 L
S
GR
GS
[0.75 0 0 0.75 0 -0.25] CT
0.149 GC
2 setlinecap
1 LJ
0.667 LW
N
430.555 41 M
430.555 48.26 L
S
GR
GS
[0.75 0 0 0.75 0 -0.25] CT
0.149 GC
2 setlinecap
1 LJ
0.667 LW
N
584.832 41 M
584.832 48.26 L
S
GR
GS
[0.75 0 0 0.75 0 -0.25] CT
0.149 GC
2 setlinecap
1 LJ
0.667 LW
N
739.109 41 M
739.109 48.26 L
S
GR
GS
[0.75 0 0 0.75 91.5 233.3] CT
0.149 GC
N
0.083 16.102 M
-2.245 16.102 -3.081 14.18 QT
-3.917 12.258 -3.917 9.617 QT
-3.917 7.977 -3.62 6.516 QT
-3.323 5.055 -2.424 4.039 QT
-1.526 3.024 0.083 3.024 QT
1.333 3.024 2.13 3.633 QT
2.927 4.242 3.349 5.219 QT
3.771 6.196 3.919 7.297 QT
4.068 8.399 4.068 9.617 QT
4.068 11.258 3.771 12.68 QT
3.474 14.102 2.591 15.102 QT
1.708 16.102 0.083 16.102 QT
cp
0.083 15.602 M
1.146 15.602 1.661 14.516 QT
2.177 13.43 2.302 12.117 QT
2.427 10.805 2.427 9.321 QT
2.427 7.883 2.302 6.68 QT
2.177 5.477 1.661 4.5 QT
1.146 3.524 0.083 3.524 QT
-0.995 3.524 -1.51 4.5 QT
-2.026 5.477 -2.151 6.68 QT
-2.276 7.883 -2.276 9.321 QT
-2.276 10.367 -2.221 11.305 QT
-2.167 12.242 -1.948 13.242 QT
-1.729 14.242 -1.229 14.922 QT
-0.729 15.602 0.083 15.602 QT
cp
f
GR
GS
[0.75 0 0 0.75 207.20801 233.3] CT
0.149 GC
N
-7.176 16.102 M
-9.504 16.102 -10.34 14.18 QT
-11.176 12.258 -11.176 9.617 QT
-11.176 7.977 -10.879 6.516 QT
-10.582 5.055 -9.684 4.039 QT
-8.785 3.024 -7.176 3.024 QT
-5.926 3.024 -5.129 3.633 QT
-4.332 4.242 -3.91 5.219 QT
-3.488 6.196 -3.34 7.297 QT
-3.192 8.399 -3.192 9.617 QT
-3.192 11.258 -3.488 12.68 QT
-3.785 14.102 -4.668 15.102 QT
-5.551 16.102 -7.176 16.102 QT
cp
-7.176 15.602 M
-6.113 15.602 -5.598 14.516 QT
-5.082 13.43 -4.957 12.117 QT
-4.832 10.805 -4.832 9.321 QT
-4.832 7.883 -4.957 6.68 QT
-5.082 5.477 -5.598 4.5 QT
-6.113 3.524 -7.176 3.524 QT
-8.254 3.524 -8.77 4.5 QT
-9.285 5.477 -9.41 6.68 QT
-9.535 7.883 -9.535 9.321 QT
-9.535 10.367 -9.481 11.305 QT
-9.426 12.242 -9.207 13.242 QT
-8.988 14.242 -8.488 14.922 QT
-7.988 15.602 -7.176 15.602 QT
cp
f
GR
GS
[0.75 0 0 0.75 207.20801 233.3] CT
0.149 GC
N
-0.999 14.633 M
-0.999 14.211 -0.679 13.899 QT
-0.358 13.586 0.048 13.586 QT
0.314 13.586 0.564 13.727 QT
0.814 13.867 0.954 14.117 QT
1.095 14.367 1.095 14.633 QT
1.095 15.055 0.79 15.367 QT
0.486 15.68 0.048 15.68 QT
-0.358 15.68 -0.679 15.367 QT
-0.999 15.055 -0.999 14.633 QT
cp
f
GR
GS
[0.75 0 0 0.75 207.20801 233.3] CT
0.149 GC
N
4.249 13.524 M
4.436 14.071 4.843 14.524 QT
5.249 14.977 5.796 15.235 QT
6.343 15.492 6.936 15.492 QT
8.311 15.492 8.835 14.43 QT
9.358 13.367 9.358 11.836 QT
9.358 11.18 9.335 10.727 QT
9.311 10.274 9.202 9.867 QT
9.03 9.196 8.593 8.696 QT
8.155 8.196 7.514 8.196 QT
6.874 8.196 6.413 8.391 QT
5.952 8.586 5.663 8.844 QT
5.374 9.102 5.155 9.391 QT
4.936 9.68 4.874 9.696 QT
4.655 9.696 L
4.608 9.696 4.546 9.633 QT
4.483 9.571 4.483 9.524 QT
4.483 3.18 L
4.483 3.133 4.538 3.078 QT
4.593 3.024 4.655 3.024 QT
4.718 3.024 L
5.999 3.633 7.436 3.633 QT
8.843 3.633 10.155 3.024 QT
10.202 3.024 L
10.28 3.024 10.335 3.071 QT
10.389 3.117 10.389 3.18 QT
10.389 3.352 L
10.389 3.446 10.343 3.446 QT
9.702 4.305 8.725 4.789 QT
7.749 5.274 6.686 5.274 QT
5.936 5.274 5.139 5.055 QT
5.139 8.649 L
5.764 8.133 6.264 7.914 QT
6.764 7.696 7.53 7.696 QT
8.577 7.696 9.405 8.305 QT
10.233 8.914 10.679 9.883 QT
11.124 10.852 11.124 11.852 QT
11.124 12.992 10.561 13.969 QT
9.999 14.946 9.038 15.524 QT
8.077 16.102 6.936 16.102 QT
6.014 16.102 5.225 15.617 QT
4.436 15.133 3.991 14.313 QT
3.546 13.492 3.546 12.586 QT
3.546 12.149 3.819 11.883 QT
4.093 11.617 4.514 11.617 QT
4.936 11.617 5.218 11.891 QT
5.499 12.164 5.499 12.586 QT
5.499 12.992 5.218 13.274 QT
4.936 13.555 4.514 13.555 QT
4.452 13.555 4.366 13.539 QT
4.28 13.524 4.249 13.524 QT
cp
f
GR
GS
[0.75 0 0 0.75 322.91604 233.3] CT
0.149 GC
N
-2.901 15.68 M
-2.901 15.008 L
-0.526 15.008 -0.526 14.414 QT
-0.526 4.43 L
-1.51 4.914 -3.01 4.914 QT
-3.01 4.242 L
-0.682 4.242 0.505 3.024 QT
0.771 3.024 L
0.833 3.024 0.896 3.078 QT
0.958 3.133 0.958 3.196 QT
0.958 14.414 L
0.958 15.008 3.333 15.008 QT
3.333 15.68 L
-2.901 15.68 L
cp
f
GR
GS
[0.75 0 0 0.75 438.62407 233.3] CT
0.149 GC
N
-10.16 15.68 M
-10.16 15.008 L
-7.785 15.008 -7.785 14.414 QT
-7.785 4.43 L
-8.77 4.914 -10.27 4.914 QT
-10.27 4.242 L
-7.942 4.242 -6.754 3.024 QT
-6.488 3.024 L
-6.426 3.024 -6.363 3.078 QT
-6.301 3.133 -6.301 3.196 QT
-6.301 14.414 L
-6.301 15.008 -3.926 15.008 QT
-3.926 15.68 L
-10.16 15.68 L
cp
f
GR
GS
[0.75 0 0 0.75 438.62407 233.3] CT
0.149 GC
N
/f-422864219{-0.999 14.633 M
-0.999 14.211 -0.679 13.899 QT
-0.358 13.586 0.048 13.586 QT
0.314 13.586 0.564 13.727 QT
0.814 13.867 0.954 14.117 QT
1.095 14.367 1.095 14.633 QT
1.095 15.055 0.79 15.367 QT
0.486 15.68 0.048 15.68 QT
-0.358 15.68 -0.679 15.367 QT
-0.999 15.055 -0.999 14.633 QT
cp}def
f-422864219
f
GR
GS
[0.75 0 0 0.75 438.62407 233.3] CT
0.149 GC
N
/f-1920764538{4.249 13.524 M
4.436 14.071 4.843 14.524 QT
5.249 14.977 5.796 15.235 QT
6.343 15.492 6.936 15.492 QT
8.311 15.492 8.835 14.43 QT
9.358 13.367 9.358 11.836 QT
9.358 11.18 9.335 10.727 QT
9.311 10.274 9.202 9.867 QT
9.03 9.196 8.593 8.696 QT
8.155 8.196 7.514 8.196 QT
6.874 8.196 6.413 8.391 QT
5.952 8.586 5.663 8.844 QT
5.374 9.102 5.155 9.391 QT
4.936 9.68 4.874 9.696 QT
4.655 9.696 L
4.608 9.696 4.546 9.633 QT
4.483 9.571 4.483 9.524 QT
4.483 3.18 L
4.483 3.133 4.538 3.078 QT
4.593 3.024 4.655 3.024 QT
4.718 3.024 L
5.999 3.633 7.436 3.633 QT
8.843 3.633 10.155 3.024 QT
10.202 3.024 L
10.28 3.024 10.335 3.071 QT
10.389 3.117 10.389 3.18 QT
10.389 3.352 L
10.389 3.446 10.343 3.446 QT
9.702 4.305 8.725 4.789 QT
7.749 5.274 6.686 5.274 QT
5.936 5.274 5.139 5.055 QT
5.139 8.649 L
5.764 8.133 6.264 7.914 QT
6.764 7.696 7.53 7.696 QT
8.577 7.696 9.405 8.305 QT
10.233 8.914 10.679 9.883 QT
11.124 10.852 11.124 11.852 QT
11.124 12.992 10.561 13.969 QT
9.999 14.946 9.038 15.524 QT
8.077 16.102 6.936 16.102 QT
6.014 16.102 5.225 15.617 QT
4.436 15.133 3.991 14.313 QT
3.546 13.492 3.546 12.586 QT
3.546 12.149 3.819 11.883 QT
4.093 11.617 4.514 11.617 QT
4.936 11.617 5.218 11.891 QT
5.499 12.164 5.499 12.586 QT
5.499 12.992 5.218 13.274 QT
4.936 13.555 4.514 13.555 QT
4.452 13.555 4.366 13.539 QT
4.28 13.524 4.249 13.524 QT
cp}def
f-1920764538
f
GR
GS
[0.75 0 0 0.75 554.33208 233.3] CT
0.149 GC
N
/f1789153862{-3.714 15.68 M
-3.714 15.164 L
-3.714 15.117 -3.682 15.071 QT
-0.729 11.805 L
-0.057 11.071 0.357 10.586 QT
0.771 10.102 1.177 9.461 QT
1.583 8.821 1.818 8.156 QT
2.052 7.492 2.052 6.742 QT
2.052 5.961 1.771 5.25 QT
1.49 4.539 0.919 4.117 QT
0.349 3.696 -0.464 3.696 QT
-1.292 3.696 -1.948 4.188 QT
-2.604 4.68 -2.87 5.477 QT
-2.807 5.461 -2.667 5.461 QT
-2.245 5.461 -1.94 5.742 QT
-1.635 6.024 -1.635 6.492 QT
-1.635 6.914 -1.94 7.219 QT
-2.245 7.524 -2.667 7.524 QT
-3.12 7.524 -3.417 7.211 QT
-3.714 6.899 -3.714 6.492 QT
-3.714 5.774 -3.448 5.149 QT
-3.182 4.524 -2.674 4.031 QT
-2.167 3.539 -1.534 3.281 QT
-0.901 3.024 -0.182 3.024 QT
0.896 3.024 1.833 3.485 QT
2.771 3.946 3.318 4.781 QT
3.865 5.617 3.865 6.742 QT
3.865 7.571 3.505 8.313 QT
3.146 9.055 2.583 9.664 QT
2.021 10.274 1.138 11.039 QT
0.255 11.805 -0.026 12.071 QT
-2.182 14.133 L
-0.354 14.133 L
0.99 14.133 1.896 14.11 QT
2.802 14.086 2.865 14.039 QT
3.083 13.805 3.318 12.289 QT
3.865 12.289 L
3.333 15.68 L
-3.714 15.68 L
cp}def
f1789153862
f
GR
GS
[0.75 0 0 0.75 363.75025 245.74801] CT
0.149 GC
N
/f-283714961{-7.026 23.894 M
-6.995 23.613 -6.698 23.613 QT
-6.683 23.613 -6.253 23.847 QT
-5.823 24.082 -5.308 24.269 QT
-4.792 24.457 -4.276 24.457 QT
-3.839 24.457 -3.534 24.082 QT
-3.23 23.707 -3.23 23.254 QT
-3.23 22.629 -3.886 22.363 QT
-7.964 20.785 L
-9.026 20.379 -9.714 19.558 QT
-10.401 18.738 -10.401 17.707 QT
-10.401 16.785 -9.909 15.785 QT
-9.417 14.785 -8.644 13.965 QT
-7.87 13.144 -6.98 12.644 QT
-7.683 12.222 -8.081 11.558 QT
-8.48 10.894 -8.48 10.097 QT
-8.48 9.254 -8.128 8.527 QT
-7.776 7.801 -7.183 7.207 QT
-6.589 6.613 -5.847 6.199 QT
-5.105 5.785 -4.355 5.566 QT
-4.464 5.082 -4.464 4.676 QT
-4.464 3.379 -3.964 3.379 QT
-3.839 3.379 -3.745 3.472 QT
-3.651 3.566 -3.651 3.691 QT
-3.651 3.816 -3.714 4.215 QT
-3.776 4.613 -3.776 4.707 QT
-3.776 5.113 -3.667 5.426 QT
-3.042 5.301 -2.48 5.301 QT
-0.276 5.301 -0.276 5.972 QT
-0.276 6.785 -2.714 6.785 QT
-3.464 6.785 -3.933 6.285 QT
-4.636 6.629 -5.222 7.277 QT
-5.808 7.926 -6.136 8.715 QT
-6.464 9.504 -6.464 10.316 QT
-6.464 11.441 -5.808 12.113 QT
-4.964 11.832 -4.105 11.832 QT
-1.901 11.832 -1.901 12.504 QT
-1.901 13.316 -4.355 13.316 QT
-5.339 13.316 -6.23 13.004 QT
-7.292 13.582 -8.183 14.754 QT
-9.073 15.926 -9.073 17.019 QT
-9.073 17.722 -8.566 18.254 QT
-8.058 18.785 -7.308 19.097 QT
-3.042 20.754 L
-2.495 20.972 -2.151 21.433 QT
-1.808 21.894 -1.808 22.488 QT
-1.808 23.472 -2.566 24.277 QT
-3.323 25.082 -4.308 25.082 QT
-4.605 25.082 -5.3 24.918 QT
-5.995 24.754 -6.511 24.488 QT
-7.026 24.222 -7.026 23.894 QT
cp
-5.089 12.582 M
-4.776 12.691 -4.308 12.691 QT
-3.136 12.691 -2.636 12.551 QT
-3.089 12.457 -4.12 12.457 QT
-4.542 12.457 -5.089 12.582 QT
cp
-3.245 6.019 M
-3.042 6.16 -2.667 6.16 QT
-1.511 6.16 -1.011 6.019 QT
-3.245 6.019 L
cp}def
f-283714961
f
GR
GS
[0.75 0 0 0.75 363.75025 245.74801] CT
0.149 GC
N
/f-210389454{-0.073 23.76 M
-0.073 22.901 L
1.364 22.901 1.52 22.744 QT
3.817 20.135 L
1.27 17.072 L
0.005 17.072 L
0.005 16.213 L
4.005 16.213 L
4.005 17.072 L
3.395 17.072 L
4.927 18.901 L
6.395 17.213 L
6.395 17.151 6.153 17.111 QT
5.911 17.072 5.755 17.072 QT
5.755 16.213 L
9.161 16.213 L
9.161 17.072 L
7.708 17.072 7.567 17.229 QT
5.489 19.572 L
8.239 22.901 L
9.52 22.901 L
9.52 23.76 L
5.505 23.76 L
5.505 22.901 L
6.13 22.901 L
4.38 20.822 L
2.677 22.76 L
2.677 22.807 2.927 22.854 QT
3.177 22.901 3.333 22.901 QT
3.333 23.76 L
-0.073 23.76 L
cp}def
f-210389454
f
GR
GS
[0.75 0 0 0.75 0 -0.25] CT
0.149 GC
2 setlinecap
1 LJ
0.667 LW
N
122 305 M
122 41 L
S
GR
GS
[0.75 0 0 0.75 0 -0.25] CT
0.149 GC
2 setlinecap
1 LJ
0.667 LW
N
848 305 M
848 41 L
S
GR
GS
[0.75 0 0 0.75 0 -0.25] CT
0.149 GC
2 setlinecap
1 LJ
0.667 LW
N
122 254.995 M
129.26 254.995 L
S
GR
GS
[0.75 0 0 0.75 0 -0.25] CT
0.149 GC
2 setlinecap
1 LJ
0.667 LW
N
122 201.496 M
129.26 201.496 L
S
GR
GS
[0.75 0 0 0.75 0 -0.25] CT
0.149 GC
2 setlinecap
1 LJ
0.667 LW
N
122 147.998 M
129.26 147.998 L
S
GR
GS
[0.75 0 0 0.75 0 -0.25] CT
0.149 GC
2 setlinecap
1 LJ
0.667 LW
N
122 94.499 M
129.26 94.499 L
S
GR
GS
[0.75 0 0 0.75 0 -0.25] CT
0.149 GC
2 setlinecap
1 LJ
0.667 LW
N
122 41 M
129.26 41 L
S
GR
GS
[0.75 0 0 0.75 0 -0.25] CT
0.149 GC
2 setlinecap
1 LJ
0.667 LW
N
848 254.995 M
840.74 254.995 L
S
GR
GS
[0.75 0 0 0.75 0 -0.25] CT
0.149 GC
2 setlinecap
1 LJ
0.667 LW
N
848 201.496 M
840.74 201.496 L
S
GR
GS
[0.75 0 0 0.75 0 -0.25] CT
0.149 GC
2 setlinecap
1 LJ
0.667 LW
N
848 147.998 M
840.74 147.998 L
S
GR
GS
[0.75 0 0 0.75 0 -0.25] CT
0.149 GC
2 setlinecap
1 LJ
0.667 LW
N
848 94.499 M
840.74 94.499 L
S
GR
GS
[0.75 0 0 0.75 0 -0.25] CT
0.149 GC
2 setlinecap
1 LJ
0.667 LW
N
848 41 M
840.74 41 L
S
GR
GS
[0.75 0 0 0.75 86.7 190.99644] CT
0.149 GC
N
/f-1029259981{-19.102 4.902 M
-21.43 4.902 -22.266 2.98 QT
-23.102 1.058 -23.102 -1.583 QT
-23.102 -3.223 -22.805 -4.684 QT
-22.508 -6.145 -21.61 -7.161 QT
-20.711 -8.176 -19.102 -8.176 QT
-17.852 -8.176 -17.055 -7.567 QT
-16.258 -6.958 -15.836 -5.981 QT
-15.414 -5.004 -15.266 -3.903 QT
-15.118 -2.801 -15.118 -1.583 QT
-15.118 0.058 -15.414 1.48 QT
-15.711 2.902 -16.594 3.902 QT
-17.477 4.902 -19.102 4.902 QT
cp
-19.102 4.402 M
-18.039 4.402 -17.524 3.316 QT
-17.008 2.23 -16.883 0.917 QT
-16.758 -0.395 -16.758 -1.879 QT
-16.758 -3.317 -16.883 -4.52 QT
-17.008 -5.723 -17.524 -6.7 QT
-18.039 -7.676 -19.102 -7.676 QT
-20.18 -7.676 -20.696 -6.7 QT
-21.211 -5.723 -21.336 -4.52 QT
-21.461 -3.317 -21.461 -1.879 QT
-21.461 -0.833 -21.407 0.105 QT
-21.352 1.042 -21.133 2.042 QT
-20.914 3.042 -20.414 3.722 QT
-19.914 4.402 -19.102 4.402 QT
cp}def
f-1029259981
f
GR
GS
[0.75 0 0 0.75 86.7 190.99644] CT
0.149 GC
N
/f1678544296{-12.925 3.433 M
-12.925 3.011 -12.605 2.699 QT
-12.284 2.386 -11.878 2.386 QT
-11.612 2.386 -11.362 2.527 QT
-11.112 2.667 -10.972 2.917 QT
-10.831 3.167 -10.831 3.433 QT
-10.831 3.855 -11.136 4.167 QT
-11.44 4.48 -11.878 4.48 QT
-12.284 4.48 -12.605 4.167 QT
-12.925 3.855 -12.925 3.433 QT
cp}def
f1678544296
f
GR
GS
[0.75 0 0 0.75 86.7 190.99644] CT
0.149 GC
N
/f221929001{-8.38 4.48 M
-8.38 3.964 L
-8.38 3.917 -8.349 3.871 QT
-5.396 0.605 L
-4.724 -0.129 -4.31 -0.614 QT
-3.896 -1.098 -3.49 -1.739 QT
-3.083 -2.379 -2.849 -3.044 QT
-2.615 -3.708 -2.615 -4.458 QT
-2.615 -5.239 -2.896 -5.95 QT
-3.177 -6.661 -3.747 -7.083 QT
-4.318 -7.504 -5.13 -7.504 QT
-5.958 -7.504 -6.615 -7.012 QT
-7.271 -6.52 -7.536 -5.723 QT
-7.474 -5.739 -7.333 -5.739 QT
-6.911 -5.739 -6.607 -5.458 QT
-6.302 -5.176 -6.302 -4.708 QT
-6.302 -4.286 -6.607 -3.981 QT
-6.911 -3.676 -7.333 -3.676 QT
-7.786 -3.676 -8.083 -3.989 QT
-8.38 -4.301 -8.38 -4.708 QT
-8.38 -5.426 -8.115 -6.051 QT
-7.849 -6.676 -7.341 -7.169 QT
-6.833 -7.661 -6.201 -7.919 QT
-5.568 -8.176 -4.849 -8.176 QT
-3.771 -8.176 -2.833 -7.715 QT
-1.896 -7.254 -1.349 -6.419 QT
-0.802 -5.583 -0.802 -4.458 QT
-0.802 -3.629 -1.161 -2.887 QT
-1.521 -2.145 -2.083 -1.536 QT
-2.646 -0.926 -3.529 -0.161 QT
-4.411 0.605 -4.693 0.871 QT
-6.849 2.933 L
-5.021 2.933 L
-3.677 2.933 -2.771 2.91 QT
-1.865 2.886 -1.802 2.839 QT
-1.583 2.605 -1.349 1.089 QT
-0.802 1.089 L
-1.333 4.48 L
-8.38 4.48 L
cp}def
f221929001
f
GR
GS
[0.75 0 0 0.75 86.7 150.87233] CT
0.149 GC
N
f-1029259981
f
GR
GS
[0.75 0 0 0.75 86.7 150.87233] CT
0.149 GC
N
f1678544296
f
GR
GS
[0.75 0 0 0.75 86.7 150.87233] CT
0.149 GC
N
/f-795451104{-8.802 1.339 M
-8.802 0.683 L
-2.927 -8.083 L
-2.865 -8.176 -2.74 -8.176 QT
-2.458 -8.176 L
-2.24 -8.176 -2.24 -7.958 QT
-2.24 0.683 L
-0.38 0.683 L
-0.38 1.339 L
-2.24 1.339 L
-2.24 3.214 L
-2.24 3.605 -1.685 3.706 QT
-1.13 3.808 -0.396 3.808 QT
-0.396 4.48 L
-5.63 4.48 L
-5.63 3.808 L
-4.896 3.808 -4.341 3.706 QT
-3.786 3.605 -3.786 3.214 QT
-3.786 1.339 L
-8.802 1.339 L
cp
-8.177 0.683 M
-3.677 0.683 L
-3.677 -6.051 L
-8.177 0.683 L
cp}def
f-795451104
f
GR
GS
[0.75 0 0 0.75 86.7 110.74821] CT
0.149 GC
N
f-1029259981
f
GR
GS
[0.75 0 0 0.75 86.7 110.74821] CT
0.149 GC
N
f1678544296
f
GR
GS
[0.75 0 0 0.75 86.7 110.74821] CT
0.149 GC
N
/f1301558740{-4.583 4.902 M
-5.755 4.902 -6.544 4.277 QT
-7.333 3.652 -7.771 2.652 QT
-8.208 1.652 -8.372 0.558 QT
-8.536 -0.536 -8.536 -1.661 QT
-8.536 -3.161 -7.951 -4.676 QT
-7.365 -6.192 -6.232 -7.184 QT
-5.099 -8.176 -3.536 -8.176 QT
-2.88 -8.176 -2.318 -7.926 QT
-1.755 -7.676 -1.443 -7.2 QT
-1.13 -6.723 -1.13 -6.051 QT
-1.13 -5.661 -1.388 -5.395 QT
-1.646 -5.129 -2.036 -5.129 QT
-2.411 -5.129 -2.677 -5.403 QT
-2.943 -5.676 -2.943 -6.051 QT
-2.943 -6.426 -2.677 -6.692 QT
-2.411 -6.958 -2.036 -6.958 QT
-1.943 -6.958 L
-2.177 -7.301 -2.622 -7.465 QT
-3.068 -7.629 -3.536 -7.629 QT
-4.115 -7.629 -4.599 -7.379 QT
-5.083 -7.129 -5.474 -6.7 QT
-5.865 -6.27 -6.122 -5.754 QT
-6.38 -5.239 -6.529 -4.583 QT
-6.677 -3.926 -6.708 -3.348 QT
-6.74 -2.77 -6.74 -1.911 QT
-6.411 -2.676 -5.802 -3.176 QT
-5.193 -3.676 -4.411 -3.676 QT
-3.568 -3.676 -2.872 -3.333 QT
-2.177 -2.989 -1.677 -2.379 QT
-1.177 -1.77 -0.911 -0.989 QT
-0.646 -0.208 -0.646 0.589 QT
-0.646 1.699 -1.146 2.706 QT
-1.646 3.714 -2.544 4.308 QT
-3.443 4.902 -4.583 4.902 QT
cp
-4.583 4.292 M
-3.849 4.292 -3.404 3.956 QT
-2.958 3.621 -2.747 3.074 QT
-2.536 2.527 -2.49 1.964 QT
-2.443 1.402 -2.443 0.589 QT
-2.443 -0.489 -2.544 -1.254 QT
-2.646 -2.02 -3.099 -2.598 QT
-3.552 -3.176 -4.49 -3.176 QT
-5.255 -3.176 -5.755 -2.653 QT
-6.255 -2.129 -6.482 -1.34 QT
-6.708 -0.551 -6.708 0.183 QT
-6.708 0.433 -6.693 0.558 QT
-6.693 0.589 -6.693 0.613 QT
-6.693 0.636 -6.708 0.652 QT
-6.708 1.48 -6.544 2.308 QT
-6.38 3.136 -5.904 3.714 QT
-5.427 4.292 -4.583 4.292 QT
cp}def
f1301558740
f
GR
GS
[0.75 0 0 0.75 86.7 70.62411] CT
0.149 GC
N
f-1029259981
f
GR
GS
[0.75 0 0 0.75 86.7 70.62411] CT
0.149 GC
N
f1678544296
f
GR
GS
[0.75 0 0 0.75 86.7 70.62411] CT
0.149 GC
N
/f-394930141{-8.536 1.589 M
-8.536 0.449 -7.786 -0.426 QT
-7.036 -1.301 -5.849 -1.879 QT
-6.552 -2.333 L
-7.208 -2.77 -7.615 -3.481 QT
-8.021 -4.192 -8.021 -4.958 QT
-8.021 -5.879 -7.544 -6.606 QT
-7.068 -7.333 -6.279 -7.754 QT
-5.49 -8.176 -4.583 -8.176 QT
-3.74 -8.176 -2.958 -7.833 QT
-2.177 -7.489 -1.669 -6.848 QT
-1.161 -6.208 -1.161 -5.333 QT
-1.161 -4.692 -1.458 -4.145 QT
-1.755 -3.598 -2.286 -3.161 QT
-2.818 -2.723 -3.411 -2.411 QT
-2.318 -1.723 L
-1.568 -1.223 -1.107 -0.426 QT
-0.646 0.371 -0.646 1.246 QT
-0.646 2.277 -1.201 3.121 QT
-1.755 3.964 -2.661 4.433 QT
-3.568 4.902 -4.583 4.902 QT
-5.568 4.902 -6.482 4.503 QT
-7.396 4.105 -7.966 3.347 QT
-8.536 2.589 -8.536 1.589 QT
cp
-7.505 1.589 M
-7.505 2.339 -7.091 2.964 QT
-6.677 3.589 -5.997 3.941 QT
-5.318 4.292 -4.583 4.292 QT
-3.474 4.292 -2.576 3.652 QT
-1.677 3.011 -1.677 1.933 QT
-1.677 1.574 -1.826 1.214 QT
-1.974 0.855 -2.224 0.566 QT
-2.474 0.277 -2.786 0.089 QT
-5.349 -1.567 L
-5.943 -1.239 -6.435 -0.762 QT
-6.927 -0.286 -7.216 0.324 QT
-7.505 0.933 -7.505 1.589 QT
cp
-6.193 -4.208 M
-3.896 -2.723 L
-3.099 -3.176 -2.591 -3.84 QT
-2.083 -4.504 -2.083 -5.333 QT
-2.083 -5.973 -2.435 -6.504 QT
-2.786 -7.036 -3.365 -7.333 QT
-3.943 -7.629 -4.599 -7.629 QT
-5.177 -7.629 -5.763 -7.403 QT
-6.349 -7.176 -6.724 -6.739 QT
-7.099 -6.301 -7.099 -5.708 QT
-7.099 -4.817 -6.193 -4.208 QT
cp}def
f-394930141
f
GR
GS
[0.75 0 0 0.75 86.7 30.5] CT
0.149 GC
N
/f-344800598{-7.568 4.48 M
-7.568 3.808 L
-5.193 3.808 -5.193 3.214 QT
-5.193 -6.77 L
-6.177 -6.286 -7.677 -6.286 QT
-7.677 -6.958 L
-5.349 -6.958 -4.161 -8.176 QT
-3.896 -8.176 L
-3.833 -8.176 -3.771 -8.122 QT
-3.708 -8.067 -3.708 -8.004 QT
-3.708 3.214 L
-3.708 3.808 -1.333 3.808 QT
-1.333 4.48 L
-7.568 4.48 L
cp}def
f-344800598
f
GR
GS
[0 -0.75 0.75 0 65.81106 129.49991] CT
0.149 GC
N
/f-2039442754{-17.178 -9.642 M
-16.459 -8.72 -15.381 -8.197 QT
-14.303 -7.673 -13.147 -7.673 QT
-12.162 -7.673 -11.334 -8.056 QT
-10.506 -8.439 -9.889 -9.126 QT
-9.272 -9.814 -8.936 -10.681 QT
-8.6 -11.548 -8.6 -12.517 QT
-8.6 -12.689 -8.412 -12.689 QT
-8.162 -12.689 L
-7.991 -12.689 -7.991 -12.486 QT
-7.991 -11.376 -8.412 -10.361 QT
-8.834 -9.345 -9.6 -8.572 QT
-10.366 -7.798 -11.366 -7.361 QT
-12.366 -6.923 -13.459 -6.923 QT
-14.959 -6.923 -16.311 -7.541 QT
-17.662 -8.158 -18.662 -9.212 QT
-19.662 -10.267 -20.225 -11.666 QT
-20.787 -13.064 -20.787 -14.564 QT
-20.787 -16.08 -20.225 -17.47 QT
-19.662 -18.861 -18.662 -19.931 QT
-17.662 -21.001 -16.311 -21.603 QT
-14.959 -22.205 -13.459 -22.205 QT
-12.381 -22.205 -11.397 -21.736 QT
-10.412 -21.267 -9.678 -20.408 QT
-8.459 -22.142 L
-8.334 -22.205 -8.319 -22.205 QT
-8.162 -22.205 L
-8.1 -22.205 -8.045 -22.15 QT
-7.991 -22.095 -7.991 -22.017 QT
-7.991 -16.361 L
-7.991 -16.173 -8.162 -16.173 QT
-8.537 -16.173 L
-8.725 -16.173 -8.725 -16.361 QT
-8.725 -16.955 -8.967 -17.705 QT
-9.209 -18.455 -9.584 -19.126 QT
-9.959 -19.798 -10.459 -20.314 QT
-11.631 -21.455 -13.162 -21.455 QT
-14.319 -21.455 -15.381 -20.931 QT
-16.444 -20.408 -17.178 -19.486 QT
-17.944 -18.501 -18.241 -17.251 QT
-18.537 -16.001 -18.537 -14.564 QT
-18.537 -13.142 -18.241 -11.884 QT
-17.944 -10.626 -17.178 -9.642 QT
cp}def
f-2039442754
f
GR
GS
[0 -0.75 0.75 0 65.81106 129.49991] CT
0.149 GC
N
/f-608966714{-6.427 -7.392 M
-6.427 -8.126 L
-4.27 -8.126 -4.27 -8.798 QT
-4.27 -20.33 L
-4.27 -21.001 -6.427 -21.001 QT
-6.427 -21.736 L
1.308 -21.736 L
2.745 -21.736 3.933 -21.119 QT
5.12 -20.501 5.964 -19.462 QT
6.808 -18.423 7.261 -17.111 QT
7.714 -15.798 7.714 -14.423 QT
7.714 -13.095 7.253 -11.837 QT
6.792 -10.58 5.925 -9.572 QT
5.058 -8.564 3.878 -7.978 QT
2.698 -7.392 1.308 -7.392 QT
-6.427 -7.392 L
cp
-2.38 -8.798 M
-2.38 -8.345 -2.122 -8.236 QT
-1.864 -8.126 -1.317 -8.126 QT
0.761 -8.126 L
1.839 -8.126 2.808 -8.595 QT
3.777 -9.064 4.417 -9.892 QT
5.089 -10.783 5.308 -11.869 QT
5.527 -12.955 5.527 -14.423 QT
5.527 -15.955 5.308 -17.103 QT
5.089 -18.251 4.417 -19.158 QT
3.792 -20.048 2.831 -20.525 QT
1.87 -21.001 0.761 -21.001 QT
-1.317 -21.001 L
-1.692 -21.001 -1.903 -20.97 QT
-2.114 -20.939 -2.247 -20.791 QT
-2.38 -20.642 -2.38 -20.33 QT
-2.38 -8.798 L
cp}def
f-608966714
f
GR
GS
[0 -0.75 0.75 0 65.81106 129.49991] CT
0.149 GC
N
/f-1389076902{9.196 -7.392 M
9.196 -8.126 L
11.368 -8.126 11.368 -8.798 QT
11.368 -20.33 L
11.368 -21.001 9.196 -21.001 QT
9.196 -21.736 L
20.774 -21.736 L
21.368 -16.923 L
20.759 -16.923 L
20.618 -18.251 20.376 -19.017 QT
20.134 -19.783 19.673 -20.22 QT
19.212 -20.658 18.438 -20.83 QT
17.665 -21.001 16.306 -21.001 QT
14.384 -21.001 L
14.009 -21.001 13.798 -20.97 QT
13.587 -20.939 13.454 -20.791 QT
13.321 -20.642 13.321 -20.33 QT
13.321 -14.923 L
14.806 -14.923 L
15.884 -14.923 16.392 -15.119 QT
16.899 -15.314 17.087 -15.814 QT
17.274 -16.314 17.274 -17.392 QT
17.884 -17.392 L
17.884 -11.736 L
17.274 -11.736 L
17.274 -12.814 17.087 -13.314 QT
16.899 -13.814 16.392 -14.009 QT
15.884 -14.205 14.806 -14.205 QT
13.321 -14.205 L
13.321 -8.798 L
13.321 -8.126 16.009 -8.126 QT
16.009 -7.392 L
9.196 -7.392 L
cp}def
f-1389076902
f
GR
GS
[0.75 0 0 0.75 0 -0.25] CT
1 LJ
2.667 LW
N
157.143 305.031 M
157.143 304.57 L
157.706 304.57 L
157.706 303.916 L
158.772 303.916 L
158.772 303.262 L
158.84 303.262 L
158.84 302.608 L
159.049 302.608 L
159.049 301.954 L
159.437 301.954 L
159.437 301.3 L
160.441 301.3 L
160.441 300.646 L
160.897 300.646 L
160.897 299.992 L
161.172 299.992 L
161.172 299.338 L
161.867 299.338 L
161.867 298.684 L
163.043 298.684 L
163.043 298.03 L
163.196 298.03 L
163.196 297.376 L
163.411 297.376 L
163.411 296.722 L
164.409 296.722 L
164.409 296.068 L
165.186 296.068 L
165.186 295.414 L
165.556 295.414 L
165.556 294.76 L
166.707 294.76 L
166.707 294.106 L
166.982 294.106 L
166.982 293.452 L
171.031 293.452 L
171.031 292.798 L
172.022 292.798 L
172.022 292.144 L
172.833 292.144 L
172.833 291.49 L
172.869 291.49 L
172.869 290.836 L
173.457 290.836 L
173.457 290.182 L
175.735 290.182 L
175.735 289.527 L
177.254 289.527 L
177.254 288.873 L
177.595 288.873 L
177.595 288.219 L
178.061 288.219 L
178.061 287.565 L
179.045 287.565 L
179.045 286.911 L
179.849 286.911 L
179.849 286.257 L
180.398 286.257 L
180.398 285.603 L
180.575 285.603 L
180.575 284.949 L
181.382 284.949 L
181.382 284.295 L
181.584 284.295 L
181.584 283.641 L
182.53 283.641 L
182.53 282.987 L
184.438 282.987 L
184.438 282.333 L
184.456 282.333 L
184.456 281.679 L
184.839 281.679 L
184.839 281.025 L
185.051 281.025 L
185.051 280.371 L
186.372 280.371 L
186.372 279.717 L
186.781 279.717 L
186.781 279.063 L
187.339 279.063 L
187.339 278.409 L
188.107 278.409 L
188.107 277.755 L
190.216 277.755 L
190.216 277.101 L
190.511 277.101 L
190.511 276.447 L
191.122 276.447 L
191.122 275.793 L
191.215 275.793 L
191.215 275.139 L
191.275 275.139 L
191.275 274.485 L
191.947 274.485 L
191.947 273.831 L
192.28 273.831 L
192.28 273.177 L
192.385 273.177 L
192.385 272.523 L
193.856 272.523 L
193.856 271.869 L
194.825 271.869 L
194.825 271.215 L
195.131 271.215 L
195.131 270.561 L
195.215 270.561 L
195.215 269.907 L
195.957 269.907 L
195.957 269.253 L
196.235 269.253 L
196.235 268.599 L
196.666 268.599 L
196.666 267.945 L
200.142 267.945 L
200.142 267.291 L
200.739 267.291 L
200.739 266.637 L
201.399 266.637 L
201.399 265.983 L
201.755 265.983 L
201.755 265.329 L
202.338 265.329 L
202.338 264.675 L
202.513 264.675 L
202.513 264.021 L
202.723 264.021 L
202.723 263.367 L
203.686 263.367 L
203.686 262.713 L
204.388 262.713 L
204.388 262.059 L
204.398 262.059 L
204.398 261.405 L
204.493 261.405 L
204.493 260.751 L
205.207 260.751 L
205.207 260.097 L
205.617 260.097 L
205.617 259.443 L
208.909 259.443 L
208.909 258.789 L
209.422 258.789 L
209.422 258.135 L
210.357 258.135 L
210.357 257.481 L
210.684 257.481 L
210.684 256.827 L
211.837 256.827 L
211.837 256.172 L
212.021 256.172 L
212.021 255.518 L
212.65 255.518 L
212.65 254.864 L
214.318 254.864 L
214.318 254.21 L
214.67 254.21 L
214.67 253.556 L
214.733 253.556 L
214.733 252.902 L
215.066 252.902 L
215.066 252.248 L
216.956 252.248 L
216.956 251.594 L
218.487 251.594 L
218.487 250.94 L
218.571 250.94 L
218.571 250.286 L
220.556 250.286 L
220.556 249.632 L
221.252 249.632 L
221.252 248.978 L
221.541 248.978 L
221.541 248.324 L
221.644 248.324 L
221.644 247.67 L
222.234 247.67 L
222.234 247.016 L
223.491 247.016 L
223.491 246.362 L
225.551 246.362 L
225.551 245.708 L
226.403 245.708 L
226.403 245.054 L
227.001 245.054 L
227.001 244.4 L
227.165 244.4 L
227.165 243.746 L
227.979 243.746 L
227.979 243.092 L
228.59 243.092 L
228.59 242.438 L
228.735 242.438 L
228.735 241.784 L
228.767 241.784 L
228.767 241.13 L
229.146 241.13 L
229.146 240.476 L
230.029 240.476 L
230.029 239.822 L
233.261 239.822 L
233.261 239.168 L
233.87 239.168 L
233.87 238.514 L
234.16 238.514 L
234.16 237.86 L
234.601 237.86 L
234.601 237.206 L
234.823 237.206 L
234.823 236.552 L
234.906 236.552 L
234.906 235.898 L
234.917 235.898 L
234.917 235.244 L
236.171 235.244 L
236.171 234.59 L
236.487 234.59 L
236.487 233.936 L
236.992 233.936 L
236.992 233.282 L
237.341 233.282 L
237.341 232.628 L
238.049 232.628 L
238.049 231.974 L
238.921 231.974 L
238.921 231.32 L
239.139 231.32 L
239.139 230.666 L
239.653 230.666 L
239.653 230.012 L
240.078 230.012 L
240.078 229.358 L
240.763 229.358 L
240.763 228.704 L
241.221 228.704 L
241.221 228.05 L
243.735 228.05 L
243.735 227.396 L
243.812 227.396 L
243.812 226.742 L
244.139 226.742 L
244.139 226.088 L
244.794 226.088 L
244.794 225.434 L
245.488 225.434 L
245.488 224.78 L
246.439 224.78 L
246.439 224.126 L
246.893 224.126 L
246.893 223.472 L
247.095 223.472 L
247.095 222.817 L
247.71 222.817 L
247.71 222.163 L
248.318 222.163 L
248.318 221.509 L
249.314 221.509 L
249.314 220.855 L
249.465 220.855 L
249.465 220.201 L
250.481 220.201 L
250.481 219.547 L
250.997 219.547 L
250.997 218.893 L
253.787 218.893 L
253.787 218.239 L
254.859 218.239 L
254.859 217.585 L
254.984 217.585 L
254.984 216.931 L
255.501 216.931 L
255.501 216.277 L
255.584 216.277 L
255.584 215.623 L
256.261 215.623 L
256.261 214.969 L
256.401 214.969 L
256.401 214.315 L
257.278 214.315 L
257.278 213.661 L
258.244 213.661 L
258.244 213.007 L
258.325 213.007 L
258.325 212.353 L
258.503 212.353 L
258.503 211.699 L
259.666 211.699 L
259.666 211.045 L
260.513 211.045 L
260.513 210.391 L
260.658 210.391 L
260.658 209.737 L
261.695 209.737 L
261.695 209.083 L
262.296 209.083 L
262.296 208.429 L
265.041 208.429 L
265.041 207.775 L
265.636 207.775 L
265.636 207.121 L
265.736 207.121 L
265.736 206.467 L
266.357 206.467 L
266.357 205.813 L
267.835 205.813 L
267.835 205.159 L
268.632 205.159 L
268.632 204.505 L
269.013 204.505 L
269.013 203.851 L
269.778 203.851 L
269.778 203.197 L
269.934 203.197 L
269.934 202.543 L
270.456 202.543 L
270.456 201.889 L
270.53 201.889 L
270.53 201.235 L
271.241 201.235 L
271.241 200.581 L
272.125 200.581 L
272.125 199.927 L
272.305 199.927 L
272.305 199.273 L
272.79 199.273 L
272.79 198.619 L
272.993 198.619 L
272.993 197.965 L
273.095 197.965 L
273.095 197.311 L
274.728 197.311 L
274.728 196.657 L
276.552 196.657 L
276.552 196.003 L
279.364 196.003 L
279.364 195.349 L
279.518 195.349 L
279.518 194.695 L
280.563 194.695 L
280.563 194.041 L
281.416 194.041 L
281.416 193.387 L
281.743 193.387 L
281.743 192.733 L
283.967 192.733 L
283.967 192.079 L
284.6 192.079 L
284.6 191.425 L
285.169 191.425 L
285.169 190.771 L
287.666 190.771 L
287.666 190.117 L
287.901 190.117 L
287.901 189.462 L
288.115 189.462 L
288.115 188.808 L
289.375 188.808 L
289.375 188.154 L
290.319 188.154 L
290.319 187.5 L
290.916 187.5 L
290.916 186.846 L
291.175 186.846 L
291.175 186.192 L
291.987 186.192 L
291.987 185.538 L
292.135 185.538 L
292.135 184.884 L
292.66 184.884 L
292.66 184.23 L
293.135 184.23 L
293.135 183.576 L
293.204 183.576 L
293.204 182.922 L
293.321 182.922 L
293.321 182.268 L
293.339 182.268 L
293.339 181.614 L
293.375 181.614 L
293.375 180.96 L
296.508 180.96 L
296.508 180.306 L
296.655 180.306 L
296.655 179.652 L
298.823 179.652 L
298.823 178.998 L
298.827 178.998 L
298.827 178.344 L
299.422 178.344 L
299.422 177.69 L
300.658 177.69 L
300.658 177.036 L
304.49 177.036 L
304.49 176.382 L
304.826 176.382 L
304.826 175.728 L
305.085 175.728 L
305.085 175.074 L
305.395 175.074 L
305.395 174.42 L
305.759 174.42 L
305.759 173.766 L
305.955 173.766 L
305.955 173.112 L
306.056 173.112 L
306.056 172.458 L
307.071 172.458 L
307.071 171.804 L
307.67 171.804 L
307.67 171.15 L
308.363 171.15 L
308.363 170.496 L
308.613 170.496 L
308.613 169.842 L
308.732 169.842 L
308.732 169.188 L
308.958 169.188 L
308.958 168.534 L
309.792 168.534 L
309.792 167.88 L
311.063 167.88 L
311.063 167.226 L
311.146 167.226 L
311.146 166.572 L
314.036 166.572 L
314.036 165.918 L
315.555 165.918 L
315.555 165.264 L
316.322 165.264 L
316.322 164.61 L
318.629 164.61 L
318.629 163.956 L
319.042 163.956 L
319.042 163.302 L
319.204 163.302 L
319.204 162.648 L
320.599 162.648 L
320.599 161.994 L
322.884 161.994 L
322.884 161.34 L
323.191 161.34 L
323.191 160.686 L
324.427 160.686 L
324.427 160.032 L
324.994 160.032 L
324.994 159.378 L
325.713 159.378 L
325.713 158.724 L
325.929 158.724 L
325.929 158.07 L
326.148 158.07 L
326.148 157.416 L
327.417 157.416 L
327.417 156.762 L
327.864 156.762 L
327.864 156.107 L
328.171 156.107 L
328.171 155.453 L
328.237 155.453 L
328.237 154.799 L
328.346 154.799 L
328.346 154.145 L
330.303 154.145 L
330.303 153.491 L
331.407 153.491 L
331.407 152.837 L
333.244 152.837 L
333.244 152.183 L
333.892 152.183 L
333.892 151.529 L
335.508 151.529 L
335.508 150.875 L
336.331 150.875 L
336.331 150.221 L
336.99 150.221 L
336.99 149.567 L
338.081 149.567 L
338.081 148.913 L
338.344 148.913 L
338.344 148.259 L
339.234 148.259 L
339.234 147.605 L
340.702 147.605 L
340.702 146.951 L
341.425 146.951 L
341.425 146.297 L
344.445 146.297 L
344.445 145.643 L
345.273 145.643 L
345.273 144.989 L
347.054 144.989 L
347.054 144.335 L
348.847 144.335 L
348.847 143.681 L
348.939 143.681 L
348.939 143.027 L
349.086 143.027 L
349.086 142.373 L
349.109 142.373 L
349.109 141.719 L
349.687 141.719 L
349.687 141.065 L
349.706 141.065 L
349.706 140.411 L
350.455 140.411 L
350.455 139.757 L
350.557 139.757 L
350.557 139.103 L
350.853 139.103 L
350.853 138.449 L
351.072 138.449 L
351.072 137.795 L
351.816 137.795 L
351.816 137.141 L
353.336 137.141 L
353.336 136.487 L
355.315 136.487 L
355.315 135.833 L
355.61 135.833 L
355.61 135.179 L
358.187 135.179 L
358.187 134.525 L
361.621 134.525 L
361.621 133.871 L
362.466 133.871 L
362.466 133.217 L
362.516 133.217 L
362.516 132.563 L
366.851 132.563 L
366.851 131.909 L
367.504 131.909 L
367.504 131.255 L
368.371 131.255 L
368.371 130.601 L
368.531 130.601 L
368.531 129.947 L
370.219 129.947 L
370.219 129.293 L
372.104 129.293 L
372.104 128.639 L
372.789 128.639 L
372.789 127.985 L
374.223 127.985 L
374.223 127.331 L
374.825 127.331 L
374.825 126.677 L
375.38 126.677 L
375.38 126.023 L
376.482 126.023 L
376.482 125.369 L
380.091 125.369 L
380.091 124.715 L
380.317 124.715 L
380.317 124.061 L
381.483 124.061 L
381.483 123.406 L
382.232 123.406 L
382.232 122.752 L
382.922 122.752 L
382.922 122.098 L
386.07 122.098 L
386.07 121.444 L
386.424 121.444 L
386.424 120.79 L
388.513 120.79 L
388.513 120.136 L
389.223 120.136 L
389.223 119.482 L
393.978 119.482 L
393.978 118.828 L
394.101 118.828 L
394.101 118.174 L
398.251 118.174 L
398.251 117.52 L
405.859 117.52 L
405.859 116.866 L
406.6 116.866 L
406.6 116.212 L
407.086 116.212 L
407.086 115.558 L
411.347 115.558 L
411.347 114.904 L
411.654 114.904 L
411.654 114.25 L
412.658 114.25 L
412.658 113.596 L
412.782 113.596 L
412.782 112.942 L
412.948 112.942 L
412.948 112.288 L
414.237 112.288 L
414.237 111.634 L
415.278 111.634 L
415.278 110.98 L
416.655 110.98 L
416.655 110.326 L
417.784 110.326 L
417.784 109.672 L
418.915 109.672 L
418.915 109.018 L
427.98 109.018 L
427.98 108.364 L
428.293 108.364 L
428.293 107.71 L
429.187 107.71 L
429.187 107.056 L
431.043 107.056 L
431.043 106.402 L
431.907 106.402 L
431.907 105.748 L
432.111 105.748 L
432.111 105.094 L
433.58 105.094 L
433.58 104.44 L
434.454 104.44 L
434.454 103.786 L
436.032 103.786 L
436.032 103.132 L
437.761 103.132 L
437.761 102.478 L
439.542 102.478 L
439.542 101.824 L
439.546 101.824 L
439.546 101.17 L
440.095 101.17 L
440.095 100.516 L
442.759 100.516 L
442.759 99.862 L
443.039 99.862 L
443.039 99.208 L
443.671 99.208 L
443.671 98.554 L
445.767 98.554 L
445.767 97.9 L
446.873 97.9 L
446.873 97.246 L
449.948 97.246 L
449.948 96.592 L
449.967 96.592 L
449.967 95.938 L
450.348 95.938 L
450.348 95.284 L
450.666 95.284 L
450.666 94.63 L
451.571 94.63 L
451.571 93.976 L
451.69 93.976 L
451.69 93.322 L
454.778 93.322 L
454.778 92.668 L
455.081 92.668 L
455.081 92.014 L
458.364 92.014 L
458.364 91.36 L
458.916 91.36 L
458.916 90.706 L
467.715 90.706 L
467.715 90.051 L
469.415 90.051 L
469.415 89.397 L
470.662 89.397 L
470.662 88.743 L
471.514 88.743 L
471.514 88.089 L
471.634 88.089 L
471.634 87.435 L
477.735 87.435 L
477.735 86.781 L
479.474 86.781 L
479.474 86.127 L
481.559 86.127 L
481.559 85.473 L
488.052 85.473 L
488.052 84.819 L
488.463 84.819 L
488.463 84.165 L
489.308 84.165 L
489.308 83.511 L
491.887 83.511 L
491.887 82.857 L
493.112 82.857 L
493.112 82.203 L
494.621 82.203 L
494.621 81.549 L
498.738 81.549 L
498.738 80.895 L
499.66 80.895 L
499.66 80.241 L
506.428 80.241 L
506.428 79.587 L
506.959 79.587 L
506.959 78.933 L
511.516 78.933 L
511.516 78.279 L
513.149 78.279 L
513.149 77.625 L
514.385 77.625 L
514.385 76.971 L
515.361 76.971 L
515.361 76.317 L
517.019 76.317 L
517.019 75.663 L
517.073 75.663 L
517.073 75.009 L
518.463 75.009 L
518.463 74.355 L
519.388 74.355 L
519.388 73.701 L
525.913 73.701 L
525.913 73.047 L
526.868 73.047 L
526.868 72.393 L
527.28 72.393 L
527.28 71.739 L
527.348 71.739 L
527.348 71.085 L
528.298 71.085 L
528.298 70.431 L
528.791 70.431 L
528.791 69.777 L
532.072 69.777 L
532.072 69.123 L
535.808 69.123 L
535.808 68.469 L
537.124 68.469 L
537.124 67.815 L
541.246 67.815 L
541.246 67.161 L
542.19 67.161 L
542.19 66.507 L
544.253 66.507 L
544.253 65.853 L
545.091 65.853 L
545.091 65.199 L
546.017 65.199 L
546.017 64.545 L
548.641 64.545 L
548.641 63.891 L
551.547 63.891 L
551.547 63.237 L
552.084 63.237 L
552.084 62.583 L
553.907 62.583 L
553.907 61.929 L
553.924 61.929 L
553.924 61.275 L
558.415 61.275 L
558.415 60.621 L
560.052 60.621 L
560.052 59.967 L
566.844 59.967 L
566.844 59.313 L
568.253 59.313 L
568.253 58.659 L
572.656 58.659 L
572.656 58.005 L
577.408 58.005 L
577.408 57.35 L
577.716 57.35 L
577.716 56.696 L
579.843 56.696 L
579.843 56.042 L
590.026 56.042 L
590.026 55.388 L
592.142 55.388 L
592.142 54.734 L
594.492 54.734 L
594.492 54.08 L
597.409 54.08 L
597.409 53.426 L
602.777 53.426 L
602.777 52.772 L
611.711 52.772 L
611.711 52.118 L
618.679 52.118 L
618.679 51.464 L
620.247 51.464 L
620.247 50.81 L
621.115 50.81 L
621.115 50.156 L
623.753 50.156 L
623.753 49.502 L
627.896 49.502 L
627.896 48.848 L
637.663 48.848 L
637.663 48.194 L
638.649 48.194 L
638.649 47.54 L
677.424 47.54 L
677.424 46.886 L
694.455 46.886 L
694.455 46.232 L
718.393 46.232 L
718.393 45.578 L
725.616 45.578 L
725.616 44.924 L
753.436 44.924 L
753.436 44.27 L
759.044 44.27 L
759.044 43.616 L
803.649 43.616 L
803.649 42.962 L
811.254 42.962 L
811.254 42.308 L
829.007 42.308 L
829.007 41.654 L
842.046 41.654 L
842.046 41 L
S
GR
GS
[0.75 0 0 0.75 0 -0.25] CT
1 0 0 RC
1 LJ
2.667 LW
N
259.964 305.031 M
259.964 304.57 L
266.479 304.57 L
266.479 303.916 L
270.247 303.916 L
270.247 303.262 L
272.121 303.262 L
272.121 302.608 L
272.412 302.608 L
272.412 301.954 L
272.453 301.954 L
272.453 301.3 L
272.618 301.3 L
272.618 300.646 L
273.004 300.646 L
273.004 299.992 L
276.019 299.992 L
276.019 299.338 L
276.995 299.338 L
276.995 298.684 L
280.633 298.684 L
280.633 298.03 L
281.007 298.03 L
281.007 297.376 L
281.556 297.376 L
281.556 296.722 L
287.079 296.722 L
287.079 296.068 L
291.184 296.068 L
291.184 295.414 L
291.199 295.414 L
291.199 294.76 L
295.094 294.76 L
295.094 294.106 L
295.799 294.106 L
295.799 293.452 L
297.154 293.452 L
297.154 292.798 L
297.721 292.798 L
297.721 292.144 L
298.308 292.144 L
298.308 291.49 L
299.096 291.49 L
299.096 290.836 L
300.906 290.836 L
300.906 290.182 L
302.7 290.182 L
302.7 289.527 L
303.162 289.527 L
303.162 288.873 L
303.461 288.873 L
303.461 288.219 L
303.463 288.219 L
303.463 287.565 L
303.668 287.565 L
303.668 286.911 L
304.108 286.911 L
304.108 286.257 L
304.124 286.257 L
304.124 285.603 L
305.379 285.603 L
305.379 284.949 L
305.901 284.949 L
305.901 284.295 L
306.815 284.295 L
306.815 283.641 L
307.084 283.641 L
307.084 282.987 L
307.168 282.987 L
307.168 282.333 L
307.206 282.333 L
307.206 281.679 L
307.775 281.679 L
307.775 281.025 L
310.392 281.025 L
310.392 280.371 L
310.713 280.371 L
310.713 279.717 L
310.833 279.717 L
310.833 279.063 L
310.948 279.063 L
310.948 278.409 L
312.933 278.409 L
312.933 277.755 L
313.332 277.755 L
313.332 277.101 L
313.971 277.101 L
313.971 276.447 L
314.451 276.447 L
314.451 275.793 L
314.996 275.793 L
314.996 275.139 L
315.794 275.139 L
315.794 274.485 L
316.396 274.485 L
316.396 273.831 L
316.527 273.831 L
316.527 273.177 L
316.958 273.177 L
316.958 272.523 L
317.926 272.523 L
317.926 271.869 L
318.874 271.869 L
318.874 271.215 L
319.599 271.215 L
319.599 270.561 L
319.878 270.561 L
319.878 269.907 L
320.27 269.907 L
320.27 269.253 L
320.473 269.253 L
320.473 268.599 L
320.559 268.599 L
320.559 267.945 L
321.334 267.945 L
321.334 267.291 L
321.794 267.291 L
321.794 266.637 L
321.918 266.637 L
321.918 265.983 L
322.508 265.983 L
322.508 265.329 L
322.805 265.329 L
322.805 264.675 L
322.893 264.675 L
322.893 264.021 L
323.186 264.021 L
323.186 263.367 L
323.395 263.367 L
323.395 262.713 L
323.575 262.713 L
323.575 262.059 L
324.109 262.059 L
324.109 261.405 L
324.396 261.405 L
324.396 260.751 L
327.374 260.751 L
327.374 260.097 L
328.067 260.097 L
328.067 259.443 L
328.18 259.443 L
328.18 258.789 L
328.954 258.789 L
328.954 258.135 L
329.687 258.135 L
329.687 257.481 L
329.966 257.481 L
329.966 256.827 L
330.675 256.827 L
330.675 256.172 L
330.821 256.172 L
330.821 255.518 L
331.647 255.518 L
331.647 254.864 L
331.793 254.864 L
331.793 254.21 L
332.067 254.21 L
332.067 253.556 L
332.422 253.556 L
332.422 252.902 L
332.628 252.902 L
332.628 252.248 L
333.99 252.248 L
333.99 251.594 L
334.49 251.594 L
334.49 250.94 L
334.595 250.94 L
334.595 250.286 L
335.092 250.286 L
335.092 249.632 L
335.168 249.632 L
335.168 248.978 L
335.785 248.978 L
335.785 248.324 L
336.165 248.324 L
336.165 247.67 L
336.394 247.67 L
336.394 247.016 L
336.395 247.016 L
336.395 246.362 L
336.63 246.362 L
336.63 245.708 L
336.774 245.708 L
336.774 245.054 L
337.404 245.054 L
337.404 244.4 L
337.442 244.4 L
337.442 243.746 L
337.561 243.746 L
337.561 243.092 L
337.603 243.092 L
337.603 242.438 L
338.221 242.438 L
338.221 241.784 L
338.243 241.784 L
338.243 241.13 L
338.591 241.13 L
338.591 240.476 L
338.738 240.476 L
338.738 239.822 L
338.753 239.822 L
338.753 239.168 L
339.02 239.168 L
339.02 238.514 L
339.146 238.514 L
339.146 237.86 L
339.345 237.86 L
339.345 237.206 L
339.566 237.206 L
339.566 236.552 L
339.699 236.552 L
339.699 235.898 L
339.953 235.898 L
339.953 235.244 L
340.595 235.244 L
340.595 234.59 L
340.737 234.59 L
340.737 233.936 L
341.053 233.936 L
341.053 233.282 L
341.717 233.282 L
341.717 232.628 L
341.962 232.628 L
341.962 231.974 L
342.374 231.974 L
342.374 231.32 L
342.467 231.32 L
342.467 230.666 L
342.747 230.666 L
342.747 230.012 L
343.041 230.012 L
343.041 229.358 L
343.051 229.358 L
343.051 228.704 L
343.528 228.704 L
343.528 228.05 L
343.536 228.05 L
343.536 227.396 L
343.943 227.396 L
343.943 226.742 L
344.243 226.742 L
344.243 226.088 L
344.245 226.088 L
344.245 225.434 L
344.704 225.434 L
344.704 224.78 L
345.057 224.78 L
345.057 224.126 L
345.331 224.126 L
345.331 223.472 L
345.76 223.472 L
345.76 222.817 L
346.206 222.817 L
346.206 222.163 L
346.236 222.163 L
346.236 221.509 L
346.636 221.509 L
346.636 220.855 L
346.701 220.855 L
346.701 220.201 L
347.312 220.201 L
347.312 219.547 L
347.707 219.547 L
347.707 218.893 L
347.98 218.893 L
347.98 218.239 L
348.159 218.239 L
348.159 217.585 L
348.258 217.585 L
348.258 216.931 L
348.466 216.931 L
348.466 216.277 L
348.542 216.277 L
348.542 215.623 L
348.771 215.623 L
348.771 214.969 L
348.863 214.969 L
348.863 214.315 L
349.131 214.315 L
349.131 213.661 L
349.494 213.661 L
349.494 213.007 L
349.844 213.007 L
349.844 212.353 L
350.618 212.353 L
350.618 211.699 L
350.655 211.699 L
350.655 211.045 L
350.922 211.045 L
350.922 210.391 L
351.171 210.391 L
351.171 209.737 L
351.394 209.737 L
351.394 209.083 L
351.669 209.083 L
351.669 208.429 L
351.822 208.429 L
351.822 207.775 L
351.925 207.775 L
351.925 207.121 L
352.262 207.121 L
352.262 206.467 L
352.265 206.467 L
352.265 205.813 L
352.3 205.813 L
352.3 205.159 L
352.38 205.159 L
352.38 204.505 L
352.554 204.505 L
352.554 203.851 L
352.63 203.851 L
352.63 203.197 L
353.057 203.197 L
353.057 202.543 L
353.118 202.543 L
353.118 201.889 L
353.371 201.889 L
353.371 201.235 L
353.494 201.235 L
353.494 200.581 L
353.496 200.581 L
353.496 199.927 L
354.137 199.927 L
354.137 199.273 L
354.147 199.273 L
354.147 198.619 L
354.334 198.619 L
354.334 197.965 L
354.608 197.965 L
354.608 197.311 L
354.67 197.311 L
354.67 196.657 L
354.686 196.657 L
354.686 196.003 L
355.152 196.003 L
355.152 195.349 L
355.157 195.349 L
355.157 194.695 L
356.529 194.695 L
356.529 194.041 L
356.835 194.041 L
356.835 193.387 L
357.931 193.387 L
357.931 192.733 L
358.33 192.733 L
358.33 192.079 L
358.352 192.079 L
358.352 191.425 L
358.414 191.425 L
358.414 190.771 L
358.911 190.771 L
358.911 190.117 L
358.918 190.117 L
358.918 189.462 L
359.343 189.462 L
359.343 188.808 L
359.475 188.808 L
359.475 188.154 L
359.861 188.154 L
359.861 187.5 L
359.97 187.5 L
359.97 186.846 L
360.584 186.846 L
360.584 186.192 L
360.712 186.192 L
360.712 185.538 L
361.064 185.538 L
361.064 184.884 L
361.164 184.884 L
361.164 184.23 L
361.212 184.23 L
361.212 183.576 L
361.713 183.576 L
361.713 182.922 L
361.811 182.922 L
361.811 182.268 L
361.992 182.268 L
361.992 181.614 L
362.393 181.614 L
362.393 180.96 L
362.448 180.96 L
362.448 180.306 L
362.468 180.306 L
362.468 179.652 L
362.553 179.652 L
362.553 178.998 L
363.081 178.998 L
363.081 178.344 L
363.573 178.344 L
363.573 177.69 L
363.958 177.69 L
363.958 177.036 L
363.962 177.036 L
363.962 176.382 L
364.014 176.382 L
364.014 175.728 L
364.096 175.728 L
364.096 175.074 L
364.229 175.074 L
364.229 174.42 L
364.442 174.42 L
364.442 173.766 L
364.688 173.766 L
364.688 173.112 L
364.994 173.112 L
364.994 172.458 L
365.163 172.458 L
365.163 171.804 L
365.293 171.804 L
365.293 171.15 L
365.358 171.15 L
365.358 170.496 L
366.115 170.496 L
366.115 169.842 L
366.31 169.842 L
366.31 169.188 L
366.437 169.188 L
366.437 168.534 L
366.724 168.534 L
366.724 167.88 L
366.777 167.88 L
366.777 167.226 L
366.98 167.226 L
366.98 166.572 L
367.202 166.572 L
367.202 165.918 L
367.35 165.918 L
367.35 165.264 L
367.674 165.264 L
367.674 164.61 L
367.944 164.61 L
367.944 163.956 L
368.411 163.956 L
368.411 163.302 L
368.607 163.302 L
368.607 162.648 L
368.748 162.648 L
368.748 161.994 L
368.82 161.994 L
368.82 161.34 L
369.009 161.34 L
369.009 160.686 L
369.059 160.686 L
369.059 160.032 L
369.13 160.032 L
369.13 159.378 L
369.709 159.378 L
369.709 158.724 L
369.863 158.724 L
369.863 158.07 L
370.094 158.07 L
370.094 157.416 L
370.901 157.416 L
370.901 156.762 L
370.911 156.762 L
370.911 156.107 L
371.852 156.107 L
371.852 155.453 L
371.891 155.453 L
371.891 154.799 L
372.011 154.799 L
372.011 154.145 L
373.335 154.145 L
373.335 153.491 L
373.54 153.491 L
373.54 152.837 L
373.595 152.837 L
373.595 152.183 L
373.918 152.183 L
373.918 151.529 L
374.465 151.529 L
374.465 150.875 L
375.337 150.875 L
375.337 150.221 L
376.591 150.221 L
376.591 149.567 L
376.903 149.567 L
376.903 148.913 L
377.085 148.913 L
377.085 148.259 L
377.502 148.259 L
377.502 147.605 L
377.633 147.605 L
377.633 146.951 L
378.16 146.951 L
378.16 146.297 L
378.546 146.297 L
378.546 145.643 L
378.738 145.643 L
378.738 144.989 L
379.123 144.989 L
379.123 144.335 L
379.369 144.335 L
379.369 143.681 L
379.39 143.681 L
379.39 143.027 L
379.726 143.027 L
379.726 142.373 L
379.766 142.373 L
379.766 141.719 L
379.97 141.719 L
379.97 141.065 L
380.04 141.065 L
380.04 140.411 L
381.148 140.411 L
381.148 139.757 L
381.355 139.757 L
381.355 139.103 L
381.522 139.103 L
381.522 138.449 L
381.672 138.449 L
381.672 137.795 L
381.766 137.795 L
381.766 137.141 L
382.043 137.141 L
382.043 136.487 L
382.542 136.487 L
382.542 135.833 L
382.551 135.833 L
382.551 135.179 L
382.561 135.179 L
382.561 134.525 L
383.177 134.525 L
383.177 133.871 L
383.534 133.871 L
383.534 133.217 L
383.651 133.217 L
383.651 132.563 L
384.454 132.563 L
384.454 131.909 L
384.455 131.909 L
384.455 131.255 L
384.475 131.255 L
384.475 130.601 L
384.527 130.601 L
384.527 129.947 L
384.623 129.947 L
384.623 129.293 L
384.785 129.293 L
384.785 128.639 L
384.839 128.639 L
384.839 127.985 L
385.332 127.985 L
385.332 127.331 L
385.458 127.331 L
385.458 126.677 L
385.782 126.677 L
385.782 126.023 L
385.909 126.023 L
385.909 125.369 L
386.197 125.369 L
386.197 124.715 L
386.555 124.715 L
386.555 124.061 L
386.648 124.061 L
386.648 123.406 L
386.663 123.406 L
386.663 122.752 L
386.679 122.752 L
386.679 122.098 L
386.693 122.098 L
386.693 121.444 L
386.738 121.444 L
386.738 120.79 L
386.851 120.79 L
386.851 120.136 L
386.961 120.136 L
386.961 119.482 L
387.265 119.482 L
387.265 118.828 L
387.695 118.828 L
387.695 118.174 L
387.766 118.174 L
387.766 117.52 L
387.774 117.52 L
387.774 116.866 L
387.868 116.866 L
387.868 116.212 L
388.079 116.212 L
388.079 115.558 L
388.207 115.558 L
388.207 114.904 L
388.286 114.904 L
388.286 114.25 L
388.367 114.25 L
388.367 113.596 L
388.515 113.596 L
388.515 112.942 L
389.288 112.942 L
389.288 112.288 L
389.409 112.288 L
389.409 111.634 L
389.711 111.634 L
389.711 110.98 L
390.036 110.98 L
390.036 110.326 L
390.137 110.326 L
390.137 109.672 L
391.685 109.672 L
391.685 109.018 L
392.084 109.018 L
392.084 108.364 L
392.352 108.364 L
392.352 107.71 L
392.364 107.71 L
392.364 107.056 L
392.917 107.056 L
392.917 106.402 L
392.955 106.402 L
392.955 105.748 L
393.019 105.748 L
393.019 105.094 L
393.268 105.094 L
393.268 104.44 L
393.38 104.44 L
393.38 103.786 L
394.355 103.786 L
394.355 103.132 L
395.333 103.132 L
395.333 102.478 L
395.662 102.478 L
395.662 101.824 L
395.984 101.824 L
395.984 101.17 L
396.334 101.17 L
396.334 100.516 L
397.013 100.516 L
397.013 99.862 L
397.363 99.862 L
397.363 99.208 L
397.382 99.208 L
397.382 98.554 L
397.413 98.554 L
397.413 97.9 L
397.773 97.9 L
397.773 97.246 L
398.086 97.246 L
398.086 96.592 L
398.137 96.592 L
398.137 95.938 L
398.429 95.938 L
398.429 95.284 L
399.105 95.284 L
399.105 94.63 L
399.439 94.63 L
399.439 93.976 L
400.041 93.976 L
400.041 93.322 L
400.123 93.322 L
400.123 92.668 L
401.024 92.668 L
401.024 92.014 L
401.052 92.014 L
401.052 91.36 L
401.764 91.36 L
401.764 90.706 L
401.85 90.706 L
401.85 90.051 L
402.098 90.051 L
402.098 89.397 L
402.694 89.397 L
402.694 88.743 L
402.798 88.743 L
402.798 88.089 L
403.245 88.089 L
403.245 87.435 L
405.43 87.435 L
405.43 86.781 L
405.825 86.781 L
405.825 86.127 L
406.097 86.127 L
406.097 85.473 L
406.673 85.473 L
406.673 84.819 L
406.727 84.819 L
406.727 84.165 L
406.878 84.165 L
406.878 83.511 L
407.302 83.511 L
407.302 82.857 L
407.557 82.857 L
407.557 82.203 L
408.602 82.203 L
408.602 81.549 L
408.713 81.549 L
408.713 80.895 L
408.777 80.895 L
408.777 80.241 L
409.074 80.241 L
409.074 79.587 L
409.142 79.587 L
409.142 78.933 L
409.582 78.933 L
409.582 78.279 L
410.434 78.279 L
410.434 77.625 L
410.811 77.625 L
410.811 76.971 L
411.006 76.971 L
411.006 76.317 L
411.566 76.317 L
411.566 75.663 L
411.942 75.663 L
411.942 75.009 L
412.127 75.009 L
412.127 74.355 L
412.338 74.355 L
412.338 73.701 L
413.197 73.701 L
413.197 73.047 L
414.405 73.047 L
414.405 72.393 L
414.801 72.393 L
414.801 71.739 L
415.408 71.739 L
415.408 71.085 L
416.896 71.085 L
416.896 70.431 L
417.44 70.431 L
417.44 69.777 L
418.314 69.777 L
418.314 69.123 L
419.201 69.123 L
419.201 68.469 L
419.457 68.469 L
419.457 67.815 L
419.651 67.815 L
419.651 67.161 L
419.782 67.161 L
419.782 66.507 L
420.947 66.507 L
420.947 65.853 L
421.382 65.853 L
421.382 65.199 L
421.426 65.199 L
421.426 64.545 L
422.141 64.545 L
422.141 63.891 L
422.988 63.891 L
422.988 63.237 L
423.703 63.237 L
423.703 62.583 L
423.845 62.583 L
423.845 61.929 L
425.367 61.929 L
425.367 61.275 L
425.603 61.275 L
425.603 60.621 L
428.761 60.621 L
428.761 59.967 L
430.748 59.967 L
430.748 59.313 L
431.358 59.313 L
431.358 58.659 L
433.482 58.659 L
433.482 58.005 L
434.682 58.005 L
434.682 57.35 L
437.07 57.35 L
437.07 56.696 L
437.661 56.696 L
437.661 56.042 L
438.055 56.042 L
438.055 55.388 L
438.563 55.388 L
438.563 54.734 L
440.69 54.734 L
440.69 54.08 L
442.07 54.08 L
442.07 53.426 L
445.234 53.426 L
445.234 52.772 L
449.989 52.772 L
449.989 52.118 L
450.94 52.118 L
450.94 51.464 L
452.319 51.464 L
452.319 50.81 L
452.593 50.81 L
452.593 50.156 L
453.54 50.156 L
453.54 49.502 L
453.659 49.502 L
453.659 48.848 L
455.47 48.848 L
455.47 48.194 L
458.889 48.194 L
458.889 47.54 L
462.692 47.54 L
462.692 46.886 L
465.756 46.886 L
465.756 46.232 L
467.061 46.232 L
467.061 45.578 L
467.331 45.578 L
467.331 44.924 L
468.007 44.924 L
468.007 44.27 L
491.221 44.27 L
491.221 43.616 L
491.902 43.616 L
491.902 42.962 L
491.923 42.962 L
491.923 42.308 L
505.256 42.308 L
505.256 41.654 L
509.068 41.654 L
509.068 41 L
S
GR
GS
[0.75 0 0 0.75 0 -0.25] CT
1 GC
N
837 294 M
837 239 L
615 239 L
615 294 L
cp
f
GR
GS
[0.75 0 0 0.75 496.50581 189.9605] CT
N
/f642440591{4.828 2.87 M
5.594 3.792 6.68 4.315 QT
7.766 4.839 8.969 4.839 QT
10.125 4.839 11.078 4.245 QT
12.031 3.651 12.031 2.557 QT
12.031 0.792 L
12.031 0.12 9.406 0.12 QT
9.406 -0.614 L
15.438 -0.614 L
15.438 0.12 L
14.766 0.12 14.375 0.237 QT
13.984 0.354 13.984 0.792 QT
13.984 4.932 L
13.984 5.011 13.93 5.065 QT
13.875 5.12 13.797 5.12 QT
13.609 5.12 13.148 4.659 QT
12.688 4.198 12.422 3.839 QT
11.922 4.714 10.82 5.151 QT
9.719 5.589 8.516 5.589 QT
6.484 5.589 4.805 4.534 QT
3.125 3.479 2.148 1.721 QT
1.172 -0.036 1.172 -2.052 QT
1.172 -3.552 1.742 -4.95 QT
2.313 -6.349 3.32 -7.419 QT
4.328 -8.489 5.672 -9.091 QT
7.016 -9.693 8.516 -9.693 QT
9.609 -9.693 10.578 -9.224 QT
11.547 -8.755 12.313 -7.896 QT
13.531 -9.63 L
13.641 -9.693 13.672 -9.693 QT
13.828 -9.693 L
13.891 -9.693 13.938 -9.638 QT
13.984 -9.583 13.984 -9.505 QT
13.984 -3.849 L
13.984 -3.661 13.828 -3.661 QT
13.438 -3.661 L
13.25 -3.661 13.25 -3.849 QT
13.25 -4.443 13.008 -5.193 QT
12.766 -5.943 12.391 -6.614 QT
12.016 -7.286 11.531 -7.802 QT
10.344 -8.943 8.813 -8.943 QT
7.656 -8.943 6.586 -8.419 QT
5.516 -7.896 4.781 -6.974 QT
4.016 -5.989 3.719 -4.739 QT
3.422 -3.489 3.422 -2.052 QT
3.422 1.167 4.828 2.87 QT
cp}def
f642440591
f
GR
GS
[0.75 0 0 0.75 496.50581 189.9605] CT
N
/f1445509541{17.381 5.12 M
17.381 4.386 L
19.553 4.386 19.553 3.136 QT
19.553 -8.364 L
18.866 -8.489 17.381 -8.489 QT
17.381 -9.224 L
21.413 -9.224 L
21.506 -9.224 21.553 -9.146 QT
28.991 1.792 L
28.991 -7.239 L
28.991 -8.489 26.819 -8.489 QT
26.819 -9.224 L
31.819 -9.224 L
31.819 -8.489 L
29.663 -8.489 29.663 -7.239 QT
29.663 4.932 L
29.663 4.995 29.577 5.057 QT
29.491 5.12 29.444 5.12 QT
29.194 5.12 L
29.085 5.12 29.053 5.042 QT
20.225 -7.943 L
20.225 3.136 L
20.225 4.386 22.397 4.386 QT
22.397 5.12 L
17.381 5.12 L
cp}def
f1445509541
f
GR
GS
[0.75 0 0 0.75 496.50581 189.9605] CT
N
/f-355075417{33.913 5.417 M
33.913 0.511 L
33.913 0.354 34.1 0.354 QT
34.366 0.354 L
34.428 0.354 34.475 0.401 QT
34.522 0.448 34.522 0.511 QT
34.522 2.573 35.803 3.706 QT
37.085 4.839 39.147 4.839 QT
39.881 4.839 40.499 4.417 QT
41.116 3.995 41.452 3.315 QT
41.788 2.636 41.788 1.917 QT
41.788 1.276 41.538 0.675 QT
41.288 0.073 40.803 -0.364 QT
40.319 -0.802 39.71 -0.958 QT
36.991 -1.614 L
35.631 -1.974 34.772 -3.091 QT
33.913 -4.208 33.913 -5.583 QT
33.913 -6.677 34.467 -7.63 QT
35.022 -8.583 35.96 -9.138 QT
36.897 -9.693 37.991 -9.693 QT
40.1 -9.693 41.335 -8.255 QT
42.194 -9.63 L
42.256 -9.693 42.335 -9.693 QT
42.475 -9.693 L
42.538 -9.693 42.6 -9.646 QT
42.663 -9.599 42.663 -9.505 QT
42.663 -4.646 L
42.663 -4.458 42.475 -4.458 QT
42.241 -4.458 L
42.038 -4.458 42.038 -4.646 QT
42.038 -5.177 41.858 -5.81 QT
41.678 -6.443 41.366 -7.029 QT
41.053 -7.614 40.678 -7.989 QT
39.663 -9.005 37.991 -9.005 QT
37.272 -9.005 36.67 -8.646 QT
36.069 -8.286 35.71 -7.661 QT
35.35 -7.036 35.35 -6.349 QT
35.35 -5.443 35.905 -4.708 QT
36.46 -3.974 37.366 -3.739 QT
40.1 -3.068 L
40.772 -2.911 41.374 -2.482 QT
41.975 -2.052 42.374 -1.489 QT
42.772 -0.927 42.999 -0.239 QT
43.225 0.448 43.225 1.198 QT
43.225 2.323 42.702 3.339 QT
42.178 4.354 41.225 4.971 QT
40.272 5.589 39.147 5.589 QT
38.46 5.589 37.725 5.432 QT
36.991 5.276 36.381 4.956 QT
35.772 4.636 35.256 4.136 QT
34.381 5.526 L
34.319 5.589 34.225 5.589 QT
34.1 5.589 L
33.913 5.589 33.913 5.417 QT
cp}def
f-355075417
f
GR
GS
[0.75 0 0 0.75 496.50581 189.9605] CT
N
/f-2736923{45.765 5.417 M
45.765 0.511 L
45.765 0.354 45.952 0.354 QT
46.218 0.354 L
46.28 0.354 46.327 0.401 QT
46.374 0.448 46.374 0.511 QT
46.374 2.573 47.655 3.706 QT
48.936 4.839 50.999 4.839 QT
51.733 4.839 52.35 4.417 QT
52.968 3.995 53.304 3.315 QT
53.64 2.636 53.64 1.917 QT
53.64 1.276 53.39 0.675 QT
53.14 0.073 52.655 -0.364 QT
52.171 -0.802 51.561 -0.958 QT
48.843 -1.614 L
47.483 -1.974 46.624 -3.091 QT
45.765 -4.208 45.765 -5.583 QT
45.765 -6.677 46.319 -7.63 QT
46.874 -8.583 47.811 -9.138 QT
48.749 -9.693 49.843 -9.693 QT
51.952 -9.693 53.186 -8.255 QT
54.046 -9.63 L
54.108 -9.693 54.186 -9.693 QT
54.327 -9.693 L
54.39 -9.693 54.452 -9.646 QT
54.515 -9.599 54.515 -9.505 QT
54.515 -4.646 L
54.515 -4.458 54.327 -4.458 QT
54.093 -4.458 L
53.89 -4.458 53.89 -4.646 QT
53.89 -5.177 53.71 -5.81 QT
53.53 -6.443 53.218 -7.029 QT
52.905 -7.614 52.53 -7.989 QT
51.515 -9.005 49.843 -9.005 QT
49.124 -9.005 48.522 -8.646 QT
47.921 -8.286 47.561 -7.661 QT
47.202 -7.036 47.202 -6.349 QT
47.202 -5.443 47.757 -4.708 QT
48.311 -3.974 49.218 -3.739 QT
51.952 -3.068 L
52.624 -2.911 53.225 -2.482 QT
53.827 -2.052 54.225 -1.489 QT
54.624 -0.927 54.85 -0.239 QT
55.077 0.448 55.077 1.198 QT
55.077 2.323 54.554 3.339 QT
54.03 4.354 53.077 4.971 QT
52.124 5.589 50.999 5.589 QT
50.311 5.589 49.577 5.432 QT
48.843 5.276 48.233 4.956 QT
47.624 4.636 47.108 4.136 QT
46.233 5.526 L
46.171 5.589 46.077 5.589 QT
45.952 5.589 L
45.765 5.589 45.765 5.417 QT
cp}def
f-2736923
f
GR
GS
[0.75 0 0 0.75 496.50581 189.9605] CT
N
/f565411095{64.728 5.417 M
64.728 0.511 L
64.728 0.354 64.915 0.354 QT
65.181 0.354 L
65.243 0.354 65.29 0.401 QT
65.337 0.448 65.337 0.511 QT
65.337 2.573 66.618 3.706 QT
67.899 4.839 69.962 4.839 QT
70.696 4.839 71.313 4.417 QT
71.931 3.995 72.267 3.315 QT
72.603 2.636 72.603 1.917 QT
72.603 1.276 72.353 0.675 QT
72.103 0.073 71.618 -0.364 QT
71.134 -0.802 70.524 -0.958 QT
67.806 -1.614 L
66.446 -1.974 65.587 -3.091 QT
64.728 -4.208 64.728 -5.583 QT
64.728 -6.677 65.282 -7.63 QT
65.837 -8.583 66.774 -9.138 QT
67.712 -9.693 68.806 -9.693 QT
70.915 -9.693 72.149 -8.255 QT
73.009 -9.63 L
73.071 -9.693 73.149 -9.693 QT
73.29 -9.693 L
73.353 -9.693 73.415 -9.646 QT
73.478 -9.599 73.478 -9.505 QT
73.478 -4.646 L
73.478 -4.458 73.29 -4.458 QT
73.056 -4.458 L
72.853 -4.458 72.853 -4.646 QT
72.853 -5.177 72.673 -5.81 QT
72.493 -6.443 72.181 -7.029 QT
71.868 -7.614 71.493 -7.989 QT
70.478 -9.005 68.806 -9.005 QT
68.087 -9.005 67.485 -8.646 QT
66.884 -8.286 66.524 -7.661 QT
66.165 -7.036 66.165 -6.349 QT
66.165 -5.443 66.72 -4.708 QT
67.274 -3.974 68.181 -3.739 QT
70.915 -3.068 L
71.587 -2.911 72.188 -2.482 QT
72.79 -2.052 73.188 -1.489 QT
73.587 -0.927 73.813 -0.239 QT
74.04 0.448 74.04 1.198 QT
74.04 2.323 73.517 3.339 QT
72.993 4.354 72.04 4.971 QT
71.087 5.589 69.962 5.589 QT
69.274 5.589 68.54 5.432 QT
67.806 5.276 67.196 4.956 QT
66.587 4.636 66.071 4.136 QT
65.196 5.526 L
65.134 5.589 65.04 5.589 QT
64.915 5.589 L
64.728 5.589 64.728 5.417 QT
cp}def
f565411095
f
GR
GS
[0.75 0 0 0.75 496.50581 189.9605] CT
N
/f795848310{77.548 2.604 M
77.548 -3.193 L
75.814 -3.193 L
75.814 -3.739 L
77.189 -3.739 77.829 -5.021 QT
78.47 -6.302 78.47 -7.802 QT
79.079 -7.802 L
79.079 -3.927 L
82.048 -3.927 L
82.048 -3.193 L
79.079 -3.193 L
79.079 2.557 L
79.079 3.432 79.368 4.089 QT
79.658 4.745 80.423 4.745 QT
81.142 4.745 81.462 4.05 QT
81.783 3.354 81.783 2.557 QT
81.783 1.323 L
82.376 1.323 L
82.376 2.604 L
82.376 3.261 82.134 3.901 QT
81.892 4.542 81.423 4.948 QT
80.954 5.354 80.283 5.354 QT
79.017 5.354 78.283 4.604 QT
77.548 3.854 77.548 2.604 QT
cp}def
f795848310
f
GR
GS
[0.75 0 0 0.75 496.50581 189.9605] CT
N
/f-948962843{84.548 3.057 M
84.548 1.807 85.532 1.026 QT
86.516 0.245 87.891 -0.083 QT
89.266 -0.411 90.516 -0.411 QT
90.516 -1.271 L
90.516 -1.88 90.251 -2.443 QT
89.985 -3.005 89.477 -3.372 QT
88.97 -3.739 88.376 -3.739 QT
86.97 -3.739 86.251 -3.114 QT
86.641 -3.114 86.907 -2.81 QT
87.173 -2.505 87.173 -2.114 QT
87.173 -1.693 86.876 -1.396 QT
86.579 -1.099 86.173 -1.099 QT
85.751 -1.099 85.454 -1.396 QT
85.157 -1.693 85.157 -2.114 QT
85.157 -3.224 86.157 -3.755 QT
87.157 -4.286 88.376 -4.286 QT
89.22 -4.286 90.079 -3.927 QT
90.938 -3.568 91.493 -2.888 QT
92.048 -2.208 92.048 -1.302 QT
92.048 3.417 L
92.048 3.823 92.22 4.167 QT
92.391 4.511 92.751 4.511 QT
93.11 4.511 93.274 4.167 QT
93.438 3.823 93.438 3.417 QT
93.438 2.073 L
94.063 2.073 L
94.063 3.417 L
94.063 3.886 93.813 4.315 QT
93.563 4.745 93.149 4.995 QT
92.735 5.245 92.251 5.245 QT
91.641 5.245 91.196 4.768 QT
90.751 4.292 90.704 3.636 QT
90.313 4.417 89.555 4.886 QT
88.798 5.354 87.923 5.354 QT
87.126 5.354 86.352 5.12 QT
85.579 4.886 85.063 4.378 QT
84.548 3.87 84.548 3.057 QT
cp
86.251 3.057 M
86.251 3.792 86.79 4.3 QT
87.329 4.807 88.079 4.807 QT
88.751 4.807 89.305 4.464 QT
89.86 4.12 90.188 3.542 QT
90.516 2.964 90.516 2.307 QT
90.516 0.12 L
89.563 0.12 88.563 0.432 QT
87.563 0.745 86.907 1.417 QT
86.251 2.089 86.251 3.057 QT
cp}def
f-948962843
f
GR
GS
[0.75 0 0 0.75 496.50581 189.9605] CT
N
/f1488627710{94.996 5.12 M
94.996 4.386 L
95.714 4.386 96.175 4.268 QT
96.636 4.151 96.636 3.714 QT
96.636 -2.021 L
96.636 -2.583 96.464 -2.833 QT
96.292 -3.083 95.98 -3.138 QT
95.667 -3.193 94.996 -3.193 QT
94.996 -3.927 L
98.042 -4.161 L
98.042 -2.114 L
98.464 -3.005 99.292 -3.583 QT
100.121 -4.161 101.089 -4.161 QT
102.542 -4.161 103.277 -3.466 QT
104.011 -2.771 104.011 -1.333 QT
104.011 3.714 L
104.011 4.151 104.472 4.268 QT
104.933 4.386 105.652 4.386 QT
105.652 5.12 L
100.839 5.12 L
100.839 4.386 L
101.558 4.386 102.019 4.268 QT
102.48 4.151 102.48 3.714 QT
102.48 -1.271 L
102.48 -2.286 102.183 -2.95 QT
101.886 -3.614 100.964 -3.614 QT
99.746 -3.614 98.957 -2.638 QT
98.167 -1.661 98.167 -0.427 QT
98.167 3.714 L
98.167 4.151 98.636 4.268 QT
99.105 4.386 99.808 4.386 QT
99.808 5.12 L
94.996 5.12 L
cp}def
f1488627710
f
GR
GS
[0.75 0 0 0.75 496.50581 189.9605] CT
N
/f493214165{111.347 5.354 M
110.113 5.354 109.082 4.682 QT
108.051 4.011 107.488 2.917 QT
106.926 1.823 106.926 0.589 QT
106.926 -0.677 107.543 -1.771 QT
108.16 -2.864 109.23 -3.513 QT
110.301 -4.161 111.582 -4.161 QT
112.347 -4.161 113.035 -3.841 QT
113.722 -3.521 114.222 -2.943 QT
114.222 -7.302 L
114.222 -7.864 114.051 -8.122 QT
113.879 -8.38 113.566 -8.435 QT
113.254 -8.489 112.597 -8.489 QT
112.597 -9.224 L
115.691 -9.458 L
115.691 3.214 L
115.691 3.761 115.863 4.018 QT
116.035 4.276 116.347 4.331 QT
116.66 4.386 117.332 4.386 QT
117.332 5.12 L
114.16 5.354 L
114.16 4.026 L
113.613 4.651 112.863 5.003 QT
112.113 5.354 111.347 5.354 QT
cp
109.207 3.292 M
109.566 3.979 110.168 4.393 QT
110.769 4.807 111.472 4.807 QT
112.347 4.807 113.074 4.3 QT
113.801 3.792 114.16 2.995 QT
114.16 -2.036 L
113.91 -2.505 113.535 -2.864 QT
113.16 -3.224 112.699 -3.419 QT
112.238 -3.614 111.707 -3.614 QT
110.613 -3.614 109.949 -2.997 QT
109.285 -2.38 109.012 -1.411 QT
108.738 -0.443 108.738 0.604 QT
108.738 1.448 108.832 2.073 QT
108.926 2.698 109.207 3.292 QT
cp}def
f493214165
f
GR
GS
[0.75 0 0 0.75 496.50581 189.9605] CT
N
/f1322329885{118.918 3.057 M
118.918 1.807 119.902 1.026 QT
120.887 0.245 122.262 -0.083 QT
123.637 -0.411 124.887 -0.411 QT
124.887 -1.271 L
124.887 -1.88 124.621 -2.443 QT
124.356 -3.005 123.848 -3.372 QT
123.34 -3.739 122.746 -3.739 QT
121.34 -3.739 120.621 -3.114 QT
121.012 -3.114 121.277 -2.81 QT
121.543 -2.505 121.543 -2.114 QT
121.543 -1.693 121.246 -1.396 QT
120.949 -1.099 120.543 -1.099 QT
120.121 -1.099 119.824 -1.396 QT
119.527 -1.693 119.527 -2.114 QT
119.527 -3.224 120.527 -3.755 QT
121.527 -4.286 122.746 -4.286 QT
123.59 -4.286 124.449 -3.927 QT
125.309 -3.568 125.863 -2.888 QT
126.418 -2.208 126.418 -1.302 QT
126.418 3.417 L
126.418 3.823 126.59 4.167 QT
126.762 4.511 127.121 4.511 QT
127.481 4.511 127.645 4.167 QT
127.809 3.823 127.809 3.417 QT
127.809 2.073 L
128.434 2.073 L
128.434 3.417 L
128.434 3.886 128.184 4.315 QT
127.934 4.745 127.52 4.995 QT
127.106 5.245 126.621 5.245 QT
126.012 5.245 125.567 4.768 QT
125.121 4.292 125.074 3.636 QT
124.684 4.417 123.926 4.886 QT
123.168 5.354 122.293 5.354 QT
121.496 5.354 120.723 5.12 QT
119.949 4.886 119.434 4.378 QT
118.918 3.87 118.918 3.057 QT
cp
120.621 3.057 M
120.621 3.792 121.16 4.3 QT
121.699 4.807 122.449 4.807 QT
123.121 4.807 123.676 4.464 QT
124.231 4.12 124.559 3.542 QT
124.887 2.964 124.887 2.307 QT
124.887 0.12 L
123.934 0.12 122.934 0.432 QT
121.934 0.745 121.277 1.417 QT
120.621 2.089 120.621 3.057 QT
cp}def
f1322329885
f
GR
GS
[0.75 0 0 0.75 496.50581 189.9605] CT
N
/f-1621018892{129.382 5.12 M
129.382 4.386 L
130.1 4.386 130.561 4.268 QT
131.022 4.151 131.022 3.714 QT
131.022 -7.302 L
131.022 -7.864 130.858 -8.122 QT
130.694 -8.38 130.374 -8.435 QT
130.054 -8.489 129.382 -8.489 QT
129.382 -9.224 L
132.507 -9.458 L
132.507 3.714 L
132.507 4.151 132.968 4.268 QT
133.429 4.386 134.132 4.386 QT
134.132 5.12 L
129.382 5.12 L
cp}def
f-1621018892
f
GR
GS
[0.75 0 0 0.75 496.50581 189.9605] CT
N
/f2009997871{139.917 5.354 M
138.651 5.354 137.573 4.714 QT
136.495 4.073 135.87 2.995 QT
135.245 1.917 135.245 0.651 QT
135.245 -0.318 135.589 -1.208 QT
135.933 -2.099 136.573 -2.802 QT
137.214 -3.505 138.065 -3.896 QT
138.917 -4.286 139.917 -4.286 QT
141.214 -4.286 142.276 -3.607 QT
143.339 -2.927 143.948 -1.786 QT
144.558 -0.646 144.558 0.651 QT
144.558 1.917 143.933 2.995 QT
143.308 4.073 142.237 4.714 QT
141.167 5.354 139.917 5.354 QT
cp
139.917 4.745 M
141.604 4.745 142.167 3.526 QT
142.729 2.307 142.729 0.417 QT
142.729 -0.646 142.612 -1.333 QT
142.495 -2.021 142.12 -2.599 QT
141.886 -2.943 141.519 -3.2 QT
141.151 -3.458 140.753 -3.599 QT
140.354 -3.739 139.917 -3.739 QT
139.261 -3.739 138.675 -3.443 QT
138.089 -3.146 137.698 -2.599 QT
137.308 -1.989 137.198 -1.279 QT
137.089 -0.568 137.089 0.417 QT
137.089 1.589 137.292 2.526 QT
137.495 3.464 138.12 4.104 QT
138.745 4.745 139.917 4.745 QT
cp}def
f2009997871
f
GR
GS
[0.75 0 0 0.75 496.50581 189.9605] CT
N
/f86489569{145.959 5.12 M
145.959 4.386 L
146.677 4.386 147.138 4.268 QT
147.599 4.151 147.599 3.714 QT
147.599 -2.021 L
147.599 -2.583 147.427 -2.833 QT
147.256 -3.083 146.943 -3.138 QT
146.631 -3.193 145.959 -3.193 QT
145.959 -3.927 L
149.006 -4.161 L
149.006 -2.114 L
149.427 -3.005 150.256 -3.583 QT
151.084 -4.161 152.052 -4.161 QT
153.506 -4.161 154.24 -3.466 QT
154.974 -2.771 154.974 -1.333 QT
154.974 3.714 L
154.974 4.151 155.435 4.268 QT
155.896 4.386 156.615 4.386 QT
156.615 5.12 L
151.802 5.12 L
151.802 4.386 L
152.521 4.386 152.982 4.268 QT
153.443 4.151 153.443 3.714 QT
153.443 -1.271 L
153.443 -2.286 153.146 -2.95 QT
152.849 -3.614 151.927 -3.614 QT
150.709 -3.614 149.92 -2.638 QT
149.131 -1.661 149.131 -0.427 QT
149.131 3.714 L
149.131 4.151 149.599 4.268 QT
150.068 4.386 150.771 4.386 QT
150.771 5.12 L
145.959 5.12 L
cp}def
f86489569
f
GR
GS
[0.75 0 0 0.75 496.50581 189.9605] CT
N
/f-1762545916{162.42 5.354 M
161.139 5.354 160.068 4.682 QT
158.998 4.011 158.381 2.886 QT
157.764 1.761 157.764 0.511 QT
157.764 -0.708 158.326 -1.818 QT
158.889 -2.927 159.889 -3.607 QT
160.889 -4.286 162.123 -4.286 QT
163.076 -4.286 163.795 -3.966 QT
164.514 -3.646 164.975 -3.075 QT
165.436 -2.505 165.67 -1.724 QT
165.904 -0.943 165.904 -0.005 QT
165.904 0.276 165.686 0.276 QT
159.607 0.276 L
159.607 0.495 L
159.607 2.245 160.311 3.495 QT
161.014 4.745 162.607 4.745 QT
163.248 4.745 163.795 4.456 QT
164.342 4.167 164.748 3.651 QT
165.154 3.136 165.295 2.557 QT
165.311 2.479 165.373 2.425 QT
165.436 2.37 165.498 2.37 QT
165.686 2.37 L
165.904 2.37 165.904 2.636 QT
165.607 3.823 164.623 4.589 QT
163.639 5.354 162.42 5.354 QT
cp
159.623 -0.255 M
164.42 -0.255 L
164.42 -1.036 164.193 -1.849 QT
163.967 -2.661 163.459 -3.2 QT
162.951 -3.739 162.123 -3.739 QT
160.936 -3.739 160.279 -2.63 QT
159.623 -1.521 159.623 -0.255 QT
cp}def
f-1762545916
f
GR
GS
[0.75 0 0 0.75 0 -0.25] CT
1 LJ
2.667 LW
N
619.001 253.614 M
659.007 253.614 L
S
GR
GS
[0.75 0 0 0.75 496.50581 209.28949] CT
N
/f-1753218115{0.641 5.12 M
0.641 4.386 L
2.813 4.386 2.813 3.714 QT
2.813 -7.818 L
2.813 -8.489 0.641 -8.489 QT
0.641 -9.224 L
6.938 -9.224 L
6.938 -8.489 L
4.766 -8.489 4.766 -7.818 QT
4.766 -2.708 L
10.969 -2.708 L
10.969 -7.818 L
10.969 -8.489 8.797 -8.489 QT
8.797 -9.224 L
15.078 -9.224 L
15.078 -8.489 L
12.922 -8.489 12.922 -7.818 QT
12.922 3.714 L
12.922 4.386 15.078 4.386 QT
15.078 5.12 L
8.797 5.12 L
8.797 4.386 L
10.969 4.386 10.969 3.714 QT
10.969 -1.974 L
4.766 -1.974 L
4.766 3.714 L
4.766 4.386 6.938 4.386 QT
6.938 5.12 L
0.641 5.12 L
cp}def
f-1753218115
f
GR
GS
[0.75 0 0 0.75 496.50581 209.28949] CT
N
/f-1625346185{20.75 5.12 M
20.75 4.386 L
22.906 4.386 22.906 3.714 QT
22.906 -0.614 L
18.5 -7.864 L
18.188 -8.286 17.641 -8.388 QT
17.094 -8.489 16.234 -8.489 QT
16.234 -9.224 L
22.156 -9.224 L
22.156 -8.489 L
20.688 -8.489 20.688 -8.005 QT
20.688 -7.958 20.734 -7.849 QT
24.516 -1.583 L
27.984 -7.271 L
28.125 -7.458 28.125 -7.693 QT
28.125 -8.114 27.758 -8.302 QT
27.391 -8.489 26.938 -8.489 QT
26.938 -9.224 L
31.5 -9.224 L
31.5 -8.489 L
30.672 -8.489 29.969 -8.193 QT
29.266 -7.896 28.875 -7.286 QT
24.797 -0.614 L
24.797 3.714 L
24.797 4.386 26.969 4.386 QT
26.969 5.12 L
20.75 5.12 L
cp}def
f-1625346185
f
GR
GS
[0.75 0 0 0.75 496.50581 209.28949] CT
N
/f-938731371{32.719 5.12 M
32.719 4.386 L
34.875 4.386 34.875 3.714 QT
34.875 -7.818 L
34.875 -8.489 32.719 -8.489 QT
32.719 -9.224 L
40.438 -9.224 L
41.5 -9.224 42.586 -8.81 QT
43.672 -8.396 44.391 -7.583 QT
45.109 -6.771 45.109 -5.661 QT
45.109 -4.38 44.055 -3.513 QT
43 -2.646 41.594 -2.38 QT
42.516 -2.38 43.477 -1.872 QT
44.438 -1.364 45.055 -0.529 QT
45.672 0.307 45.672 1.261 QT
45.672 2.401 44.992 3.284 QT
44.313 4.167 43.219 4.643 QT
42.125 5.12 41.031 5.12 QT
32.719 5.12 L
cp
36.703 3.714 M
36.703 4.167 36.961 4.276 QT
37.219 4.386 37.766 4.386 QT
40.438 4.386 L
41.266 4.386 41.969 3.956 QT
42.672 3.526 43.078 2.8 QT
43.484 2.073 43.484 1.261 QT
43.484 0.448 43.149 -0.31 QT
42.813 -1.068 42.18 -1.56 QT
41.547 -2.052 40.734 -2.052 QT
36.703 -2.052 L
36.703 3.714 L
cp
36.703 -2.614 M
39.859 -2.614 L
40.484 -2.614 41.047 -2.841 QT
41.609 -3.068 42.055 -3.505 QT
42.5 -3.943 42.742 -4.489 QT
42.984 -5.036 42.984 -5.661 QT
42.984 -6.208 42.805 -6.708 QT
42.625 -7.208 42.274 -7.614 QT
41.922 -8.021 41.453 -8.255 QT
40.984 -8.489 40.438 -8.489 QT
37.766 -8.489 L
37.391 -8.489 37.18 -8.458 QT
36.969 -8.427 36.836 -8.279 QT
36.703 -8.13 36.703 -7.818 QT
36.703 -2.614 L
cp}def
f-938731371
f
GR
GS
[0.75 0 0 0.75 496.50581 209.28949] CT
N
/f-277721615{47.814 5.12 M
47.814 4.386 L
49.971 4.386 49.971 3.714 QT
49.971 -7.818 L
49.971 -8.489 47.814 -8.489 QT
47.814 -9.224 L
54.408 -9.224 L
55.58 -9.224 56.877 -8.802 QT
58.174 -8.38 59.049 -7.505 QT
59.924 -6.63 59.924 -5.427 QT
59.924 -4.536 59.392 -3.849 QT
58.861 -3.161 58.033 -2.693 QT
57.205 -2.224 56.346 -2.021 QT
57.299 -1.693 58.002 -0.974 QT
58.705 -0.255 58.846 0.667 QT
59.142 2.542 L
59.361 3.792 59.58 4.417 QT
59.799 5.042 60.58 5.042 QT
61.236 5.042 61.557 4.432 QT
61.877 3.823 61.877 3.104 QT
61.877 3.026 61.947 2.971 QT
62.017 2.917 62.08 2.917 QT
62.283 2.917 L
62.486 2.917 62.486 3.198 QT
62.486 3.761 62.26 4.315 QT
62.033 4.87 61.603 5.229 QT
61.174 5.589 60.596 5.589 QT
59.08 5.589 57.986 4.831 QT
56.892 4.073 56.892 2.62 QT
56.892 0.745 L
56.892 -0.302 56.166 -1.044 QT
55.439 -1.786 54.377 -1.786 QT
51.861 -1.786 L
51.861 3.714 L
51.861 4.386 54.017 4.386 QT
54.017 5.12 L
47.814 5.12 L
cp
51.861 -2.333 M
54.111 -2.333 L
55.846 -2.333 56.76 -3.036 QT
57.674 -3.739 57.674 -5.427 QT
57.674 -7.099 56.767 -7.794 QT
55.861 -8.489 54.111 -8.489 QT
52.924 -8.489 L
52.549 -8.489 52.338 -8.458 QT
52.127 -8.427 51.994 -8.279 QT
51.861 -8.13 51.861 -7.818 QT
51.861 -2.333 L
cp}def
f-277721615
f
GR
GS
[0.75 0 0 0.75 496.50581 209.28949] CT
N
/f273874688{63.362 5.12 M
63.362 4.386 L
65.627 4.386 65.627 3.714 QT
65.627 -7.818 L
65.627 -8.489 63.362 -8.489 QT
63.362 -9.224 L
69.846 -9.224 L
69.846 -8.489 L
67.581 -8.489 67.581 -7.818 QT
67.581 3.714 L
67.581 4.386 69.846 4.386 QT
69.846 5.12 L
63.362 5.12 L
cp}def
f273874688
f
GR
GS
[0.75 0 0 0.75 496.50581 209.28949] CT
N
/f-456611894{71.222 5.12 M
71.222 4.386 L
73.378 4.386 73.378 3.714 QT
73.378 -7.818 L
73.378 -8.489 71.222 -8.489 QT
71.222 -9.224 L
78.956 -9.224 L
80.394 -9.224 81.581 -8.607 QT
82.769 -7.989 83.612 -6.95 QT
84.456 -5.911 84.909 -4.599 QT
85.362 -3.286 85.362 -1.911 QT
85.362 -0.583 84.901 0.675 QT
84.441 1.932 83.573 2.94 QT
82.706 3.948 81.526 4.534 QT
80.347 5.12 78.956 5.12 QT
71.222 5.12 L
cp
75.269 3.714 M
75.269 4.167 75.526 4.276 QT
75.784 4.386 76.331 4.386 QT
78.409 4.386 L
79.487 4.386 80.456 3.917 QT
81.425 3.448 82.066 2.62 QT
82.737 1.729 82.956 0.643 QT
83.175 -0.443 83.175 -1.911 QT
83.175 -3.443 82.956 -4.591 QT
82.737 -5.739 82.066 -6.646 QT
81.441 -7.536 80.48 -8.013 QT
79.519 -8.489 78.409 -8.489 QT
76.331 -8.489 L
75.956 -8.489 75.745 -8.458 QT
75.534 -8.427 75.401 -8.279 QT
75.269 -8.13 75.269 -7.818 QT
75.269 3.714 L
cp}def
f-456611894
f
GR
GS
[0.75 0 0 0.75 496.50581 209.28949] CT
N
/f451069321{95.098 5.417 M
95.098 0.511 L
95.098 0.354 95.285 0.354 QT
95.551 0.354 L
95.614 0.354 95.66 0.401 QT
95.707 0.448 95.707 0.511 QT
95.707 2.573 96.989 3.706 QT
98.27 4.839 100.332 4.839 QT
101.067 4.839 101.684 4.417 QT
102.301 3.995 102.637 3.315 QT
102.973 2.636 102.973 1.917 QT
102.973 1.276 102.723 0.675 QT
102.473 0.073 101.989 -0.364 QT
101.504 -0.802 100.895 -0.958 QT
98.176 -1.614 L
96.817 -1.974 95.957 -3.091 QT
95.098 -4.208 95.098 -5.583 QT
95.098 -6.677 95.653 -7.63 QT
96.207 -8.583 97.145 -9.138 QT
98.082 -9.693 99.176 -9.693 QT
101.285 -9.693 102.52 -8.255 QT
103.379 -9.63 L
103.442 -9.693 103.52 -9.693 QT
103.66 -9.693 L
103.723 -9.693 103.785 -9.646 QT
103.848 -9.599 103.848 -9.505 QT
103.848 -4.646 L
103.848 -4.458 103.66 -4.458 QT
103.426 -4.458 L
103.223 -4.458 103.223 -4.646 QT
103.223 -5.177 103.043 -5.81 QT
102.864 -6.443 102.551 -7.029 QT
102.239 -7.614 101.864 -7.989 QT
100.848 -9.005 99.176 -9.005 QT
98.457 -9.005 97.856 -8.646 QT
97.254 -8.286 96.895 -7.661 QT
96.535 -7.036 96.535 -6.349 QT
96.535 -5.443 97.09 -4.708 QT
97.645 -3.974 98.551 -3.739 QT
101.285 -3.068 L
101.957 -2.911 102.559 -2.482 QT
103.16 -2.052 103.559 -1.489 QT
103.957 -0.927 104.184 -0.239 QT
104.41 0.448 104.41 1.198 QT
104.41 2.323 103.887 3.339 QT
103.364 4.354 102.41 4.971 QT
101.457 5.589 100.332 5.589 QT
99.645 5.589 98.91 5.432 QT
98.176 5.276 97.567 4.956 QT
96.957 4.636 96.442 4.136 QT
95.567 5.526 L
95.504 5.589 95.41 5.589 QT
95.285 5.589 L
95.098 5.589 95.098 5.417 QT
cp}def
f451069321
f
GR
GS
[0.75 0 0 0.75 496.50581 209.28949] CT
N
/f-1022810214{111.028 5.354 M
109.762 5.354 108.684 4.714 QT
107.606 4.073 106.981 2.995 QT
106.356 1.917 106.356 0.651 QT
106.356 -0.318 106.7 -1.208 QT
107.044 -2.099 107.684 -2.802 QT
108.325 -3.505 109.176 -3.896 QT
110.028 -4.286 111.028 -4.286 QT
112.325 -4.286 113.387 -3.607 QT
114.45 -2.927 115.059 -1.786 QT
115.669 -0.646 115.669 0.651 QT
115.669 1.917 115.044 2.995 QT
114.419 4.073 113.348 4.714 QT
112.278 5.354 111.028 5.354 QT
cp
111.028 4.745 M
112.715 4.745 113.278 3.526 QT
113.84 2.307 113.84 0.417 QT
113.84 -0.646 113.723 -1.333 QT
113.606 -2.021 113.231 -2.599 QT
112.997 -2.943 112.63 -3.2 QT
112.262 -3.458 111.864 -3.599 QT
111.465 -3.739 111.028 -3.739 QT
110.372 -3.739 109.786 -3.443 QT
109.2 -3.146 108.809 -2.599 QT
108.419 -1.989 108.309 -1.279 QT
108.2 -0.568 108.2 0.417 QT
108.2 1.589 108.403 2.526 QT
108.606 3.464 109.231 4.104 QT
109.856 4.745 111.028 4.745 QT
cp}def
f-1022810214
f
GR
GS
[0.75 0 0 0.75 496.50581 209.28949] CT
N
/f-2050209368{117.085 5.12 M
117.085 4.386 L
117.804 4.386 118.265 4.268 QT
118.726 4.151 118.726 3.714 QT
118.726 -7.302 L
118.726 -7.864 118.562 -8.122 QT
118.398 -8.38 118.077 -8.435 QT
117.757 -8.489 117.085 -8.489 QT
117.085 -9.224 L
120.21 -9.458 L
120.21 3.714 L
120.21 4.151 120.671 4.268 QT
121.132 4.386 121.835 4.386 QT
121.835 5.12 L
117.085 5.12 L
cp}def
f-2050209368
f
GR
GS
[0.75 0 0 0.75 496.50581 209.28949] CT
N
/f732425257{124.636 2.62 M
124.636 -2.021 L
124.636 -2.583 124.464 -2.833 QT
124.292 -3.083 123.98 -3.138 QT
123.667 -3.193 122.996 -3.193 QT
122.996 -3.927 L
126.167 -4.161 L
126.167 2.62 L
126.167 3.432 126.292 3.893 QT
126.417 4.354 126.8 4.581 QT
127.183 4.807 128.027 4.807 QT
129.152 4.807 129.816 3.862 QT
130.48 2.917 130.48 1.714 QT
130.48 -2.021 L
130.48 -2.583 130.308 -2.833 QT
130.136 -3.083 129.824 -3.138 QT
129.511 -3.193 128.839 -3.193 QT
128.839 -3.927 L
132.011 -4.161 L
132.011 3.214 L
132.011 3.761 132.183 4.018 QT
132.355 4.276 132.667 4.331 QT
132.98 4.386 133.652 4.386 QT
133.652 5.12 L
130.542 5.354 L
130.542 3.589 L
130.152 4.37 129.457 4.862 QT
128.761 5.354 127.917 5.354 QT
126.417 5.354 125.527 4.714 QT
124.636 4.073 124.636 2.62 QT
cp}def
f732425257
f
GR
GS
[0.75 0 0 0.75 496.50581 209.28949] CT
N
/f783276197{136.363 2.604 M
136.363 -3.193 L
134.629 -3.193 L
134.629 -3.739 L
136.004 -3.739 136.644 -5.021 QT
137.285 -6.302 137.285 -7.802 QT
137.894 -7.802 L
137.894 -3.927 L
140.863 -3.927 L
140.863 -3.193 L
137.894 -3.193 L
137.894 2.557 L
137.894 3.432 138.183 4.089 QT
138.473 4.745 139.238 4.745 QT
139.957 4.745 140.277 4.05 QT
140.598 3.354 140.598 2.557 QT
140.598 1.323 L
141.191 1.323 L
141.191 2.604 L
141.191 3.261 140.949 3.901 QT
140.707 4.542 140.238 4.948 QT
139.769 5.354 139.098 5.354 QT
137.832 5.354 137.098 4.604 QT
136.363 3.854 136.363 2.604 QT
cp}def
f783276197
f
GR
GS
[0.75 0 0 0.75 496.50581 209.28949] CT
N
/f1312719205{143.159 5.12 M
143.159 4.386 L
143.878 4.386 144.339 4.268 QT
144.8 4.151 144.8 3.714 QT
144.8 -2.021 L
144.8 -2.833 144.488 -3.013 QT
144.175 -3.193 143.253 -3.193 QT
143.253 -3.927 L
146.284 -4.161 L
146.284 3.714 L
146.284 4.151 146.683 4.268 QT
147.081 4.386 147.753 4.386 QT
147.753 5.12 L
143.159 5.12 L
cp
144.05 -7.771 M
144.05 -8.224 144.402 -8.575 QT
144.753 -8.927 145.206 -8.927 QT
145.503 -8.927 145.777 -8.771 QT
146.05 -8.614 146.206 -8.341 QT
146.363 -8.068 146.363 -7.771 QT
146.363 -7.318 146.011 -6.966 QT
145.659 -6.614 145.206 -6.614 QT
144.753 -6.614 144.402 -6.966 QT
144.05 -7.318 144.05 -7.771 QT
cp}def
f1312719205
f
GR
GS
[0.75 0 0 0.75 496.50581 209.28949] CT
N
/f-1761590384{153.695 5.354 M
152.429 5.354 151.351 4.714 QT
150.273 4.073 149.648 2.995 QT
149.023 1.917 149.023 0.651 QT
149.023 -0.318 149.367 -1.208 QT
149.71 -2.099 150.351 -2.802 QT
150.992 -3.505 151.843 -3.896 QT
152.695 -4.286 153.695 -4.286 QT
154.992 -4.286 156.054 -3.607 QT
157.117 -2.927 157.726 -1.786 QT
158.335 -0.646 158.335 0.651 QT
158.335 1.917 157.71 2.995 QT
157.085 4.073 156.015 4.714 QT
154.945 5.354 153.695 5.354 QT
cp
153.695 4.745 M
155.382 4.745 155.945 3.526 QT
156.507 2.307 156.507 0.417 QT
156.507 -0.646 156.39 -1.333 QT
156.273 -2.021 155.898 -2.599 QT
155.664 -2.943 155.296 -3.2 QT
154.929 -3.458 154.531 -3.599 QT
154.132 -3.739 153.695 -3.739 QT
153.039 -3.739 152.453 -3.443 QT
151.867 -3.146 151.476 -2.599 QT
151.085 -1.989 150.976 -1.279 QT
150.867 -0.568 150.867 0.417 QT
150.867 1.589 151.07 2.526 QT
151.273 3.464 151.898 4.104 QT
152.523 4.745 153.695 4.745 QT
cp}def
f-1761590384
f
GR
GS
[0.75 0 0 0.75 496.50581 209.28949] CT
N
/f-215021349{159.736 5.12 M
159.736 4.386 L
160.455 4.386 160.916 4.268 QT
161.377 4.151 161.377 3.714 QT
161.377 -2.021 L
161.377 -2.583 161.205 -2.833 QT
161.033 -3.083 160.721 -3.138 QT
160.408 -3.193 159.736 -3.193 QT
159.736 -3.927 L
162.783 -4.161 L
162.783 -2.114 L
163.205 -3.005 164.033 -3.583 QT
164.861 -4.161 165.83 -4.161 QT
167.283 -4.161 168.018 -3.466 QT
168.752 -2.771 168.752 -1.333 QT
168.752 3.714 L
168.752 4.151 169.213 4.268 QT
169.674 4.386 170.393 4.386 QT
170.393 5.12 L
165.58 5.12 L
165.58 4.386 L
166.299 4.386 166.76 4.268 QT
167.221 4.151 167.221 3.714 QT
167.221 -1.271 L
167.221 -2.286 166.924 -2.95 QT
166.627 -3.614 165.705 -3.614 QT
164.486 -3.614 163.697 -2.638 QT
162.908 -1.661 162.908 -0.427 QT
162.908 3.714 L
162.908 4.151 163.377 4.268 QT
163.846 4.386 164.549 4.386 QT
164.549 5.12 L
159.736 5.12 L
cp}def
f-215021349
f
GR
GS
[0.75 0 0 0.75 0 -0.25] CT
1 0 0 RC
1 LJ
2.667 LW
N
619.001 279.386 M
659.007 279.386 L
S
GR
GS
[0.75 0 0 0.75 0 -0.25] CT
0.149 GC
10.0 ML
0.667 LW
N
615 294 M
615 239 L
837 239 L
837 294 L
cp
S
GR
%%Trailer
%%Pages: 1
%%EOF
