%!PS-Adobe-3.0 EPSF-3.0
%%Creator: (MATLAB, The Mathworks, Inc. Version 9.5.0.944444 \(R2018b\). Operating System: Windows 10)
%%Title: (C:/Users/Alex/Documents/PhD Docs/01. GIT/my_phd_thesis/Chapter8/Figures/capsloc_res/04102019_ex03_pieCharts.eps)
%%CreationDate: 2019-10-10T14:48:56
%%Pages: (atend)
%%BoundingBox: 0 0 720 573
%%LanguageLevel: 3
%%EndComments
%%BeginProlog
%%BeginResource: procset (Apache XML Graphics Std ProcSet) 1.2 0
%%Version: 1.2 0
%%Copyright: (Copyright 2001-2003,2010 The Apache Software Foundation. License terms: http://www.apache.org/licenses/LICENSE-2.0)
/bd{bind def}bind def
/ld{load def}bd
/GR/grestore ld
/GS/gsave ld
/RM/rmoveto ld
/C/curveto ld
/t/show ld
/L/lineto ld
/ML/setmiterlimit ld
/CT/concat ld
/f/fill ld
/N/newpath ld
/S/stroke ld
/CC/setcmykcolor ld
/A/ashow ld
/cp/closepath ld
/RC/setrgbcolor ld
/LJ/setlinejoin ld
/GC/setgray ld
/LW/setlinewidth ld
/M/moveto ld
/re {4 2 roll M
1 index 0 rlineto
0 exch rlineto
neg 0 rlineto
cp } bd
/_ctm matrix def
/_tm matrix def
/BT { _ctm currentmatrix pop matrix _tm copy pop 0 0 moveto } bd
/ET { _ctm setmatrix } bd
/iTm { _ctm setmatrix _tm concat } bd
/Tm { _tm astore pop iTm 0 0 moveto } bd
/ux 0.0 def
/uy 0.0 def
/F {
  /Tp exch def
  /Tf exch def
  Tf findfont Tp scalefont setfont
  /cf Tf def  /cs Tp def
} bd
/ULS {currentpoint /uy exch def /ux exch def} bd
/ULE {
  /Tcx currentpoint pop def
  gsave
  newpath
  cf findfont cs scalefont dup
  /FontMatrix get 0 get /Ts exch def /FontInfo get dup
  /UnderlinePosition get Ts mul /To exch def
  /UnderlineThickness get Ts mul /Tt exch def
  ux uy To add moveto  Tcx uy To add lineto
  Tt setlinewidth stroke
  grestore
} bd
/OLE {
  /Tcx currentpoint pop def
  gsave
  newpath
  cf findfont cs scalefont dup
  /FontMatrix get 0 get /Ts exch def /FontInfo get dup
  /UnderlinePosition get Ts mul /To exch def
  /UnderlineThickness get Ts mul /Tt exch def
  ux uy To add cs add moveto Tcx uy To add cs add lineto
  Tt setlinewidth stroke
  grestore
} bd
/SOE {
  /Tcx currentpoint pop def
  gsave
  newpath
  cf findfont cs scalefont dup
  /FontMatrix get 0 get /Ts exch def /FontInfo get dup
  /UnderlinePosition get Ts mul /To exch def
  /UnderlineThickness get Ts mul /Tt exch def
  ux uy To add cs 10 mul 26 idiv add moveto Tcx uy To add cs 10 mul 26 idiv add lineto
  Tt setlinewidth stroke
  grestore
} bd
/QT {
/Y22 exch store
/X22 exch store
/Y21 exch store
/X21 exch store
currentpoint
/Y21 load 2 mul add 3 div exch
/X21 load 2 mul add 3 div exch
/X21 load 2 mul /X22 load add 3 div
/Y21 load 2 mul /Y22 load add 3 div
/X22 load /Y22 load curveto
} bd
/SSPD {
dup length /d exch dict def
{
/v exch def
/k exch def
currentpagedevice k known {
/cpdv currentpagedevice k get def
v cpdv ne {
/upd false def
/nullv v type /nulltype eq def
/nullcpdv cpdv type /nulltype eq def
nullv nullcpdv or
{
/upd true def
} {
/sametype v type cpdv type eq def
sametype {
v type /arraytype eq {
/vlen v length def
/cpdvlen cpdv length def
vlen cpdvlen eq {
0 1 vlen 1 sub {
/i exch def
/obj v i get def
/cpdobj cpdv i get def
obj cpdobj ne {
/upd true def
exit
} if
} for
} {
/upd true def
} ifelse
} {
v type /dicttype eq {
v {
/dv exch def
/dk exch def
/cpddv cpdv dk get def
dv cpddv ne {
/upd true def
exit
} if
} forall
} {
/upd true def
} ifelse
} ifelse
} if
} ifelse
upd true eq {
d k v put
} if
} if
} if
} forall
d length 0 gt {
d setpagedevice
} if
} bd
/RE { % /NewFontName [NewEncodingArray] /FontName RE -
  findfont dup length dict begin
  {
    1 index /FID ne
    {def} {pop pop} ifelse
  } forall
  /Encoding exch def
  /FontName 1 index def
  currentdict definefont pop
  end
} bind def
%%EndResource
%%BeginResource: procset (Apache XML Graphics EPS ProcSet) 1.0 0
%%Version: 1.0 0
%%Copyright: (Copyright 2002-2003 The Apache Software Foundation. License terms: http://www.apache.org/licenses/LICENSE-2.0)
/BeginEPSF { %def
/b4_Inc_state save def         % Save state for cleanup
/dict_count countdictstack def % Count objects on dict stack
/op_count count 1 sub def      % Count objects on operand stack
userdict begin                 % Push userdict on dict stack
/showpage { } def              % Redefine showpage, { } = null proc
0 setgray 0 setlinecap         % Prepare graphics state
1 setlinewidth 0 setlinejoin
10 setmiterlimit [ ] 0 setdash newpath
/languagelevel where           % If level not equal to 1 then
{pop languagelevel             % set strokeadjust and
1 ne                           % overprint to their defaults.
{false setstrokeadjust false setoverprint
} if
} if
} bd
/EndEPSF { %def
count op_count sub {pop} repeat            % Clean up stacks
countdictstack dict_count sub {end} repeat
b4_Inc_state restore
} bd
%%EndResource
%FOPBeginFontDict
%%IncludeResource: font Courier-Oblique
%%IncludeResource: font Courier-BoldOblique
%%IncludeResource: font Courier-Bold
%%IncludeResource: font ZapfDingbats
%%IncludeResource: font Symbol
%%IncludeResource: font Helvetica
%%IncludeResource: font Helvetica-Oblique
%%IncludeResource: font Helvetica-Bold
%%IncludeResource: font Helvetica-BoldOblique
%%IncludeResource: font Times-Roman
%%IncludeResource: font Times-Italic
%%IncludeResource: font Times-Bold
%%IncludeResource: font Times-BoldItalic
%%IncludeResource: font Courier
%FOPEndFontDict
%%BeginResource: encoding WinAnsiEncoding
/WinAnsiEncoding [
/.notdef /.notdef /.notdef /.notdef /.notdef
/.notdef /.notdef /.notdef /.notdef /.notdef
/.notdef /.notdef /.notdef /.notdef /.notdef
/.notdef /.notdef /.notdef /.notdef /.notdef
/.notdef /.notdef /.notdef /.notdef /.notdef
/.notdef /.notdef /.notdef /.notdef /.notdef
/.notdef /.notdef /space /exclam /quotedbl
/numbersign /dollar /percent /ampersand /quotesingle
/parenleft /parenright /asterisk /plus /comma
/hyphen /period /slash /zero /one
/two /three /four /five /six
/seven /eight /nine /colon /semicolon
/less /equal /greater /question /at
/A /B /C /D /E
/F /G /H /I /J
/K /L /M /N /O
/P /Q /R /S /T
/U /V /W /X /Y
/Z /bracketleft /backslash /bracketright /asciicircum
/underscore /quoteleft /a /b /c
/d /e /f /g /h
/i /j /k /l /m
/n /o /p /q /r
/s /t /u /v /w
/x /y /z /braceleft /bar
/braceright /asciitilde /bullet /Euro /bullet
/quotesinglbase /florin /quotedblbase /ellipsis /dagger
/daggerdbl /circumflex /perthousand /Scaron /guilsinglleft
/OE /bullet /Zcaron /bullet /bullet
/quoteleft /quoteright /quotedblleft /quotedblright /bullet
/endash /emdash /asciitilde /trademark /scaron
/guilsinglright /oe /bullet /zcaron /Ydieresis
/space /exclamdown /cent /sterling /currency
/yen /brokenbar /section /dieresis /copyright
/ordfeminine /guillemotleft /logicalnot /sfthyphen /registered
/macron /degree /plusminus /twosuperior /threesuperior
/acute /mu /paragraph /middot /cedilla
/onesuperior /ordmasculine /guillemotright /onequarter /onehalf
/threequarters /questiondown /Agrave /Aacute /Acircumflex
/Atilde /Adieresis /Aring /AE /Ccedilla
/Egrave /Eacute /Ecircumflex /Edieresis /Igrave
/Iacute /Icircumflex /Idieresis /Eth /Ntilde
/Ograve /Oacute /Ocircumflex /Otilde /Odieresis
/multiply /Oslash /Ugrave /Uacute /Ucircumflex
/Udieresis /Yacute /Thorn /germandbls /agrave
/aacute /acircumflex /atilde /adieresis /aring
/ae /ccedilla /egrave /eacute /ecircumflex
/edieresis /igrave /iacute /icircumflex /idieresis
/eth /ntilde /ograve /oacute /ocircumflex
/otilde /odieresis /divide /oslash /ugrave
/uacute /ucircumflex /udieresis /yacute /thorn
/ydieresis
] def
%%EndResource
%FOPBeginFontReencode
/Courier-Oblique findfont
dup length dict begin
  {1 index /FID ne {def} {pop pop} ifelse} forall
  /Encoding WinAnsiEncoding def
  currentdict
end
/Courier-Oblique exch definefont pop
/Courier-BoldOblique findfont
dup length dict begin
  {1 index /FID ne {def} {pop pop} ifelse} forall
  /Encoding WinAnsiEncoding def
  currentdict
end
/Courier-BoldOblique exch definefont pop
/Courier-Bold findfont
dup length dict begin
  {1 index /FID ne {def} {pop pop} ifelse} forall
  /Encoding WinAnsiEncoding def
  currentdict
end
/Courier-Bold exch definefont pop
/Helvetica findfont
dup length dict begin
  {1 index /FID ne {def} {pop pop} ifelse} forall
  /Encoding WinAnsiEncoding def
  currentdict
end
/Helvetica exch definefont pop
/Helvetica-Oblique findfont
dup length dict begin
  {1 index /FID ne {def} {pop pop} ifelse} forall
  /Encoding WinAnsiEncoding def
  currentdict
end
/Helvetica-Oblique exch definefont pop
/Helvetica-Bold findfont
dup length dict begin
  {1 index /FID ne {def} {pop pop} ifelse} forall
  /Encoding WinAnsiEncoding def
  currentdict
end
/Helvetica-Bold exch definefont pop
/Helvetica-BoldOblique findfont
dup length dict begin
  {1 index /FID ne {def} {pop pop} ifelse} forall
  /Encoding WinAnsiEncoding def
  currentdict
end
/Helvetica-BoldOblique exch definefont pop
/Times-Roman findfont
dup length dict begin
  {1 index /FID ne {def} {pop pop} ifelse} forall
  /Encoding WinAnsiEncoding def
  currentdict
end
/Times-Roman exch definefont pop
/Times-Italic findfont
dup length dict begin
  {1 index /FID ne {def} {pop pop} ifelse} forall
  /Encoding WinAnsiEncoding def
  currentdict
end
/Times-Italic exch definefont pop
/Times-Bold findfont
dup length dict begin
  {1 index /FID ne {def} {pop pop} ifelse} forall
  /Encoding WinAnsiEncoding def
  currentdict
end
/Times-Bold exch definefont pop
/Times-BoldItalic findfont
dup length dict begin
  {1 index /FID ne {def} {pop pop} ifelse} forall
  /Encoding WinAnsiEncoding def
  currentdict
end
/Times-BoldItalic exch definefont pop
/Courier findfont
dup length dict begin
  {1 index /FID ne {def} {pop pop} ifelse} forall
  /Encoding WinAnsiEncoding def
  currentdict
end
/Courier exch definefont pop
%FOPEndFontReencode
%%EndProlog
%%Page: 1 1
%%PageBoundingBox: 0 0 720 573
%%BeginPageSetup
[1 0 0 -1 0 573] CT
%%EndPageSetup
GS
[0.75 0 0 0.75 0 0] CT
1 GC
N
0 0 960 764 re
f
GR
GS
[0.75 0 0 0.75 0 0] CT
1 GC
N
0 0 960 764 re
f
GR
GS
[0.75 0 0 0.75 532.1255 291.5625] CT
/Helvetica-Bold 14.667 F
GS
[1 0 0 1 0 0] CT
-74 -4 moveto 
1 -1 scale
(EN Profitability SM02) t 
GR
GR
GS
[0.75 0 0 0.75 0 0] CT
0.302 0.749 0.929 RC
N
576.028 495 M
573.445 502.721 L
701.521 541.266 L
701.521 407.516 L
693.383 407.764 L
685.276 408.506 L
677.229 409.74 L
669.271 411.462 L
661.434 413.665 L
653.744 416.34 L
646.232 419.478 L
638.925 423.068 L
631.849 427.095 L
625.032 431.546 L
618.498 436.402 L
612.272 441.648 L
606.376 447.263 L
600.833 453.225 L
595.663 459.514 L
590.886 466.107 L
586.518 472.977 L
582.576 480.1 L
579.075 487.451 L
cp
f
GR
GS
[0.75 0 0 0.75 0 0] CT
0.094 0.749 0.71 RC
N
618.353 649.884 M
624.578 655.331 L
631.127 660.383 L
637.977 665.02 L
645.1 669.225 L
652.469 672.981 L
660.056 676.275 L
667.833 679.094 L
675.768 681.427 L
683.833 683.264 L
691.996 684.6 L
700.226 685.428 L
708.492 685.746 L
716.761 685.553 L
725.002 684.849 L
733.184 683.636 L
741.276 681.921 L
749.246 679.708 L
757.064 677.007 L
764.7 673.828 L
772.125 670.183 L
779.311 666.085 L
786.229 661.552 L
792.855 656.6 L
799.161 651.247 L
805.124 645.515 L
810.722 639.425 L
815.932 633.001 L
820.736 626.268 L
825.114 619.25 L
829.05 611.975 L
832.528 604.47 L
835.536 596.765 L
838.062 588.889 L
840.097 580.871 L
841.632 572.743 L
842.661 564.536 L
843.181 556.281 L
843.19 548.009 L
842.688 539.753 L
841.676 531.544 L
840.159 523.413 L
838.142 515.391 L
835.633 507.509 L
709.5 552 L
581.424 513.455 L
579.287 521.446 L
577.647 529.553 L
576.512 537.746 L
575.885 545.994 L
575.769 554.265 L
576.165 562.527 L
577.071 570.748 L
578.483 578.899 L
580.396 586.946 L
582.803 594.859 L
585.695 602.609 L
589.06 610.165 L
592.885 617.499 L
597.157 624.582 L
601.858 631.387 L
606.971 637.889 L
612.477 644.063 L
cp
f
GR
GS
[0.75 0 0 0.75 0 0] CT
0 0.451 0.741 RC
N
709.5 418.25 M
709.5 552 L
835.633 507.509 L
832.656 499.83 L
829.212 492.35 L
825.314 485.095 L
820.976 478.094 L
816.216 471.373 L
811.052 464.958 L
805.502 458.873 L
799.589 453.141 L
793.334 447.784 L
786.761 442.822 L
779.895 438.274 L
772.762 434.157 L
765.389 430.487 L
757.805 427.277 L
750.037 424.541 L
742.116 422.288 L
734.07 420.526 L
725.932 419.263 L
717.732 418.504 L
cp
f
GR
GS
[0.75 0 0 0.75 468.56177 326.39257] CT
/Helvetica 18.667 F
GS
[1 0 0 1 0 0] CT
-92 -5 moveto 
1 -1 scale
(Profit: 20%) t 
GR
GR
GS
[0.75 0 0 0.75 534.70532 453.81358] CT
1 GC
/Helvetica-Bold 18.667 F
GS
[1 0 0 1 0 0] CT
-63.5 19 moveto 
1 -1 scale
(Invariant: 60%) t 
GR
GR
GS
[0.75 0 0 0.75 600.36497 335.17802] CT
/Helvetica 18.667 F
GS
[1 0 0 1 0 0] CT
0 -5 moveto 
1 -1 scale
(Degraded: 20%) t 
GR
GR
GS
[0.75 0 0 0.75 214.87521 291.5625] CT
/Helvetica-Bold 14.667 F
GS
[1 0 0 1 0 0] CT
-79 -4 moveto 
1 -1 scale
(ENU Profitability SM01) t 
GR
GR
GS
[0.75 0 0 0.75 0 0] CT
0.302 0.749 0.929 RC
N
151.543 498.872 M
149.139 506.858 L
278.354 541.392 L
278.354 407.642 L
270.019 407.902 L
261.715 408.681 L
253.477 409.976 L
245.335 411.782 L
237.321 414.091 L
229.467 416.896 L
221.803 420.185 L
214.359 423.945 L
207.164 428.162 L
200.245 432.819 L
193.63 437.898 L
187.345 443.38 L
181.413 449.242 L
175.859 455.463 L
170.703 462.018 L
165.965 468.882 L
161.664 476.027 L
157.817 483.427 L
154.439 491.052 L
cp
f
GR
GS
[0.75 0 0 0.75 0 0] CT
0.094 0.749 0.71 RC
N
206.401 659.113 M
213.261 663.916 L
220.409 668.28 L
227.816 672.188 L
235.453 675.625 L
243.29 678.578 L
251.296 681.034 L
259.44 682.984 L
267.691 684.421 L
276.015 685.338 L
284.38 685.733 L
292.754 685.604 L
301.103 684.95 L
309.395 683.776 L
317.597 682.085 L
325.677 679.884 L
333.603 677.181 L
341.345 673.988 L
348.872 670.316 L
356.154 666.181 L
363.164 661.598 L
369.872 656.585 L
376.254 651.163 L
382.284 645.351 L
387.939 639.174 L
393.195 632.655 L
398.034 625.819 L
402.435 618.694 L
406.382 611.308 L
409.858 603.689 L
412.851 595.868 L
415.349 587.874 L
417.342 579.74 L
418.821 571.497 L
419.782 563.178 L
420.22 554.815 L
420.134 546.441 L
419.525 538.088 L
418.393 529.791 L
416.745 521.58 L
414.586 513.488 L
411.924 505.548 L
286.5 552 L
157.285 517.467 L
155.377 525.621 L
153.983 533.879 L
153.109 542.208 L
152.758 550.575 L
152.931 558.948 L
153.627 567.293 L
154.845 575.579 L
156.579 583.772 L
158.822 591.841 L
161.565 599.753 L
164.799 607.478 L
168.509 614.986 L
172.682 622.247 L
177.302 629.232 L
182.349 635.915 L
187.805 642.268 L
193.648 648.268 L
199.855 653.89 L
cp
f
GR
GS
[0.75 0 0 0.75 0 0] CT
0 0.451 0.741 RC
N
286.5 418.25 M
286.5 552 L
411.924 505.548 L
408.87 498.012 L
405.363 490.676 L
401.417 483.566 L
397.046 476.709 L
392.266 470.131 L
387.096 463.855 L
381.554 457.905 L
375.66 452.303 L
369.437 447.069 L
362.907 442.223 L
356.095 437.783 L
349.026 433.765 L
341.725 430.184 L
334.221 427.053 L
326.54 424.384 L
318.711 422.187 L
310.763 420.469 L
302.725 419.238 L
294.628 418.497 L
cp
f
GR
GS
[0.75 0 0 0.75 141.56433 318.52389] CT
/Helvetica 18.667 F
GS
[1 0 0 1 0 0] CT
-92 -5 moveto 
1 -1 scale
(Profit: 21%) t 
GR
GR
GS
[0.75 0 0 0.75 217.03423 459.72308] CT
1 GC
/Helvetica-Bold 18.667 F
GS
[1 0 0 1 0 0] CT
-63.5 19 moveto 
1 -1 scale
(Invariant: 60%) t 
GR
GR
GS
[0.75 0 0 0.75 294.41087 351.93388] CT
/Helvetica 18.667 F
GS
[1 0 0 1 0 0] CT
0 -5 moveto 
1 -1 scale
(Degraded: 19%) t 
GR
GR
GS
[0.75 0 0 0.75 220.12521 30.1875] CT
/Helvetica-Bold 14.667 F
GS
[1 0 0 1 0 0] CT
-79 -4 moveto 
1 -1 scale
(ENU Profitability SM01) t 
GR
GR
GS
[0.75 0 0 0.75 0 0] CT
0.302 0.749 0.929 RC
N
176.165 286.673 M
181.624 293.006 L
187.468 298.986 L
193.674 304.589 L
200.218 309.794 L
207.075 314.579 L
214.217 318.927 L
221.617 322.82 L
229.245 326.243 L
237.073 329.182 L
245.069 331.627 L
253.202 333.567 L
261.44 334.996 L
280.158 202.562 L
280.158 68.812 L
271.801 69.073 L
263.476 69.856 L
255.217 71.158 L
247.055 72.973 L
239.022 75.295 L
231.151 78.114 L
223.47 81.419 L
216.012 85.198 L
208.804 89.435 L
201.874 94.115 L
195.251 99.218 L
188.96 104.725 L
183.025 110.615 L
177.469 116.864 L
172.315 123.448 L
167.583 130.341 L
163.29 137.516 L
159.454 144.946 L
156.09 152.6 L
153.21 160.45 L
150.827 168.465 L
148.949 176.612 L
147.584 184.862 L
146.737 193.18 L
146.412 201.535 L
146.609 209.894 L
147.328 218.224 L
148.566 226.493 L
150.319 234.669 L
152.579 242.719 L
155.337 250.612 L
158.583 258.318 L
162.305 265.805 L
166.487 273.045 L
171.113 280.01 L
cp
f
GR
GS
[0.75 0 0 0.75 0 0] CT
0.094 0.749 0.71 RC
N
290.929 337.225 M
299.032 337.136 L
307.114 336.555 L
315.146 335.487 L
323.099 333.934 L
330.943 331.902 L
338.649 329.399 L
346.19 326.434 L
353.538 323.018 L
360.665 319.163 L
367.546 314.883 L
374.155 310.195 L
380.468 305.115 L
386.461 299.663 L
392.114 293.857 L
397.405 287.719 L
402.314 281.273 L
406.824 274.541 L
410.918 267.548 L
414.581 260.32 L
293.5 203.5 L
274.782 335.934 L
282.836 336.824 L
cp
f
GR
GS
[0.75 0 0 0.75 0 0] CT
0 0.451 0.741 RC
N
293.5 69.75 M
293.5 203.5 L
414.581 260.32 L
417.908 252.61 L
420.745 244.705 L
423.08 236.639 L
424.904 228.441 L
426.21 220.145 L
426.993 211.784 L
427.25 203.39 L
426.979 194.996 L
426.183 186.636 L
424.863 178.343 L
423.025 170.148 L
420.677 162.085 L
417.827 154.186 L
414.487 146.48 L
410.67 139 L
406.391 131.774 L
401.667 124.83 L
396.517 118.197 L
390.96 111.9 L
385.02 105.964 L
378.718 100.413 L
372.081 95.268 L
365.133 90.55 L
357.904 86.277 L
350.42 82.466 L
342.712 79.133 L
334.81 76.289 L
326.745 73.948 L
318.549 72.117 L
310.255 70.804 L
301.894 70.014 L
cp
f
GR
GS
[0.75 0 0 0.75 100.0465 144.18123] CT
/Helvetica 18.667 F
GS
[1 0 0 1 0 0] CT
-92 7 moveto 
1 -1 scale
(Profit: 48%) t 
GR
GR
GS
[0.75 0 0 0.75 291.3704 222.68156] CT
/Helvetica 18.667 F
GS
[1 0 0 1 0 0] CT
0 19 moveto 
1 -1 scale
(Invariant: 20%) t 
GR
GR
GS
[0.75 0 0 0.75 296.76018 79.20082] CT
/Helvetica 18.667 F
GS
[1 0 0 1 0 0] CT
0 -5 moveto 
1 -1 scale
(Degraded: 32%) t 
GR
GR
GS
[0.75 0 0 0.75 537.3755 30.1875] CT
/Helvetica-Bold 14.667 F
GS
[1 0 0 1 0 0] CT
-74 -4 moveto 
1 -1 scale
(EN Profitability SM02) t 
GR
GR
GS
[0.75 0 0 0.75 0 0] CT
0.302 0.749 0.929 RC
N
576.985 238.388 M
579.779 246.287 L
583.061 253.994 L
586.819 261.482 L
591.039 268.719 L
595.703 275.678 L
600.795 282.331 L
704.417 197.765 L
704.417 64.015 L
696.044 64.277 L
687.703 65.063 L
679.428 66.37 L
671.251 68.192 L
663.204 70.523 L
655.319 73.353 L
647.626 76.671 L
640.156 80.463 L
632.939 84.717 L
626.001 89.413 L
619.372 94.535 L
613.076 100.062 L
607.138 105.972 L
601.582 112.242 L
596.43 118.848 L
591.701 125.764 L
587.414 132.962 L
583.587 140.414 L
580.233 148.091 L
577.367 155.963 L
574.999 163.999 L
573.139 172.167 L
571.794 180.436 L
570.97 188.773 L
570.668 197.145 L
570.892 205.52 L
571.639 213.864 L
572.908 222.145 L
574.692 230.331 L
cp
f
GR
GS
[0.75 0 0 0.75 0 0] CT
0.094 0.749 0.71 RC
N
636.82 310.925 M
643.633 315.658 L
650.726 319.96 L
658.072 323.813 L
665.643 327.204 L
673.41 330.119 L
681.342 332.547 L
689.41 334.478 L
697.582 335.905 L
705.827 336.823 L
714.112 337.229 L
722.407 337.119 L
730.679 336.496 L
738.897 335.361 L
747.028 333.719 L
755.042 331.576 L
762.908 328.941 L
770.595 325.822 L
778.074 322.234 L
785.317 318.188 L
792.294 313.701 L
798.98 308.791 L
805.349 303.475 L
811.376 297.775 L
817.037 291.712 L
822.313 285.309 L
827.181 278.592 L
831.623 271.586 L
835.622 264.319 L
839.164 256.817 L
842.233 249.11 L
844.819 241.228 L
846.911 233.2 L
848.501 225.058 L
849.584 216.834 L
850.154 208.558 L
850.211 200.262 L
849.753 191.98 L
848.782 183.741 L
847.303 175.578 L
845.321 167.523 L
842.842 159.606 L
839.878 151.858 L
836.44 144.309 L
832.539 136.988 L
828.193 129.922 L
823.417 123.139 L
818.229 116.666 L
812.65 110.526 L
806.702 104.744 L
800.406 99.342 L
793.788 94.341 L
786.872 89.76 L
779.685 85.616 L
772.256 81.926 L
716.5 203.5 L
612.878 288.066 L
618.319 294.327 L
624.139 300.239 L
630.314 305.779 L
cp
f
GR
GS
[0.75 0 0 0.75 0 0] CT
0 0.451 0.741 RC
N
716.5 69.75 M
716.5 203.5 L
772.256 81.926 L
764.687 78.732 L
756.937 76.009 L
749.034 73.767 L
741.009 72.015 L
732.891 70.758 L
724.711 70.002 L
cp
f
GR
GS
[0.75 0 0 0.75 471.37798 62.0089] CT
/Helvetica 18.667 F
GS
[1 0 0 1 0 0] CT
-92 -5 moveto 
1 -1 scale
(Profit: 36%) t 
GR
GR
GS
[0.75 0 0 0.75 533.17039 190.86765] CT
/Helvetica 13.333 F
GS
[1 0 0 1 0 0] CT
0 14 moveto 
1 -1 scale
(Invariant: 57%) t 
GR
GR
GS
[0.75 0 0 0.75 594.66628 54.5717] CT
/Helvetica 18.667 F
GS
[1 0 0 1 0 0] CT
-60 -5 moveto 
1 -1 scale
(Degraded: 7%) t 
GR
GR
%%Trailer
%%Pages: 1
%%EOF
