%!PS-Adobe-3.0 EPSF-3.0
%%Creator: (MATLAB, The Mathworks, Inc. Version 9.5.0.944444 \(R2018b\). Operating System: Windows 10)
%%Title: (C:/Users/Alex/Documents/PhD Docs/01. GIT/my_phd_thesis/Chapter8/Figures/capsloc_res/exampleTests_improvement.eps)
%%CreationDate: 2019-11-07T10:24:23
%%Pages: (atend)
%%BoundingBox: 0 0 864 608
%%LanguageLevel: 3
%%EndComments
%%BeginProlog
%%BeginResource: procset (Apache XML Graphics Std ProcSet) 1.2 0
%%Version: 1.2 0
%%Copyright: (Copyright 2001-2003,2010 The Apache Software Foundation. License terms: http://www.apache.org/licenses/LICENSE-2.0)
/bd{bind def}bind def
/ld{load def}bd
/GR/grestore ld
/GS/gsave ld
/RM/rmoveto ld
/C/curveto ld
/t/show ld
/L/lineto ld
/ML/setmiterlimit ld
/CT/concat ld
/f/fill ld
/N/newpath ld
/S/stroke ld
/CC/setcmykcolor ld
/A/ashow ld
/cp/closepath ld
/RC/setrgbcolor ld
/LJ/setlinejoin ld
/GC/setgray ld
/LW/setlinewidth ld
/M/moveto ld
/re {4 2 roll M
1 index 0 rlineto
0 exch rlineto
neg 0 rlineto
cp } bd
/_ctm matrix def
/_tm matrix def
/BT { _ctm currentmatrix pop matrix _tm copy pop 0 0 moveto } bd
/ET { _ctm setmatrix } bd
/iTm { _ctm setmatrix _tm concat } bd
/Tm { _tm astore pop iTm 0 0 moveto } bd
/ux 0.0 def
/uy 0.0 def
/F {
  /Tp exch def
  /Tf exch def
  Tf findfont Tp scalefont setfont
  /cf Tf def  /cs Tp def
} bd
/ULS {currentpoint /uy exch def /ux exch def} bd
/ULE {
  /Tcx currentpoint pop def
  gsave
  newpath
  cf findfont cs scalefont dup
  /FontMatrix get 0 get /Ts exch def /FontInfo get dup
  /UnderlinePosition get Ts mul /To exch def
  /UnderlineThickness get Ts mul /Tt exch def
  ux uy To add moveto  Tcx uy To add lineto
  Tt setlinewidth stroke
  grestore
} bd
/OLE {
  /Tcx currentpoint pop def
  gsave
  newpath
  cf findfont cs scalefont dup
  /FontMatrix get 0 get /Ts exch def /FontInfo get dup
  /UnderlinePosition get Ts mul /To exch def
  /UnderlineThickness get Ts mul /Tt exch def
  ux uy To add cs add moveto Tcx uy To add cs add lineto
  Tt setlinewidth stroke
  grestore
} bd
/SOE {
  /Tcx currentpoint pop def
  gsave
  newpath
  cf findfont cs scalefont dup
  /FontMatrix get 0 get /Ts exch def /FontInfo get dup
  /UnderlinePosition get Ts mul /To exch def
  /UnderlineThickness get Ts mul /Tt exch def
  ux uy To add cs 10 mul 26 idiv add moveto Tcx uy To add cs 10 mul 26 idiv add lineto
  Tt setlinewidth stroke
  grestore
} bd
/QT {
/Y22 exch store
/X22 exch store
/Y21 exch store
/X21 exch store
currentpoint
/Y21 load 2 mul add 3 div exch
/X21 load 2 mul add 3 div exch
/X21 load 2 mul /X22 load add 3 div
/Y21 load 2 mul /Y22 load add 3 div
/X22 load /Y22 load curveto
} bd
/SSPD {
dup length /d exch dict def
{
/v exch def
/k exch def
currentpagedevice k known {
/cpdv currentpagedevice k get def
v cpdv ne {
/upd false def
/nullv v type /nulltype eq def
/nullcpdv cpdv type /nulltype eq def
nullv nullcpdv or
{
/upd true def
} {
/sametype v type cpdv type eq def
sametype {
v type /arraytype eq {
/vlen v length def
/cpdvlen cpdv length def
vlen cpdvlen eq {
0 1 vlen 1 sub {
/i exch def
/obj v i get def
/cpdobj cpdv i get def
obj cpdobj ne {
/upd true def
exit
} if
} for
} {
/upd true def
} ifelse
} {
v type /dicttype eq {
v {
/dv exch def
/dk exch def
/cpddv cpdv dk get def
dv cpddv ne {
/upd true def
exit
} if
} forall
} {
/upd true def
} ifelse
} ifelse
} if
} ifelse
upd true eq {
d k v put
} if
} if
} if
} forall
d length 0 gt {
d setpagedevice
} if
} bd
/RE { % /NewFontName [NewEncodingArray] /FontName RE -
  findfont dup length dict begin
  {
    1 index /FID ne
    {def} {pop pop} ifelse
  } forall
  /Encoding exch def
  /FontName 1 index def
  currentdict definefont pop
  end
} bind def
%%EndResource
%%BeginResource: procset (Apache XML Graphics EPS ProcSet) 1.0 0
%%Version: 1.0 0
%%Copyright: (Copyright 2002-2003 The Apache Software Foundation. License terms: http://www.apache.org/licenses/LICENSE-2.0)
/BeginEPSF { %def
/b4_Inc_state save def         % Save state for cleanup
/dict_count countdictstack def % Count objects on dict stack
/op_count count 1 sub def      % Count objects on operand stack
userdict begin                 % Push userdict on dict stack
/showpage { } def              % Redefine showpage, { } = null proc
0 setgray 0 setlinecap         % Prepare graphics state
1 setlinewidth 0 setlinejoin
10 setmiterlimit [ ] 0 setdash newpath
/languagelevel where           % If level not equal to 1 then
{pop languagelevel             % set strokeadjust and
1 ne                           % overprint to their defaults.
{false setstrokeadjust false setoverprint
} if
} if
} bd
/EndEPSF { %def
count op_count sub {pop} repeat            % Clean up stacks
countdictstack dict_count sub {end} repeat
b4_Inc_state restore
} bd
%%EndResource
%FOPBeginFontDict
%%IncludeResource: font Courier-Oblique
%%IncludeResource: font Courier-BoldOblique
%%IncludeResource: font Courier-Bold
%%IncludeResource: font ZapfDingbats
%%IncludeResource: font Symbol
%%IncludeResource: font Helvetica
%%IncludeResource: font Helvetica-Oblique
%%IncludeResource: font Helvetica-Bold
%%IncludeResource: font Helvetica-BoldOblique
%%IncludeResource: font Times-Roman
%%IncludeResource: font Times-Italic
%%IncludeResource: font Times-Bold
%%IncludeResource: font Times-BoldItalic
%%IncludeResource: font Courier
%FOPEndFontDict
%%BeginResource: encoding WinAnsiEncoding
/WinAnsiEncoding [
/.notdef /.notdef /.notdef /.notdef /.notdef
/.notdef /.notdef /.notdef /.notdef /.notdef
/.notdef /.notdef /.notdef /.notdef /.notdef
/.notdef /.notdef /.notdef /.notdef /.notdef
/.notdef /.notdef /.notdef /.notdef /.notdef
/.notdef /.notdef /.notdef /.notdef /.notdef
/.notdef /.notdef /space /exclam /quotedbl
/numbersign /dollar /percent /ampersand /quotesingle
/parenleft /parenright /asterisk /plus /comma
/hyphen /period /slash /zero /one
/two /three /four /five /six
/seven /eight /nine /colon /semicolon
/less /equal /greater /question /at
/A /B /C /D /E
/F /G /H /I /J
/K /L /M /N /O
/P /Q /R /S /T
/U /V /W /X /Y
/Z /bracketleft /backslash /bracketright /asciicircum
/underscore /quoteleft /a /b /c
/d /e /f /g /h
/i /j /k /l /m
/n /o /p /q /r
/s /t /u /v /w
/x /y /z /braceleft /bar
/braceright /asciitilde /bullet /Euro /bullet
/quotesinglbase /florin /quotedblbase /ellipsis /dagger
/daggerdbl /circumflex /perthousand /Scaron /guilsinglleft
/OE /bullet /Zcaron /bullet /bullet
/quoteleft /quoteright /quotedblleft /quotedblright /bullet
/endash /emdash /asciitilde /trademark /scaron
/guilsinglright /oe /bullet /zcaron /Ydieresis
/space /exclamdown /cent /sterling /currency
/yen /brokenbar /section /dieresis /copyright
/ordfeminine /guillemotleft /logicalnot /sfthyphen /registered
/macron /degree /plusminus /twosuperior /threesuperior
/acute /mu /paragraph /middot /cedilla
/onesuperior /ordmasculine /guillemotright /onequarter /onehalf
/threequarters /questiondown /Agrave /Aacute /Acircumflex
/Atilde /Adieresis /Aring /AE /Ccedilla
/Egrave /Eacute /Ecircumflex /Edieresis /Igrave
/Iacute /Icircumflex /Idieresis /Eth /Ntilde
/Ograve /Oacute /Ocircumflex /Otilde /Odieresis
/multiply /Oslash /Ugrave /Uacute /Ucircumflex
/Udieresis /Yacute /Thorn /germandbls /agrave
/aacute /acircumflex /atilde /adieresis /aring
/ae /ccedilla /egrave /eacute /ecircumflex
/edieresis /igrave /iacute /icircumflex /idieresis
/eth /ntilde /ograve /oacute /ocircumflex
/otilde /odieresis /divide /oslash /ugrave
/uacute /ucircumflex /udieresis /yacute /thorn
/ydieresis
] def
%%EndResource
%FOPBeginFontReencode
/Courier-Oblique findfont
dup length dict begin
  {1 index /FID ne {def} {pop pop} ifelse} forall
  /Encoding WinAnsiEncoding def
  currentdict
end
/Courier-Oblique exch definefont pop
/Courier-BoldOblique findfont
dup length dict begin
  {1 index /FID ne {def} {pop pop} ifelse} forall
  /Encoding WinAnsiEncoding def
  currentdict
end
/Courier-BoldOblique exch definefont pop
/Courier-Bold findfont
dup length dict begin
  {1 index /FID ne {def} {pop pop} ifelse} forall
  /Encoding WinAnsiEncoding def
  currentdict
end
/Courier-Bold exch definefont pop
/Helvetica findfont
dup length dict begin
  {1 index /FID ne {def} {pop pop} ifelse} forall
  /Encoding WinAnsiEncoding def
  currentdict
end
/Helvetica exch definefont pop
/Helvetica-Oblique findfont
dup length dict begin
  {1 index /FID ne {def} {pop pop} ifelse} forall
  /Encoding WinAnsiEncoding def
  currentdict
end
/Helvetica-Oblique exch definefont pop
/Helvetica-Bold findfont
dup length dict begin
  {1 index /FID ne {def} {pop pop} ifelse} forall
  /Encoding WinAnsiEncoding def
  currentdict
end
/Helvetica-Bold exch definefont pop
/Helvetica-BoldOblique findfont
dup length dict begin
  {1 index /FID ne {def} {pop pop} ifelse} forall
  /Encoding WinAnsiEncoding def
  currentdict
end
/Helvetica-BoldOblique exch definefont pop
/Times-Roman findfont
dup length dict begin
  {1 index /FID ne {def} {pop pop} ifelse} forall
  /Encoding WinAnsiEncoding def
  currentdict
end
/Times-Roman exch definefont pop
/Times-Italic findfont
dup length dict begin
  {1 index /FID ne {def} {pop pop} ifelse} forall
  /Encoding WinAnsiEncoding def
  currentdict
end
/Times-Italic exch definefont pop
/Times-Bold findfont
dup length dict begin
  {1 index /FID ne {def} {pop pop} ifelse} forall
  /Encoding WinAnsiEncoding def
  currentdict
end
/Times-Bold exch definefont pop
/Times-BoldItalic findfont
dup length dict begin
  {1 index /FID ne {def} {pop pop} ifelse} forall
  /Encoding WinAnsiEncoding def
  currentdict
end
/Times-BoldItalic exch definefont pop
/Courier findfont
dup length dict begin
  {1 index /FID ne {def} {pop pop} ifelse} forall
  /Encoding WinAnsiEncoding def
  currentdict
end
/Courier exch definefont pop
%FOPEndFontReencode
%%EndProlog
%%Page: 1 1
%%PageBoundingBox: 0 0 864 608
%%BeginPageSetup
[1 0 0 -1 0 608] CT
%%EndPageSetup
GS
[0.75 0 0 0.75 0 -0.25] CT
1 GC
N
0 0 1152 811 re
f
GR
GS
[0.75 0 0 0.75 0 -0.25] CT
1 GC
N
0 0 1152 811 re
f
GR
GS
[0.75 0 0 0.75 0 -0.25] CT
1 GC
N
79 780 M
295 780 L
295 454 L
79 454 L
cp
f
GR
GS
[0.75 0 0 0.75 140.25014 337.3625] CT
/Helvetica-Bold 20.533 F
GS
[1 0 0 1 0 0] CT
-27 -5 moveto 
1 -1 scale
(SM01) t 
GR
GR
GS
[0.75 0 0 0.75 0 -0.25] CT
0.149 GC
1 LJ
0.667 LW
N
79 780 M
295 780 L
S
GR
GS
[0.75 0 0 0.75 0 -0.25] CT
0 0.447 0.741 RC
N
180.647 780 M
180.647 642.132 L
129.824 642.132 L
129.824 780 L
cp
244.176 780 M
244.176 733.933 L
193.353 733.933 L
193.353 780 L
cp
f
GR
GS
[0.75 0 0 0.75 0 -0.25] CT
10.0 ML
0.667 LW
N
129.824 780 M
129.824 642.132 L
180.647 642.132 L
180.647 780 L
cp
S
GR
GS
[0.75 0 0 0.75 0 -0.25] CT
10.0 ML
0.667 LW
N
193.353 780 M
193.353 733.933 L
244.176 733.933 L
244.176 780 L
cp
S
GR
GS
[0.75 0 0 0.75 0 -0.25] CT
0.863 GC
N
180.647 642.132 M
180.647 471.846 L
129.824 471.846 L
129.824 642.132 L
cp
244.176 733.933 M
244.176 655.212 L
193.353 655.212 L
193.353 733.933 L
cp
f
GR
GS
[0.75 0 0 0.75 0 -0.25] CT
10.0 ML
0.667 LW
N
129.824 642.132 M
129.824 471.846 L
180.647 471.846 L
180.647 642.132 L
cp
S
GR
GS
[0.75 0 0 0.75 0 -0.25] CT
10.0 ML
0.667 LW
N
193.353 733.933 M
193.353 655.212 L
244.176 655.212 L
244.176 733.933 L
cp
S
GR
GS
[0.75 0 0 0.75 0 -0.25] CT
0.149 GC
2 setlinecap
1 LJ
0.667 LW
N
79 780 M
295 780 L
S
GR
GS
[0.75 0 0 0.75 0 -0.25] CT
0.149 GC
2 setlinecap
1 LJ
0.667 LW
N
79 454 M
295 454 L
S
GR
GS
[0.75 0 0 0.75 0 -0.25] CT
0.149 GC
2 setlinecap
1 LJ
0.667 LW
N
155.235 780 M
155.235 776.74 L
S
GR
GS
[0.75 0 0 0.75 0 -0.25] CT
0.149 GC
2 setlinecap
1 LJ
0.667 LW
N
218.765 780 M
218.765 776.74 L
S
GR
GS
[0.75 0 0 0.75 0 -0.25] CT
0.149 GC
2 setlinecap
1 LJ
0.667 LW
N
155.235 454 M
155.235 457.26 L
S
GR
GS
[0.75 0 0 0.75 0 -0.25] CT
0.149 GC
2 setlinecap
1 LJ
0.667 LW
N
218.765 454 M
218.765 457.26 L
S
GR
GS
[0.75 0 0 0.75 116.42647 589.55002] CT
0.149 GC
/Helvetica 18.667 F
GS
[1 0 0 1 0 0] CT
-12 19 moveto 
1 -1 scale
(3D) t 
GR
GR
GS
[0.75 0 0 0.75 164.07353 589.55002] CT
0.149 GC
/Helvetica 18.667 F
GS
[1 0 0 1 0 0] CT
-12 19 moveto 
1 -1 scale
(2D) t 
GR
GR
GS
[0.75 0 0 0.75 0 -0.25] CT
0.149 GC
2 setlinecap
1 LJ
0.667 LW
N
79 780 M
79 454 L
S
GR
GS
[0.75 0 0 0.75 0 -0.25] CT
0.149 GC
2 setlinecap
1 LJ
0.667 LW
N
295 780 M
295 454 L
S
GR
GS
[0.75 0 0 0.75 0 -0.25] CT
0.149 GC
2 setlinecap
1 LJ
0.667 LW
N
79 780 M
82.26 780 L
S
GR
GS
[0.75 0 0 0.75 0 -0.25] CT
0.149 GC
2 setlinecap
1 LJ
0.667 LW
N
79 698.5 M
82.26 698.5 L
S
GR
GS
[0.75 0 0 0.75 0 -0.25] CT
0.149 GC
2 setlinecap
1 LJ
0.667 LW
N
79 617 M
82.26 617 L
S
GR
GS
[0.75 0 0 0.75 0 -0.25] CT
0.149 GC
2 setlinecap
1 LJ
0.667 LW
N
79 535.5 M
82.26 535.5 L
S
GR
GS
[0.75 0 0 0.75 0 -0.25] CT
0.149 GC
2 setlinecap
1 LJ
0.667 LW
N
79 454 M
82.26 454 L
S
GR
GS
[0.75 0 0 0.75 0 -0.25] CT
0.149 GC
2 setlinecap
1 LJ
0.667 LW
N
295 780 M
291.74 780 L
S
GR
GS
[0.75 0 0 0.75 0 -0.25] CT
0.149 GC
2 setlinecap
1 LJ
0.667 LW
N
295 698.5 M
291.74 698.5 L
S
GR
GS
[0.75 0 0 0.75 0 -0.25] CT
0.149 GC
2 setlinecap
1 LJ
0.667 LW
N
295 617 M
291.74 617 L
S
GR
GS
[0.75 0 0 0.75 0 -0.25] CT
0.149 GC
2 setlinecap
1 LJ
0.667 LW
N
295 535.5 M
291.74 535.5 L
S
GR
GS
[0.75 0 0 0.75 0 -0.25] CT
0.149 GC
2 setlinecap
1 LJ
0.667 LW
N
295 454 M
291.74 454 L
S
GR
GS
[0.75 0 0 0.75 54.45 584.75] CT
0.149 GC
/Helvetica 18.667 F
GS
[1 0 0 1 0 0] CT
-11 7 moveto 
1 -1 scale
(0) t 
GR
GR
GS
[0.75 0 0 0.75 54.45 523.625] CT
0.149 GC
/Helvetica 18.667 F
GS
[1 0 0 1 0 0] CT
-21 7 moveto 
1 -1 scale
(10) t 
GR
GR
GS
[0.75 0 0 0.75 54.45 462.5] CT
0.149 GC
/Helvetica 18.667 F
GS
[1 0 0 1 0 0] CT
-21 7 moveto 
1 -1 scale
(20) t 
GR
GR
GS
[0.75 0 0 0.75 54.45 401.375] CT
0.149 GC
/Helvetica 18.667 F
GS
[1 0 0 1 0 0] CT
-21 7 moveto 
1 -1 scale
(30) t 
GR
GR
GS
[0.75 0 0 0.75 54.45 340.25] CT
0.149 GC
/Helvetica 18.667 F
GS
[1 0 0 1 0 0] CT
-21 7 moveto 
1 -1 scale
(40) t 
GR
GR
GS
[0 -0.75 0.75 0 35.7 462.49986] CT
0.149 GC
/Helvetica 20.533 F
GS
[1 0 0 1 0 0] CT
-68.5 -5 moveto 
1 -1 scale
(Mean error \(m\)) t 
GR
GR
GS
[0.75 0 0 0.75 0 -0.25] CT
1 GC
N
309 780 M
524 780 L
524 455 L
309 455 L
cp
f
GR
GS
[0.75 0 0 0.75 312.3753 338.1125] CT
/Helvetica-Bold 20.533 F
GS
[1 0 0 1 0 0] CT
-27 -5 moveto 
1 -1 scale
(SM02) t 
GR
GR
GS
[0.75 0 0 0.75 0 -0.25] CT
0.149 GC
1 LJ
0.667 LW
N
309 780 M
524 780 L
S
GR
GS
[0.75 0 0 0.75 0 -0.25] CT
0 0.447 0.741 RC
N
410.176 780 M
410.176 621.295 L
359.588 621.295 L
359.588 780 L
cp
473.412 780 M
473.412 738.366 L
422.824 738.366 L
422.824 780 L
cp
f
GR
GS
[0.75 0 0 0.75 0 -0.25] CT
10.0 ML
0.667 LW
N
359.588 780 M
359.588 621.295 L
410.176 621.295 L
410.176 780 L
cp
S
GR
GS
[0.75 0 0 0.75 0 -0.25] CT
10.0 ML
0.667 LW
N
422.824 780 M
422.824 738.366 L
473.412 738.366 L
473.412 780 L
cp
S
GR
GS
[0.75 0 0 0.75 0 -0.25] CT
0.863 GC
N
410.176 621.295 M
410.176 477.82 L
359.588 477.82 L
359.588 621.295 L
cp
473.412 738.366 M
473.412 683.361 L
422.824 683.361 L
422.824 738.366 L
cp
f
GR
GS
[0.75 0 0 0.75 0 -0.25] CT
10.0 ML
0.667 LW
N
359.588 621.295 M
359.588 477.82 L
410.176 477.82 L
410.176 621.295 L
cp
S
GR
GS
[0.75 0 0 0.75 0 -0.25] CT
10.0 ML
0.667 LW
N
422.824 738.366 M
422.824 683.361 L
473.412 683.361 L
473.412 738.366 L
cp
S
GR
GS
[0.75 0 0 0.75 0 -0.25] CT
0.149 GC
2 setlinecap
1 LJ
0.667 LW
N
309 780 M
524 780 L
S
GR
GS
[0.75 0 0 0.75 0 -0.25] CT
0.149 GC
2 setlinecap
1 LJ
0.667 LW
N
309 455 M
524 455 L
S
GR
GS
[0.75 0 0 0.75 0 -0.25] CT
0.149 GC
2 setlinecap
1 LJ
0.667 LW
N
384.882 780 M
384.882 776.75 L
S
GR
GS
[0.75 0 0 0.75 0 -0.25] CT
0.149 GC
2 setlinecap
1 LJ
0.667 LW
N
448.118 780 M
448.118 776.75 L
S
GR
GS
[0.75 0 0 0.75 0 -0.25] CT
0.149 GC
2 setlinecap
1 LJ
0.667 LW
N
384.882 455 M
384.882 458.25 L
S
GR
GS
[0.75 0 0 0.75 0 -0.25] CT
0.149 GC
2 setlinecap
1 LJ
0.667 LW
N
448.118 455 M
448.118 458.25 L
S
GR
GS
[0.75 0 0 0.75 288.66177 589.55002] CT
0.149 GC
/Helvetica 18.667 F
GS
[1 0 0 1 0 0] CT
-12 19 moveto 
1 -1 scale
(3D) t 
GR
GR
GS
[0.75 0 0 0.75 336.08823 589.55002] CT
0.149 GC
/Helvetica 18.667 F
GS
[1 0 0 1 0 0] CT
-12 19 moveto 
1 -1 scale
(2D) t 
GR
GR
GS
[0.75 0 0 0.75 0 -0.25] CT
0.149 GC
2 setlinecap
1 LJ
0.667 LW
N
524 780 M
524 455 L
S
GR
GS
[0.75 0 0 0.75 0 -0.25] CT
0.149 GC
2 setlinecap
1 LJ
0.667 LW
N
309 780 M
309 455 L
S
GR
GS
[0.75 0 0 0.75 0 -0.25] CT
0.149 GC
2 setlinecap
1 LJ
0.667 LW
N
524 780 M
520.75 780 L
S
GR
GS
[0.75 0 0 0.75 0 -0.25] CT
0.149 GC
2 setlinecap
1 LJ
0.667 LW
N
524 698.75 M
520.75 698.75 L
S
GR
GS
[0.75 0 0 0.75 0 -0.25] CT
0.149 GC
2 setlinecap
1 LJ
0.667 LW
N
524 617.5 M
520.75 617.5 L
S
GR
GS
[0.75 0 0 0.75 0 -0.25] CT
0.149 GC
2 setlinecap
1 LJ
0.667 LW
N
524 536.25 M
520.75 536.25 L
S
GR
GS
[0.75 0 0 0.75 0 -0.25] CT
0.149 GC
2 setlinecap
1 LJ
0.667 LW
N
524 455 M
520.75 455 L
S
GR
GS
[0.75 0 0 0.75 0 -0.25] CT
0.149 GC
2 setlinecap
1 LJ
0.667 LW
N
309 780 M
312.25 780 L
S
GR
GS
[0.75 0 0 0.75 0 -0.25] CT
0.149 GC
2 setlinecap
1 LJ
0.667 LW
N
309 698.75 M
312.25 698.75 L
S
GR
GS
[0.75 0 0 0.75 0 -0.25] CT
0.149 GC
2 setlinecap
1 LJ
0.667 LW
N
309 617.5 M
312.25 617.5 L
S
GR
GS
[0.75 0 0 0.75 0 -0.25] CT
0.149 GC
2 setlinecap
1 LJ
0.667 LW
N
309 536.25 M
312.25 536.25 L
S
GR
GS
[0.75 0 0 0.75 0 -0.25] CT
0.149 GC
2 setlinecap
1 LJ
0.667 LW
N
309 455 M
312.25 455 L
S
GR
GS
[0.75 0 0 0.75 397.80002 584.75] CT
0.149 GC
/Helvetica 18.667 F
GS
[1 0 0 1 0 0] CT
0 7 moveto 
1 -1 scale
(0) t 
GR
GR
GS
[0.75 0 0 0.75 397.80002 523.8125] CT
0.149 GC
/Helvetica 18.667 F
GS
[1 0 0 1 0 0] CT
0 7 moveto 
1 -1 scale
(10) t 
GR
GR
GS
[0.75 0 0 0.75 397.80002 462.875] CT
0.149 GC
/Helvetica 18.667 F
GS
[1 0 0 1 0 0] CT
0 7 moveto 
1 -1 scale
(20) t 
GR
GR
GS
[0.75 0 0 0.75 397.80002 401.9375] CT
0.149 GC
/Helvetica 18.667 F
GS
[1 0 0 1 0 0] CT
0 7 moveto 
1 -1 scale
(30) t 
GR
GR
GS
[0.75 0 0 0.75 397.80002 341] CT
0.149 GC
/Helvetica 18.667 F
GS
[1 0 0 1 0 0] CT
0 7 moveto 
1 -1 scale
(40) t 
GR
GR
GS
[0 -0.75 0.75 0 416.55002 462.87486] CT
0.149 GC
/Helvetica 20.533 F
GS
[1 0 0 1 0 0] CT
-68.5 21 moveto 
1 -1 scale
(Mean error \(m\)) t 
GR
GR
GS
[0.75 0 0 0.75 0 -0.25] CT
1 GC
N
613 780 M
836 780 L
836 454 L
613 454 L
cp
f
GR
GS
[0.75 0 0 0.75 543.3755 337.3625] CT
/Helvetica-Bold 20.533 F
GS
[1 0 0 1 0 0] CT
-27 -5 moveto 
1 -1 scale
(SM01) t 
GR
GR
GS
[0.75 0 0 0.75 0 -0.25] CT
0.149 GC
1 LJ
0.667 LW
N
613 780 M
836 780 L
S
GR
GS
[0.75 0 0 0.75 0 -0.25] CT
0 0.447 0.741 RC
N
717.941 780 M
717.941 585.764 L
665.471 585.764 L
665.471 780 L
cp
783.529 780 M
783.529 727.692 L
731.059 727.692 L
731.059 780 L
cp
f
GR
GS
[0.75 0 0 0.75 0 -0.25] CT
10.0 ML
0.667 LW
N
665.471 780 M
665.471 585.764 L
717.941 585.764 L
717.941 780 L
cp
S
GR
GS
[0.75 0 0 0.75 0 -0.25] CT
10.0 ML
0.667 LW
N
731.059 780 M
731.059 727.692 L
783.529 727.692 L
783.529 780 L
cp
S
GR
GS
[0.75 0 0 0.75 0 -0.25] CT
0.863 GC
N
717.941 585.764 M
717.941 480.342 L
665.471 480.342 L
665.471 585.764 L
cp
783.529 727.692 M
783.529 689.24 L
731.059 689.24 L
731.059 727.692 L
cp
f
GR
GS
[0.75 0 0 0.75 0 -0.25] CT
10.0 ML
0.667 LW
N
665.471 585.764 M
665.471 480.342 L
717.941 480.342 L
717.941 585.764 L
cp
S
GR
GS
[0.75 0 0 0.75 0 -0.25] CT
10.0 ML
0.667 LW
N
731.059 727.692 M
731.059 689.24 L
783.529 689.24 L
783.529 727.692 L
cp
S
GR
GS
[0.75 0 0 0.75 0 -0.25] CT
0.149 GC
2 setlinecap
1 LJ
0.667 LW
N
613 780 M
836 780 L
S
GR
GS
[0.75 0 0 0.75 0 -0.25] CT
0.149 GC
2 setlinecap
1 LJ
0.667 LW
N
613 454 M
836 454 L
S
GR
GS
[0.75 0 0 0.75 0 -0.25] CT
0.149 GC
2 setlinecap
1 LJ
0.667 LW
N
691.706 780 M
691.706 776.74 L
S
GR
GS
[0.75 0 0 0.75 0 -0.25] CT
0.149 GC
2 setlinecap
1 LJ
0.667 LW
N
757.294 780 M
757.294 776.74 L
S
GR
GS
[0.75 0 0 0.75 0 -0.25] CT
0.149 GC
2 setlinecap
1 LJ
0.667 LW
N
691.706 454 M
691.706 457.26 L
S
GR
GS
[0.75 0 0 0.75 0 -0.25] CT
0.149 GC
2 setlinecap
1 LJ
0.667 LW
N
757.294 454 M
757.294 457.26 L
S
GR
GS
[0.75 0 0 0.75 518.7794 589.55002] CT
0.149 GC
/Helvetica 18.667 F
GS
[1 0 0 1 0 0] CT
-12 19 moveto 
1 -1 scale
(3D) t 
GR
GR
GS
[0.75 0 0 0.75 567.9706 589.55002] CT
0.149 GC
/Helvetica 18.667 F
GS
[1 0 0 1 0 0] CT
-12 19 moveto 
1 -1 scale
(2D) t 
GR
GR
GS
[0.75 0 0 0.75 0 -0.25] CT
0.149 GC
2 setlinecap
1 LJ
0.667 LW
N
613 780 M
613 454 L
S
GR
GS
[0.75 0 0 0.75 0 -0.25] CT
0.149 GC
2 setlinecap
1 LJ
0.667 LW
N
836 780 M
836 454 L
S
GR
GS
[0.75 0 0 0.75 0 -0.25] CT
0.149 GC
2 setlinecap
1 LJ
0.667 LW
N
613 780 M
616.26 780 L
S
GR
GS
[0.75 0 0 0.75 0 -0.25] CT
0.149 GC
2 setlinecap
1 LJ
0.667 LW
N
613 698.5 M
616.26 698.5 L
S
GR
GS
[0.75 0 0 0.75 0 -0.25] CT
0.149 GC
2 setlinecap
1 LJ
0.667 LW
N
613 617 M
616.26 617 L
S
GR
GS
[0.75 0 0 0.75 0 -0.25] CT
0.149 GC
2 setlinecap
1 LJ
0.667 LW
N
613 535.5 M
616.26 535.5 L
S
GR
GS
[0.75 0 0 0.75 0 -0.25] CT
0.149 GC
2 setlinecap
1 LJ
0.667 LW
N
613 454 M
616.26 454 L
S
GR
GS
[0.75 0 0 0.75 0 -0.25] CT
0.149 GC
2 setlinecap
1 LJ
0.667 LW
N
836 780 M
832.74 780 L
S
GR
GS
[0.75 0 0 0.75 0 -0.25] CT
0.149 GC
2 setlinecap
1 LJ
0.667 LW
N
836 698.5 M
832.74 698.5 L
S
GR
GS
[0.75 0 0 0.75 0 -0.25] CT
0.149 GC
2 setlinecap
1 LJ
0.667 LW
N
836 617 M
832.74 617 L
S
GR
GS
[0.75 0 0 0.75 0 -0.25] CT
0.149 GC
2 setlinecap
1 LJ
0.667 LW
N
836 535.5 M
832.74 535.5 L
S
GR
GS
[0.75 0 0 0.75 0 -0.25] CT
0.149 GC
2 setlinecap
1 LJ
0.667 LW
N
836 454 M
832.74 454 L
S
GR
GS
[0.75 0 0 0.75 454.94998 584.75] CT
0.149 GC
/Helvetica 18.667 F
GS
[1 0 0 1 0 0] CT
-11 7 moveto 
1 -1 scale
(0) t 
GR
GR
GS
[0.75 0 0 0.75 454.94998 523.625] CT
0.149 GC
/Helvetica 18.667 F
GS
[1 0 0 1 0 0] CT
-21 7 moveto 
1 -1 scale
(10) t 
GR
GR
GS
[0.75 0 0 0.75 454.94998 462.5] CT
0.149 GC
/Helvetica 18.667 F
GS
[1 0 0 1 0 0] CT
-21 7 moveto 
1 -1 scale
(20) t 
GR
GR
GS
[0.75 0 0 0.75 454.94998 401.375] CT
0.149 GC
/Helvetica 18.667 F
GS
[1 0 0 1 0 0] CT
-21 7 moveto 
1 -1 scale
(30) t 
GR
GR
GS
[0.75 0 0 0.75 454.94998 340.25] CT
0.149 GC
/Helvetica 18.667 F
GS
[1 0 0 1 0 0] CT
-21 7 moveto 
1 -1 scale
(40) t 
GR
GR
GS
[0.75 0 0 0.75 0 -0.25] CT
1 GC
N
849 781 M
1073 781 L
1073 452 L
849 452 L
cp
f
GR
GS
[0.75 0 0 0.75 720.75069 335.86252] CT
/Helvetica-Bold 20.533 F
GS
[1 0 0 1 0 0] CT
-27 -5 moveto 
1 -1 scale
(SM02) t 
GR
GR
GS
[0.75 0 0 0.75 0 -0.25] CT
0.149 GC
1 LJ
0.667 LW
N
849 781 M
1073 781 L
S
GR
GS
[0.75 0 0 0.75 0 -0.25] CT
0 0.447 0.741 RC
N
954.412 781 M
954.412 610.426 L
901.706 610.426 L
901.706 781 L
cp
1020.294 781 M
1020.294 701.908 L
967.588 701.908 L
967.588 781 L
cp
f
GR
GS
[0.75 0 0 0.75 0 -0.25] CT
10.0 ML
0.667 LW
N
901.706 781 M
901.706 610.426 L
954.412 610.426 L
954.412 781 L
cp
S
GR
GS
[0.75 0 0 0.75 0 -0.25] CT
10.0 ML
0.667 LW
N
967.588 781 M
967.588 701.908 L
1020.294 701.908 L
1020.294 781 L
cp
S
GR
GS
[0.75 0 0 0.75 0 -0.25] CT
0.863 GC
N
954.412 610.426 M
954.412 488.343 L
901.706 488.343 L
901.706 610.426 L
cp
1020.294 701.908 M
1020.294 625.492 L
967.588 625.492 L
967.588 701.908 L
cp
f
GR
GS
[0.75 0 0 0.75 0 -0.25] CT
10.0 ML
0.667 LW
N
901.706 610.426 M
901.706 488.343 L
954.412 488.343 L
954.412 610.426 L
cp
S
GR
GS
[0.75 0 0 0.75 0 -0.25] CT
10.0 ML
0.667 LW
N
967.588 701.908 M
967.588 625.492 L
1020.294 625.492 L
1020.294 701.908 L
cp
S
GR
GS
[0.75 0 0 0.75 0 -0.25] CT
0.149 GC
2 setlinecap
1 LJ
0.667 LW
N
849 781 M
1073 781 L
S
GR
GS
[0.75 0 0 0.75 0 -0.25] CT
0.149 GC
2 setlinecap
1 LJ
0.667 LW
N
849 452 M
1073 452 L
S
GR
GS
[0.75 0 0 0.75 0 -0.25] CT
0.149 GC
2 setlinecap
1 LJ
0.667 LW
N
928.059 781 M
928.059 777.71 L
S
GR
GS
[0.75 0 0 0.75 0 -0.25] CT
0.149 GC
2 setlinecap
1 LJ
0.667 LW
N
993.941 781 M
993.941 777.71 L
S
GR
GS
[0.75 0 0 0.75 0 -0.25] CT
0.149 GC
2 setlinecap
1 LJ
0.667 LW
N
928.059 452 M
928.059 455.29 L
S
GR
GS
[0.75 0 0 0.75 0 -0.25] CT
0.149 GC
2 setlinecap
1 LJ
0.667 LW
N
993.941 452 M
993.941 455.29 L
S
GR
GS
[0.75 0 0 0.75 696.04413 590.30002] CT
0.149 GC
/Helvetica 18.667 F
GS
[1 0 0 1 0 0] CT
-12 19 moveto 
1 -1 scale
(3D) t 
GR
GR
GS
[0.75 0 0 0.75 745.45587 590.30002] CT
0.149 GC
/Helvetica 18.667 F
GS
[1 0 0 1 0 0] CT
-12 19 moveto 
1 -1 scale
(2D) t 
GR
GR
GS
[0.75 0 0 0.75 0 -0.25] CT
0.149 GC
2 setlinecap
1 LJ
0.667 LW
N
1073 781 M
1073 452 L
S
GR
GS
[0.75 0 0 0.75 0 -0.25] CT
0.149 GC
2 setlinecap
1 LJ
0.667 LW
N
849 781 M
849 452 L
S
GR
GS
[0.75 0 0 0.75 0 -0.25] CT
0.149 GC
2 setlinecap
1 LJ
0.667 LW
N
1073 781 M
1069.71 781 L
S
GR
GS
[0.75 0 0 0.75 0 -0.25] CT
0.149 GC
2 setlinecap
1 LJ
0.667 LW
N
1073 734 M
1069.71 734 L
S
GR
GS
[0.75 0 0 0.75 0 -0.25] CT
0.149 GC
2 setlinecap
1 LJ
0.667 LW
N
1073 687 M
1069.71 687 L
S
GR
GS
[0.75 0 0 0.75 0 -0.25] CT
0.149 GC
2 setlinecap
1 LJ
0.667 LW
N
1073 640 M
1069.71 640 L
S
GR
GS
[0.75 0 0 0.75 0 -0.25] CT
0.149 GC
2 setlinecap
1 LJ
0.667 LW
N
1073 593 M
1069.71 593 L
S
GR
GS
[0.75 0 0 0.75 0 -0.25] CT
0.149 GC
2 setlinecap
1 LJ
0.667 LW
N
1073 546 M
1069.71 546 L
S
GR
GS
[0.75 0 0 0.75 0 -0.25] CT
0.149 GC
2 setlinecap
1 LJ
0.667 LW
N
1073 499 M
1069.71 499 L
S
GR
GS
[0.75 0 0 0.75 0 -0.25] CT
0.149 GC
2 setlinecap
1 LJ
0.667 LW
N
1073 452 M
1069.71 452 L
S
GR
GS
[0.75 0 0 0.75 0 -0.25] CT
0.149 GC
2 setlinecap
1 LJ
0.667 LW
N
849 781 M
852.29 781 L
S
GR
GS
[0.75 0 0 0.75 0 -0.25] CT
0.149 GC
2 setlinecap
1 LJ
0.667 LW
N
849 734 M
852.29 734 L
S
GR
GS
[0.75 0 0 0.75 0 -0.25] CT
0.149 GC
2 setlinecap
1 LJ
0.667 LW
N
849 687 M
852.29 687 L
S
GR
GS
[0.75 0 0 0.75 0 -0.25] CT
0.149 GC
2 setlinecap
1 LJ
0.667 LW
N
849 640 M
852.29 640 L
S
GR
GS
[0.75 0 0 0.75 0 -0.25] CT
0.149 GC
2 setlinecap
1 LJ
0.667 LW
N
849 593 M
852.29 593 L
S
GR
GS
[0.75 0 0 0.75 0 -0.25] CT
0.149 GC
2 setlinecap
1 LJ
0.667 LW
N
849 546 M
852.29 546 L
S
GR
GS
[0.75 0 0 0.75 0 -0.25] CT
0.149 GC
2 setlinecap
1 LJ
0.667 LW
N
849 499 M
852.29 499 L
S
GR
GS
[0.75 0 0 0.75 0 -0.25] CT
0.149 GC
2 setlinecap
1 LJ
0.667 LW
N
849 452 M
852.29 452 L
S
GR
GS
[0.75 0 0 0.75 809.55002 585.5] CT
0.149 GC
/Helvetica 18.667 F
GS
[1 0 0 1 0 0] CT
0 7 moveto 
1 -1 scale
(0) t 
GR
GR
GS
[0.75 0 0 0.75 809.55002 550.25] CT
0.149 GC
/Helvetica 18.667 F
GS
[1 0 0 1 0 0] CT
0 7 moveto 
1 -1 scale
(5) t 
GR
GR
GS
[0.75 0 0 0.75 809.55002 515] CT
0.149 GC
/Helvetica 18.667 F
GS
[1 0 0 1 0 0] CT
0 7 moveto 
1 -1 scale
(10) t 
GR
GR
GS
[0.75 0 0 0.75 809.55002 479.75] CT
0.149 GC
/Helvetica 18.667 F
GS
[1 0 0 1 0 0] CT
0 7 moveto 
1 -1 scale
(15) t 
GR
GR
GS
[0.75 0 0 0.75 809.55002 444.5] CT
0.149 GC
/Helvetica 18.667 F
GS
[1 0 0 1 0 0] CT
0 7 moveto 
1 -1 scale
(20) t 
GR
GR
GS
[0.75 0 0 0.75 809.55002 409.25] CT
0.149 GC
/Helvetica 18.667 F
GS
[1 0 0 1 0 0] CT
0 7 moveto 
1 -1 scale
(25) t 
GR
GR
GS
[0.75 0 0 0.75 809.55002 374] CT
0.149 GC
/Helvetica 18.667 F
GS
[1 0 0 1 0 0] CT
0 7 moveto 
1 -1 scale
(30) t 
GR
GR
GS
[0.75 0 0 0.75 809.55002 338.75] CT
0.149 GC
/Helvetica 18.667 F
GS
[1 0 0 1 0 0] CT
0 7 moveto 
1 -1 scale
(35) t 
GR
GR
GS
[0 -0.75 0.75 0 828.30002 462.12486] CT
0.149 GC
/Helvetica 20.533 F
GS
[1 0 0 1 0 0] CT
-68.5 21 moveto 
1 -1 scale
(Mean error \(m\)) t 
GR
GR
GS
[0.75 0 0 0.75 0 -0.25] CT
1 GC
N
78 384 M
299 384 L
299 44 L
78 44 L
cp
f
GR
GS
[0.75 0 0 0.75 141.37514 29.8625] CT
/Helvetica-Bold 20.533 F
GS
[1 0 0 1 0 0] CT
-27 -5 moveto 
1 -1 scale
(SM01) t 
GR
GR
GS
[0.75 0 0 0.75 0 -0.25] CT
0.149 GC
1 LJ
0.667 LW
N
78 384 M
299 384 L
S
GR
GS
[0.75 0 0 0.75 0 -0.25] CT
0 0.447 0.741 RC
N
182 384 M
182 254.607 L
130 254.607 L
130 384 L
cp
247 384 M
247 342.384 L
195 342.384 L
195 384 L
cp
f
GR
GS
[0.75 0 0 0.75 0 -0.25] CT
10.0 ML
0.667 LW
N
130 384 M
130 254.607 L
182 254.607 L
182 384 L
cp
S
GR
GS
[0.75 0 0 0.75 0 -0.25] CT
10.0 ML
0.667 LW
N
195 384 M
195 342.384 L
247 342.384 L
247 384 L
cp
S
GR
GS
[0.75 0 0 0.75 0 -0.25] CT
0.863 GC
N
182 254.607 M
182 62.07 L
130 62.07 L
130 254.607 L
cp
247 342.384 M
247 268.674 L
195 268.674 L
195 342.384 L
cp
f
GR
GS
[0.75 0 0 0.75 0 -0.25] CT
10.0 ML
0.667 LW
N
130 254.607 M
130 62.07 L
182 62.07 L
182 254.607 L
cp
S
GR
GS
[0.75 0 0 0.75 0 -0.25] CT
10.0 ML
0.667 LW
N
195 342.384 M
195 268.674 L
247 268.674 L
247 342.384 L
cp
S
GR
GS
[0.75 0 0 0.75 0 -0.25] CT
0.149 GC
2 setlinecap
1 LJ
0.667 LW
N
78 384 M
299 384 L
S
GR
GS
[0.75 0 0 0.75 0 -0.25] CT
0.149 GC
2 setlinecap
1 LJ
0.667 LW
N
78 44 M
299 44 L
S
GR
GS
[0.75 0 0 0.75 0 -0.25] CT
0.149 GC
2 setlinecap
1 LJ
0.667 LW
N
156 384 M
156 380.6 L
S
GR
GS
[0.75 0 0 0.75 0 -0.25] CT
0.149 GC
2 setlinecap
1 LJ
0.667 LW
N
221 384 M
221 380.6 L
S
GR
GS
[0.75 0 0 0.75 0 -0.25] CT
0.149 GC
2 setlinecap
1 LJ
0.667 LW
N
156 44 M
156 47.4 L
S
GR
GS
[0.75 0 0 0.75 0 -0.25] CT
0.149 GC
2 setlinecap
1 LJ
0.667 LW
N
221 44 M
221 47.4 L
S
GR
GS
[0.75 0 0 0.75 117 292.55] CT
0.149 GC
/Helvetica 18.667 F
GS
[1 0 0 1 0 0] CT
-12 19 moveto 
1 -1 scale
(3D) t 
GR
GR
GS
[0.75 0 0 0.75 165.75 292.55] CT
0.149 GC
/Helvetica 18.667 F
GS
[1 0 0 1 0 0] CT
-12 19 moveto 
1 -1 scale
(2D) t 
GR
GR
GS
[0.75 0 0 0.75 0 -0.25] CT
0.149 GC
2 setlinecap
1 LJ
0.667 LW
N
78 384 M
78 44 L
S
GR
GS
[0.75 0 0 0.75 0 -0.25] CT
0.149 GC
2 setlinecap
1 LJ
0.667 LW
N
299 384 M
299 44 L
S
GR
GS
[0.75 0 0 0.75 0 -0.25] CT
0.149 GC
2 setlinecap
1 LJ
0.667 LW
N
78 384 M
81.4 384 L
S
GR
GS
[0.75 0 0 0.75 0 -0.25] CT
0.149 GC
2 setlinecap
1 LJ
0.667 LW
N
78 327.333 M
81.4 327.333 L
S
GR
GS
[0.75 0 0 0.75 0 -0.25] CT
0.149 GC
2 setlinecap
1 LJ
0.667 LW
N
78 270.667 M
81.4 270.667 L
S
GR
GS
[0.75 0 0 0.75 0 -0.25] CT
0.149 GC
2 setlinecap
1 LJ
0.667 LW
N
78 214 M
81.4 214 L
S
GR
GS
[0.75 0 0 0.75 0 -0.25] CT
0.149 GC
2 setlinecap
1 LJ
0.667 LW
N
78 157.333 M
81.4 157.333 L
S
GR
GS
[0.75 0 0 0.75 0 -0.25] CT
0.149 GC
2 setlinecap
1 LJ
0.667 LW
N
78 100.667 M
81.4 100.667 L
S
GR
GS
[0.75 0 0 0.75 0 -0.25] CT
0.149 GC
2 setlinecap
1 LJ
0.667 LW
N
78 44 M
81.4 44 L
S
GR
GS
[0.75 0 0 0.75 0 -0.25] CT
0.149 GC
2 setlinecap
1 LJ
0.667 LW
N
299 384 M
295.6 384 L
S
GR
GS
[0.75 0 0 0.75 0 -0.25] CT
0.149 GC
2 setlinecap
1 LJ
0.667 LW
N
299 327.333 M
295.6 327.333 L
S
GR
GS
[0.75 0 0 0.75 0 -0.25] CT
0.149 GC
2 setlinecap
1 LJ
0.667 LW
N
299 270.667 M
295.6 270.667 L
S
GR
GS
[0.75 0 0 0.75 0 -0.25] CT
0.149 GC
2 setlinecap
1 LJ
0.667 LW
N
299 214 M
295.6 214 L
S
GR
GS
[0.75 0 0 0.75 0 -0.25] CT
0.149 GC
2 setlinecap
1 LJ
0.667 LW
N
299 157.333 M
295.6 157.333 L
S
GR
GS
[0.75 0 0 0.75 0 -0.25] CT
0.149 GC
2 setlinecap
1 LJ
0.667 LW
N
299 100.667 M
295.6 100.667 L
S
GR
GS
[0.75 0 0 0.75 0 -0.25] CT
0.149 GC
2 setlinecap
1 LJ
0.667 LW
N
299 44 M
295.6 44 L
S
GR
GS
[0.75 0 0 0.75 53.7 287.75] CT
0.149 GC
/Helvetica 18.667 F
GS
[1 0 0 1 0 0] CT
-11 7 moveto 
1 -1 scale
(0) t 
GR
GR
GS
[0.75 0 0 0.75 53.7 245.25001] CT
0.149 GC
/Helvetica 18.667 F
GS
[1 0 0 1 0 0] CT
-11 7 moveto 
1 -1 scale
(5) t 
GR
GR
GS
[0.75 0 0 0.75 53.7 202.74999] CT
0.149 GC
/Helvetica 18.667 F
GS
[1 0 0 1 0 0] CT
-21 7 moveto 
1 -1 scale
(10) t 
GR
GR
GS
[0.75 0 0 0.75 53.7 160.25] CT
0.149 GC
/Helvetica 18.667 F
GS
[1 0 0 1 0 0] CT
-21 7 moveto 
1 -1 scale
(15) t 
GR
GR
GS
[0.75 0 0 0.75 53.7 117.75] CT
0.149 GC
/Helvetica 18.667 F
GS
[1 0 0 1 0 0] CT
-21 7 moveto 
1 -1 scale
(20) t 
GR
GR
GS
[0.75 0 0 0.75 53.7 75.25] CT
0.149 GC
/Helvetica 18.667 F
GS
[1 0 0 1 0 0] CT
-21 7 moveto 
1 -1 scale
(25) t 
GR
GR
GS
[0.75 0 0 0.75 53.7 32.75] CT
0.149 GC
/Helvetica 18.667 F
GS
[1 0 0 1 0 0] CT
-21 7 moveto 
1 -1 scale
(30) t 
GR
GR
GS
[0 -0.75 0.75 0 34.95 160.24987] CT
0.149 GC
/Helvetica 20.533 F
GS
[1 0 0 1 0 0] CT
-68.5 -5 moveto 
1 -1 scale
(Mean error \(m\)) t 
GR
GR
GS
[0.75 0 0 0.75 0 -0.25] CT
1 GC
N
291 104 M
291 55 L
208 55 L
208 104 L
cp
f
GR
GS
[0.75 0 0 0.75 191.56595 50.83976] CT
N
0.547 2.542 M
0.547 1.558 1.148 0.581 QT
1.75 -0.395 2.664 -1.169 QT
3.578 -1.942 4.469 -2.395 QT
3.688 -2.708 3.219 -3.231 QT
2.75 -3.754 2.75 -4.536 QT
2.75 -5.442 3.313 -6.239 QT
3.875 -7.036 4.773 -7.645 QT
5.672 -8.254 6.688 -8.583 QT
7.703 -8.911 8.531 -8.911 QT
8.641 -8.911 L
9.469 -8.911 10.094 -8.629 QT
10.719 -8.348 10.719 -7.645 QT
10.719 -7.176 10.469 -6.762 QT
10.219 -6.348 9.805 -6.075 QT
9.391 -5.801 8.953 -5.77 QT
8.844 -5.77 L
8.813 -5.786 8.766 -5.817 QT
8.719 -5.848 8.719 -5.911 QT
8.719 -5.973 8.734 -6.004 QT
8.828 -6.176 8.891 -6.301 QT
8.953 -6.426 8.992 -6.551 QT
9.031 -6.676 9.031 -6.817 QT
9.031 -7.379 8.492 -7.59 QT
7.953 -7.801 7.281 -7.801 QT
6.547 -7.801 5.891 -7.504 QT
5.234 -7.208 4.836 -6.653 QT
4.438 -6.098 4.438 -5.348 QT
4.438 -4.254 5.461 -3.731 QT
6.484 -3.208 7.672 -3.208 QT
7.813 -3.145 7.813 -3.067 QT
7.813 -2.77 7.258 -2.45 QT
6.703 -2.129 6.359 -2.098 QT
4.719 -2.098 3.516 -0.958 QT
2.984 -0.395 2.617 0.331 QT
2.25 1.058 2.25 1.699 QT
2.25 2.386 2.672 2.855 QT
3.094 3.324 3.742 3.55 QT
4.391 3.777 5.063 3.777 QT
5.906 3.777 6.43 3.48 QT
6.953 3.183 7.516 2.542 QT
8.078 1.902 8.391 1.636 QT
8.703 1.371 9.25 1.324 QT
9.359 1.324 L
9.484 1.386 9.484 1.48 QT
9.484 1.542 9.406 1.683 QT
8.797 2.574 7.891 3.3 QT
6.984 4.027 5.906 4.464 QT
4.828 4.902 3.797 4.902 QT
3.688 4.902 L
2.953 4.902 2.219 4.636 QT
1.484 4.371 1.016 3.839 QT
0.547 3.308 0.547 2.542 QT
cp
f
GR
GS
[0.75 0 0 0.75 191.56595 50.83976] CT
N
11.743 4.467 M
11.743 5.249 12.047 5.842 QT
12.352 6.436 12.93 6.772 QT
13.508 7.108 14.289 7.108 QT
15.102 7.108 15.86 6.686 QT
16.618 6.264 17.157 5.569 QT
17.696 4.874 17.883 4.077 QT
17.914 3.999 17.993 3.999 QT
18.149 3.999 L
18.196 3.999 18.227 4.038 QT
18.258 4.077 18.258 4.124 QT
18.258 4.124 18.243 4.155 QT
18.024 5.061 17.391 5.85 QT
16.758 6.639 15.868 7.1 QT
14.977 7.561 14.039 7.561 QT
13.024 7.561 12.219 7.108 QT
11.414 6.655 10.961 5.842 QT
10.508 5.03 10.508 3.999 QT
10.508 2.905 11 1.842 QT
11.493 0.78 12.313 -0.056 QT
13.133 -0.892 14.196 -1.392 QT
15.258 -1.892 16.336 -1.892 QT
16.774 -1.892 17.164 -1.759 QT
17.555 -1.626 17.891 -1.361 QT
18.227 -1.095 18.446 -0.751 QT
19.477 -1.861 L
19.477 -1.892 19.539 -1.892 QT
19.618 -1.892 L
19.664 -1.892 19.696 -1.845 QT
19.727 -1.798 19.727 -1.751 QT
18.852 1.764 L
18.852 1.842 18.743 1.842 QT
18.508 1.842 L
18.414 1.842 18.414 1.702 QT
18.461 1.421 18.461 1.014 QT
18.461 0.374 18.243 -0.189 QT
18.024 -0.751 17.571 -1.087 QT
17.118 -1.423 16.461 -1.423 QT
15.399 -1.423 14.524 -0.892 QT
13.649 -0.361 13.032 0.506 QT
12.414 1.374 12.078 2.428 QT
11.743 3.483 11.743 4.467 QT
cp
f
GR
GS
[0.75 0 0 0.75 191.56595 50.83976] CT
N
20.766 7.28 M
20.641 7.28 20.641 7.108 QT
20.641 7.077 20.657 6.999 QT
20.672 6.921 20.711 6.874 QT
20.751 6.827 20.797 6.827 QT
21.594 6.827 21.907 6.733 QT
22.079 6.671 22.157 6.389 QT
23.938 -0.751 L
23.954 -0.876 23.954 -0.939 QT
23.954 -1.079 23.813 -1.095 QT
23.563 -1.142 22.876 -1.142 QT
22.735 -1.142 22.735 -1.314 QT
22.751 -1.345 22.766 -1.423 QT
22.782 -1.501 22.821 -1.548 QT
22.86 -1.595 22.907 -1.595 QT
27.391 -1.595 L
28.016 -1.595 28.594 -1.376 QT
29.172 -1.158 29.54 -0.712 QT
29.907 -0.267 29.907 0.374 QT
29.907 1.202 29.321 1.85 QT
28.735 2.499 27.868 2.858 QT
27.001 3.217 26.188 3.217 QT
24.079 3.217 L
23.282 6.436 L
23.266 6.561 23.266 6.624 QT
23.266 6.671 23.282 6.702 QT
23.297 6.733 23.321 6.749 QT
23.344 6.764 23.407 6.764 QT
23.657 6.827 24.36 6.827 QT
24.485 6.827 24.485 6.999 QT
24.438 7.171 24.415 7.225 QT
24.391 7.28 24.251 7.28 QT
20.766 7.28 L
cp
24.141 2.842 M
25.969 2.842 L
27.235 2.842 27.891 2.155 QT
28.219 1.827 28.438 1.186 QT
28.657 0.546 28.657 0.03 QT
28.657 -0.611 28.165 -0.876 QT
27.672 -1.142 26.954 -1.142 QT
25.704 -1.142 L
25.344 -1.142 25.235 -1.079 QT
25.126 -1.017 25.032 -0.704 QT
24.141 2.842 L
cp
f
GR
GS
[0.75 0 0 0.75 0 -0.25] CT
0 0.447 0.741 RC
N
252.394 76.469 M
252.394 59.771 L
212.036 59.771 L
212.036 76.469 L
cp
f
GR
GS
[0.75 0 0 0.75 0 -0.25] CT
10.0 ML
0.667 LW
N
212.036 76.469 M
212.036 59.771 L
252.394 59.771 L
252.394 76.469 L
cp
S
GR
GS
[0.75 0 0 0.75 191.56595 67.91024] CT
N
/f-1402268507{0.547 2.542 M
0.547 1.558 1.148 0.581 QT
1.75 -0.395 2.664 -1.169 QT
3.578 -1.942 4.469 -2.395 QT
3.688 -2.708 3.219 -3.231 QT
2.75 -3.754 2.75 -4.536 QT
2.75 -5.442 3.313 -6.239 QT
3.875 -7.036 4.773 -7.645 QT
5.672 -8.254 6.688 -8.583 QT
7.703 -8.911 8.531 -8.911 QT
8.641 -8.911 L
9.469 -8.911 10.094 -8.629 QT
10.719 -8.348 10.719 -7.645 QT
10.719 -7.176 10.469 -6.762 QT
10.219 -6.348 9.805 -6.075 QT
9.391 -5.801 8.953 -5.77 QT
8.844 -5.77 L
8.813 -5.786 8.766 -5.817 QT
8.719 -5.848 8.719 -5.911 QT
8.719 -5.973 8.734 -6.004 QT
8.828 -6.176 8.891 -6.301 QT
8.953 -6.426 8.992 -6.551 QT
9.031 -6.676 9.031 -6.817 QT
9.031 -7.379 8.492 -7.59 QT
7.953 -7.801 7.281 -7.801 QT
6.547 -7.801 5.891 -7.504 QT
5.234 -7.208 4.836 -6.653 QT
4.438 -6.098 4.438 -5.348 QT
4.438 -4.254 5.461 -3.731 QT
6.484 -3.208 7.672 -3.208 QT
7.813 -3.145 7.813 -3.067 QT
7.813 -2.77 7.258 -2.45 QT
6.703 -2.129 6.359 -2.098 QT
4.719 -2.098 3.516 -0.958 QT
2.984 -0.395 2.617 0.331 QT
2.25 1.058 2.25 1.699 QT
2.25 2.386 2.672 2.855 QT
3.094 3.324 3.742 3.55 QT
4.391 3.777 5.063 3.777 QT
5.906 3.777 6.43 3.48 QT
6.953 3.183 7.516 2.542 QT
8.078 1.902 8.391 1.636 QT
8.703 1.371 9.25 1.324 QT
9.359 1.324 L
9.484 1.386 9.484 1.48 QT
9.484 1.542 9.406 1.683 QT
8.797 2.574 7.891 3.3 QT
6.984 4.027 5.906 4.464 QT
4.828 4.902 3.797 4.902 QT
3.688 4.902 L
2.953 4.902 2.219 4.636 QT
1.484 4.371 1.016 3.839 QT
0.547 3.308 0.547 2.542 QT
cp}def
f-1402268507
f
GR
GS
[0.75 0 0 0.75 191.56595 67.91024] CT
N
/f-513890574{10.649 7.561 M
10.602 7.561 10.571 7.522 QT
10.539 7.483 10.539 7.436 QT
11.289 4.405 L
11.321 4.327 11.399 4.327 QT
11.555 4.327 L
11.602 4.327 11.633 4.366 QT
11.664 4.405 11.664 4.467 QT
11.555 4.905 11.555 5.249 QT
11.555 6.202 12.203 6.655 QT
12.852 7.108 13.836 7.108 QT
14.258 7.108 14.672 6.897 QT
15.086 6.686 15.391 6.35 QT
15.696 6.014 15.883 5.6 QT
16.071 5.186 16.071 4.764 QT
16.071 4.296 15.828 3.944 QT
15.586 3.592 15.164 3.483 QT
13.571 3.061 L
12.93 2.889 12.547 2.374 QT
12.164 1.858 12.164 1.217 QT
12.164 0.436 12.633 -0.29 QT
13.102 -1.017 13.844 -1.454 QT
14.586 -1.892 15.368 -1.892 QT
15.961 -1.892 16.461 -1.673 QT
16.961 -1.454 17.227 -0.97 QT
17.961 -1.845 L
18.039 -1.892 18.055 -1.892 QT
18.133 -1.892 L
18.18 -1.892 18.211 -1.845 QT
18.243 -1.798 18.243 -1.751 QT
17.493 1.264 L
17.477 1.358 17.399 1.358 QT
17.227 1.358 L
17.118 1.358 17.118 1.217 QT
17.18 0.796 17.18 0.499 QT
17.18 -0.111 16.977 -0.556 QT
16.774 -1.001 16.36 -1.236 QT
15.946 -1.47 15.321 -1.47 QT
14.805 -1.47 14.289 -1.173 QT
13.774 -0.876 13.453 -0.376 QT
13.133 0.124 13.133 0.655 QT
13.133 1.077 13.383 1.397 QT
13.633 1.717 14.039 1.827 QT
15.618 2.249 L
16.055 2.358 16.375 2.647 QT
16.696 2.936 16.86 3.335 QT
17.024 3.733 17.024 4.202 QT
17.024 4.811 16.766 5.413 QT
16.508 6.014 16.039 6.514 QT
15.571 7.014 14.977 7.288 QT
14.383 7.561 13.774 7.561 QT
12.227 7.561 11.555 6.655 QT
10.836 7.53 L
10.758 7.561 10.727 7.561 QT
10.649 7.561 L
cp}def
f-513890574
f
GR
GS
[0.75 0 0 0.75 191.56595 67.91024] CT
N
/f1088209836{19.196 7.28 M
19.071 7.28 19.071 7.108 QT
19.133 6.827 19.242 6.827 QT
19.774 6.827 20.156 6.616 QT
20.539 6.405 20.821 5.967 QT
20.836 5.936 20.836 5.936 QT
25.477 -1.892 L
25.586 -2.033 25.727 -2.033 QT
25.899 -2.033 L
25.93 -2.033 25.969 -2.017 QT
26.008 -2.001 26.039 -1.962 QT
26.071 -1.923 26.071 -1.892 QT
26.852 6.514 L
26.852 6.561 26.914 6.686 QT
27.039 6.827 27.883 6.827 QT
28.024 6.827 28.024 6.999 QT
27.977 7.171 27.946 7.225 QT
27.914 7.28 27.789 7.28 QT
24.539 7.28 L
24.43 7.28 24.43 7.108 QT
24.492 6.827 24.602 6.827 QT
25.633 6.827 25.696 6.467 QT
25.492 4.327 L
22.289 4.327 L
21.242 6.077 L
21.149 6.217 21.149 6.405 QT
21.149 6.624 21.367 6.725 QT
21.586 6.827 21.852 6.827 QT
21.977 6.827 21.977 6.999 QT
21.93 7.171 21.906 7.225 QT
21.883 7.28 21.774 7.28 QT
19.196 7.28 L
cp
22.539 3.874 M
25.446 3.874 L
25.055 -0.345 L
22.539 3.874 L
cp}def
f1088209836
f
GR
GS
[0.75 0 0 0.75 0 -0.25] CT
0.863 GC
N
252.394 99.229 M
252.394 82.531 L
212.036 82.531 L
212.036 99.229 L
cp
f
GR
GS
[0.75 0 0 0.75 0 -0.25] CT
10.0 ML
0.667 LW
N
212.036 99.229 M
212.036 82.531 L
252.394 82.531 L
252.394 99.229 L
cp
S
GR
GS
[0.75 0 0 0.75 0 -0.25] CT
1 GC
10.0 ML
0.667 LW
N
208 104 M
208 55 L
291 55 L
291 104 L
cp
S
GR
GS
[0.75 0 0 0.75 0 -0.25] CT
1 GC
N
310 385 M
524 385 L
524 45 L
310 45 L
cp
f
GR
GS
[0.75 0 0 0.75 312.7503 30.6125] CT
/Helvetica-Bold 20.533 F
GS
[1 0 0 1 0 0] CT
-27 -5 moveto 
1 -1 scale
(SM02) t 
GR
GR
GS
[0.75 0 0 0.75 0 -0.25] CT
0.149 GC
1 LJ
0.667 LW
N
310 385 M
524 385 L
S
GR
GS
[0.75 0 0 0.75 0 -0.25] CT
0 0.447 0.741 RC
N
410.706 385 M
410.706 281.75 L
360.353 281.75 L
360.353 385 L
cp
473.647 385 M
473.647 339.328 L
423.294 339.328 L
423.294 385 L
cp
f
GR
GS
[0.75 0 0 0.75 0 -0.25] CT
10.0 ML
0.667 LW
N
360.353 385 M
360.353 281.75 L
410.706 281.75 L
410.706 385 L
cp
S
GR
GS
[0.75 0 0 0.75 0 -0.25] CT
10.0 ML
0.667 LW
N
423.294 385 M
423.294 339.328 L
473.647 339.328 L
473.647 385 L
cp
S
GR
GS
[0.75 0 0 0.75 0 -0.25] CT
0.863 GC
N
410.706 281.75 M
410.706 63.342 L
360.353 63.342 L
360.353 281.75 L
cp
473.647 339.328 M
473.647 269.771 L
423.294 269.771 L
423.294 339.328 L
cp
f
GR
GS
[0.75 0 0 0.75 0 -0.25] CT
10.0 ML
0.667 LW
N
360.353 281.75 M
360.353 63.342 L
410.706 63.342 L
410.706 281.75 L
cp
S
GR
GS
[0.75 0 0 0.75 0 -0.25] CT
10.0 ML
0.667 LW
N
423.294 339.328 M
423.294 269.771 L
473.647 269.771 L
473.647 339.328 L
cp
S
GR
GS
[0.75 0 0 0.75 0 -0.25] CT
0.149 GC
2 setlinecap
1 LJ
0.667 LW
N
310 385 M
524 385 L
S
GR
GS
[0.75 0 0 0.75 0 -0.25] CT
0.149 GC
2 setlinecap
1 LJ
0.667 LW
N
310 45 M
524 45 L
S
GR
GS
[0.75 0 0 0.75 0 -0.25] CT
0.149 GC
2 setlinecap
1 LJ
0.667 LW
N
385.529 385 M
385.529 381.6 L
S
GR
GS
[0.75 0 0 0.75 0 -0.25] CT
0.149 GC
2 setlinecap
1 LJ
0.667 LW
N
448.471 385 M
448.471 381.6 L
S
GR
GS
[0.75 0 0 0.75 0 -0.25] CT
0.149 GC
2 setlinecap
1 LJ
0.667 LW
N
385.529 45 M
385.529 48.4 L
S
GR
GS
[0.75 0 0 0.75 0 -0.25] CT
0.149 GC
2 setlinecap
1 LJ
0.667 LW
N
448.471 45 M
448.471 48.4 L
S
GR
GS
[0.75 0 0 0.75 289.14706 293.3] CT
0.149 GC
/Helvetica 18.667 F
GS
[1 0 0 1 0 0] CT
-12 19 moveto 
1 -1 scale
(3D) t 
GR
GR
GS
[0.75 0 0 0.75 336.35294 293.3] CT
0.149 GC
/Helvetica 18.667 F
GS
[1 0 0 1 0 0] CT
-12 19 moveto 
1 -1 scale
(2D) t 
GR
GR
GS
[0.75 0 0 0.75 0 -0.25] CT
0.149 GC
2 setlinecap
1 LJ
0.667 LW
N
524 385 M
524 45 L
S
GR
GS
[0.75 0 0 0.75 0 -0.25] CT
0.149 GC
2 setlinecap
1 LJ
0.667 LW
N
310 385 M
310 45 L
S
GR
GS
[0.75 0 0 0.75 0 -0.25] CT
0.149 GC
2 setlinecap
1 LJ
0.667 LW
N
524 385 M
520.6 385 L
S
GR
GS
[0.75 0 0 0.75 0 -0.25] CT
0.149 GC
2 setlinecap
1 LJ
0.667 LW
N
524 300 M
520.6 300 L
S
GR
GS
[0.75 0 0 0.75 0 -0.25] CT
0.149 GC
2 setlinecap
1 LJ
0.667 LW
N
524 215 M
520.6 215 L
S
GR
GS
[0.75 0 0 0.75 0 -0.25] CT
0.149 GC
2 setlinecap
1 LJ
0.667 LW
N
524 130 M
520.6 130 L
S
GR
GS
[0.75 0 0 0.75 0 -0.25] CT
0.149 GC
2 setlinecap
1 LJ
0.667 LW
N
524 45 M
520.6 45 L
S
GR
GS
[0.75 0 0 0.75 0 -0.25] CT
0.149 GC
2 setlinecap
1 LJ
0.667 LW
N
310 385 M
313.4 385 L
S
GR
GS
[0.75 0 0 0.75 0 -0.25] CT
0.149 GC
2 setlinecap
1 LJ
0.667 LW
N
310 300 M
313.4 300 L
S
GR
GS
[0.75 0 0 0.75 0 -0.25] CT
0.149 GC
2 setlinecap
1 LJ
0.667 LW
N
310 215 M
313.4 215 L
S
GR
GS
[0.75 0 0 0.75 0 -0.25] CT
0.149 GC
2 setlinecap
1 LJ
0.667 LW
N
310 130 M
313.4 130 L
S
GR
GS
[0.75 0 0 0.75 0 -0.25] CT
0.149 GC
2 setlinecap
1 LJ
0.667 LW
N
310 45 M
313.4 45 L
S
GR
GS
[0.75 0 0 0.75 397.80002 288.5] CT
0.149 GC
/Helvetica 18.667 F
GS
[1 0 0 1 0 0] CT
0 7 moveto 
1 -1 scale
(0) t 
GR
GR
GS
[0.75 0 0 0.75 397.80002 224.75] CT
0.149 GC
/Helvetica 18.667 F
GS
[1 0 0 1 0 0] CT
0 7 moveto 
1 -1 scale
(10) t 
GR
GR
GS
[0.75 0 0 0.75 397.80002 161] CT
0.149 GC
/Helvetica 18.667 F
GS
[1 0 0 1 0 0] CT
0 7 moveto 
1 -1 scale
(20) t 
GR
GR
GS
[0.75 0 0 0.75 397.80002 97.25] CT
0.149 GC
/Helvetica 18.667 F
GS
[1 0 0 1 0 0] CT
0 7 moveto 
1 -1 scale
(30) t 
GR
GR
GS
[0.75 0 0 0.75 397.80002 33.5] CT
0.149 GC
/Helvetica 18.667 F
GS
[1 0 0 1 0 0] CT
0 7 moveto 
1 -1 scale
(40) t 
GR
GR
GS
[0 -0.75 0.75 0 416.55002 160.99987] CT
0.149 GC
/Helvetica 20.533 F
GS
[1 0 0 1 0 0] CT
-68.5 21 moveto 
1 -1 scale
(Mean error \(m\)) t 
GR
GR
GS
[0.75 0 0 0.75 0 -0.25] CT
1 GC
N
853 381 M
1074 381 L
1074 42 L
853 42 L
cp
f
GR
GS
[0.75 0 0 0.75 722.62569 28.36251] CT
/Helvetica-Bold 20.533 F
GS
[1 0 0 1 0 0] CT
-27 -5 moveto 
1 -1 scale
(SM02) t 
GR
GR
GS
[0.75 0 0 0.75 0 -0.25] CT
0.149 GC
1 LJ
0.667 LW
N
853 381 M
1074 381 L
S
GR
GS
[0.75 0 0 0.75 0 -0.25] CT
0 0.447 0.741 RC
N
957 381 M
957 182.572 L
905 182.572 L
905 381 L
cp
1022 381 M
1022 266.237 L
970 266.237 L
970 381 L
cp
f
GR
GS
[0.75 0 0 0.75 0 -0.25] CT
10.0 ML
0.667 LW
N
905 381 M
905 182.572 L
957 182.572 L
957 381 L
cp
S
GR
GS
[0.75 0 0 0.75 0 -0.25] CT
10.0 ML
0.667 LW
N
970 381 M
970 266.237 L
1022 266.237 L
1022 381 L
cp
S
GR
GS
[0.75 0 0 0.75 0 -0.25] CT
0.863 GC
N
957 182.572 M
957 71.626 L
905 71.626 L
905 182.572 L
cp
1022 266.237 M
1022 132.315 L
970 132.315 L
970 266.237 L
cp
f
GR
GS
[0.75 0 0 0.75 0 -0.25] CT
10.0 ML
0.667 LW
N
905 182.572 M
905 71.626 L
957 71.626 L
957 182.572 L
cp
S
GR
GS
[0.75 0 0 0.75 0 -0.25] CT
10.0 ML
0.667 LW
N
970 266.237 M
970 132.315 L
1022 132.315 L
1022 266.237 L
cp
S
GR
GS
[0.75 0 0 0.75 0 -0.25] CT
0.149 GC
2 setlinecap
1 LJ
0.667 LW
N
853 381 M
1074 381 L
S
GR
GS
[0.75 0 0 0.75 0 -0.25] CT
0.149 GC
2 setlinecap
1 LJ
0.667 LW
N
853 42 M
1074 42 L
S
GR
GS
[0.75 0 0 0.75 0 -0.25] CT
0.149 GC
2 setlinecap
1 LJ
0.667 LW
N
931 381 M
931 377.61 L
S
GR
GS
[0.75 0 0 0.75 0 -0.25] CT
0.149 GC
2 setlinecap
1 LJ
0.667 LW
N
996 381 M
996 377.61 L
S
GR
GS
[0.75 0 0 0.75 0 -0.25] CT
0.149 GC
2 setlinecap
1 LJ
0.667 LW
N
931 42 M
931 45.39 L
S
GR
GS
[0.75 0 0 0.75 0 -0.25] CT
0.149 GC
2 setlinecap
1 LJ
0.667 LW
N
996 42 M
996 45.39 L
S
GR
GS
[0.75 0 0 0.75 698.25 290.3] CT
0.149 GC
/Helvetica 18.667 F
GS
[1 0 0 1 0 0] CT
-12 19 moveto 
1 -1 scale
(3D) t 
GR
GR
GS
[0.75 0 0 0.75 747 290.3] CT
0.149 GC
/Helvetica 18.667 F
GS
[1 0 0 1 0 0] CT
-12 19 moveto 
1 -1 scale
(2D) t 
GR
GR
GS
[0.75 0 0 0.75 0 -0.25] CT
0.149 GC
2 setlinecap
1 LJ
0.667 LW
N
1074 381 M
1074 42 L
S
GR
GS
[0.75 0 0 0.75 0 -0.25] CT
0.149 GC
2 setlinecap
1 LJ
0.667 LW
N
853 381 M
853 42 L
S
GR
GS
[0.75 0 0 0.75 0 -0.25] CT
0.149 GC
2 setlinecap
1 LJ
0.667 LW
N
1074 381 M
1070.61 381 L
S
GR
GS
[0.75 0 0 0.75 0 -0.25] CT
0.149 GC
2 setlinecap
1 LJ
0.667 LW
N
1074 332.571 M
1070.61 332.571 L
S
GR
GS
[0.75 0 0 0.75 0 -0.25] CT
0.149 GC
2 setlinecap
1 LJ
0.667 LW
N
1074 284.143 M
1070.61 284.143 L
S
GR
GS
[0.75 0 0 0.75 0 -0.25] CT
0.149 GC
2 setlinecap
1 LJ
0.667 LW
N
1074 235.714 M
1070.61 235.714 L
S
GR
GS
[0.75 0 0 0.75 0 -0.25] CT
0.149 GC
2 setlinecap
1 LJ
0.667 LW
N
1074 187.286 M
1070.61 187.286 L
S
GR
GS
[0.75 0 0 0.75 0 -0.25] CT
0.149 GC
2 setlinecap
1 LJ
0.667 LW
N
1074 138.857 M
1070.61 138.857 L
S
GR
GS
[0.75 0 0 0.75 0 -0.25] CT
0.149 GC
2 setlinecap
1 LJ
0.667 LW
N
1074 90.429 M
1070.61 90.429 L
S
GR
GS
[0.75 0 0 0.75 0 -0.25] CT
0.149 GC
2 setlinecap
1 LJ
0.667 LW
N
1074 42 M
1070.61 42 L
S
GR
GS
[0.75 0 0 0.75 0 -0.25] CT
0.149 GC
2 setlinecap
1 LJ
0.667 LW
N
853 381 M
856.39 381 L
S
GR
GS
[0.75 0 0 0.75 0 -0.25] CT
0.149 GC
2 setlinecap
1 LJ
0.667 LW
N
853 332.571 M
856.39 332.571 L
S
GR
GS
[0.75 0 0 0.75 0 -0.25] CT
0.149 GC
2 setlinecap
1 LJ
0.667 LW
N
853 284.143 M
856.39 284.143 L
S
GR
GS
[0.75 0 0 0.75 0 -0.25] CT
0.149 GC
2 setlinecap
1 LJ
0.667 LW
N
853 235.714 M
856.39 235.714 L
S
GR
GS
[0.75 0 0 0.75 0 -0.25] CT
0.149 GC
2 setlinecap
1 LJ
0.667 LW
N
853 187.286 M
856.39 187.286 L
S
GR
GS
[0.75 0 0 0.75 0 -0.25] CT
0.149 GC
2 setlinecap
1 LJ
0.667 LW
N
853 138.857 M
856.39 138.857 L
S
GR
GS
[0.75 0 0 0.75 0 -0.25] CT
0.149 GC
2 setlinecap
1 LJ
0.667 LW
N
853 90.429 M
856.39 90.429 L
S
GR
GS
[0.75 0 0 0.75 0 -0.25] CT
0.149 GC
2 setlinecap
1 LJ
0.667 LW
N
853 42 M
856.39 42 L
S
GR
GS
[0.75 0 0 0.75 810.30002 285.5] CT
0.149 GC
/Helvetica 18.667 F
GS
[1 0 0 1 0 0] CT
0 7 moveto 
1 -1 scale
(0) t 
GR
GR
GS
[0.75 0 0 0.75 810.30002 249.17858] CT
0.149 GC
/Helvetica 18.667 F
GS
[1 0 0 1 0 0] CT
0 7 moveto 
1 -1 scale
(5) t 
GR
GR
GS
[0.75 0 0 0.75 810.30002 212.85714] CT
0.149 GC
/Helvetica 18.667 F
GS
[1 0 0 1 0 0] CT
0 7 moveto 
1 -1 scale
(10) t 
GR
GR
GS
[0.75 0 0 0.75 810.30002 176.53571] CT
0.149 GC
/Helvetica 18.667 F
GS
[1 0 0 1 0 0] CT
0 7 moveto 
1 -1 scale
(15) t 
GR
GR
GS
[0.75 0 0 0.75 810.30002 140.21429] CT
0.149 GC
/Helvetica 18.667 F
GS
[1 0 0 1 0 0] CT
0 7 moveto 
1 -1 scale
(20) t 
GR
GR
GS
[0.75 0 0 0.75 810.30002 103.89286] CT
0.149 GC
/Helvetica 18.667 F
GS
[1 0 0 1 0 0] CT
0 7 moveto 
1 -1 scale
(25) t 
GR
GR
GS
[0.75 0 0 0.75 810.30002 67.57143] CT
0.149 GC
/Helvetica 18.667 F
GS
[1 0 0 1 0 0] CT
0 7 moveto 
1 -1 scale
(30) t 
GR
GR
GS
[0.75 0 0 0.75 810.30002 31.25] CT
0.149 GC
/Helvetica 18.667 F
GS
[1 0 0 1 0 0] CT
0 7 moveto 
1 -1 scale
(35) t 
GR
GR
GS
[0 -0.75 0.75 0 829.05002 158.37487] CT
0.149 GC
/Helvetica 20.533 F
GS
[1 0 0 1 0 0] CT
-68.5 21 moveto 
1 -1 scale
(Mean error \(m\)) t 
GR
GR
GS
[0.75 0 0 0.75 0 -0.25] CT
1 GC
N
612 384 M
836 384 L
836 42 L
612 42 L
cp
f
GR
GS
[0.75 0 0 0.75 543.0005 28.3625] CT
/Helvetica-Bold 20.533 F
GS
[1 0 0 1 0 0] CT
-27 -5 moveto 
1 -1 scale
(SM01) t 
GR
GR
GS
[0.75 0 0 0.75 0 -0.25] CT
0.149 GC
1 LJ
0.667 LW
N
612 384 M
836 384 L
S
GR
GS
[0.75 0 0 0.75 0 -0.25] CT
0 0.447 0.741 RC
N
717.412 384 M
717.412 120.552 L
664.706 120.552 L
664.706 384 L
cp
783.294 384 M
783.294 320.033 L
730.588 320.033 L
730.588 384 L
cp
f
GR
GS
[0.75 0 0 0.75 0 -0.25] CT
10.0 ML
0.667 LW
N
664.706 384 M
664.706 120.552 L
717.412 120.552 L
717.412 384 L
cp
S
GR
GS
[0.75 0 0 0.75 0 -0.25] CT
10.0 ML
0.667 LW
N
730.588 384 M
730.588 320.033 L
783.294 320.033 L
783.294 384 L
cp
S
GR
GS
[0.75 0 0 0.75 0 -0.25] CT
0.863 GC
N
717.412 120.552 M
717.412 78.214 L
664.706 78.214 L
664.706 120.552 L
cp
783.294 320.033 M
783.294 299.053 L
730.588 299.053 L
730.588 320.033 L
cp
f
GR
GS
[0.75 0 0 0.75 0 -0.25] CT
10.0 ML
0.667 LW
N
664.706 120.552 M
664.706 78.214 L
717.412 78.214 L
717.412 120.552 L
cp
S
GR
GS
[0.75 0 0 0.75 0 -0.25] CT
10.0 ML
0.667 LW
N
730.588 320.033 M
730.588 299.053 L
783.294 299.053 L
783.294 320.033 L
cp
S
GR
GS
[0.75 0 0 0.75 0 -0.25] CT
0.149 GC
2 setlinecap
1 LJ
0.667 LW
N
612 384 M
836 384 L
S
GR
GS
[0.75 0 0 0.75 0 -0.25] CT
0.149 GC
2 setlinecap
1 LJ
0.667 LW
N
612 42 M
836 42 L
S
GR
GS
[0.75 0 0 0.75 0 -0.25] CT
0.149 GC
2 setlinecap
1 LJ
0.667 LW
N
691.059 384 M
691.059 380.58 L
S
GR
GS
[0.75 0 0 0.75 0 -0.25] CT
0.149 GC
2 setlinecap
1 LJ
0.667 LW
N
756.941 384 M
756.941 380.58 L
S
GR
GS
[0.75 0 0 0.75 0 -0.25] CT
0.149 GC
2 setlinecap
1 LJ
0.667 LW
N
691.059 42 M
691.059 45.42 L
S
GR
GS
[0.75 0 0 0.75 0 -0.25] CT
0.149 GC
2 setlinecap
1 LJ
0.667 LW
N
756.941 42 M
756.941 45.42 L
S
GR
GS
[0.75 0 0 0.75 518.29413 292.55] CT
0.149 GC
/Helvetica 18.667 F
GS
[1 0 0 1 0 0] CT
-12 19 moveto 
1 -1 scale
(3D) t 
GR
GR
GS
[0.75 0 0 0.75 567.70587 292.55] CT
0.149 GC
/Helvetica 18.667 F
GS
[1 0 0 1 0 0] CT
-12 19 moveto 
1 -1 scale
(2D) t 
GR
GR
GS
[0.75 0 0 0.75 0 -0.25] CT
0.149 GC
2 setlinecap
1 LJ
0.667 LW
N
612 384 M
612 42 L
S
GR
GS
[0.75 0 0 0.75 0 -0.25] CT
0.149 GC
2 setlinecap
1 LJ
0.667 LW
N
836 384 M
836 42 L
S
GR
GS
[0.75 0 0 0.75 0 -0.25] CT
0.149 GC
2 setlinecap
1 LJ
0.667 LW
N
612 384 M
615.42 384 L
S
GR
GS
[0.75 0 0 0.75 0 -0.25] CT
0.149 GC
2 setlinecap
1 LJ
0.667 LW
N
612 315.6 M
615.42 315.6 L
S
GR
GS
[0.75 0 0 0.75 0 -0.25] CT
0.149 GC
2 setlinecap
1 LJ
0.667 LW
N
612 247.2 M
615.42 247.2 L
S
GR
GS
[0.75 0 0 0.75 0 -0.25] CT
0.149 GC
2 setlinecap
1 LJ
0.667 LW
N
612 178.8 M
615.42 178.8 L
S
GR
GS
[0.75 0 0 0.75 0 -0.25] CT
0.149 GC
2 setlinecap
1 LJ
0.667 LW
N
612 110.4 M
615.42 110.4 L
S
GR
GS
[0.75 0 0 0.75 0 -0.25] CT
0.149 GC
2 setlinecap
1 LJ
0.667 LW
N
612 42 M
615.42 42 L
S
GR
GS
[0.75 0 0 0.75 0 -0.25] CT
0.149 GC
2 setlinecap
1 LJ
0.667 LW
N
836 384 M
832.58 384 L
S
GR
GS
[0.75 0 0 0.75 0 -0.25] CT
0.149 GC
2 setlinecap
1 LJ
0.667 LW
N
836 315.6 M
832.58 315.6 L
S
GR
GS
[0.75 0 0 0.75 0 -0.25] CT
0.149 GC
2 setlinecap
1 LJ
0.667 LW
N
836 247.2 M
832.58 247.2 L
S
GR
GS
[0.75 0 0 0.75 0 -0.25] CT
0.149 GC
2 setlinecap
1 LJ
0.667 LW
N
836 178.8 M
832.58 178.8 L
S
GR
GS
[0.75 0 0 0.75 0 -0.25] CT
0.149 GC
2 setlinecap
1 LJ
0.667 LW
N
836 110.4 M
832.58 110.4 L
S
GR
GS
[0.75 0 0 0.75 0 -0.25] CT
0.149 GC
2 setlinecap
1 LJ
0.667 LW
N
836 42 M
832.58 42 L
S
GR
GS
[0.75 0 0 0.75 454.19998 287.75] CT
0.149 GC
/Helvetica 18.667 F
GS
[1 0 0 1 0 0] CT
-11 7 moveto 
1 -1 scale
(0) t 
GR
GR
GS
[0.75 0 0 0.75 454.19998 236.45] CT
0.149 GC
/Helvetica 18.667 F
GS
[1 0 0 1 0 0] CT
-21 7 moveto 
1 -1 scale
(10) t 
GR
GR
GS
[0.75 0 0 0.75 454.19998 185.15] CT
0.149 GC
/Helvetica 18.667 F
GS
[1 0 0 1 0 0] CT
-21 7 moveto 
1 -1 scale
(20) t 
GR
GR
GS
[0.75 0 0 0.75 454.19998 133.85] CT
0.149 GC
/Helvetica 18.667 F
GS
[1 0 0 1 0 0] CT
-21 7 moveto 
1 -1 scale
(30) t 
GR
GR
GS
[0.75 0 0 0.75 454.19998 82.55] CT
0.149 GC
/Helvetica 18.667 F
GS
[1 0 0 1 0 0] CT
-21 7 moveto 
1 -1 scale
(40) t 
GR
GR
GS
[0.75 0 0 0.75 454.19998 31.25] CT
0.149 GC
/Helvetica 18.667 F
GS
[1 0 0 1 0 0] CT
-21 7 moveto 
1 -1 scale
(50) t 
GR
GR
GS
[0.75 0 0 0.75 0 -0.25] CT
10.0 ML
0.667 LW
N
808.059 36.864 M
808.059 8.731 L
879.986 8.731 L
879.986 36.864 L
cp
S
GR
GS
[0.75 0 0 0.75 633.01698 9.29814] CT
/Helvetica 18.667 F
GS
[1 0 0 1 0 0] CT
-16.5 19 moveto 
1 -1 scale
(f-01) t 
GR
GR
GS
[0.75 0 0 0.75 0 -0.25] CT
10.0 ML
0.667 LW
N
807.045 446.244 M
807.045 418.111 L
878.971 418.111 L
878.971 446.244 L
cp
S
GR
GS
[0.75 0 0 0.75 632.25581 316.33343] CT
/Helvetica 18.667 F
GS
[1 0 0 1 0 0] CT
-19 19 moveto 
1 -1 scale
(d-02) t 
GR
GR
GS
[0.75 0 0 0.75 0 -0.25] CT
10.0 ML
0.667 LW
N
267.076 447.214 M
267.076 419.081 L
339.003 419.081 L
339.003 447.214 L
cp
S
GR
GS
[0.75 0 0 0.75 227.27957 317.061] CT
/Helvetica 18.667 F
GS
[1 0 0 1 0 0] CT
-19 19 moveto 
1 -1 scale
(g-05) t 
GR
GR
GS
[0.75 0 0 0.75 0 -0.25] CT
10.0 ML
0.667 LW
N
269.106 37.834 M
269.106 9.701 L
341.033 9.701 L
341.033 37.834 L
cp
S
GR
GS
[0.75 0 0 0.75 228.80205 10.02573] CT
/Helvetica 18.667 F
GS
[1 0 0 1 0 0] CT
-18.5 19 moveto 
1 -1 scale
(c-01) t 
GR
GR
%%Trailer
%%Pages: 1
%%EOF
