\relax 
\providecommand\hyper@newdestlabel[2]{}
\@writefile{toc}{\contentsline {chapter}{\numberline {5}Simulation analysis and assessment of GNSS-based baseline length computation}{63}{chapter.5}\protected@file@percent }
\@writefile{lof}{\addvspace {10\p@ }}
\@writefile{lot}{\addvspace {10\p@ }}
\newlabel{ch:GNSSrangingAssessment}{{5}{63}{Simulation analysis and assessment of GNSS-based baseline length computation}{chapter.5}{}}
\acronymused{DGPS}
\acronymused{GNSS}
\acronymused{DGPS}
\acronymused{RTK}
\acronymused{GNSS}
\acronymused{IAR}
\acronymused{IAR}
\acronymused{IAR}
\acronymused{W-IAR}
\acronymused{W-IAR}
\acronymused{IAR}
\@writefile{toc}{\contentsline {section}{\numberline {5.1}Analysis and assessment of \ac {IAR} model}{64}{section.5.1}\protected@file@percent }
\newlabel{sec:IARass}{{5.1}{64}{Analysis and assessment of \ac {IAR} model}{section.5.1}{}}
\acronymused{IAR}
\acronymused{IAR}
\@writefile{toc}{\contentsline {subsection}{\numberline {5.1.1}Geometrical Model}{64}{subsection.5.1.1}\protected@file@percent }
\newlabel{sub:geomodel}{{5.1.1}{64}{Geometrical Model}{subsection.5.1.1}{}}
\acronymused{IAR}
\@writefile{lof}{\contentsline {figure}{\numberline {5.1}{\ignorespaces {\relax \fontsize  {10}{12}\selectfont  \abovedisplayskip 10\p@ plus2\p@ minus5\p@ \abovedisplayshortskip \z@ plus3\p@ \belowdisplayshortskip 6\p@ plus3\p@ minus3\p@ \def \leftmargin \leftmargini \parsep 4.5\p@ plus2\p@ minus\p@ \topsep 9\p@ plus3\p@ minus5\p@ \itemsep 4.5\p@ plus2\p@ minus\p@ {\leftmargin \leftmargini \topsep 6\p@ plus2\p@ minus2\p@ \parsep 3\p@ plus2\p@ minus\p@ \itemsep \parsep }\belowdisplayskip \abovedisplayskip \added [id=1]{H}emispherical cap lying on the \ac {LTP} centered in $\mathbf  {x}_T$.}\relax }}{64}{figure.caption.39}\protected@file@percent }
\@writefile{loc}{\ChangesListline {added}{Added~(1)}{H}{64}}
\acronymused{LTP}
\newlabel{fig:HemisphericalRef}{{5.1}{64}{{\small \added [id=1]{H}emispherical cap lying on the \ac {LTP} centered in $\mathbf {x}_T$.}\relax }{figure.caption.39}{}}
\acronymused{IAR}
\acronymused{LTP}
\@writefile{loc}{\ChangesListline {replaced}{Replaced~(1)}{Appendix}{64}}
\acronymused{IAR}
\acronymused{IAR}
\acronymused{IAR}
\acronymused{GDOP}
\acronymused{IAR}
\acronymused{IAR}
\@writefile{toc}{\contentsline {subsection}{\numberline {5.1.2}Variance behaviour in single satellite \ac {IAR}}{65}{subsection.5.1.2}\protected@file@percent }
\newlabel{sub:varBehav}{{5.1.2}{65}{Variance behaviour in single satellite \ac {IAR}}{subsection.5.1.2}{}}
\acronymused{LTP}
\acronymused{IAR}
\@writefile{lof}{\contentsline {figure}{\numberline {5.2}{\ignorespaces \relax \fontsize  {10}{12}\selectfont  \abovedisplayskip 10\p@ plus2\p@ minus5\p@ \abovedisplayshortskip \z@ plus3\p@ \belowdisplayshortskip 6\p@ plus3\p@ minus3\p@ \def \leftmargin \leftmargini \parsep 4.5\p@ plus2\p@ minus\p@ \topsep 9\p@ plus3\p@ minus5\p@ \itemsep 4.5\p@ plus2\p@ minus\p@ {\leftmargin \leftmargini \topsep 6\p@ plus2\p@ minus2\p@ \parsep 3\p@ plus2\p@ minus\p@ \itemsep \parsep }\belowdisplayskip \abovedisplayskip {Simulated evaluation of the bias of the \ac {IAR} measurements according to the position of the shared satellite and varying the magnitude of $\sigma _{\mathaccentV {hat}05E{\gamma }}$ in $[0, 1\cdot 10^{-7}, 5\cdot 10^{-7}]$, $d=100$ m, $\sigma _i=\sigma _j=7.03$ m.}\relax }}{65}{figure.caption.40}\protected@file@percent }
\acronymused{IAR}
\newlabel{fig:skyplotsBIAS}{{5.2}{65}{\small {Simulated evaluation of the bias of the \ac {IAR} measurements according to the position of the shared satellite and varying the magnitude of $\sigma _{\hat {\gamma }}$ in $[0, 1\cdot 10^{-7}, 5\cdot 10^{-7}]$, $d=100$ m, $\sigma _i=\sigma _j=7.03$ m.}\relax }{figure.caption.40}{}}
\newlabel{fig:skyPlot_a_std}{{5.3a}{65}{\relax }{figure.caption.41}{}}
\newlabel{sub@fig:skyPlot_a_std}{{a}{65}{\relax }{figure.caption.41}{}}
\newlabel{fig:skyPlot_b_std}{{5.3b}{65}{\relax }{figure.caption.41}{}}
\newlabel{sub@fig:skyPlot_b_std}{{b}{65}{\relax }{figure.caption.41}{}}
\newlabel{fig:skyPlot_c_std}{{5.3c}{65}{\relax }{figure.caption.41}{}}
\newlabel{sub@fig:skyPlot_c_std}{{c}{65}{\relax }{figure.caption.41}{}}
\@writefile{lof}{\contentsline {figure}{\numberline {5.3}{\ignorespaces Analytic evaluation of $\sigma _{\mathaccentV {hat}05E{d}}$ according to the position of the shared satellite and varying the magnitude of $\sigma _{\mathaccentV {hat}05E{\gamma }}$ in $[0, 1\cdot 10^{-7}, 5\cdot 10^{-6}]$, $d=100$ m,$\sigma _i=\sigma _j=7.03$ m.\relax }}{65}{figure.caption.41}\protected@file@percent }
\newlabel{fig:skyplotsSTD}{{5.3}{65}{Analytic evaluation of $\sigma _{\hat {d}}$ according to the position of the shared satellite and varying the magnitude of $\sigma _{\hat {\gamma }}$ in $[0, 1\cdot 10^{-7}, 5\cdot 10^{-6}]$, $d=100$ m,$\sigma _i=\sigma _j=7.03$ m.\relax }{figure.caption.41}{}}
\acronymused{LoS}
\@writefile{lof}{\contentsline {figure}{\numberline {5.4}{\ignorespaces \relax \fontsize  {10}{12}\selectfont  \abovedisplayskip 10\p@ plus2\p@ minus5\p@ \abovedisplayshortskip \z@ plus3\p@ \belowdisplayshortskip 6\p@ plus3\p@ minus3\p@ \def \leftmargin \leftmargini \parsep 4.5\p@ plus2\p@ minus\p@ \topsep 9\p@ plus3\p@ minus5\p@ \itemsep 4.5\p@ plus2\p@ minus\p@ {\leftmargin \leftmargini \topsep 6\p@ plus2\p@ minus2\p@ \parsep 3\p@ plus2\p@ minus\p@ \itemsep \parsep }\belowdisplayskip \abovedisplayskip Analytic evaluation of $\sigma _{\mathaccentV {hat}05E{d}}$ varying the azimuth of the aiding agent $j$, w.r.t. the aided agent $i$. Parameters: $\sigma _{\mathaccentV {hat}05E{\gamma }}=0.5\cdot 10^{-6}$ $d=100$ m, $\sigma _i=\sigma _j=7.03$ m.\relax }}{66}{figure.caption.42}\protected@file@percent }
\newlabel{fig:azrotation}{{5.4}{66}{\small Analytic evaluation of $\sigma _{\hat {d}}$ varying the azimuth of the aiding agent $j$, w.r.t. the aided agent $i$. Parameters: $\sigma _{\hat {\gamma }}=0.5\cdot 10^{-6}$ $d=100$ m, $\sigma _i=\sigma _j=7.03$ m.\relax }{figure.caption.42}{}}
\@writefile{lof}{\contentsline {figure}{\numberline {5.5}{\ignorespaces \relax \fontsize  {10}{12}\selectfont  \abovedisplayskip 10\p@ plus2\p@ minus5\p@ \abovedisplayshortskip \z@ plus3\p@ \belowdisplayshortskip 6\p@ plus3\p@ minus3\p@ \def \leftmargin \leftmargini \parsep 4.5\p@ plus2\p@ minus\p@ \topsep 9\p@ plus3\p@ minus5\p@ \itemsep 4.5\p@ plus2\p@ minus\p@ {\leftmargin \leftmargini \topsep 6\p@ plus2\p@ minus2\p@ \parsep 3\p@ plus2\p@ minus\p@ \itemsep \parsep }\belowdisplayskip \abovedisplayskip Analytic evaluation of $\sigma _{\mathaccentV {hat}05E{d}}$ both the azimuth and elevation angle of the aiding agent $j$, w.r.t. the aided agent $i$. Parameters: $\sigma _{\mathaccentV {hat}05E{\gamma }}=0.5\cdot 10^{-6}$ $d=100$ m, $\sigma _i=\sigma _j=7.03$ m.\relax }}{66}{figure.caption.43}\protected@file@percent }
\newlabel{fig:elevation}{{5.5}{66}{\small Analytic evaluation of $\sigma _{\hat {d}}$ both the azimuth and elevation angle of the aiding agent $j$, w.r.t. the aided agent $i$. Parameters: $\sigma _{\hat {\gamma }}=0.5\cdot 10^{-6}$ $d=100$ m, $\sigma _i=\sigma _j=7.03$ m.\relax }{figure.caption.43}{}}
\@writefile{toc}{\contentsline {subsection}{\numberline {5.1.3}Analytic formula assessment }{66}{subsection.5.1.3}\protected@file@percent }
\acronymused{IAR}
\acronymused{IAR}
\newlabel{fig:skyPlot_A_rotation}{{5.6a}{67}{\relax }{figure.caption.44}{}}
\newlabel{sub@fig:skyPlot_A_rotation}{{a}{67}{\relax }{figure.caption.44}{}}
\newlabel{fig:skyPlot_B_rotation}{{5.6b}{67}{\relax }{figure.caption.44}{}}
\newlabel{sub@fig:skyPlot_B_rotation}{{b}{67}{\relax }{figure.caption.44}{}}
\newlabel{fig:skyPlot_C_rotation}{{5.6c}{67}{\relax }{figure.caption.44}{}}
\newlabel{sub@fig:skyPlot_C_rotation}{{c}{67}{\relax }{figure.caption.44}{}}
\@writefile{lof}{\contentsline {figure}{\numberline {5.6}{\ignorespaces \relax \fontsize  {10}{12}\selectfont  \abovedisplayskip 10\p@ plus2\p@ minus5\p@ \abovedisplayshortskip \z@ plus3\p@ \belowdisplayshortskip 6\p@ plus3\p@ minus3\p@ \def \leftmargin \leftmargini \parsep 4.5\p@ plus2\p@ minus\p@ \topsep 9\p@ plus3\p@ minus5\p@ \itemsep 4.5\p@ plus2\p@ minus\p@ {\leftmargin \leftmargini \topsep 6\p@ plus2\p@ minus2\p@ \parsep 3\p@ plus2\p@ minus\p@ \itemsep \parsep }\belowdisplayskip \abovedisplayskip {Analytic evaluation of $\sigma _{\mathaccentV {hat}05E{d}}$ according to the position of the shared satellite and varying the magnitude of $\sigma _{\mathaccentV {hat}05E{\gamma }} \in [0, 1\cdot 10^{-7}, 5\cdot 10^{-6}]$, $d=100$ m,$\sigma _i=\sigma _j=7.03$ m.}\relax }}{67}{figure.caption.44}\protected@file@percent }
\newlabel{fig:formulaComparison}{{5.6}{67}{\small {Analytic evaluation of $\sigma _{\hat {d}}$ according to the position of the shared satellite and varying the magnitude of $\sigma _{\hat {\gamma }} \in [0, 1\cdot 10^{-7}, 5\cdot 10^{-6}]$, $d=100$ m,$\sigma _i=\sigma _j=7.03$ m.}\relax }{figure.caption.44}{}}
\acronymused{IAR}
\acronymused{IAR}
\@writefile{toc}{\contentsline {subsection}{\numberline {5.1.4}Experimental framework in a controlled static environment}{67}{subsection.5.1.4}\protected@file@percent }
\newlabel{sub:experiment0}{{5.1.4}{67}{Experimental framework in a controlled static environment}{subsection.5.1.4}{}}
\acronymused{IAR}
\acronymused{RF}
\AC@undonewlabel{acro:RFCS}
\newlabel{acro:RFCS}{{5.1.4}{67}{Experimental framework in a controlled static environment}{subsection.5.1.4}{}}
\acronymused{RFCS}
\acronymused{LLA}
\acronymused{RFCS}
\@writefile{lot}{\contentsline {table}{\numberline {5.1}{\ignorespaces LLA Coordinates of simulated static agents in a controlled environment.\relax }}{67}{table.caption.46}\protected@file@percent }
\newlabel{tab:coordinatesIFEN}{{5.1}{67}{LLA Coordinates of simulated static agents in a controlled environment.\relax }{table.caption.46}{}}
\@writefile{lof}{\contentsline {figure}{\numberline {5.7}{\ignorespaces {\relax \fontsize  {10}{12}\selectfont  \abovedisplayskip 10\p@ plus2\p@ minus5\p@ \abovedisplayshortskip \z@ plus3\p@ \belowdisplayshortskip 6\p@ plus3\p@ minus3\p@ \def \leftmargin \leftmargini \parsep 4.5\p@ plus2\p@ minus\p@ \topsep 9\p@ plus3\p@ minus5\p@ \itemsep 4.5\p@ plus2\p@ minus\p@ {\leftmargin \leftmargini \topsep 6\p@ plus2\p@ minus2\p@ \parsep 3\p@ plus2\p@ minus\p@ \itemsep \parsep }\belowdisplayskip \abovedisplayskip Simulation test-bench for \ac {IAR} performance assessment processing realistic \ac {RF} signals.}\relax }}{68}{figure.caption.45}\protected@file@percent }
\acronymused{IAR}
\acronymused{RF}
\newlabel{fig:SimuSchemePLANS}{{5.7}{68}{{\small Simulation test-bench for \ac {IAR} performance assessment processing realistic \ac {RF} signals.}\relax }{figure.caption.45}{}}
\acronymused{GNSS}
\AC@undonewlabel{acro:OCXO}
\newlabel{acro:OCXO}{{5.1.4}{68}{Experimental framework in a controlled static environment}{table.caption.46}{}}
\acronymused{OCXO}
\@writefile{lot}{\contentsline {table}{\numberline {5.2}{\ignorespaces Hardware configuration.\relax }}{68}{table.caption.47}\protected@file@percent }
\@writefile{lot}{\contentsline {table}{\numberline {5.3}{\ignorespaces Ettus Research USRP N210.\relax }}{68}{table.caption.47}\protected@file@percent }
\newlabel{tab:parameters}{{5.3}{68}{Ettus Research USRP N210.\relax }{table.caption.47}{}}
\acronymused{PVT}
\@writefile{lot}{\contentsline {table}{\numberline {5.4}{\ignorespaces NavSAS Software Receiver.\relax }}{68}{table.caption.47}\protected@file@percent }
\acronymused{GNSS}
\acronymused{CRU}
\acronymused{IAR}
\acronymused{GNSS}
\acronymused{IAR}
\acronymused{GPS}
\acronymused{PRN}
\newlabel{fig:1a}{{5.8a}{69}{\relax }{figure.caption.48}{}}
\newlabel{sub@fig:1a}{{a}{69}{\relax }{figure.caption.48}{}}
\newlabel{fig:1b}{{5.8b}{69}{\relax }{figure.caption.48}{}}
\newlabel{sub@fig:1b}{{b}{69}{\relax }{figure.caption.48}{}}
\newlabel{fig:1c}{{5.8c}{69}{\relax }{figure.caption.48}{}}
\newlabel{sub@fig:1c}{{c}{69}{\relax }{figure.caption.48}{}}
\@writefile{lof}{\contentsline {figure}{\numberline {5.8}{\ignorespaces \relax \fontsize  {10}{12}\selectfont  \abovedisplayskip 10\p@ plus2\p@ minus5\p@ \abovedisplayshortskip \z@ plus3\p@ \belowdisplayshortskip 6\p@ plus3\p@ minus3\p@ \def \leftmargin \leftmargini \parsep 4.5\p@ plus2\p@ minus\p@ \topsep 9\p@ plus3\p@ minus5\p@ \itemsep 4.5\p@ plus2\p@ minus\p@ {\leftmargin \leftmargini \topsep 6\p@ plus2\p@ minus2\p@ \parsep 3\p@ plus2\p@ minus\p@ \itemsep \parsep }\belowdisplayskip \abovedisplayskip {$\sigma ^2$ skyplot with superposition of satellites azimuth and elevation observed within experimental simulation.}\relax }}{69}{figure.caption.48}\protected@file@percent }
\newlabel{fig:multiFigureSuperposition}{{5.8}{69}{\small {$\sigma ^2$ skyplot with superposition of satellites azimuth and elevation observed within experimental simulation.}\relax }{figure.caption.48}{}}
\newlabel{fig:1da}{{5.9a}{69}{\relax }{figure.caption.49}{}}
\newlabel{sub@fig:1da}{{a}{69}{\relax }{figure.caption.49}{}}
\newlabel{fig:1db}{{5.9b}{69}{\relax }{figure.caption.49}{}}
\newlabel{sub@fig:1db}{{b}{69}{\relax }{figure.caption.49}{}}
\newlabel{fig:1dc}{{5.9c}{69}{\relax }{figure.caption.49}{}}
\newlabel{sub@fig:1dc}{{c}{69}{\relax }{figure.caption.49}{}}
\@writefile{lof}{\contentsline {figure}{\numberline {5.9}{\ignorespaces \relax \fontsize  {10}{12}\selectfont  \abovedisplayskip 10\p@ plus2\p@ minus5\p@ \abovedisplayshortskip \z@ plus3\p@ \belowdisplayshortskip 6\p@ plus3\p@ minus3\p@ \def \leftmargin \leftmargini \parsep 4.5\p@ plus2\p@ minus\p@ \topsep 9\p@ plus3\p@ minus5\p@ \itemsep 4.5\p@ plus2\p@ minus\p@ {\leftmargin \leftmargini \topsep 6\p@ plus2\p@ minus2\p@ \parsep 3\p@ plus2\p@ minus\p@ \itemsep \parsep }\belowdisplayskip \abovedisplayskip {Ranking plot of all the shareable satellites based on the \ac {STD} experimentally observed and the interpolation of the analytic model.}\relax }}{69}{figure.caption.49}\protected@file@percent }
\acronymused{STD}
\newlabel{fig:multiFigureSuperposition_rank}{{5.9}{69}{\small {Ranking plot of all the shareable satellites based on the \ac {STD} experimentally observed and the interpolation of the analytic model.}\relax }{figure.caption.49}{}}
\acronymused{PRN}
\acronymused{PRN}
\acronymused{PRN}
\@writefile{toc}{\contentsline {subsection}{\numberline {5.1.5}Experimental assessment using COTS GNSS Receivers}{70}{subsection.5.1.5}\protected@file@percent }
\newlabel{sub:experiment}{{5.1.5}{70}{Experimental assessment using COTS GNSS Receivers}{subsection.5.1.5}{}}
\acronymused{IAR}
\AC@undonewlabel{acro:COTS}
\newlabel{acro:COTS}{{5.1.5}{70}{Experimental assessment using COTS GNSS Receivers}{subsection.5.1.5}{}}
\acronymused{COTS}
\acronymused{IAR}
\@writefile{lof}{\contentsline {figure}{\numberline {5.10}{\ignorespaces {\relax \fontsize  {10}{12}\selectfont  \abovedisplayskip 10\p@ plus2\p@ minus5\p@ \abovedisplayshortskip \z@ plus3\p@ \belowdisplayshortskip 6\p@ plus3\p@ minus3\p@ \def \leftmargin \leftmargini \parsep 4.5\p@ plus2\p@ minus\p@ \topsep 9\p@ plus3\p@ minus5\p@ \itemsep 4.5\p@ plus2\p@ minus\p@ {\leftmargin \leftmargini \topsep 6\p@ plus2\p@ minus2\p@ \parsep 3\p@ plus2\p@ minus\p@ \itemsep \parsep }\belowdisplayskip \abovedisplayskip Simulation test-bench for performance assessment of GNSS-based ranging methods in real environment.}\relax }}{70}{figure.caption.50}\protected@file@percent }
\newlabel{fig:SimuScheme}{{5.10}{70}{{\small Simulation test-bench for performance assessment of GNSS-based ranging methods in real environment.}\relax }{figure.caption.50}{}}
\acronymused{IAR}
\acronymused{LMS}
\acronymused{GPS}
\acronymused{IAR}
\@writefile{lot}{\contentsline {table}{\numberline {5.5}{\ignorespaces LLA Coordinates of georeferenced geodetic antenna (aiding peer).\relax }}{71}{table.caption.51}\protected@file@percent }
\newlabel{tab:coordinatesLLA}{{5.5}{71}{LLA Coordinates of georeferenced geodetic antenna (aiding peer).\relax }{table.caption.51}{}}
\@writefile{lot}{\contentsline {table}{\numberline {5.6}{\ignorespaces Test scenarios for GNSS-based ranging (LLA coordinates of the aided peer).\relax }}{71}{table.caption.52}\protected@file@percent }
\newlabel{tab:tests}{{5.6}{71}{Test scenarios for GNSS-based ranging (LLA coordinates of the aided peer).\relax }{table.caption.52}{}}
\@writefile{loc}{\ChangesListline {added}{Added~(1)}{Test}{71}}
\acronymused{COTS}
\@writefile{toc}{\contentsline {subsubsection}{Validation of the theoretical model using COTS receiver}{71}{table.caption.52}\protected@file@percent }
\newlabel{sub:cotsValidation}{{5.1.5}{71}{Validation of the theoretical model using COTS receiver}{table.caption.52}{}}
\acronymused{IAR}
\acronymused{IAR}
\acronymused{IAR}
\acronymused{STD}
\acronymused{IAR}
\acronymused{IAR}
\acronymused{IAR}
\acronymused{IAR}
\@writefile{lof}{\contentsline {figure}{\numberline {5.11}{\ignorespaces {\relax \fontsize  {10}{12}\selectfont  \abovedisplayskip 10\p@ plus2\p@ minus5\p@ \abovedisplayshortskip \z@ plus3\p@ \belowdisplayshortskip 6\p@ plus3\p@ minus3\p@ \def \leftmargin \leftmargini \parsep 4.5\p@ plus2\p@ minus\p@ \topsep 9\p@ plus3\p@ minus5\p@ \itemsep 4.5\p@ plus2\p@ minus\p@ {\leftmargin \leftmargini \topsep 6\p@ plus2\p@ minus2\p@ \parsep 3\p@ plus2\p@ minus\p@ \itemsep \parsep }\belowdisplayskip \abovedisplayskip Inter-Agent Range standard deviation estimated from experimental data compared to theoretical formulas.}\relax }}{72}{figure.caption.53}\protected@file@percent }
\newlabel{fig:newModel}{{5.11}{72}{{\small Inter-Agent Range standard deviation estimated from experimental data compared to theoretical formulas.}\relax }{figure.caption.53}{}}
\@writefile{lot}{\contentsline {table}{\numberline {5.7}{\ignorespaces \relax \fontsize  {10}{12}\selectfont  \abovedisplayskip 10\p@ plus2\p@ minus5\p@ \abovedisplayshortskip \z@ plus3\p@ \belowdisplayshortskip 6\p@ plus3\p@ minus3\p@ \def \leftmargin \leftmargini \topsep 6\p@ plus2\p@ minus2\p@ \parsep 3\p@ plus2\p@ minus\p@ \itemsep \parsep {\leftmargin \leftmargini \topsep 6\p@ plus2\p@ minus2\p@ \parsep 3\p@ plus2\p@ minus\p@ \itemsep \parsep }\belowdisplayskip \abovedisplayskip Comparison between theoretical IAR variance and measured variance. The generalized theoretical formula \textup  {\hbox {\mathsurround \z@ \normalfont  (\ignorespaces \ref  {eq:generalizedIARvar}\unskip \@@italiccorr )}} and the theoretical formula with the assumption of null cross-correlation \textup  {\hbox {\mathsurround \z@ \normalfont  (\ignorespaces \ref  {eq:varIAR_uncorr}\unskip \@@italiccorr )}} are compared\relax }}{72}{table.caption.54}\protected@file@percent }
\newlabel{tab:variance_error_reduction}{{5.7}{72}{\small Comparison between theoretical IAR variance and measured variance. The generalized theoretical formula \eqref {eq:generalizedIARvar} and the theoretical formula with the assumption of null cross-correlation \eqref {eq:varIAR_uncorr} are compared\relax }{table.caption.54}{}}
\acronymused{PCC}
\newlabel{eq:corrcoefEstimation}{{5.1}{72}{Validation of the theoretical model using COTS receiver}{equation.5.1.1}{}}
\acronymused{IAR}
\acronymused{IAR}
\@writefile{toc}{\contentsline {subsection}{\numberline {5.1.6}Weighted \ac {IAR} measurements}{73}{subsection.5.1.6}\protected@file@percent }
\acronymused{IAR}
\acronymused{IAR}
\newlabel{eq:W-IAR}{{5.2}{73}{Weighted \ac {IAR} measurements}{equation.5.1.2}{}}
\acronymused{IAR}
\acronymused{W-IAR}
\@writefile{toc}{\contentsline {section}{\numberline {5.2}Statistical analysis of baseline estimation techniques}{73}{section.5.2}\protected@file@percent }
\newlabel{sec:baseline}{{5.2}{73}{Statistical analysis of baseline estimation techniques}{section.5.2}{}}
\acronymused{WGN}
\@writefile{toc}{\contentsline {subsubsection}{MATLAB Simulation Environment}{73}{figure.caption.55}\protected@file@percent }
\acronymused{RFCS}
\@writefile{lof}{\contentsline {figure}{\numberline {5.12}{\ignorespaces {\relax \fontsize  {10}{12}\selectfont  \abovedisplayskip 10\p@ plus2\p@ minus5\p@ \abovedisplayshortskip \z@ plus3\p@ \belowdisplayshortskip 6\p@ plus3\p@ minus3\p@ \def \leftmargin \leftmargini \parsep 4.5\p@ plus2\p@ minus\p@ \topsep 9\p@ plus3\p@ minus5\p@ \itemsep 4.5\p@ plus2\p@ minus\p@ {\leftmargin \leftmargini \topsep 6\p@ plus2\p@ minus2\p@ \parsep 3\p@ plus2\p@ minus\p@ \itemsep \parsep }\belowdisplayskip \abovedisplayskip Baseline length estimation in simulated vehicular scenario in close proximity assumption.}\relax }}{74}{figure.caption.55}\protected@file@percent }
\newlabel{fig:genericSimulation}{{5.12}{74}{{\small Baseline length estimation in simulated vehicular scenario in close proximity assumption.}\relax }{figure.caption.55}{}}
\@writefile{lof}{\contentsline {figure}{\numberline {5.13}{\ignorespaces {\relax \fontsize  {10}{12}\selectfont  \abovedisplayskip 10\p@ plus2\p@ minus5\p@ \abovedisplayshortskip \z@ plus3\p@ \belowdisplayshortskip 6\p@ plus3\p@ minus3\p@ \def \leftmargin \leftmargini \parsep 4.5\p@ plus2\p@ minus\p@ \topsep 9\p@ plus3\p@ minus5\p@ \itemsep 4.5\p@ plus2\p@ minus\p@ {\leftmargin \leftmargini \topsep 6\p@ plus2\p@ minus2\p@ \parsep 3\p@ plus2\p@ minus\p@ \itemsep \parsep }\belowdisplayskip \abovedisplayskip Example of satellite and aiding agent visibility experienced by a dynamic agent travelling on a predefined trajectory.}\relax }}{74}{figure.caption.56}\protected@file@percent }
\newlabel{fig:simuSkyplot}{{5.13}{74}{{\small Example of satellite and aiding agent visibility experienced by a dynamic agent travelling on a predefined trajectory.}\relax }{figure.caption.56}{}}
\@writefile{toc}{\contentsline {subsection}{\numberline {5.2.1}Cross correlation among standalone GNSS measurements and collaborative baseline length estimation}{74}{subsection.5.2.1}\protected@file@percent }
\@writefile{lof}{\contentsline {figure}{\numberline {5.14}{\ignorespaces {\relax \fontsize  {10}{12}\selectfont  \abovedisplayskip 10\p@ plus2\p@ minus5\p@ \abovedisplayshortskip \z@ plus3\p@ \belowdisplayshortskip 6\p@ plus3\p@ minus3\p@ \def \leftmargin \leftmargini \parsep 4.5\p@ plus2\p@ minus\p@ \topsep 9\p@ plus3\p@ minus5\p@ \itemsep 4.5\p@ plus2\p@ minus\p@ {\leftmargin \leftmargini \topsep 6\p@ plus2\p@ minus2\p@ \parsep 3\p@ plus2\p@ minus\p@ \itemsep \parsep }\belowdisplayskip \abovedisplayskip Example of a path based on a Bernoullian lemniscate of \si {1046.7}{m} travelled at an average speed of \si {26.15}{m/s}. The dashed lines depict the collaborative range measurements retrieved at different time instants.}\relax }}{75}{figure.caption.57}\protected@file@percent }
\newlabel{fig:simuTraj}{{5.14}{75}{{\small Example of a path based on a Bernoullian lemniscate of \si {1046.7}{m} travelled at an average speed of \si {26.15}{m/s}. The dashed lines depict the collaborative range measurements retrieved at different time instants.}\relax }{figure.caption.57}{}}
\acronymused{GNSS}
\@writefile{lof}{\contentsline {figure}{\numberline {5.15}{\ignorespaces {\relax \fontsize  {10}{12}\selectfont  \abovedisplayskip 10\p@ plus2\p@ minus5\p@ \abovedisplayshortskip \z@ plus3\p@ \belowdisplayshortskip 6\p@ plus3\p@ minus3\p@ \def \leftmargin \leftmargini \parsep 4.5\p@ plus2\p@ minus\p@ \topsep 9\p@ plus3\p@ minus5\p@ \itemsep 4.5\p@ plus2\p@ minus\p@ {\leftmargin \leftmargini \topsep 6\p@ plus2\p@ minus2\p@ \parsep 3\p@ plus2\p@ minus\p@ \itemsep \parsep }\belowdisplayskip \abovedisplayskip Correlation matrix of a set of 10 measurements (5 Inter-agent distances and 5 Normally-distributed pseudorange measurements).}\relax }}{76}{figure.caption.58}\protected@file@percent }
\newlabel{fig:corrPlot}{{5.15}{76}{{\small Correlation matrix of a set of 10 measurements (5 Inter-agent distances and 5 Normally-distributed pseudorange measurements).}\relax }{figure.caption.58}{}}
\newlabel{eq:measVec1}{{5.3}{77}{Cross correlation among standalone GNSS measurements and collaborative baseline length estimation}{equation.5.2.3}{}}
\acronymused{PCC}
\acronymused{PCC}
\acronymused{PCC}
\acronymused{WGN}
\newlabel{eq:PCC}{{5.4}{77}{Cross correlation among standalone GNSS measurements and collaborative baseline length estimation}{equation.5.2.4}{}}
\@writefile{lof}{\contentsline {figure}{\numberline {5.16}{\ignorespaces {\relax \fontsize  {10}{12}\selectfont  \abovedisplayskip 10\p@ plus2\p@ minus5\p@ \abovedisplayshortskip \z@ plus3\p@ \belowdisplayshortskip 6\p@ plus3\p@ minus3\p@ \def \leftmargin \leftmargini \parsep 4.5\p@ plus2\p@ minus\p@ \topsep 9\p@ plus3\p@ minus5\p@ \itemsep 4.5\p@ plus2\p@ minus\p@ {\leftmargin \leftmargini \topsep 6\p@ plus2\p@ minus2\p@ \parsep 3\p@ plus2\p@ minus\p@ \itemsep \parsep }\belowdisplayskip \abovedisplayskip \ac {PCC} plot scheme for hybridized measurement vector (Compact representation of the correlation matrix).}\relax }}{77}{figure.caption.59}\protected@file@percent }
\acronymused{PCC}
\newlabel{fig:PCCmatrix}{{5.16}{77}{{\small \ac {PCC} plot scheme for hybridized measurement vector (Compact representation of the correlation matrix).}\relax }{figure.caption.59}{}}
\acronymused{PDF}
\acronymused{PCC}
\acronymused{PCC}
\@writefile{lof}{\contentsline {figure}{\numberline {5.17}{\ignorespaces {\relax \fontsize  {10}{12}\selectfont  \abovedisplayskip 10\p@ plus2\p@ minus5\p@ \abovedisplayshortskip \z@ plus3\p@ \belowdisplayshortskip 6\p@ plus3\p@ minus3\p@ \def \leftmargin \leftmargini \parsep 4.5\p@ plus2\p@ minus\p@ \topsep 9\p@ plus3\p@ minus5\p@ \itemsep 4.5\p@ plus2\p@ minus\p@ {\leftmargin \leftmargini \topsep 6\p@ plus2\p@ minus2\p@ \parsep 3\p@ plus2\p@ minus\p@ \itemsep \parsep }\belowdisplayskip \abovedisplayskip Sample \ac {PCC} matrix time series scheme for hybridized measurement vector including 5 \ac {IAR} and 4 satellites. Colorscale black (0) - white (1).}\relax }}{78}{figure.caption.60}\protected@file@percent }
\acronymused{PCC}
\acronymused{IAR}
\newlabel{fig:PCCmatrixSeries}{{5.17}{78}{{\small Sample \ac {PCC} matrix time series scheme for hybridized measurement vector including 5 \ac {IAR} and 4 satellites. Colorscale black (0) - white (1).}\relax }{figure.caption.60}{}}
\acronymused{PCC}
\acronymused{WGN}
\acronymused{PCC}
\acronymused{PCC}
\acronymused{IAR}
\acronymused{IAR}
\acronymused{PCC}
\@writefile{toc}{\contentsline {subsection}{\numberline {5.2.2}Statistical Distribution of the Baseline Length Error considering independent Gaussian inputs}{78}{subsection.5.2.2}\protected@file@percent }
\newlabel{sec:statisticalAn}{{5.2.2}{78}{Statistical Distribution of the Baseline Length Error considering independent Gaussian inputs}{subsection.5.2.2}{}}
\acronymused{PDF}
\acronymused{PDF}
\acronymused{PDF}
\@writefile{lof}{\contentsline {figure}{\numberline {5.18}{\ignorespaces {\relax \fontsize  {10}{12}\selectfont  \abovedisplayskip 10\p@ plus2\p@ minus5\p@ \abovedisplayshortskip \z@ plus3\p@ \belowdisplayshortskip 6\p@ plus3\p@ minus3\p@ \def \leftmargin \leftmargini \parsep 4.5\p@ plus2\p@ minus\p@ \topsep 9\p@ plus3\p@ minus5\p@ \itemsep 4.5\p@ plus2\p@ minus\p@ {\leftmargin \leftmargini \topsep 6\p@ plus2\p@ minus2\p@ \parsep 3\p@ plus2\p@ minus\p@ \itemsep \parsep }\belowdisplayskip \abovedisplayskip PCCs over a selected set of time instants $t_k$ for the measurements set of a dynamic agents travelling over a Bernoullian lemniscate trajectory. Colorscale black (0) - white (1). }\relax }}{79}{figure.caption.61}\protected@file@percent }
\newlabel{fig:multiMethodPCC}{{5.18}{79}{{\small PCCs over a selected set of time instants $t_k$ for the measurements set of a dynamic agents travelling over a Bernoullian lemniscate trajectory. Colorscale black (0) - white (1). }\relax }{figure.caption.61}{}}
\@writefile{lof}{\contentsline {figure}{\numberline {5.19}{\ignorespaces {\relax \fontsize  {10}{12}\selectfont  \abovedisplayskip 10\p@ plus2\p@ minus5\p@ \abovedisplayshortskip \z@ plus3\p@ \belowdisplayshortskip 6\p@ plus3\p@ minus3\p@ \def \leftmargin \leftmargini \parsep 4.5\p@ plus2\p@ minus\p@ \topsep 9\p@ plus3\p@ minus5\p@ \itemsep 4.5\p@ plus2\p@ minus\p@ {\leftmargin \leftmargini \topsep 6\p@ plus2\p@ minus2\p@ \parsep 3\p@ plus2\p@ minus\p@ \itemsep \parsep }\belowdisplayskip \abovedisplayskip Snapshot of the estimated probability distribution over 10000 samples taken at a random time instant $t_k$.}\relax }}{79}{figure.caption.62}\protected@file@percent }
\newlabel{fig:histrograms}{{5.19}{79}{{\small Snapshot of the estimated probability distribution over 10000 samples taken at a random time instant $t_k$.}\relax }{figure.caption.62}{}}
\acronymused{IAR}
\acronymused{IAR}
\newlabel{fig:pdf1}{{5.20a}{80}{\ac {IAR}\relax }{figure.caption.63}{}}
\newlabel{sub@fig:pdf1}{{a}{80}{\ac {IAR}\relax }{figure.caption.63}{}}
\acronymused{PR}
\newlabel{fig:pdf2}{{5.20b}{80}{\ac {PR}\relax }{figure.caption.63}{}}
\newlabel{sub@fig:pdf2}{{b}{80}{\ac {PR}\relax }{figure.caption.63}{}}
\acronymused{SD}
\newlabel{fig:pdf3}{{5.20c}{80}{\ac {SD}\relax }{figure.caption.63}{}}
\newlabel{sub@fig:pdf3}{{c}{80}{\ac {SD}\relax }{figure.caption.63}{}}
\acronymused{DD}
\newlabel{fig:pdf4}{{5.20d}{80}{\ac {DD}\relax }{figure.caption.63}{}}
\newlabel{sub@fig:pdf4}{{d}{80}{\ac {DD}\relax }{figure.caption.63}{}}
\@writefile{lof}{\contentsline {figure}{\numberline {5.20}{\ignorespaces \relax \fontsize  {10}{12}\selectfont  \abovedisplayskip 10\p@ plus2\p@ minus5\p@ \abovedisplayshortskip \z@ plus3\p@ \belowdisplayshortskip 6\p@ plus3\p@ minus3\p@ \def \leftmargin \leftmargini \parsep 4.5\p@ plus2\p@ minus\p@ \topsep 9\p@ plus3\p@ minus5\p@ \itemsep 4.5\p@ plus2\p@ minus\p@ {\leftmargin \leftmargini \topsep 6\p@ plus2\p@ minus2\p@ \parsep 3\p@ plus2\p@ minus\p@ \itemsep \parsep }\belowdisplayskip \abovedisplayskip {Goodness of fit occurrences for the baseline length error of three independent agents over a Bernoullian trajectory}\relax }}{80}{figure.caption.63}\protected@file@percent }
\newlabel{fig:distribHist}{{5.20}{80}{\small {Goodness of fit occurrences for the baseline length error of three independent agents over a Bernoullian trajectory}\relax }{figure.caption.63}{}}
\acronymused{W-IAR}
\acronymused{BIC}
\acronymused{PDF}
\acronymused{IAR}
\newlabel{fig:box1}{{5.21a}{81}{\ac {IAR}\relax }{figure.caption.64}{}}
\newlabel{sub@fig:box1}{{a}{81}{\ac {IAR}\relax }{figure.caption.64}{}}
\acronymused{PR}
\newlabel{fig:box2}{{5.21b}{81}{\ac {PR}\relax }{figure.caption.64}{}}
\newlabel{sub@fig:box2}{{b}{81}{\ac {PR}\relax }{figure.caption.64}{}}
\acronymused{SD}
\newlabel{fig:box3}{{5.21c}{81}{\ac {SD}\relax }{figure.caption.64}{}}
\newlabel{sub@fig:box3}{{c}{81}{\ac {SD}\relax }{figure.caption.64}{}}
\acronymused{DD}
\newlabel{fig:box4}{{5.21d}{81}{\ac {DD}\relax }{figure.caption.64}{}}
\newlabel{sub@fig:box4}{{d}{81}{\ac {DD}\relax }{figure.caption.64}{}}
\@writefile{lof}{\contentsline {figure}{\numberline {5.21}{\ignorespaces \relax \fontsize  {10}{12}\selectfont  \abovedisplayskip 10\p@ plus2\p@ minus5\p@ \abovedisplayshortskip \z@ plus3\p@ \belowdisplayshortskip 6\p@ plus3\p@ minus3\p@ \def \leftmargin \leftmargini \parsep 4.5\p@ plus2\p@ minus\p@ \topsep 9\p@ plus3\p@ minus5\p@ \itemsep 4.5\p@ plus2\p@ minus\p@ {\leftmargin \leftmargini \topsep 6\p@ plus2\p@ minus2\p@ \parsep 3\p@ plus2\p@ minus\p@ \itemsep \parsep }\belowdisplayskip \abovedisplayskip {Box plot of the time evolution of the \ac {PDF} of the baseline length error for the different methods.}\relax }}{81}{figure.caption.64}\protected@file@percent }
\acronymused{PDF}
\newlabel{fig:boxPlots}{{5.21}{81}{\small {Box plot of the time evolution of the \ac {PDF} of the baseline length error for the different methods.}\relax }{figure.caption.64}{}}
\acronymused{W-IAR}
\AC@undonewlabel{acro:GEV}
\newlabel{acro:GEV}{{5.2.2}{82}{Statistical Distribution of the Baseline Length Error considering independent Gaussian inputs}{figure.caption.64}{}}
\acronymused{GEV}
\acronymused{PR}
\acronymused{SD}
\@writefile{toc}{\contentsline {section}{\numberline {5.3}Final remarks}{82}{section.5.3}\protected@file@percent }
\acronymused{IAR}
\acronymused{W-IAR}
\acronymused{IAR}
\acronymused{IAR}
\@setckpt{Chapter4/chapter4}{
\setcounter{page}{83}
\setcounter{equation}{4}
\setcounter{enumi}{0}
\setcounter{enumii}{0}
\setcounter{enumiii}{0}
\setcounter{enumiv}{0}
\setcounter{footnote}{0}
\setcounter{mpfootnote}{0}
\setcounter{part}{0}
\setcounter{chapter}{5}
\setcounter{section}{3}
\setcounter{subsection}{0}
\setcounter{subsubsection}{0}
\setcounter{paragraph}{0}
\setcounter{subparagraph}{0}
\setcounter{figure}{21}
\setcounter{table}{7}
\setcounter{SDpage}{0}
\setcounter{NumberSD}{0}
\setcounter{tomo}{0}
\setcounter{parentequation}{0}
\setcounter{caption@flags}{0}
\setcounter{ContinuedFloat}{0}
\setcounter{subfigure}{4}
\setcounter{subtable}{0}
\setcounter{float@type}{16}
\setcounter{tabx@nest}{0}
\setcounter{listtotal}{0}
\setcounter{listcount}{0}
\setcounter{liststart}{0}
\setcounter{liststop}{0}
\setcounter{citecount}{0}
\setcounter{citetotal}{0}
\setcounter{multicitecount}{0}
\setcounter{multicitetotal}{0}
\setcounter{instcount}{262}
\setcounter{maxnames}{3}
\setcounter{minnames}{1}
\setcounter{maxitems}{3}
\setcounter{minitems}{1}
\setcounter{citecounter}{0}
\setcounter{maxcitecounter}{0}
\setcounter{savedcitecounter}{0}
\setcounter{uniquelist}{0}
\setcounter{uniquename}{0}
\setcounter{refsection}{0}
\setcounter{refsegment}{0}
\setcounter{maxextratitle}{0}
\setcounter{maxextratitleyear}{0}
\setcounter{maxextraname}{5}
\setcounter{maxextradate}{0}
\setcounter{maxextraalpha}{0}
\setcounter{abbrvpenalty}{50}
\setcounter{highnamepenalty}{50}
\setcounter{lownamepenalty}{25}
\setcounter{maxparens}{3}
\setcounter{parenlevel}{0}
\setcounter{mincomprange}{10}
\setcounter{maxcomprange}{100000}
\setcounter{mincompwidth}{1}
\setcounter{afterword}{0}
\setcounter{savedafterword}{0}
\setcounter{annotator}{0}
\setcounter{savedannotator}{0}
\setcounter{author}{0}
\setcounter{savedauthor}{0}
\setcounter{bookauthor}{0}
\setcounter{savedbookauthor}{0}
\setcounter{commentator}{0}
\setcounter{savedcommentator}{0}
\setcounter{editor}{0}
\setcounter{savededitor}{0}
\setcounter{editora}{0}
\setcounter{savededitora}{0}
\setcounter{editorb}{0}
\setcounter{savededitorb}{0}
\setcounter{editorc}{0}
\setcounter{savededitorc}{0}
\setcounter{foreword}{0}
\setcounter{savedforeword}{0}
\setcounter{holder}{0}
\setcounter{savedholder}{0}
\setcounter{introduction}{0}
\setcounter{savedintroduction}{0}
\setcounter{namea}{0}
\setcounter{savednamea}{0}
\setcounter{nameb}{0}
\setcounter{savednameb}{0}
\setcounter{namec}{0}
\setcounter{savednamec}{0}
\setcounter{translator}{0}
\setcounter{savedtranslator}{0}
\setcounter{shortauthor}{0}
\setcounter{savedshortauthor}{0}
\setcounter{shorteditor}{0}
\setcounter{savedshorteditor}{0}
\setcounter{labelname}{0}
\setcounter{savedlabelname}{0}
\setcounter{institution}{0}
\setcounter{savedinstitution}{0}
\setcounter{lista}{0}
\setcounter{savedlista}{0}
\setcounter{listb}{0}
\setcounter{savedlistb}{0}
\setcounter{listc}{0}
\setcounter{savedlistc}{0}
\setcounter{listd}{0}
\setcounter{savedlistd}{0}
\setcounter{liste}{0}
\setcounter{savedliste}{0}
\setcounter{listf}{0}
\setcounter{savedlistf}{0}
\setcounter{location}{0}
\setcounter{savedlocation}{0}
\setcounter{organization}{0}
\setcounter{savedorganization}{0}
\setcounter{origlocation}{0}
\setcounter{savedoriglocation}{0}
\setcounter{origpublisher}{0}
\setcounter{savedorigpublisher}{0}
\setcounter{publisher}{0}
\setcounter{savedpublisher}{0}
\setcounter{language}{0}
\setcounter{savedlanguage}{0}
\setcounter{origlanguage}{0}
\setcounter{savedoriglanguage}{0}
\setcounter{pageref}{0}
\setcounter{savedpageref}{0}
\setcounter{textcitecount}{0}
\setcounter{textcitetotal}{0}
\setcounter{textcitemaxnames}{0}
\setcounter{biburlnumpenalty}{0}
\setcounter{biburlucpenalty}{0}
\setcounter{biburllcpenalty}{0}
\setcounter{smartand}{1}
\setcounter{bbx:relatedcount}{0}
\setcounter{bbx:relatedtotal}{0}
\setcounter{Item}{0}
\setcounter{Hfootnote}{0}
\setcounter{bookmark@seq@number}{58}
\setcounter{nlinenum}{0}
\setcounter{algorithm}{0}
\setcounter{ALC@unique}{0}
\setcounter{ALC@line}{0}
\setcounter{ALC@rem}{0}
\setcounter{ALC@depth}{0}
\setcounter{@todonotes@numberoftodonotes}{0}
\setcounter{Changes@AuthorCount}{2}
\setcounter{Changes@Author}{2}
\setcounter{Changes@addedCount}{1}
\setcounter{Changes@deletedCount}{0}
\setcounter{Changes@replacedCount}{1}
\setcounter{Changes@highlightCount}{0}
\setcounter{Changes@commentCount}{0}
\setcounter{authorcommentcount}{0}
\setcounter{Changes@addedCount1}{24}
\setcounter{Changes@deletedCount1}{2}
\setcounter{Changes@replacedCount1}{7}
\setcounter{Changes@highlightCount1}{0}
\setcounter{Changes@commentCount1}{0}
\setcounter{lstnumber}{1}
\setcounter{FancyVerbLine}{0}
\setcounter{section@level}{0}
\setcounter{lstlisting}{0}
}
