%!PS-Adobe-3.0 EPSF-3.0
%%Creator: (MATLAB, The Mathworks, Inc. Version 9.5.0.944444 \(R2018b\). Operating System: Windows 10)
%%Title: (X:/[ALEX] - Collaborative ranging CRLB/submission TVT/Revision/fig/skplotExp_revisions.eps)
%%CreationDate: 2019-05-13T10:31:00
%%Pages: (atend)
%%BoundingBox: 0 0 676 428
%%LanguageLevel: 3
%%EndComments
%%BeginProlog
%%BeginResource: procset (Apache XML Graphics Std ProcSet) 1.2 0
%%Version: 1.2 0
%%Copyright: (Copyright 2001-2003,2010 The Apache Software Foundation. License terms: http://www.apache.org/licenses/LICENSE-2.0)
/bd{bind def}bind def
/ld{load def}bd
/GR/grestore ld
/GS/gsave ld
/RM/rmoveto ld
/C/curveto ld
/t/show ld
/L/lineto ld
/ML/setmiterlimit ld
/CT/concat ld
/f/fill ld
/N/newpath ld
/S/stroke ld
/CC/setcmykcolor ld
/A/ashow ld
/cp/closepath ld
/RC/setrgbcolor ld
/LJ/setlinejoin ld
/GC/setgray ld
/LW/setlinewidth ld
/M/moveto ld
/re {4 2 roll M
1 index 0 rlineto
0 exch rlineto
neg 0 rlineto
cp } bd
/_ctm matrix def
/_tm matrix def
/BT { _ctm currentmatrix pop matrix _tm copy pop 0 0 moveto } bd
/ET { _ctm setmatrix } bd
/iTm { _ctm setmatrix _tm concat } bd
/Tm { _tm astore pop iTm 0 0 moveto } bd
/ux 0.0 def
/uy 0.0 def
/F {
  /Tp exch def
  /Tf exch def
  Tf findfont Tp scalefont setfont
  /cf Tf def  /cs Tp def
} bd
/ULS {currentpoint /uy exch def /ux exch def} bd
/ULE {
  /Tcx currentpoint pop def
  gsave
  newpath
  cf findfont cs scalefont dup
  /FontMatrix get 0 get /Ts exch def /FontInfo get dup
  /UnderlinePosition get Ts mul /To exch def
  /UnderlineThickness get Ts mul /Tt exch def
  ux uy To add moveto  Tcx uy To add lineto
  Tt setlinewidth stroke
  grestore
} bd
/OLE {
  /Tcx currentpoint pop def
  gsave
  newpath
  cf findfont cs scalefont dup
  /FontMatrix get 0 get /Ts exch def /FontInfo get dup
  /UnderlinePosition get Ts mul /To exch def
  /UnderlineThickness get Ts mul /Tt exch def
  ux uy To add cs add moveto Tcx uy To add cs add lineto
  Tt setlinewidth stroke
  grestore
} bd
/SOE {
  /Tcx currentpoint pop def
  gsave
  newpath
  cf findfont cs scalefont dup
  /FontMatrix get 0 get /Ts exch def /FontInfo get dup
  /UnderlinePosition get Ts mul /To exch def
  /UnderlineThickness get Ts mul /Tt exch def
  ux uy To add cs 10 mul 26 idiv add moveto Tcx uy To add cs 10 mul 26 idiv add lineto
  Tt setlinewidth stroke
  grestore
} bd
/QT {
/Y22 exch store
/X22 exch store
/Y21 exch store
/X21 exch store
currentpoint
/Y21 load 2 mul add 3 div exch
/X21 load 2 mul add 3 div exch
/X21 load 2 mul /X22 load add 3 div
/Y21 load 2 mul /Y22 load add 3 div
/X22 load /Y22 load curveto
} bd
/SSPD {
dup length /d exch dict def
{
/v exch def
/k exch def
currentpagedevice k known {
/cpdv currentpagedevice k get def
v cpdv ne {
/upd false def
/nullv v type /nulltype eq def
/nullcpdv cpdv type /nulltype eq def
nullv nullcpdv or
{
/upd true def
} {
/sametype v type cpdv type eq def
sametype {
v type /arraytype eq {
/vlen v length def
/cpdvlen cpdv length def
vlen cpdvlen eq {
0 1 vlen 1 sub {
/i exch def
/obj v i get def
/cpdobj cpdv i get def
obj cpdobj ne {
/upd true def
exit
} if
} for
} {
/upd true def
} ifelse
} {
v type /dicttype eq {
v {
/dv exch def
/dk exch def
/cpddv cpdv dk get def
dv cpddv ne {
/upd true def
exit
} if
} forall
} {
/upd true def
} ifelse
} ifelse
} if
} ifelse
upd true eq {
d k v put
} if
} if
} if
} forall
d length 0 gt {
d setpagedevice
} if
} bd
/RE { % /NewFontName [NewEncodingArray] /FontName RE -
  findfont dup length dict begin
  {
    1 index /FID ne
    {def} {pop pop} ifelse
  } forall
  /Encoding exch def
  /FontName 1 index def
  currentdict definefont pop
  end
} bind def
%%EndResource
%%BeginResource: procset (Apache XML Graphics EPS ProcSet) 1.0 0
%%Version: 1.0 0
%%Copyright: (Copyright 2002-2003 The Apache Software Foundation. License terms: http://www.apache.org/licenses/LICENSE-2.0)
/BeginEPSF { %def
/b4_Inc_state save def         % Save state for cleanup
/dict_count countdictstack def % Count objects on dict stack
/op_count count 1 sub def      % Count objects on operand stack
userdict begin                 % Push userdict on dict stack
/showpage { } def              % Redefine showpage, { } = null proc
0 setgray 0 setlinecap         % Prepare graphics state
1 setlinewidth 0 setlinejoin
10 setmiterlimit [ ] 0 setdash newpath
/languagelevel where           % If level not equal to 1 then
{pop languagelevel             % set strokeadjust and
1 ne                           % overprint to their defaults.
{false setstrokeadjust false setoverprint
} if
} if
} bd
/EndEPSF { %def
count op_count sub {pop} repeat            % Clean up stacks
countdictstack dict_count sub {end} repeat
b4_Inc_state restore
} bd
%%EndResource
%FOPBeginFontDict
%%IncludeResource: font Courier-Oblique
%%IncludeResource: font Courier-BoldOblique
%%IncludeResource: font Courier-Bold
%%IncludeResource: font ZapfDingbats
%%IncludeResource: font Symbol
%%IncludeResource: font Helvetica
%%IncludeResource: font Helvetica-Oblique
%%IncludeResource: font Helvetica-Bold
%%IncludeResource: font Helvetica-BoldOblique
%%IncludeResource: font Times-Roman
%%IncludeResource: font Times-Italic
%%IncludeResource: font Times-Bold
%%IncludeResource: font Times-BoldItalic
%%IncludeResource: font Courier
%FOPEndFontDict
%%BeginResource: encoding WinAnsiEncoding
/WinAnsiEncoding [
/.notdef /.notdef /.notdef /.notdef /.notdef
/.notdef /.notdef /.notdef /.notdef /.notdef
/.notdef /.notdef /.notdef /.notdef /.notdef
/.notdef /.notdef /.notdef /.notdef /.notdef
/.notdef /.notdef /.notdef /.notdef /.notdef
/.notdef /.notdef /.notdef /.notdef /.notdef
/.notdef /.notdef /space /exclam /quotedbl
/numbersign /dollar /percent /ampersand /quotesingle
/parenleft /parenright /asterisk /plus /comma
/hyphen /period /slash /zero /one
/two /three /four /five /six
/seven /eight /nine /colon /semicolon
/less /equal /greater /question /at
/A /B /C /D /E
/F /G /H /I /J
/K /L /M /N /O
/P /Q /R /S /T
/U /V /W /X /Y
/Z /bracketleft /backslash /bracketright /asciicircum
/underscore /quoteleft /a /b /c
/d /e /f /g /h
/i /j /k /l /m
/n /o /p /q /r
/s /t /u /v /w
/x /y /z /braceleft /bar
/braceright /asciitilde /bullet /Euro /bullet
/quotesinglbase /florin /quotedblbase /ellipsis /dagger
/daggerdbl /circumflex /perthousand /Scaron /guilsinglleft
/OE /bullet /Zcaron /bullet /bullet
/quoteleft /quoteright /quotedblleft /quotedblright /bullet
/endash /emdash /asciitilde /trademark /scaron
/guilsinglright /oe /bullet /zcaron /Ydieresis
/space /exclamdown /cent /sterling /currency
/yen /brokenbar /section /dieresis /copyright
/ordfeminine /guillemotleft /logicalnot /sfthyphen /registered
/macron /degree /plusminus /twosuperior /threesuperior
/acute /mu /paragraph /middot /cedilla
/onesuperior /ordmasculine /guillemotright /onequarter /onehalf
/threequarters /questiondown /Agrave /Aacute /Acircumflex
/Atilde /Adieresis /Aring /AE /Ccedilla
/Egrave /Eacute /Ecircumflex /Edieresis /Igrave
/Iacute /Icircumflex /Idieresis /Eth /Ntilde
/Ograve /Oacute /Ocircumflex /Otilde /Odieresis
/multiply /Oslash /Ugrave /Uacute /Ucircumflex
/Udieresis /Yacute /Thorn /germandbls /agrave
/aacute /acircumflex /atilde /adieresis /aring
/ae /ccedilla /egrave /eacute /ecircumflex
/edieresis /igrave /iacute /icircumflex /idieresis
/eth /ntilde /ograve /oacute /ocircumflex
/otilde /odieresis /divide /oslash /ugrave
/uacute /ucircumflex /udieresis /yacute /thorn
/ydieresis
] def
%%EndResource
%FOPBeginFontReencode
/Courier-Oblique findfont
dup length dict begin
  {1 index /FID ne {def} {pop pop} ifelse} forall
  /Encoding WinAnsiEncoding def
  currentdict
end
/Courier-Oblique exch definefont pop
/Courier-BoldOblique findfont
dup length dict begin
  {1 index /FID ne {def} {pop pop} ifelse} forall
  /Encoding WinAnsiEncoding def
  currentdict
end
/Courier-BoldOblique exch definefont pop
/Courier-Bold findfont
dup length dict begin
  {1 index /FID ne {def} {pop pop} ifelse} forall
  /Encoding WinAnsiEncoding def
  currentdict
end
/Courier-Bold exch definefont pop
/Helvetica findfont
dup length dict begin
  {1 index /FID ne {def} {pop pop} ifelse} forall
  /Encoding WinAnsiEncoding def
  currentdict
end
/Helvetica exch definefont pop
/Helvetica-Oblique findfont
dup length dict begin
  {1 index /FID ne {def} {pop pop} ifelse} forall
  /Encoding WinAnsiEncoding def
  currentdict
end
/Helvetica-Oblique exch definefont pop
/Helvetica-Bold findfont
dup length dict begin
  {1 index /FID ne {def} {pop pop} ifelse} forall
  /Encoding WinAnsiEncoding def
  currentdict
end
/Helvetica-Bold exch definefont pop
/Helvetica-BoldOblique findfont
dup length dict begin
  {1 index /FID ne {def} {pop pop} ifelse} forall
  /Encoding WinAnsiEncoding def
  currentdict
end
/Helvetica-BoldOblique exch definefont pop
/Times-Roman findfont
dup length dict begin
  {1 index /FID ne {def} {pop pop} ifelse} forall
  /Encoding WinAnsiEncoding def
  currentdict
end
/Times-Roman exch definefont pop
/Times-Italic findfont
dup length dict begin
  {1 index /FID ne {def} {pop pop} ifelse} forall
  /Encoding WinAnsiEncoding def
  currentdict
end
/Times-Italic exch definefont pop
/Times-Bold findfont
dup length dict begin
  {1 index /FID ne {def} {pop pop} ifelse} forall
  /Encoding WinAnsiEncoding def
  currentdict
end
/Times-Bold exch definefont pop
/Times-BoldItalic findfont
dup length dict begin
  {1 index /FID ne {def} {pop pop} ifelse} forall
  /Encoding WinAnsiEncoding def
  currentdict
end
/Times-BoldItalic exch definefont pop
/Courier findfont
dup length dict begin
  {1 index /FID ne {def} {pop pop} ifelse} forall
  /Encoding WinAnsiEncoding def
  currentdict
end
/Courier exch definefont pop
%FOPEndFontReencode
%%EndProlog
%%Page: 1 1
%%PageBoundingBox: 0 0 676 428
%%BeginPageSetup
[1 0 0 -1 0 428] CT
%%EndPageSetup
GS
[0.75 0 0 0.75 0 0.5] CT
1 GC
N
0 0 901 570 re
f
GR
GS
[0.75 0 0 0.75 0 0.5] CT
1 GC
N
0 0 901 570 re
f
GR
GS
[0.75 0 0 0.75 0 0.5] CT
1 GC
N
247.361 288.361 M
247.829 302.661 L
249.232 316.899 L
251.562 331.016 L
254.811 344.949 L
258.964 358.64 L
264.004 372.031 L
269.909 385.063 L
276.653 397.681 L
284.209 409.83 L
292.542 421.46 L
301.619 432.52 L
311.399 442.962 L
321.841 452.743 L
332.901 461.819 L
344.531 470.153 L
356.681 477.708 L
369.299 484.452 L
382.331 490.357 L
395.721 495.397 L
409.412 499.55 L
423.346 502.799 L
437.462 505.13 L
451.7 506.532 L
466 507 L
480.3 506.532 L
494.538 505.13 L
508.654 502.799 L
522.588 499.55 L
536.279 495.397 L
549.669 490.357 L
562.701 484.452 L
575.319 477.708 L
587.469 470.153 L
599.099 461.819 L
610.159 452.743 L
620.601 442.962 L
630.381 432.52 L
639.458 421.46 L
647.792 409.83 L
655.347 397.681 L
662.091 385.063 L
667.996 372.031 L
673.036 358.64 L
677.189 344.949 L
680.438 331.016 L
682.768 316.899 L
684.171 302.661 L
684.639 288.361 L
684.171 274.062 L
682.768 259.823 L
680.438 245.707 L
677.189 231.773 L
673.036 218.082 L
667.996 204.692 L
662.091 191.66 L
655.347 179.042 L
647.792 166.892 L
639.458 155.262 L
630.381 144.203 L
620.601 133.76 L
610.159 123.98 L
599.099 114.903 L
587.469 106.57 L
575.319 99.015 L
562.701 92.27 L
549.669 86.365 L
536.279 81.326 L
522.588 77.172 L
508.654 73.924 L
494.538 71.593 L
480.3 70.191 L
466 69.723 L
451.7 70.191 L
437.462 71.593 L
423.346 73.924 L
409.412 77.172 L
395.721 81.326 L
382.331 86.365 L
369.299 92.27 L
356.681 99.015 L
344.531 106.57 L
332.901 114.903 L
321.841 123.98 L
311.399 133.76 L
301.619 144.203 L
292.542 155.262 L
284.209 166.892 L
276.653 179.042 L
269.909 191.66 L
264.004 204.692 L
258.964 218.082 L
254.811 231.773 L
251.562 245.707 L
249.232 259.823 L
247.829 274.062 L
cp
f
GR
GS
[0.75 0 0 0.75 0 0.5] CT
0.149 GC
1 LJ
0.667 LW
N
247.361 288.361 M
247.829 302.661 L
249.232 316.899 L
251.562 331.016 L
254.811 344.949 L
258.964 358.64 L
264.004 372.031 L
269.909 385.063 L
276.653 397.681 L
284.209 409.83 L
292.542 421.46 L
301.619 432.52 L
311.399 442.962 L
321.841 452.743 L
332.901 461.819 L
344.531 470.153 L
356.681 477.708 L
369.299 484.452 L
382.331 490.357 L
395.721 495.397 L
409.412 499.55 L
423.346 502.799 L
437.462 505.13 L
451.7 506.532 L
466 507 L
466 507 L
480.3 506.532 L
494.538 505.13 L
508.654 502.799 L
522.588 499.55 L
536.279 495.397 L
549.669 490.357 L
562.701 484.452 L
575.319 477.708 L
587.469 470.153 L
599.099 461.819 L
610.159 452.743 L
620.601 442.962 L
630.381 432.52 L
639.458 421.46 L
647.792 409.83 L
655.347 397.681 L
662.091 385.063 L
667.996 372.031 L
673.036 358.64 L
677.189 344.949 L
680.438 331.016 L
682.768 316.899 L
684.171 302.661 L
684.639 288.361 L
684.639 288.361 L
684.171 274.062 L
682.768 259.823 L
680.438 245.707 L
677.189 231.773 L
673.036 218.082 L
667.996 204.692 L
662.091 191.66 L
655.347 179.042 L
647.792 166.892 L
639.458 155.262 L
630.381 144.203 L
620.601 133.76 L
610.159 123.98 L
599.099 114.903 L
587.469 106.57 L
575.319 99.015 L
562.701 92.27 L
549.669 86.365 L
536.279 81.326 L
522.588 77.172 L
508.654 73.924 L
494.538 71.593 L
480.3 70.191 L
466 69.723 L
466 69.723 L
451.7 70.191 L
437.462 71.593 L
423.346 73.924 L
409.412 77.172 L
395.721 81.326 L
382.331 86.365 L
369.299 92.27 L
356.681 99.015 L
344.531 106.57 L
332.901 114.903 L
321.841 123.98 L
311.399 133.76 L
301.619 144.203 L
292.542 155.262 L
284.209 166.892 L
276.653 179.042 L
269.909 191.66 L
264.004 204.692 L
258.964 218.082 L
254.811 231.773 L
251.562 245.707 L
249.232 259.823 L
247.829 274.062 L
247.361 288.361 L
cp
S
GR
GS
[0.75 0 0 0.75 0 0.5] CT
0.149 GC
[1 3] 0 setdash
2 LJ
0.667 LW
N
575.319 99.015 M
356.681 477.708 L
S
GR
GS
[0.75 0 0 0.75 0 0.5] CT
0.149 GC
[1 3] 0 setdash
2 LJ
0.667 LW
N
655.347 179.042 M
276.653 397.681 L
S
GR
GS
[0.75 0 0 0.75 0 0.5] CT
0.149 GC
[1 3] 0 setdash
2 LJ
0.667 LW
N
684.639 288.361 M
247.361 288.361 L
S
GR
GS
[0.75 0 0 0.75 0 0.5] CT
0.149 GC
[1 3] 0 setdash
2 LJ
0.667 LW
N
655.347 397.681 M
276.653 179.042 L
S
GR
GS
[0.75 0 0 0.75 0 0.5] CT
0.149 GC
[1 3] 0 setdash
2 LJ
0.667 LW
N
575.319 477.708 M
356.681 99.015 L
S
GR
GS
[0.75 0 0 0.75 0 0.5] CT
0.149 GC
[1 3] 0 setdash
2 LJ
0.667 LW
N
466 507 M
466 69.723 L
S
GR
GS
[0.75 0 0 0.75 439.68846 60.55992] CT
N
-8.667 3.495 M
-8.182 4.214 -7.346 4.565 QT
-6.51 4.917 -5.557 4.917 QT
-4.339 4.917 -3.823 3.878 QT
-3.307 2.839 -3.307 1.511 QT
-3.307 0.917 -3.417 0.323 QT
-3.526 -0.271 -3.784 -0.786 QT
-4.042 -1.302 -4.487 -1.607 QT
-4.932 -1.911 -5.573 -1.911 QT
-6.979 -1.911 L
-7.167 -1.911 -7.167 -2.114 QT
-7.167 -2.286 L
-7.167 -2.458 -6.979 -2.458 QT
-5.823 -2.552 L
-5.073 -2.552 -4.589 -3.107 QT
-4.104 -3.661 -3.878 -4.45 QT
-3.651 -5.239 -3.651 -5.958 QT
-3.651 -6.974 -4.12 -7.614 QT
-4.589 -8.255 -5.557 -8.255 QT
-6.354 -8.255 -7.089 -7.958 QT
-7.823 -7.661 -8.245 -7.036 QT
-8.198 -7.052 -8.175 -7.06 QT
-8.151 -7.068 -8.104 -7.068 QT
-7.635 -7.068 -7.315 -6.739 QT
-6.995 -6.411 -6.995 -5.943 QT
-6.995 -5.489 -7.315 -5.161 QT
-7.635 -4.833 -8.104 -4.833 QT
-8.557 -4.833 -8.885 -5.161 QT
-9.214 -5.489 -9.214 -5.943 QT
-9.214 -6.849 -8.675 -7.513 QT
-8.135 -8.177 -7.276 -8.521 QT
-6.417 -8.864 -5.557 -8.864 QT
-4.917 -8.864 -4.214 -8.677 QT
-3.51 -8.489 -2.932 -8.138 QT
-2.354 -7.786 -1.995 -7.232 QT
-1.635 -6.677 -1.635 -5.958 QT
-1.635 -5.083 -2.026 -4.333 QT
-2.417 -3.583 -3.104 -3.044 QT
-3.792 -2.505 -4.62 -2.239 QT
-3.698 -2.052 -2.878 -1.544 QT
-2.057 -1.036 -1.565 -0.232 QT
-1.073 0.573 -1.073 1.495 QT
-1.073 2.651 -1.706 3.589 QT
-2.339 4.526 -3.378 5.057 QT
-4.417 5.589 -5.557 5.589 QT
-6.542 5.589 -7.534 5.214 QT
-8.526 4.839 -9.159 4.089 QT
-9.792 3.339 -9.792 2.292 QT
-9.792 1.761 -9.44 1.417 QT
-9.089 1.073 -8.557 1.073 QT
-8.229 1.073 -7.948 1.229 QT
-7.667 1.386 -7.503 1.675 QT
-7.339 1.964 -7.339 2.292 QT
-7.339 2.807 -7.698 3.151 QT
-8.057 3.495 -8.557 3.495 QT
-8.667 3.495 L
cp
f
GR
GS
[0.75 0 0 0.75 439.68846 60.55992] CT
N
5.25 5.589 M
2.672 5.589 1.75 3.464 QT
0.828 1.339 0.828 -1.583 QT
0.828 -3.396 1.156 -5.005 QT
1.484 -6.614 2.477 -7.739 QT
3.469 -8.864 5.25 -8.864 QT
6.641 -8.864 7.516 -8.193 QT
8.391 -7.521 8.859 -6.443 QT
9.328 -5.364 9.492 -4.146 QT
9.656 -2.927 9.656 -1.583 QT
9.656 0.229 9.328 1.8 QT
9 3.37 8.023 4.479 QT
7.047 5.589 5.25 5.589 QT
cp
5.25 5.042 M
6.422 5.042 6.992 3.839 QT
7.563 2.636 7.695 1.182 QT
7.828 -0.271 7.828 -1.911 QT
7.828 -3.489 7.695 -4.825 QT
7.563 -6.161 6.992 -7.239 QT
6.422 -8.318 5.25 -8.318 QT
4.063 -8.318 3.484 -7.232 QT
2.906 -6.146 2.773 -4.818 QT
2.641 -3.489 2.641 -1.911 QT
2.641 -0.739 2.703 0.292 QT
2.766 1.323 3.008 2.425 QT
3.25 3.526 3.797 4.284 QT
4.344 5.042 5.25 5.042 QT
cp
f
GR
GS
[0.75 0 0 0.75 259.31152 372.98198] CT
N
-14.953 5.12 M
-14.953 4.557 L
-14.953 4.511 -14.906 4.448 QT
-11.656 0.839 L
-10.906 0.026 -10.445 -0.513 QT
-9.984 -1.052 -9.539 -1.763 QT
-9.094 -2.474 -8.828 -3.2 QT
-8.563 -3.927 -8.563 -4.755 QT
-8.563 -5.614 -8.883 -6.404 QT
-9.203 -7.193 -9.836 -7.661 QT
-10.469 -8.13 -11.359 -8.13 QT
-12.266 -8.13 -12.992 -7.583 QT
-13.719 -7.036 -14.016 -6.161 QT
-13.938 -6.177 -13.797 -6.177 QT
-13.328 -6.177 -12.992 -5.864 QT
-12.656 -5.552 -12.656 -5.036 QT
-12.656 -4.568 -12.992 -4.232 QT
-13.328 -3.896 -13.797 -3.896 QT
-14.281 -3.896 -14.617 -4.239 QT
-14.953 -4.583 -14.953 -5.036 QT
-14.953 -5.833 -14.656 -6.521 QT
-14.359 -7.208 -13.797 -7.747 QT
-13.234 -8.286 -12.539 -8.575 QT
-11.844 -8.864 -11.047 -8.864 QT
-9.844 -8.864 -8.813 -8.357 QT
-7.781 -7.849 -7.172 -6.919 QT
-6.563 -5.989 -6.563 -4.755 QT
-6.563 -3.849 -6.961 -3.029 QT
-7.359 -2.208 -7.984 -1.536 QT
-8.609 -0.864 -9.586 -0.013 QT
-10.563 0.839 -10.875 1.136 QT
-13.25 3.417 L
-11.234 3.417 L
-9.75 3.417 -8.75 3.393 QT
-7.75 3.37 -7.688 3.307 QT
-7.438 3.042 -7.188 1.37 QT
-6.563 1.37 L
-7.156 5.12 L
-14.953 5.12 L
cp
f
GR
GS
[0.75 0 0 0.75 259.31152 372.98198] CT
N
-3.38 5.12 M
-3.38 4.386 L
-0.755 4.386 -0.755 3.714 QT
-0.755 -7.302 L
-1.849 -6.786 -3.505 -6.786 QT
-3.505 -7.521 L
-0.927 -7.521 0.385 -8.864 QT
0.682 -8.864 L
0.745 -8.864 0.815 -8.81 QT
0.885 -8.755 0.885 -8.677 QT
0.885 3.714 L
0.885 4.386 3.51 4.386 QT
3.51 5.12 L
-3.38 5.12 L
cp
f
GR
GS
[0.75 0 0 0.75 259.31152 372.98198] CT
N
10.583 5.589 M
8.005 5.589 7.083 3.464 QT
6.161 1.339 6.161 -1.583 QT
6.161 -3.396 6.49 -5.005 QT
6.818 -6.614 7.81 -7.739 QT
8.802 -8.864 10.583 -8.864 QT
11.974 -8.864 12.849 -8.193 QT
13.724 -7.521 14.193 -6.443 QT
14.661 -5.364 14.826 -4.146 QT
14.99 -2.927 14.99 -1.583 QT
14.99 0.229 14.661 1.8 QT
14.333 3.37 13.357 4.479 QT
12.38 5.589 10.583 5.589 QT
cp
10.583 5.042 M
11.755 5.042 12.326 3.839 QT
12.896 2.636 13.029 1.182 QT
13.161 -0.271 13.161 -1.911 QT
13.161 -3.489 13.029 -4.825 QT
12.896 -6.161 12.326 -7.239 QT
11.755 -8.318 10.583 -8.318 QT
9.396 -8.318 8.818 -7.232 QT
8.24 -6.146 8.107 -4.818 QT
7.974 -3.489 7.974 -1.911 QT
7.974 -0.739 8.036 0.292 QT
8.099 1.323 8.341 2.425 QT
8.583 3.526 9.13 4.284 QT
9.677 5.042 10.583 5.042 QT
cp
f
GR
GS
[0.75 0 0 0.75 505.71103 126.58247] CT
N
-5.417 5.589 M
-6.714 5.589 -7.589 4.893 QT
-8.464 4.198 -8.94 3.096 QT
-9.417 1.995 -9.604 0.784 QT
-9.792 -0.427 -9.792 -1.661 QT
-9.792 -3.333 -9.143 -5.005 QT
-8.495 -6.677 -7.237 -7.771 QT
-5.979 -8.864 -4.26 -8.864 QT
-3.542 -8.864 -2.917 -8.591 QT
-2.292 -8.318 -1.94 -7.794 QT
-1.589 -7.271 -1.589 -6.521 QT
-1.589 -6.083 -1.885 -5.794 QT
-2.182 -5.505 -2.604 -5.505 QT
-3.01 -5.505 -3.307 -5.802 QT
-3.604 -6.099 -3.604 -6.521 QT
-3.604 -6.927 -3.307 -7.224 QT
-3.01 -7.521 -2.604 -7.521 QT
-2.495 -7.521 L
-2.76 -7.896 -3.245 -8.075 QT
-3.729 -8.255 -4.26 -8.255 QT
-4.901 -8.255 -5.432 -7.982 QT
-5.964 -7.708 -6.401 -7.239 QT
-6.839 -6.771 -7.12 -6.2 QT
-7.401 -5.63 -7.565 -4.904 QT
-7.729 -4.177 -7.768 -3.536 QT
-7.807 -2.896 -7.807 -1.943 QT
-7.432 -2.802 -6.76 -3.349 QT
-6.089 -3.896 -5.229 -3.896 QT
-4.292 -3.896 -3.526 -3.513 QT
-2.76 -3.13 -2.206 -2.458 QT
-1.651 -1.786 -1.362 -0.927 QT
-1.073 -0.068 -1.073 0.807 QT
-1.073 2.042 -1.62 3.159 QT
-2.167 4.276 -3.159 4.932 QT
-4.151 5.589 -5.417 5.589 QT
cp
-5.417 4.917 M
-4.604 4.917 -4.112 4.55 QT
-3.62 4.182 -3.393 3.573 QT
-3.167 2.964 -3.104 2.339 QT
-3.042 1.714 -3.042 0.807 QT
-3.042 -0.38 -3.159 -1.216 QT
-3.276 -2.052 -3.776 -2.693 QT
-4.276 -3.333 -5.307 -3.333 QT
-6.167 -3.333 -6.714 -2.763 QT
-7.26 -2.193 -7.51 -1.318 QT
-7.76 -0.443 -7.76 0.37 QT
-7.76 0.651 -7.745 0.792 QT
-7.745 0.823 -7.753 0.846 QT
-7.76 0.87 -7.76 0.901 QT
-7.76 1.792 -7.581 2.714 QT
-7.401 3.636 -6.878 4.276 QT
-6.354 4.917 -5.417 4.917 QT
cp
f
GR
GS
[0.75 0 0 0.75 505.71103 126.58247] CT
N
/f1776739717{5.25 5.589 M
2.672 5.589 1.75 3.464 QT
0.828 1.339 0.828 -1.583 QT
0.828 -3.396 1.156 -5.005 QT
1.484 -6.614 2.477 -7.739 QT
3.469 -8.864 5.25 -8.864 QT
6.641 -8.864 7.516 -8.193 QT
8.391 -7.521 8.859 -6.443 QT
9.328 -5.364 9.492 -4.146 QT
9.656 -2.927 9.656 -1.583 QT
9.656 0.229 9.328 1.8 QT
9 3.37 8.023 4.479 QT
7.047 5.589 5.25 5.589 QT
cp
5.25 5.042 M
6.422 5.042 6.992 3.839 QT
7.563 2.636 7.695 1.182 QT
7.828 -0.271 7.828 -1.911 QT
7.828 -3.489 7.695 -4.825 QT
7.563 -6.161 6.992 -7.239 QT
6.422 -8.318 5.25 -8.318 QT
4.063 -8.318 3.484 -7.232 QT
2.906 -6.146 2.773 -4.818 QT
2.641 -3.489 2.641 -1.911 QT
2.641 -0.739 2.703 0.292 QT
2.766 1.323 3.008 2.425 QT
3.25 3.526 3.797 4.284 QT
4.344 5.042 5.25 5.042 QT
cp}def
f1776739717
f
GR
GS
[0.75 0 0 0.75 193.28897 306.95943] CT
N
/f1390903136{-14.953 5.12 M
-14.953 4.557 L
-14.953 4.511 -14.906 4.448 QT
-11.656 0.839 L
-10.906 0.026 -10.445 -0.513 QT
-9.984 -1.052 -9.539 -1.763 QT
-9.094 -2.474 -8.828 -3.2 QT
-8.563 -3.927 -8.563 -4.755 QT
-8.563 -5.614 -8.883 -6.404 QT
-9.203 -7.193 -9.836 -7.661 QT
-10.469 -8.13 -11.359 -8.13 QT
-12.266 -8.13 -12.992 -7.583 QT
-13.719 -7.036 -14.016 -6.161 QT
-13.938 -6.177 -13.797 -6.177 QT
-13.328 -6.177 -12.992 -5.864 QT
-12.656 -5.552 -12.656 -5.036 QT
-12.656 -4.568 -12.992 -4.232 QT
-13.328 -3.896 -13.797 -3.896 QT
-14.281 -3.896 -14.617 -4.239 QT
-14.953 -4.583 -14.953 -5.036 QT
-14.953 -5.833 -14.656 -6.521 QT
-14.359 -7.208 -13.797 -7.747 QT
-13.234 -8.286 -12.539 -8.575 QT
-11.844 -8.864 -11.047 -8.864 QT
-9.844 -8.864 -8.813 -8.357 QT
-7.781 -7.849 -7.172 -6.919 QT
-6.563 -5.989 -6.563 -4.755 QT
-6.563 -3.849 -6.961 -3.029 QT
-7.359 -2.208 -7.984 -1.536 QT
-8.609 -0.864 -9.586 -0.013 QT
-10.563 0.839 -10.875 1.136 QT
-13.25 3.417 L
-11.234 3.417 L
-9.75 3.417 -8.75 3.393 QT
-7.75 3.37 -7.688 3.307 QT
-7.438 3.042 -7.188 1.37 QT
-6.563 1.37 L
-7.156 5.12 L
-14.953 5.12 L
cp}def
f1390903136
f
GR
GS
[0.75 0 0 0.75 193.28897 306.95943] CT
N
/f346431540{-4.755 1.651 M
-4.755 0.917 L
1.745 -8.771 L
1.807 -8.864 1.964 -8.864 QT
2.26 -8.864 L
2.495 -8.864 2.495 -8.63 QT
2.495 0.917 L
4.557 0.917 L
4.557 1.651 L
2.495 1.651 L
2.495 3.714 L
2.495 4.151 3.112 4.268 QT
3.729 4.386 4.542 4.386 QT
4.542 5.12 L
-1.24 5.12 L
-1.24 4.386 L
-0.427 4.386 0.182 4.268 QT
0.792 4.151 0.792 3.714 QT
0.792 1.651 L
-4.755 1.651 L
cp
-4.052 0.917 M
0.917 0.917 L
0.917 -6.521 L
-4.052 0.917 L
cp}def
f346431540
f
GR
GS
[0.75 0 0 0.75 193.28897 306.95943] CT
N
/f-485083074{10.583 5.589 M
8.005 5.589 7.083 3.464 QT
6.161 1.339 6.161 -1.583 QT
6.161 -3.396 6.49 -5.005 QT
6.818 -6.614 7.81 -7.739 QT
8.802 -8.864 10.583 -8.864 QT
11.974 -8.864 12.849 -8.193 QT
13.724 -7.521 14.193 -6.443 QT
14.661 -5.364 14.826 -4.146 QT
14.99 -2.927 14.99 -1.583 QT
14.99 0.229 14.661 1.8 QT
14.333 3.37 13.357 4.479 QT
12.38 5.589 10.583 5.589 QT
cp
10.583 5.042 M
11.755 5.042 12.326 3.839 QT
12.896 2.636 13.029 1.182 QT
13.161 -0.271 13.161 -1.911 QT
13.161 -3.489 13.029 -4.825 QT
12.896 -6.161 12.326 -7.239 QT
11.755 -8.318 10.583 -8.318 QT
9.396 -8.318 8.818 -7.232 QT
8.24 -6.146 8.107 -4.818 QT
7.974 -3.489 7.974 -1.911 QT
7.974 -0.739 8.036 0.292 QT
8.099 1.323 8.341 2.425 QT
8.583 3.526 9.13 4.284 QT
9.677 5.042 10.583 5.042 QT
cp}def
f-485083074
f
GR
GS
[0.75 0 0 0.75 529.87697 216.77095] CT
N
/f-117821145{-8.246 6.4 M
-8.246 5.447 L
-5.465 5.447 -5.465 4.587 QT
-5.465 -10.241 L
-5.465 -11.1 -8.246 -11.1 QT
-8.246 -12.038 L
7.02 -12.038 L
7.77 -5.866 L
7.004 -5.866 L
6.707 -8.194 6.184 -9.249 QT
5.66 -10.303 4.52 -10.702 QT
3.379 -11.1 1.082 -11.1 QT
-1.574 -11.1 L
-2.058 -11.1 -2.332 -11.061 QT
-2.605 -11.022 -2.777 -10.827 QT
-2.949 -10.631 -2.949 -10.241 QT
-2.949 -3.647 L
-0.949 -3.647 L
0.426 -3.647 1.098 -3.874 QT
1.77 -4.1 2.027 -4.756 QT
2.285 -5.413 2.285 -6.803 QT
3.082 -6.803 L
3.082 0.447 L
2.285 0.447 L
2.285 -0.913 2.027 -1.577 QT
1.77 -2.241 1.098 -2.467 QT
0.426 -2.694 -0.949 -2.694 QT
-2.949 -2.694 L
-2.949 4.587 L
-2.949 5.181 -2.613 5.314 QT
-2.277 5.447 -1.574 5.447 QT
1.285 5.447 L
3.16 5.447 4.317 5.15 QT
5.473 4.853 6.113 4.166 QT
6.754 3.478 7.098 2.376 QT
7.442 1.275 7.754 -0.678 QT
8.52 -0.678 L
7.395 6.4 L
-8.246 6.4 L
cp}def
f-117821145
f
GR
GS
[0.75 0 0 0.75 163.26089 216.77095] CT
N
/f804141451{-5.313 6.697 M
-10.813 -10.241 L
-11.032 -10.803 -11.633 -10.952 QT
-12.235 -11.1 -13.219 -11.1 QT
-13.219 -12.038 L
-5.985 -12.038 L
-5.985 -11.1 L
-8.251 -11.1 -8.251 -10.366 QT
-8.251 -10.241 L
-3.938 3.056 L
-0.251 -8.319 L
-0.876 -10.241 L
-1.094 -10.803 -1.696 -10.952 QT
-2.297 -11.1 -3.282 -11.1 QT
-3.282 -12.038 L
3.953 -12.038 L
3.953 -11.1 L
1.656 -11.1 1.656 -10.366 QT
1.656 -10.334 1.679 -10.256 QT
1.703 -10.178 1.703 -10.147 QT
5.999 3.056 L
10.046 -9.506 L
10.078 -9.584 10.078 -9.756 QT
10.078 -10.459 9.328 -10.78 QT
8.578 -11.1 7.765 -11.1 QT
7.765 -12.038 L
13.531 -12.038 L
13.531 -11.1 L
11.406 -11.1 10.89 -9.506 QT
5.624 6.697 L
5.531 6.994 5.234 6.994 QT
5.031 6.994 L
4.734 6.994 4.64 6.697 QT
0.171 -7.053 L
-4.297 6.697 L
-4.391 6.994 -4.719 6.994 QT
-4.891 6.994 L
-5.219 6.994 -5.313 6.697 QT
cp}def
f804141451
f
GR
GS
[0.75 0 0 0.75 505.71103 306.95943] CT
N
/f-150821628{-14.047 5.12 M
-14.047 4.386 L
-11.422 4.386 -11.422 3.714 QT
-11.422 -7.302 L
-12.516 -6.786 -14.172 -6.786 QT
-14.172 -7.521 L
-11.594 -7.521 -10.281 -8.864 QT
-9.984 -8.864 L
-9.922 -8.864 -9.852 -8.81 QT
-9.781 -8.755 -9.781 -8.677 QT
-9.781 3.714 L
-9.781 4.386 -7.156 4.386 QT
-7.156 5.12 L
-14.047 5.12 L
cp}def
f-150821628
f
GR
GS
[0.75 0 0 0.75 505.71103 306.95943] CT
N
/f-1774948328{-4.286 5.12 M
-4.286 4.557 L
-4.286 4.511 -4.24 4.448 QT
-0.99 0.839 L
-0.24 0.026 0.221 -0.513 QT
0.682 -1.052 1.128 -1.763 QT
1.573 -2.474 1.839 -3.2 QT
2.104 -3.927 2.104 -4.755 QT
2.104 -5.614 1.784 -6.404 QT
1.464 -7.193 0.831 -7.661 QT
0.198 -8.13 -0.693 -8.13 QT
-1.599 -8.13 -2.326 -7.583 QT
-3.052 -7.036 -3.349 -6.161 QT
-3.271 -6.177 -3.13 -6.177 QT
-2.661 -6.177 -2.326 -5.864 QT
-1.99 -5.552 -1.99 -5.036 QT
-1.99 -4.568 -2.326 -4.232 QT
-2.661 -3.896 -3.13 -3.896 QT
-3.615 -3.896 -3.951 -4.239 QT
-4.286 -4.583 -4.286 -5.036 QT
-4.286 -5.833 -3.99 -6.521 QT
-3.693 -7.208 -3.13 -7.747 QT
-2.568 -8.286 -1.872 -8.575 QT
-1.177 -8.864 -0.38 -8.864 QT
0.823 -8.864 1.854 -8.357 QT
2.885 -7.849 3.495 -6.919 QT
4.104 -5.989 4.104 -4.755 QT
4.104 -3.849 3.706 -3.029 QT
3.307 -2.208 2.682 -1.536 QT
2.057 -0.864 1.081 -0.013 QT
0.104 0.839 -0.208 1.136 QT
-2.583 3.417 L
-0.568 3.417 L
0.917 3.417 1.917 3.393 QT
2.917 3.37 2.979 3.307 QT
3.229 3.042 3.479 1.37 QT
4.104 1.37 L
3.51 5.12 L
-4.286 5.12 L
cp}def
f-1774948328
f
GR
GS
[0.75 0 0 0.75 505.71103 306.95943] CT
N
f-485083074
f
GR
GS
[0.75 0 0 0.75 193.28897 126.58247] CT
N
/f-211614979{-14 3.495 M
-13.516 4.214 -12.68 4.565 QT
-11.844 4.917 -10.891 4.917 QT
-9.672 4.917 -9.156 3.878 QT
-8.641 2.839 -8.641 1.511 QT
-8.641 0.917 -8.75 0.323 QT
-8.859 -0.271 -9.117 -0.786 QT
-9.375 -1.302 -9.82 -1.607 QT
-10.266 -1.911 -10.906 -1.911 QT
-12.313 -1.911 L
-12.5 -1.911 -12.5 -2.114 QT
-12.5 -2.286 L
-12.5 -2.458 -12.313 -2.458 QT
-11.156 -2.552 L
-10.406 -2.552 -9.922 -3.107 QT
-9.438 -3.661 -9.211 -4.45 QT
-8.984 -5.239 -8.984 -5.958 QT
-8.984 -6.974 -9.453 -7.614 QT
-9.922 -8.255 -10.891 -8.255 QT
-11.688 -8.255 -12.422 -7.958 QT
-13.156 -7.661 -13.578 -7.036 QT
-13.531 -7.052 -13.508 -7.06 QT
-13.484 -7.068 -13.438 -7.068 QT
-12.969 -7.068 -12.648 -6.739 QT
-12.328 -6.411 -12.328 -5.943 QT
-12.328 -5.489 -12.648 -5.161 QT
-12.969 -4.833 -13.438 -4.833 QT
-13.891 -4.833 -14.219 -5.161 QT
-14.547 -5.489 -14.547 -5.943 QT
-14.547 -6.849 -14.008 -7.513 QT
-13.469 -8.177 -12.609 -8.521 QT
-11.75 -8.864 -10.891 -8.864 QT
-10.25 -8.864 -9.547 -8.677 QT
-8.844 -8.489 -8.266 -8.138 QT
-7.688 -7.786 -7.328 -7.232 QT
-6.969 -6.677 -6.969 -5.958 QT
-6.969 -5.083 -7.359 -4.333 QT
-7.75 -3.583 -8.438 -3.044 QT
-9.125 -2.505 -9.953 -2.239 QT
-9.031 -2.052 -8.211 -1.544 QT
-7.391 -1.036 -6.898 -0.232 QT
-6.406 0.573 -6.406 1.495 QT
-6.406 2.651 -7.039 3.589 QT
-7.672 4.526 -8.711 5.057 QT
-9.75 5.589 -10.891 5.589 QT
-11.875 5.589 -12.867 5.214 QT
-13.859 4.839 -14.492 4.089 QT
-15.125 3.339 -15.125 2.292 QT
-15.125 1.761 -14.773 1.417 QT
-14.422 1.073 -13.891 1.073 QT
-13.563 1.073 -13.281 1.229 QT
-13 1.386 -12.836 1.675 QT
-12.672 1.964 -12.672 2.292 QT
-12.672 2.807 -13.031 3.151 QT
-13.391 3.495 -13.891 3.495 QT
-14 3.495 L
cp}def
f-211614979
f
GR
GS
[0.75 0 0 0.75 193.28897 126.58247] CT
N
/f879674892{-0.083 5.589 M
-2.661 5.589 -3.583 3.464 QT
-4.505 1.339 -4.505 -1.583 QT
-4.505 -3.396 -4.177 -5.005 QT
-3.849 -6.614 -2.857 -7.739 QT
-1.865 -8.864 -0.083 -8.864 QT
1.307 -8.864 2.182 -8.193 QT
3.057 -7.521 3.526 -6.443 QT
3.995 -5.364 4.159 -4.146 QT
4.323 -2.927 4.323 -1.583 QT
4.323 0.229 3.995 1.8 QT
3.667 3.37 2.69 4.479 QT
1.714 5.589 -0.083 5.589 QT
cp
-0.083 5.042 M
1.089 5.042 1.659 3.839 QT
2.229 2.636 2.362 1.182 QT
2.495 -0.271 2.495 -1.911 QT
2.495 -3.489 2.362 -4.825 QT
2.229 -6.161 1.659 -7.239 QT
1.089 -8.318 -0.083 -8.318 QT
-1.271 -8.318 -1.849 -7.232 QT
-2.427 -6.146 -2.56 -4.818 QT
-2.693 -3.489 -2.693 -1.911 QT
-2.693 -0.739 -2.63 0.292 QT
-2.568 1.323 -2.326 2.425 QT
-2.083 3.526 -1.536 4.284 QT
-0.99 5.042 -0.083 5.042 QT
cp}def
f879674892
f
GR
GS
[0.75 0 0 0.75 193.28897 126.58247] CT
N
f-485083074
f
GR
GS
[0.75 0 0 0.75 439.68846 372.98198] CT
N
f-150821628
f
GR
GS
[0.75 0 0 0.75 439.68846 372.98198] CT
N
/f-1242808361{-3.505 2.729 M
-3.286 3.339 -2.841 3.846 QT
-2.396 4.354 -1.786 4.636 QT
-1.177 4.917 -0.521 4.917 QT
0.995 4.917 1.565 3.737 QT
2.135 2.557 2.135 0.87 QT
2.135 0.151 2.112 -0.349 QT
2.089 -0.849 1.979 -1.302 QT
1.776 -2.052 1.292 -2.607 QT
0.807 -3.161 0.104 -3.161 QT
-0.599 -3.161 -1.107 -2.943 QT
-1.615 -2.724 -1.935 -2.435 QT
-2.255 -2.146 -2.505 -1.833 QT
-2.755 -1.521 -2.818 -1.489 QT
-3.052 -1.489 L
-3.099 -1.489 -3.177 -1.56 QT
-3.255 -1.63 -3.255 -1.693 QT
-3.255 -8.708 L
-3.255 -8.755 -3.185 -8.81 QT
-3.115 -8.864 -3.052 -8.864 QT
-2.99 -8.864 L
-1.568 -8.193 0.026 -8.193 QT
1.573 -8.193 3.026 -8.864 QT
3.089 -8.864 L
3.151 -8.864 3.214 -8.818 QT
3.276 -8.771 3.276 -8.708 QT
3.276 -8.505 L
3.276 -8.411 3.245 -8.411 QT
2.526 -7.458 1.44 -6.919 QT
0.354 -6.38 -0.802 -6.38 QT
-1.646 -6.38 -2.521 -6.614 QT
-2.521 -2.646 L
-1.833 -3.224 -1.279 -3.458 QT
-0.724 -3.693 0.12 -3.693 QT
1.276 -3.693 2.198 -3.029 QT
3.12 -2.364 3.612 -1.294 QT
4.104 -0.224 4.104 0.901 QT
4.104 2.151 3.479 3.229 QT
2.854 4.307 1.792 4.948 QT
0.729 5.589 -0.521 5.589 QT
-1.552 5.589 -2.419 5.05 QT
-3.286 4.511 -3.786 3.612 QT
-4.286 2.714 -4.286 1.698 QT
-4.286 1.229 -3.982 0.932 QT
-3.677 0.636 -3.208 0.636 QT
-2.755 0.636 -2.443 0.932 QT
-2.13 1.229 -2.13 1.698 QT
-2.13 2.151 -2.443 2.464 QT
-2.755 2.776 -3.208 2.776 QT
-3.286 2.776 -3.38 2.761 QT
-3.474 2.745 -3.505 2.729 QT
cp}def
f-1242808361
f
GR
GS
[0.75 0 0 0.75 439.68846 372.98198] CT
N
f-485083074
f
GR
GS
[0.75 0 0 0.75 259.31152 60.55992] CT
N
f-211614979
f
GR
GS
[0.75 0 0 0.75 259.31152 60.55992] CT
N
/f-1112969129{-3.333 3.495 M
-2.849 4.214 -2.013 4.565 QT
-1.177 4.917 -0.224 4.917 QT
0.995 4.917 1.51 3.878 QT
2.026 2.839 2.026 1.511 QT
2.026 0.917 1.917 0.323 QT
1.807 -0.271 1.549 -0.786 QT
1.292 -1.302 0.846 -1.607 QT
0.401 -1.911 -0.24 -1.911 QT
-1.646 -1.911 L
-1.833 -1.911 -1.833 -2.114 QT
-1.833 -2.286 L
-1.833 -2.458 -1.646 -2.458 QT
-0.49 -2.552 L
0.26 -2.552 0.745 -3.107 QT
1.229 -3.661 1.456 -4.45 QT
1.682 -5.239 1.682 -5.958 QT
1.682 -6.974 1.214 -7.614 QT
0.745 -8.255 -0.224 -8.255 QT
-1.021 -8.255 -1.755 -7.958 QT
-2.49 -7.661 -2.911 -7.036 QT
-2.865 -7.052 -2.841 -7.06 QT
-2.818 -7.068 -2.771 -7.068 QT
-2.302 -7.068 -1.982 -6.739 QT
-1.661 -6.411 -1.661 -5.943 QT
-1.661 -5.489 -1.982 -5.161 QT
-2.302 -4.833 -2.771 -4.833 QT
-3.224 -4.833 -3.552 -5.161 QT
-3.88 -5.489 -3.88 -5.943 QT
-3.88 -6.849 -3.341 -7.513 QT
-2.802 -8.177 -1.943 -8.521 QT
-1.083 -8.864 -0.224 -8.864 QT
0.417 -8.864 1.12 -8.677 QT
1.823 -8.489 2.401 -8.138 QT
2.979 -7.786 3.339 -7.232 QT
3.698 -6.677 3.698 -5.958 QT
3.698 -5.083 3.307 -4.333 QT
2.917 -3.583 2.229 -3.044 QT
1.542 -2.505 0.714 -2.239 QT
1.635 -2.052 2.456 -1.544 QT
3.276 -1.036 3.768 -0.232 QT
4.26 0.573 4.26 1.495 QT
4.26 2.651 3.628 3.589 QT
2.995 4.526 1.956 5.057 QT
0.917 5.589 -0.224 5.589 QT
-1.208 5.589 -2.201 5.214 QT
-3.193 4.839 -3.826 4.089 QT
-4.458 3.339 -4.458 2.292 QT
-4.458 1.761 -4.107 1.417 QT
-3.755 1.073 -3.224 1.073 QT
-2.896 1.073 -2.615 1.229 QT
-2.333 1.386 -2.169 1.675 QT
-2.005 1.964 -2.005 2.292 QT
-2.005 2.807 -2.365 3.151 QT
-2.724 3.495 -3.224 3.495 QT
-3.333 3.495 L
cp}def
f-1112969129
f
GR
GS
[0.75 0 0 0.75 259.31152 60.55992] CT
N
f-485083074
f
GR
GS
[0.75 0 0 0.75 349.5 397.14792] CT
N
/f-1384251478{-5.892 6.775 M
-5.892 0.478 L
-5.892 0.275 -5.657 0.275 QT
-5.329 0.275 L
-5.251 0.275 -5.181 0.337 QT
-5.111 0.4 -5.111 0.478 QT
-5.111 3.134 -3.47 4.587 QT
-1.829 6.041 0.827 6.041 QT
1.764 6.041 2.561 5.501 QT
3.358 4.962 3.796 4.087 QT
4.233 3.212 4.233 2.275 QT
4.233 1.462 3.905 0.689 QT
3.577 -0.084 2.96 -0.655 QT
2.343 -1.225 1.561 -1.413 QT
-1.954 -2.256 L
-3.689 -2.725 -4.79 -4.155 QT
-5.892 -5.584 -5.892 -7.366 QT
-5.892 -8.756 -5.181 -9.983 QT
-4.47 -11.209 -3.259 -11.92 QT
-2.048 -12.631 -0.657 -12.631 QT
2.046 -12.631 3.639 -10.803 QT
4.749 -12.553 L
4.827 -12.631 4.936 -12.631 QT
5.124 -12.631 L
5.202 -12.631 5.272 -12.577 QT
5.343 -12.522 5.343 -12.413 QT
5.343 -6.147 L
5.343 -5.913 5.124 -5.913 QT
4.796 -5.913 L
4.546 -5.913 4.546 -6.147 QT
4.546 -6.834 4.319 -7.655 QT
4.093 -8.475 3.679 -9.225 QT
3.264 -9.975 2.796 -10.444 QT
1.499 -11.772 -0.657 -11.772 QT
-1.579 -11.772 -2.361 -11.303 QT
-3.142 -10.834 -3.603 -10.03 QT
-4.064 -9.225 -4.064 -8.334 QT
-4.064 -7.178 -3.345 -6.233 QT
-2.626 -5.288 -1.454 -4.991 QT
2.046 -4.131 L
2.921 -3.928 3.686 -3.381 QT
4.452 -2.834 4.968 -2.108 QT
5.483 -1.381 5.772 -0.491 QT
6.061 0.4 6.061 1.353 QT
6.061 2.806 5.389 4.111 QT
4.718 5.416 3.499 6.205 QT
2.28 6.994 0.827 6.994 QT
-0.064 6.994 -1.001 6.798 QT
-1.939 6.603 -2.728 6.189 QT
-3.517 5.775 -4.157 5.134 QT
-5.298 6.916 L
-5.376 6.994 -5.501 6.994 QT
-5.657 6.994 L
-5.892 6.994 -5.892 6.775 QT
cp}def
f-1384251478
f
GR
GS
[0.75 0 0 0.75 349.5 36.39398] CT
N
/f2079878726{-9.172 6.4 M
-9.172 5.447 L
-6.391 5.447 -6.391 3.853 QT
-6.391 -10.944 L
-7.266 -11.1 -9.172 -11.1 QT
-9.172 -12.038 L
-4 -12.038 L
-3.875 -12.038 -3.813 -11.944 QT
5.734 2.134 L
5.734 -9.506 L
5.734 -11.1 2.953 -11.1 QT
2.953 -12.038 L
9.375 -12.038 L
9.375 -11.1 L
6.609 -11.1 6.609 -9.506 QT
6.609 6.166 L
6.609 6.244 6.508 6.322 QT
6.406 6.4 6.328 6.4 QT
6 6.4 L
5.875 6.4 5.828 6.291 QT
-5.516 -10.397 L
-5.516 3.853 L
-5.516 5.447 -2.734 5.447 QT
-2.734 6.4 L
-9.172 6.4 L
cp}def
f2079878726
f
GR
GS
[0.75 0 0 0.75 0 0.5] CT
0.149 GC
[1 3] 0 setdash
2 LJ
0.667 LW
N
466 77.172 M
479.261 77.589 L
492.469 78.838 L
505.573 80.913 L
518.521 83.807 L
531.261 87.509 L
543.744 92.003 L
555.92 97.272 L
567.741 103.295 L
579.161 110.049 L
590.134 117.506 L
600.617 125.637 L
610.569 134.411 L
619.95 143.793 L
628.724 153.744 L
636.855 164.228 L
644.313 175.201 L
651.066 186.62 L
657.089 198.441 L
662.358 210.617 L
666.852 223.1 L
670.554 235.841 L
673.448 248.788 L
675.523 261.892 L
676.772 275.101 L
677.189 288.361 L
676.772 301.622 L
675.523 314.83 L
673.448 327.934 L
670.554 340.882 L
666.852 353.622 L
662.358 366.105 L
657.089 378.281 L
651.066 390.102 L
644.313 401.522 L
636.855 412.495 L
628.724 422.978 L
619.95 432.93 L
610.569 442.311 L
600.617 451.085 L
590.134 459.217 L
579.161 466.674 L
567.741 473.427 L
555.92 479.451 L
543.744 484.72 L
531.261 489.214 L
518.521 492.915 L
505.573 495.809 L
492.469 497.885 L
479.261 499.133 L
466 499.55 L
452.739 499.133 L
439.531 497.885 L
426.427 495.809 L
413.479 492.915 L
400.739 489.214 L
388.256 484.72 L
376.08 479.451 L
364.259 473.427 L
352.839 466.674 L
341.866 459.217 L
331.383 451.085 L
321.431 442.311 L
312.05 432.93 L
303.276 422.978 L
295.145 412.495 L
287.687 401.522 L
280.934 390.102 L
274.911 378.281 L
269.642 366.105 L
265.147 353.622 L
261.446 340.882 L
258.552 327.934 L
256.477 314.83 L
255.228 301.622 L
254.811 288.361 L
255.228 275.101 L
256.477 261.892 L
258.552 248.788 L
261.446 235.841 L
265.147 223.1 L
269.642 210.617 L
274.911 198.441 L
280.934 186.62 L
287.687 175.201 L
295.145 164.228 L
303.276 153.744 L
312.05 143.793 L
321.431 134.411 L
331.383 125.637 L
341.866 117.506 L
352.839 110.049 L
364.259 103.295 L
376.08 97.272 L
388.256 92.003 L
400.739 87.509 L
413.479 83.807 L
426.427 80.913 L
439.531 78.838 L
452.739 77.589 L
466 77.172 L
S
GR
GS
[0.75 0 0 0.75 0 0.5] CT
0.149 GC
[1 3] 0 setdash
2 LJ
0.667 LW
N
466 99.015 M
477.889 99.388 L
489.731 100.508 L
501.48 102.368 L
513.089 104.963 L
524.511 108.282 L
535.703 112.311 L
546.62 117.035 L
557.219 122.435 L
567.457 128.491 L
577.295 135.177 L
586.694 142.467 L
595.617 150.333 L
604.028 158.745 L
611.894 167.667 L
619.185 177.066 L
625.871 186.904 L
631.926 197.143 L
637.326 207.741 L
642.05 218.658 L
646.079 229.85 L
649.398 241.273 L
651.993 252.881 L
653.854 264.63 L
654.973 276.472 L
655.347 288.361 L
654.973 300.25 L
653.854 312.093 L
651.993 323.841 L
649.398 335.45 L
646.079 346.873 L
642.05 358.064 L
637.326 368.981 L
631.926 379.58 L
625.871 389.818 L
619.185 399.656 L
611.894 409.055 L
604.028 417.978 L
595.617 426.389 L
586.694 434.255 L
577.295 441.546 L
567.457 448.232 L
557.219 454.287 L
546.62 459.687 L
535.703 464.411 L
524.511 468.441 L
513.089 471.759 L
501.48 474.354 L
489.731 476.215 L
477.889 477.334 L
466 477.708 L
454.111 477.334 L
442.269 476.215 L
430.52 474.354 L
418.911 471.759 L
407.489 468.441 L
396.297 464.411 L
385.38 459.687 L
374.782 454.287 L
364.543 448.232 L
354.705 441.546 L
345.306 434.255 L
336.383 426.389 L
327.972 417.978 L
320.106 409.055 L
312.815 399.656 L
306.129 389.818 L
300.074 379.58 L
294.674 368.981 L
289.95 358.064 L
285.921 346.873 L
282.602 335.45 L
280.007 323.841 L
278.146 312.093 L
277.027 300.25 L
276.653 288.361 L
277.027 276.472 L
278.146 264.63 L
280.007 252.881 L
282.602 241.273 L
285.921 229.85 L
289.95 218.658 L
294.674 207.741 L
300.074 197.143 L
306.129 186.904 L
312.815 177.066 L
320.106 167.667 L
327.972 158.745 L
336.383 150.333 L
345.306 142.467 L
354.705 135.177 L
364.543 128.491 L
374.782 122.435 L
385.38 117.035 L
396.297 112.311 L
407.489 108.282 L
418.911 104.963 L
430.52 102.368 L
442.269 100.508 L
454.111 99.388 L
466 99.015 L
S
GR
GS
[0.75 0 0 0.75 356.79337 69.71106] CT
N
/f-2102542514{-6.469 2.606 M
-6.094 3.152 -5.461 3.418 QT
-4.828 3.684 -4.109 3.684 QT
-3.172 3.684 -2.781 2.887 QT
-2.391 2.09 -2.391 1.09 QT
-2.391 0.637 -2.477 0.184 QT
-2.563 -0.269 -2.758 -0.66 QT
-2.953 -1.051 -3.289 -1.285 QT
-3.625 -1.519 -4.125 -1.519 QT
-5.188 -1.519 L
-5.328 -1.519 -5.328 -1.676 QT
-5.328 -1.816 L
-5.328 -1.941 -5.188 -1.941 QT
-4.297 -2.004 L
-3.734 -2.004 -3.367 -2.426 QT
-3 -2.848 -2.828 -3.457 QT
-2.656 -4.066 -2.656 -4.613 QT
-2.656 -5.379 -3.016 -5.871 QT
-3.375 -6.363 -4.109 -6.363 QT
-4.719 -6.363 -5.273 -6.129 QT
-5.828 -5.894 -6.156 -5.426 QT
-6.125 -5.441 -6.102 -5.441 QT
-6.078 -5.441 -6.047 -5.441 QT
-5.688 -5.441 -5.445 -5.191 QT
-5.203 -4.941 -5.203 -4.598 QT
-5.203 -4.254 -5.445 -4.004 QT
-5.688 -3.754 -6.047 -3.754 QT
-6.391 -3.754 -6.641 -4.004 QT
-6.891 -4.254 -6.891 -4.598 QT
-6.891 -5.285 -6.477 -5.793 QT
-6.063 -6.301 -5.414 -6.558 QT
-4.766 -6.816 -4.109 -6.816 QT
-3.625 -6.816 -3.086 -6.676 QT
-2.547 -6.535 -2.109 -6.262 QT
-1.672 -5.988 -1.391 -5.566 QT
-1.109 -5.144 -1.109 -4.613 QT
-1.109 -3.941 -1.414 -3.371 QT
-1.719 -2.801 -2.242 -2.387 QT
-2.766 -1.973 -3.391 -1.769 QT
-2.688 -1.629 -2.063 -1.238 QT
-1.438 -0.848 -1.063 -0.238 QT
-0.688 0.371 -0.688 1.074 QT
-0.688 1.949 -1.172 2.668 QT
-1.656 3.387 -2.445 3.793 QT
-3.234 4.199 -4.109 4.199 QT
-4.859 4.199 -5.609 3.91 QT
-6.359 3.621 -6.844 3.051 QT
-7.328 2.481 -7.328 1.684 QT
-7.328 1.277 -7.063 1.012 QT
-6.797 0.746 -6.391 0.746 QT
-6.141 0.746 -5.922 0.871 QT
-5.703 0.996 -5.586 1.215 QT
-5.469 1.434 -5.469 1.684 QT
-5.469 2.074 -5.742 2.34 QT
-6.016 2.606 -6.391 2.606 QT
-6.469 2.606 L
cp}def
f-2102542514
f
GR
GS
[0.75 0 0 0.75 356.79337 69.71106] CT
N
/f-1692182862{4 4.199 M
2.047 4.199 1.336 2.582 QT
0.625 0.965 0.625 -1.269 QT
0.625 -2.66 0.883 -3.887 QT
1.141 -5.113 1.891 -5.965 QT
2.641 -6.816 4 -6.816 QT
5.063 -6.816 5.734 -6.301 QT
6.406 -5.785 6.758 -4.973 QT
7.109 -4.16 7.234 -3.223 QT
7.359 -2.285 7.359 -1.269 QT
7.359 0.106 7.109 1.309 QT
6.859 2.512 6.117 3.356 QT
5.375 4.199 4 4.199 QT
cp
4 3.777 M
4.891 3.777 5.328 2.863 QT
5.766 1.949 5.867 0.84 QT
5.969 -0.269 5.969 -1.519 QT
5.969 -2.723 5.867 -3.738 QT
5.766 -4.754 5.336 -5.582 QT
4.906 -6.41 4 -6.41 QT
3.094 -6.41 2.656 -5.582 QT
2.219 -4.754 2.117 -3.738 QT
2.016 -2.723 2.016 -1.519 QT
2.016 -0.629 2.063 0.16 QT
2.109 0.949 2.297 1.785 QT
2.484 2.621 2.898 3.199 QT
3.313 3.777 4 3.777 QT
cp}def
f-1692182862
f
GR
GS
[0.75 0 0 0.75 0 0.5] CT
0.149 GC
[1 3] 0 setdash
2 LJ
0.667 LW
N
466 133.76 M
475.707 134.065 L
485.377 134.979 L
494.969 136.499 L
504.448 138.617 L
513.774 141.327 L
522.912 144.617 L
531.826 148.474 L
540.48 152.883 L
548.839 157.827 L
556.872 163.286 L
564.546 169.239 L
571.832 175.662 L
578.699 182.53 L
585.122 189.815 L
591.075 197.489 L
596.534 205.522 L
601.478 213.882 L
605.887 222.535 L
609.744 231.449 L
613.034 240.587 L
615.744 249.914 L
617.863 259.392 L
619.382 268.985 L
620.296 278.654 L
620.601 288.361 L
620.296 298.069 L
619.382 307.738 L
617.863 317.331 L
615.744 326.809 L
613.034 336.136 L
609.744 345.274 L
605.887 354.187 L
601.478 362.841 L
596.534 371.201 L
591.075 379.233 L
585.122 386.908 L
578.699 394.193 L
571.832 401.06 L
564.546 407.483 L
556.872 413.436 L
548.839 418.895 L
540.48 423.839 L
531.826 428.248 L
522.912 432.106 L
513.774 435.395 L
504.448 438.105 L
494.969 440.224 L
485.377 441.743 L
475.707 442.657 L
466 442.962 L
456.293 442.657 L
446.623 441.743 L
437.031 440.224 L
427.552 438.105 L
418.226 435.395 L
409.088 432.106 L
400.174 428.248 L
391.52 423.839 L
383.161 418.895 L
375.128 413.436 L
367.454 407.483 L
360.168 401.06 L
353.301 394.193 L
346.878 386.908 L
340.925 379.233 L
335.466 371.201 L
330.522 362.841 L
326.113 354.187 L
322.256 345.274 L
318.966 336.136 L
316.256 326.809 L
314.137 317.331 L
312.618 307.738 L
311.704 298.069 L
311.399 288.361 L
311.704 278.654 L
312.618 268.985 L
314.137 259.392 L
316.256 249.914 L
318.966 240.587 L
322.256 231.449 L
326.113 222.535 L
330.522 213.882 L
335.466 205.522 L
340.925 197.489 L
346.878 189.815 L
353.301 182.53 L
360.168 175.662 L
367.454 169.239 L
375.128 163.286 L
383.161 157.827 L
391.52 152.883 L
400.174 148.474 L
409.088 144.617 L
418.226 141.327 L
427.552 138.617 L
437.031 136.499 L
446.623 134.979 L
456.293 134.065 L
466 133.76 L
S
GR
GS
[0.75 0 0 0.75 356.23059 95.58534] CT
N
/f42575179{-7.547 1.199 M
-7.547 0.637 L
-2.609 -6.738 L
-2.547 -6.816 -2.438 -6.816 QT
-2.203 -6.816 L
-2.031 -6.816 -2.031 -6.644 QT
-2.031 0.637 L
-0.453 0.637 L
-0.453 1.199 L
-2.031 1.199 L
-2.031 2.762 L
-2.031 3.09 -1.563 3.184 QT
-1.094 3.277 -0.469 3.277 QT
-0.469 3.84 L
-4.875 3.84 L
-4.875 3.277 L
-4.266 3.277 -3.797 3.184 QT
-3.328 3.09 -3.328 2.762 QT
-3.328 1.199 L
-7.547 1.199 L
cp
-7.016 0.637 M
-3.234 0.637 L
-3.234 -5.035 L
-7.016 0.637 L
cp}def
f42575179
f
GR
GS
[0.75 0 0 0.75 356.23059 95.58534] CT
N
/f919121033{1.391 2.012 M
1.563 2.481 1.898 2.863 QT
2.234 3.246 2.703 3.465 QT
3.172 3.684 3.672 3.684 QT
4.828 3.684 5.266 2.785 QT
5.703 1.887 5.703 0.606 QT
5.703 0.043 5.68 -0.332 QT
5.656 -0.707 5.578 -1.066 QT
5.422 -1.629 5.055 -2.051 QT
4.688 -2.473 4.141 -2.473 QT
3.609 -2.473 3.219 -2.308 QT
2.828 -2.144 2.586 -1.926 QT
2.344 -1.707 2.156 -1.465 QT
1.969 -1.223 1.922 -1.207 QT
1.75 -1.207 L
1.703 -1.207 1.648 -1.254 QT
1.594 -1.301 1.594 -1.348 QT
1.594 -6.691 L
1.594 -6.738 1.641 -6.777 QT
1.688 -6.816 1.75 -6.816 QT
1.797 -6.816 L
2.875 -6.301 4.078 -6.301 QT
5.266 -6.301 6.375 -6.816 QT
6.422 -6.816 L
6.469 -6.816 6.516 -6.777 QT
6.563 -6.738 6.563 -6.691 QT
6.563 -6.551 L
6.563 -6.473 6.531 -6.473 QT
5.984 -5.738 5.164 -5.332 QT
4.344 -4.926 3.453 -4.926 QT
2.813 -4.926 2.141 -5.113 QT
2.141 -2.082 L
2.672 -2.519 3.094 -2.699 QT
3.516 -2.879 4.156 -2.879 QT
5.047 -2.879 5.742 -2.371 QT
6.438 -1.863 6.813 -1.051 QT
7.188 -0.238 7.188 0.621 QT
7.188 1.574 6.719 2.395 QT
6.25 3.215 5.438 3.707 QT
4.625 4.199 3.672 4.199 QT
2.875 4.199 2.219 3.785 QT
1.563 3.371 1.18 2.684 QT
0.797 1.996 0.797 1.231 QT
0.797 0.871 1.031 0.645 QT
1.266 0.418 1.625 0.418 QT
1.969 0.418 2.211 0.645 QT
2.453 0.871 2.453 1.231 QT
2.453 1.574 2.211 1.809 QT
1.969 2.043 1.625 2.043 QT
1.563 2.043 1.492 2.035 QT
1.422 2.027 1.391 2.012 QT
cp}def
f919121033
f
GR
GS
[0.75 0 0 0.75 0 0.5] CT
0.149 GC
[1 3] 0 setdash
2 LJ
0.667 LW
N
466 179.042 M
472.864 179.258 L
479.701 179.904 L
486.484 180.978 L
493.187 182.476 L
499.782 184.392 L
506.243 186.719 L
512.546 189.446 L
518.665 192.564 L
524.576 196.06 L
530.256 199.92 L
535.683 204.129 L
540.834 208.671 L
545.69 213.527 L
550.232 218.678 L
554.441 224.105 L
558.301 229.785 L
561.797 235.696 L
564.915 241.815 L
567.643 248.118 L
569.969 254.58 L
571.885 261.175 L
573.383 267.877 L
574.457 274.66 L
575.104 281.497 L
575.319 288.361 L
575.104 295.225 L
574.457 302.063 L
573.383 308.846 L
571.885 315.548 L
569.969 322.143 L
567.643 328.604 L
564.915 334.907 L
561.797 341.026 L
558.301 346.938 L
554.441 352.618 L
550.232 358.044 L
545.69 363.196 L
540.834 368.052 L
535.683 372.593 L
530.256 376.802 L
524.576 380.663 L
518.665 384.159 L
512.546 387.276 L
506.243 390.004 L
499.782 392.33 L
493.187 394.246 L
486.484 395.744 L
479.701 396.819 L
472.864 397.465 L
466 397.681 L
459.136 397.465 L
452.299 396.819 L
445.516 395.744 L
438.813 394.246 L
432.218 392.33 L
425.757 390.004 L
419.454 387.276 L
413.335 384.159 L
407.424 380.663 L
401.744 376.802 L
396.317 372.593 L
391.166 368.052 L
386.31 363.196 L
381.768 358.044 L
377.559 352.618 L
373.699 346.938 L
370.203 341.026 L
367.085 334.907 L
364.357 328.604 L
362.031 322.143 L
360.115 315.548 L
358.617 308.846 L
357.543 302.063 L
356.896 295.225 L
356.681 288.361 L
356.896 281.497 L
357.543 274.66 L
358.617 267.877 L
360.115 261.175 L
362.031 254.58 L
364.357 248.118 L
367.085 241.815 L
370.203 235.696 L
373.699 229.785 L
377.559 224.105 L
381.768 218.678 L
386.31 213.527 L
391.166 208.671 L
396.317 204.129 L
401.744 199.92 L
407.424 196.06 L
413.335 192.564 L
419.454 189.446 L
425.757 186.719 L
432.218 184.392 L
438.813 182.476 L
445.516 180.978 L
452.299 179.904 L
459.136 179.258 L
466 179.042 L
S
GR
GS
[0.75 0 0 0.75 356.23059 128.79867] CT
N
/f359229147{-4 4.199 M
-4.984 4.199 -5.648 3.668 QT
-6.313 3.137 -6.68 2.293 QT
-7.047 1.449 -7.188 0.527 QT
-7.328 -0.394 -7.328 -1.332 QT
-7.328 -2.598 -6.836 -3.871 QT
-6.344 -5.144 -5.383 -5.98 QT
-4.422 -6.816 -3.109 -6.816 QT
-2.563 -6.816 -2.094 -6.613 QT
-1.625 -6.41 -1.352 -6.004 QT
-1.078 -5.598 -1.078 -5.035 QT
-1.078 -4.707 -1.305 -4.48 QT
-1.531 -4.254 -1.859 -4.254 QT
-2.172 -4.254 -2.398 -4.48 QT
-2.625 -4.707 -2.625 -5.035 QT
-2.625 -5.348 -2.398 -5.574 QT
-2.172 -5.801 -1.859 -5.801 QT
-1.766 -5.801 L
-1.969 -6.082 -2.344 -6.223 QT
-2.719 -6.363 -3.109 -6.363 QT
-3.594 -6.363 -4.008 -6.152 QT
-4.422 -5.941 -4.75 -5.582 QT
-5.078 -5.223 -5.297 -4.785 QT
-5.516 -4.348 -5.633 -3.793 QT
-5.75 -3.238 -5.781 -2.754 QT
-5.813 -2.269 -5.813 -1.535 QT
-5.531 -2.191 -5.016 -2.613 QT
-4.5 -3.035 -3.859 -3.035 QT
-3.141 -3.035 -2.555 -2.746 QT
-1.969 -2.457 -1.547 -1.941 QT
-1.125 -1.426 -0.906 -0.769 QT
-0.688 -0.113 -0.688 0.559 QT
-0.688 1.496 -1.102 2.34 QT
-1.516 3.184 -2.273 3.692 QT
-3.031 4.199 -4 4.199 QT
cp
-4 3.684 M
-3.375 3.684 -3 3.402 QT
-2.625 3.121 -2.453 2.652 QT
-2.281 2.184 -2.234 1.715 QT
-2.188 1.246 -2.188 0.559 QT
-2.188 -0.348 -2.273 -0.988 QT
-2.359 -1.629 -2.742 -2.121 QT
-3.125 -2.613 -3.922 -2.613 QT
-4.563 -2.613 -4.984 -2.176 QT
-5.406 -1.738 -5.594 -1.066 QT
-5.781 -0.394 -5.781 0.215 QT
-5.781 0.434 -5.766 0.543 QT
-5.766 0.559 -5.773 0.574 QT
-5.781 0.59 -5.781 0.621 QT
-5.781 1.309 -5.641 2.012 QT
-5.5 2.715 -5.102 3.199 QT
-4.703 3.684 -4 3.684 QT
cp}def
f359229147
f
GR
GS
[0.75 0 0 0.75 356.23059 128.79867] CT
N
f-1692182862
f
GR
GS
[0.75 0 0 0.75 0 0.5] CT
0.149 GC
[1 3] 0 setdash
2 LJ
0.667 LW
N
466 231.773 M
469.553 231.885 L
473.092 232.22 L
476.604 232.776 L
480.073 233.551 L
483.487 234.543 L
486.831 235.747 L
490.094 237.159 L
493.261 238.773 L
496.321 240.583 L
499.262 242.581 L
502.07 244.76 L
504.737 247.11 L
507.251 249.624 L
509.602 252.291 L
511.781 255.1 L
513.779 258.04 L
515.588 261.1 L
517.202 264.267 L
518.614 267.53 L
519.818 270.875 L
520.81 274.288 L
521.586 277.758 L
522.142 281.269 L
522.476 284.808 L
522.588 288.361 L
522.476 291.914 L
522.142 295.454 L
521.586 298.965 L
520.81 302.434 L
519.818 305.848 L
518.614 309.193 L
517.202 312.455 L
515.588 315.623 L
513.779 318.683 L
511.781 321.623 L
509.602 324.432 L
507.251 327.098 L
504.737 329.612 L
502.07 331.963 L
499.262 334.142 L
496.321 336.14 L
493.261 337.95 L
490.094 339.564 L
486.831 340.975 L
483.487 342.18 L
480.073 343.171 L
476.604 343.947 L
473.092 344.503 L
469.553 344.837 L
466 344.949 L
462.447 344.837 L
458.908 344.503 L
455.396 343.947 L
451.927 343.171 L
448.513 342.18 L
445.169 340.975 L
441.906 339.564 L
438.739 337.95 L
435.679 336.14 L
432.738 334.142 L
429.93 331.963 L
427.263 329.612 L
424.749 327.098 L
422.398 324.432 L
420.219 321.623 L
418.221 318.683 L
416.412 315.623 L
414.798 312.455 L
413.386 309.193 L
412.182 305.848 L
411.19 302.434 L
410.414 298.965 L
409.858 295.454 L
409.524 291.914 L
409.412 288.361 L
409.524 284.808 L
409.858 281.269 L
410.414 277.758 L
411.19 274.288 L
412.182 270.875 L
413.386 267.53 L
414.798 264.267 L
416.412 261.1 L
418.221 258.04 L
420.219 255.1 L
422.398 252.291 L
424.749 249.624 L
427.263 247.11 L
429.93 244.76 L
432.738 242.581 L
435.679 240.583 L
438.739 238.773 L
441.906 237.159 L
445.169 235.747 L
448.513 234.543 L
451.927 233.551 L
455.396 232.776 L
458.908 232.22 L
462.447 231.885 L
466 231.773 L
S
GR
GS
[0.75 0 0 0.75 356.23059 169.09515] CT
N
/f967907560{-5.219 3.418 M
-5.219 2.527 -5.063 1.676 QT
-4.906 0.824 -4.602 -0.004 QT
-4.297 -0.832 -3.875 -1.637 QT
-3.453 -2.441 -2.938 -3.144 QT
-1.484 -5.176 L
-3.313 -5.176 L
-6.156 -5.176 -6.234 -5.098 QT
-6.453 -4.832 -6.641 -3.613 QT
-7.094 -3.613 L
-6.578 -6.973 L
-6.109 -6.973 L
-6.109 -6.926 L
-6.109 -6.644 -5.133 -6.558 QT
-4.156 -6.473 -3.219 -6.473 QT
-0.234 -6.473 L
-0.234 -6.051 L
-0.234 -6.035 -0.242 -6.027 QT
-0.25 -6.019 -0.25 -6.004 QT
-2.453 -2.91 L
-3.266 -1.707 -3.469 -0.238 QT
-3.672 1.231 -3.672 3.418 QT
-3.672 3.731 -3.898 3.965 QT
-4.125 4.199 -4.438 4.199 QT
-4.766 4.199 -4.992 3.965 QT
-5.219 3.731 -5.219 3.418 QT
cp}def
f967907560
f
GR
GS
[0.75 0 0 0.75 356.23059 169.09515] CT
N
f919121033
f
GR
GS
[0.75 0 0 0.75 0 0.5] CT
0.149 GC
[1 3] 0 setdash
2 LJ
0.667 LW
N
466 288.361 M
466 288.361 L
466 288.361 L
466 288.361 L
466 288.361 L
466 288.361 L
466 288.361 L
466 288.361 L
466 288.361 L
466 288.361 L
466 288.361 L
466 288.361 L
466 288.361 L
466 288.361 L
466 288.361 L
466 288.361 L
466 288.361 L
466 288.361 L
466 288.361 L
466 288.361 L
466 288.361 L
466 288.361 L
466 288.361 L
466 288.361 L
466 288.361 L
466 288.361 L
466 288.361 L
466 288.361 L
466 288.361 L
466 288.361 L
466 288.361 L
466 288.361 L
466 288.361 L
466 288.361 L
466 288.361 L
466 288.361 L
466 288.361 L
466 288.361 L
466 288.361 L
466 288.361 L
466 288.361 L
466 288.361 L
466 288.361 L
466 288.361 L
466 288.361 L
466 288.361 L
466 288.361 L
466 288.361 L
466 288.361 L
466 288.361 L
466 288.361 L
466 288.361 L
466 288.361 L
466 288.361 L
466 288.361 L
466 288.361 L
466 288.361 L
466 288.361 L
466 288.361 L
466 288.361 L
466 288.361 L
466 288.361 L
466 288.361 L
466 288.361 L
466 288.361 L
466 288.361 L
466 288.361 L
466 288.361 L
466 288.361 L
466 288.361 L
466 288.361 L
466 288.361 L
466 288.361 L
466 288.361 L
466 288.361 L
466 288.361 L
466 288.361 L
466 288.361 L
466 288.361 L
466 288.361 L
466 288.361 L
466 288.361 L
466 288.361 L
466 288.361 L
466 288.361 L
466 288.361 L
466 288.361 L
466 288.361 L
466 288.361 L
466 288.361 L
466 288.361 L
466 288.361 L
466 288.361 L
466 288.361 L
466 288.361 L
466 288.361 L
466 288.361 L
466 288.361 L
466 288.361 L
466 288.361 L
466 288.361 L
S
GR
GS
[0.75 0 0 0.75 355.48274 204.80547] CT
N
/f-1341065651{-6.188 3.168 M
-5.75 3.684 -4.672 3.684 QT
-4.063 3.684 -3.531 3.27 QT
-3 2.856 -2.719 2.246 QT
-2.375 1.574 -2.281 0.801 QT
-2.188 0.027 -2.188 -1.113 QT
-2.469 -0.457 -2.977 -0.043 QT
-3.484 0.371 -4.156 0.371 QT
-5.078 0.371 -5.813 -0.137 QT
-6.547 -0.644 -6.938 -1.465 QT
-7.328 -2.285 -7.328 -3.223 QT
-7.328 -4.176 -6.891 -5.012 QT
-6.453 -5.848 -5.68 -6.332 QT
-4.906 -6.816 -3.922 -6.816 QT
-2.953 -6.816 -2.297 -6.293 QT
-1.641 -5.769 -1.297 -4.933 QT
-0.953 -4.098 -0.82 -3.168 QT
-0.688 -2.238 -0.688 -1.332 QT
-0.688 -0.098 -1.141 1.184 QT
-1.594 2.465 -2.492 3.332 QT
-3.391 4.199 -4.672 4.199 QT
-5.609 4.199 -6.266 3.746 QT
-6.922 3.293 -6.922 2.402 QT
-6.922 2.074 -6.703 1.848 QT
-6.484 1.621 -6.156 1.621 QT
-5.828 1.621 -5.609 1.848 QT
-5.391 2.074 -5.391 2.402 QT
-5.391 2.715 -5.617 2.942 QT
-5.844 3.168 -6.156 3.168 QT
-6.188 3.168 L
cp
-4.094 -0.051 M
-3.438 -0.051 -3.016 -0.496 QT
-2.594 -0.941 -2.406 -1.598 QT
-2.219 -2.254 -2.219 -2.894 QT
-2.219 -3.207 L
-2.219 -3.269 L
-2.219 -4.473 -2.57 -5.418 QT
-2.922 -6.363 -3.922 -6.363 QT
-4.547 -6.363 -4.945 -6.082 QT
-5.344 -5.801 -5.531 -5.34 QT
-5.719 -4.879 -5.766 -4.355 QT
-5.813 -3.832 -5.813 -3.223 QT
-5.813 -2.316 -5.727 -1.676 QT
-5.641 -1.035 -5.258 -0.543 QT
-4.875 -0.051 -4.094 -0.051 QT
cp}def
f-1341065651
f
GR
GS
[0.75 0 0 0.75 355.48274 204.80547] CT
N
f-1692182862
f
GR
GS
[0.75 0 0 0.75 349.5 243.76102] CT
N
-8 -8 M
-8 8 L
8 8 L
8 -8 L
cp
f
GR
GS
[0.75 0 0 0.75 349.5 243.76102] CT
10.0 ML
1.333 LW
N
-8 -8 M
-8 8 L
8 8 L
8 -8 L
cp
S
GR
GS
[0.75 0 0 0.75 311.4372 337.49069] CT
N
/f-2140490004{-8 -8 M
-8 8 L
8 8 L
8 -8 L
cp}def
f-2140490004
f
GR
GS
[0.75 0 0 0.75 311.4372 337.49069] CT
10.0 ML
1.333 LW
N
-8 -8 M
-8 8 L
8 8 L
8 -8 L
cp
S
GR
GS
[0.75 0 0 0.75 270.76071 329.22231] CT
N
f-2140490004
f
GR
GS
[0.75 0 0 0.75 270.76071 329.22231] CT
10.0 ML
1.333 LW
N
-8 -8 M
-8 8 L
8 8 L
8 -8 L
cp
S
GR
GS
[0.75 0 0 0.75 269.59502 278.08418] CT
N
f-2140490004
f
GR
GS
[0.75 0 0 0.75 269.59502 278.08418] CT
10.0 ML
1.333 LW
N
-8 -8 M
-8 8 L
8 8 L
8 -8 L
cp
S
GR
GS
[0.75 0 0 0.75 242.0536 255.87823] CT
N
f-2140490004
f
GR
GS
[0.75 0 0 0.75 242.0536 255.87823] CT
10.0 ML
1.333 LW
N
-8 -8 M
-8 8 L
8 8 L
8 -8 L
cp
S
GR
GS
[0.75 0 0 0.75 0 0.5] CT
1 GC
N
/f-947588838{453.309 310.859 M
453.309 339.732 L
482.257 339.732 L
482.257 310.859 L
cp}def
f-947588838
f
GR
GS
[0.75 0 0 0.75 0 0.5] CT
0.494 GC
[1 3] 0 setdash
2 LJ
0.667 LW
N
466.034 340.796 M
466.034 293.505 L
S
GR
GS
[0.75 0 0 0.75 514.82451 146.15288] CT
N
/f-1833028947{1.672 20.212 M
1.672 19.822 1.75 19.462 QT
3.703 11.712 L
0.875 11.712 L
0.594 11.712 0.594 11.353 QT
0.703 10.759 0.953 10.759 QT
3.938 10.759 L
5.016 6.353 L
5.125 5.994 5.445 5.744 QT
5.766 5.494 6.156 5.494 QT
6.5 5.494 6.734 5.697 QT
6.969 5.9 6.969 6.244 QT
6.969 6.322 6.961 6.369 QT
6.953 6.416 6.938 6.478 QT
5.859 10.759 L
8.641 10.759 L
8.906 10.759 8.906 11.119 QT
8.906 11.181 8.859 11.337 QT
8.813 11.494 8.75 11.603 QT
8.688 11.712 8.563 11.712 QT
5.609 11.712 L
3.672 19.509 L
3.484 20.275 3.484 20.837 QT
3.484 21.994 4.266 21.994 QT
5.453 21.994 6.375 20.876 QT
7.297 19.759 7.781 18.431 QT
7.891 18.275 7.984 18.275 QT
8.313 18.275 L
8.422 18.275 8.492 18.345 QT
8.563 18.416 8.563 18.509 QT
8.563 18.556 8.531 18.587 QT
7.938 20.228 6.805 21.462 QT
5.672 22.697 4.203 22.697 QT
3.141 22.697 2.406 22.001 QT
1.672 21.306 1.672 20.212 QT
cp}def
f-1833028947
f
GR
GS
[0.75 0 0 0.75 514.82451 146.15288] CT
N
/f2029717348{10.161 23.259 M
10.161 22.603 L
16.036 13.837 L
16.098 13.744 16.223 13.744 QT
16.505 13.744 L
16.723 13.744 16.723 13.962 QT
16.723 22.603 L
18.583 22.603 L
18.583 23.259 L
16.723 23.259 L
16.723 25.134 L
16.723 25.525 17.278 25.626 QT
17.833 25.728 18.567 25.728 QT
18.567 26.4 L
13.333 26.4 L
13.333 25.728 L
14.067 25.728 14.622 25.626 QT
15.177 25.525 15.177 25.134 QT
15.177 23.259 L
10.161 23.259 L
cp
10.786 22.603 M
15.286 22.603 L
15.286 15.869 L
10.786 22.603 L
cp}def
f2029717348
f
GR
GS
[0.75 0 0 0.75 169.53035 257.70914] CT
N
f-1833028947
f
GR
GS
[0.75 0 0 0.75 169.53035 257.70914] CT
N
/f-1028082059{10.583 26.4 M
10.583 25.884 L
10.583 25.837 10.614 25.79 QT
13.567 22.525 L
14.239 21.79 14.653 21.306 QT
15.067 20.822 15.473 20.181 QT
15.88 19.54 16.114 18.876 QT
16.348 18.212 16.348 17.462 QT
16.348 16.681 16.067 15.97 QT
15.786 15.259 15.216 14.837 QT
14.645 14.415 13.833 14.415 QT
13.005 14.415 12.348 14.908 QT
11.692 15.4 11.427 16.197 QT
11.489 16.181 11.63 16.181 QT
12.052 16.181 12.356 16.462 QT
12.661 16.744 12.661 17.212 QT
12.661 17.634 12.356 17.939 QT
12.052 18.244 11.63 18.244 QT
11.177 18.244 10.88 17.931 QT
10.583 17.619 10.583 17.212 QT
10.583 16.494 10.848 15.869 QT
11.114 15.244 11.622 14.751 QT
12.13 14.259 12.762 14.001 QT
13.395 13.744 14.114 13.744 QT
15.192 13.744 16.13 14.205 QT
17.067 14.665 17.614 15.501 QT
18.161 16.337 18.161 17.462 QT
18.161 18.29 17.802 19.033 QT
17.442 19.775 16.88 20.384 QT
16.317 20.994 15.434 21.759 QT
14.552 22.525 14.27 22.79 QT
12.114 24.853 L
13.942 24.853 L
15.286 24.853 16.192 24.83 QT
17.098 24.806 17.161 24.759 QT
17.38 24.525 17.614 23.009 QT
18.161 23.009 L
17.63 26.4 L
10.583 26.4 L
cp}def
f-1028082059
f
GR
GS
[0.75 0 0 0.75 0 0.5] CT
1 0 0 RC
N
/f607608582{257.365 287.558 M
257.402 286.654 L
257.365 285.751 L
257.255 284.854 L
257.073 283.97 L
256.819 283.105 L
256.497 282.266 L
256.107 281.458 L
255.653 280.688 L
255.138 279.961 L
254.566 279.282 L
253.941 278.656 L
253.267 278.088 L
252.55 277.582 L
251.794 277.141 L
251.005 276.768 L
250.188 276.467 L
249.35 276.239 L
248.497 276.086 L
247.634 276.01 L
246.768 276.01 L
245.905 276.086 L
245.052 276.239 L
244.214 276.467 L
243.398 276.768 L
242.608 277.141 L
241.853 277.582 L
241.135 278.088 L
240.461 278.656 L
239.836 279.282 L
239.264 279.961 L
238.749 280.688 L
238.295 281.458 L
237.906 282.266 L
237.583 283.105 L
237.329 283.97 L
237.147 284.854 L
237.037 285.751 L
237 286.654 L
237.037 287.558 L
237.147 288.455 L
237.329 289.339 L
237.583 290.204 L
237.906 291.043 L
238.295 291.851 L
238.749 292.621 L
239.264 293.348 L
239.836 294.027 L
240.461 294.653 L
241.135 295.221 L
241.853 295.727 L
242.608 296.168 L
243.398 296.541 L
244.214 296.842 L
245.052 297.07 L
245.905 297.223 L
246.768 297.299 L
247.634 297.299 L
248.497 297.223 L
249.35 297.07 L
250.188 296.842 L
251.005 296.541 L
251.794 296.168 L
252.55 295.727 L
253.267 295.221 L
253.941 294.653 L
254.566 294.027 L
255.138 293.348 L
255.653 292.621 L
256.107 291.851 L
256.497 291.043 L
256.819 290.204 L
257.073 289.339 L
257.255 288.455 L
cp}def
f607608582
f
GR
GS
[0.75 0 0 0.75 0 0.5] CT
1 0 0 RC
1 LJ
0.667 LW
N
257.402 286.654 M
257.365 285.751 L
257.255 284.854 L
257.073 283.97 L
256.819 283.105 L
256.497 282.266 L
256.107 281.458 L
255.653 280.688 L
255.138 279.961 L
254.566 279.282 L
253.941 278.656 L
253.267 278.088 L
252.55 277.582 L
251.794 277.141 L
251.005 276.768 L
250.188 276.467 L
249.35 276.239 L
248.497 276.086 L
247.634 276.01 L
246.768 276.01 L
245.905 276.086 L
245.052 276.239 L
244.214 276.467 L
243.398 276.768 L
242.608 277.141 L
241.853 277.582 L
241.135 278.088 L
240.461 278.656 L
239.836 279.282 L
239.264 279.961 L
238.749 280.688 L
238.295 281.458 L
237.906 282.266 L
237.583 283.105 L
237.329 283.97 L
237.147 284.854 L
237.037 285.751 L
237 286.654 L
237.037 287.558 L
237.147 288.455 L
237.329 289.339 L
237.583 290.204 L
237.906 291.043 L
238.295 291.851 L
238.749 292.621 L
239.264 293.348 L
239.836 294.027 L
240.461 294.653 L
241.135 295.221 L
241.853 295.727 L
242.608 296.168 L
243.398 296.541 L
244.214 296.842 L
245.052 297.07 L
245.905 297.223 L
246.768 297.299 L
247.634 297.299 L
248.497 297.223 L
249.35 297.07 L
250.188 296.842 L
251.005 296.541 L
251.794 296.168 L
252.55 295.727 L
253.267 295.221 L
253.941 294.653 L
254.566 294.027 L
255.138 293.348 L
255.653 292.621 L
256.107 291.851 L
256.497 291.043 L
256.819 290.204 L
257.073 289.339 L
257.255 288.455 L
257.365 287.558 L
257.402 286.654 L
cp
S
GR
GS
[0.75 0 0 0.75 192.56882 192.98038] CT
N
f-1833028947
f
GR
GS
[0.75 0 0 0.75 192.56882 192.98038] CT
N
/f-2100812036{11.395 26.4 M
11.395 25.728 L
13.77 25.728 13.77 25.134 QT
13.77 15.15 L
12.786 15.634 11.286 15.634 QT
11.286 14.962 L
13.614 14.962 14.802 13.744 QT
15.067 13.744 L
15.13 13.744 15.192 13.798 QT
15.255 13.853 15.255 13.915 QT
15.255 25.134 L
15.255 25.728 17.63 25.728 QT
17.63 26.4 L
11.395 26.4 L
cp}def
f-2100812036
f
GR
GS
[0.75 0 0 0.75 0 0.5] CT
1 0 0 RC
N
/f872769610{282.365 189.558 M
282.402 188.654 L
282.365 187.751 L
282.255 186.854 L
282.073 185.97 L
281.819 185.105 L
281.497 184.266 L
281.107 183.458 L
280.653 182.688 L
280.138 181.961 L
279.566 181.282 L
278.941 180.656 L
278.267 180.088 L
277.55 179.582 L
276.794 179.141 L
276.005 178.768 L
275.188 178.467 L
274.35 178.239 L
273.497 178.086 L
272.634 178.01 L
271.768 178.01 L
270.905 178.086 L
270.052 178.239 L
269.214 178.467 L
268.398 178.768 L
267.609 179.141 L
266.853 179.582 L
266.135 180.088 L
265.461 180.656 L
264.836 181.282 L
264.264 181.961 L
263.749 182.688 L
263.295 183.458 L
262.906 184.266 L
262.583 185.105 L
262.329 185.97 L
262.147 186.854 L
262.037 187.751 L
262 188.654 L
262.037 189.558 L
262.147 190.455 L
262.329 191.339 L
262.583 192.204 L
262.906 193.043 L
263.295 193.851 L
263.749 194.621 L
264.264 195.348 L
264.836 196.027 L
265.461 196.652 L
266.135 197.221 L
266.853 197.727 L
267.609 198.168 L
268.398 198.541 L
269.214 198.842 L
270.052 199.07 L
270.905 199.223 L
271.768 199.299 L
272.634 199.299 L
273.497 199.223 L
274.35 199.07 L
275.188 198.842 L
276.005 198.541 L
276.794 198.168 L
277.55 197.727 L
278.267 197.221 L
278.941 196.652 L
279.566 196.027 L
280.138 195.348 L
280.653 194.621 L
281.107 193.851 L
281.497 193.043 L
281.819 192.204 L
282.073 191.339 L
282.255 190.455 L
cp}def
f872769610
f
GR
GS
[0.75 0 0 0.75 0 0.5] CT
1 0 0 RC
1 LJ
0.667 LW
N
282.402 188.654 M
282.365 187.751 L
282.255 186.854 L
282.073 185.97 L
281.819 185.105 L
281.497 184.266 L
281.107 183.458 L
280.653 182.688 L
280.138 181.961 L
279.566 181.282 L
278.941 180.656 L
278.267 180.088 L
277.55 179.582 L
276.794 179.141 L
276.005 178.768 L
275.188 178.467 L
274.35 178.239 L
273.497 178.086 L
272.634 178.01 L
271.768 178.01 L
270.905 178.086 L
270.052 178.239 L
269.214 178.467 L
268.398 178.768 L
267.609 179.141 L
266.853 179.582 L
266.135 180.088 L
265.461 180.656 L
264.836 181.282 L
264.264 181.961 L
263.749 182.688 L
263.295 183.458 L
262.906 184.266 L
262.583 185.105 L
262.329 185.97 L
262.147 186.854 L
262.037 187.751 L
262 188.654 L
262.037 189.558 L
262.147 190.455 L
262.329 191.339 L
262.583 192.204 L
262.906 193.043 L
263.295 193.851 L
263.749 194.621 L
264.264 195.348 L
264.836 196.027 L
265.461 196.652 L
266.135 197.221 L
266.853 197.727 L
267.609 198.168 L
268.398 198.541 L
269.214 198.842 L
270.052 199.07 L
270.905 199.223 L
271.768 199.299 L
272.634 199.299 L
273.497 199.223 L
274.35 199.07 L
275.188 198.842 L
276.005 198.541 L
276.794 198.168 L
277.55 197.727 L
278.267 197.221 L
278.941 196.652 L
279.566 196.027 L
280.138 195.348 L
280.653 194.621 L
281.107 193.851 L
281.497 193.043 L
281.819 192.204 L
282.073 191.339 L
282.255 190.455 L
282.365 189.558 L
282.402 188.654 L
cp
S
GR
GS
[0.75 0 0 0.75 178.23617 135.24014] CT
N
f-1833028947
f
GR
GS
[0.75 0 0 0.75 178.23617 135.24014] CT
N
/f-855994398{11.442 24.931 M
11.88 25.587 12.63 25.9 QT
13.38 26.212 14.255 26.212 QT
15.348 26.212 15.817 25.275 QT
16.286 24.337 16.286 23.134 QT
16.286 22.603 16.184 22.064 QT
16.083 21.525 15.856 21.056 QT
15.63 20.587 15.223 20.314 QT
14.817 20.04 14.239 20.04 QT
12.973 20.04 L
12.802 20.04 12.802 19.853 QT
12.802 19.697 L
12.802 19.54 12.973 19.54 QT
14.02 19.462 L
14.692 19.462 15.13 18.962 QT
15.567 18.462 15.77 17.744 QT
15.973 17.025 15.973 16.369 QT
15.973 15.462 15.552 14.876 QT
15.13 14.29 14.255 14.29 QT
13.52 14.29 12.864 14.564 QT
12.208 14.837 11.817 15.4 QT
11.864 15.384 11.887 15.384 QT
11.911 15.384 11.942 15.384 QT
12.38 15.384 12.669 15.681 QT
12.958 15.978 12.958 16.384 QT
12.958 16.79 12.669 17.087 QT
12.38 17.384 11.942 17.384 QT
11.536 17.384 11.239 17.087 QT
10.942 16.79 10.942 16.384 QT
10.942 15.572 11.434 14.97 QT
11.927 14.369 12.7 14.056 QT
13.473 13.744 14.255 13.744 QT
14.833 13.744 15.466 13.915 QT
16.098 14.087 16.622 14.408 QT
17.145 14.728 17.473 15.228 QT
17.802 15.728 17.802 16.369 QT
17.802 17.165 17.442 17.845 QT
17.083 18.525 16.466 19.017 QT
15.848 19.509 15.098 19.744 QT
15.927 19.9 16.669 20.369 QT
17.411 20.837 17.864 21.556 QT
18.317 22.275 18.317 23.119 QT
18.317 24.165 17.739 25.017 QT
17.161 25.869 16.223 26.345 QT
15.286 26.822 14.255 26.822 QT
13.364 26.822 12.466 26.478 QT
11.567 26.134 10.997 25.462 QT
10.427 24.79 10.427 23.837 QT
10.427 23.369 10.739 23.048 QT
11.052 22.728 11.536 22.728 QT
11.833 22.728 12.091 22.876 QT
12.348 23.025 12.489 23.283 QT
12.63 23.54 12.63 23.837 QT
12.63 24.306 12.309 24.619 QT
11.989 24.931 11.536 24.931 QT
11.442 24.931 L
cp}def
f-855994398
f
GR
GS
[0.75 0 0 0.75 0 0.5] CT
1 0 0 RC
N
/f878574932{274.365 370.558 M
274.402 369.654 L
274.365 368.751 L
274.255 367.854 L
274.073 366.97 L
273.819 366.105 L
273.497 365.266 L
273.107 364.458 L
272.653 363.688 L
272.138 362.961 L
271.566 362.282 L
270.941 361.656 L
270.267 361.088 L
269.55 360.582 L
268.794 360.141 L
268.005 359.768 L
267.188 359.467 L
266.35 359.239 L
265.497 359.086 L
264.634 359.01 L
263.768 359.01 L
262.905 359.086 L
262.052 359.239 L
261.214 359.467 L
260.398 359.768 L
259.608 360.141 L
258.853 360.582 L
258.135 361.088 L
257.461 361.656 L
256.836 362.282 L
256.264 362.961 L
255.749 363.688 L
255.295 364.458 L
254.906 365.266 L
254.583 366.105 L
254.329 366.97 L
254.147 367.854 L
254.037 368.751 L
254 369.654 L
254.037 370.558 L
254.147 371.455 L
254.329 372.339 L
254.583 373.204 L
254.906 374.043 L
255.295 374.851 L
255.749 375.621 L
256.264 376.348 L
256.836 377.027 L
257.461 377.653 L
258.135 378.221 L
258.853 378.727 L
259.608 379.168 L
260.398 379.541 L
261.214 379.842 L
262.052 380.07 L
262.905 380.223 L
263.768 380.299 L
264.634 380.299 L
265.497 380.223 L
266.35 380.07 L
267.188 379.842 L
268.005 379.541 L
268.794 379.168 L
269.55 378.727 L
270.267 378.221 L
270.941 377.653 L
271.566 377.027 L
272.138 376.348 L
272.653 375.621 L
273.107 374.851 L
273.497 374.043 L
273.819 373.204 L
274.073 372.339 L
274.255 371.455 L
cp}def
f878574932
f
GR
GS
[0.75 0 0 0.75 0 0.5] CT
1 0 0 RC
1 LJ
0.667 LW
N
274.402 369.654 M
274.365 368.751 L
274.255 367.854 L
274.073 366.97 L
273.819 366.105 L
273.497 365.266 L
273.107 364.458 L
272.653 363.688 L
272.138 362.961 L
271.566 362.282 L
270.941 361.656 L
270.267 361.088 L
269.55 360.582 L
268.794 360.141 L
268.005 359.768 L
267.188 359.467 L
266.35 359.239 L
265.497 359.086 L
264.634 359.01 L
263.768 359.01 L
262.905 359.086 L
262.052 359.239 L
261.214 359.467 L
260.398 359.768 L
259.608 360.141 L
258.853 360.582 L
258.135 361.088 L
257.461 361.656 L
256.836 362.282 L
256.264 362.961 L
255.749 363.688 L
255.295 364.458 L
254.906 365.266 L
254.583 366.105 L
254.329 366.97 L
254.147 367.854 L
254.037 368.751 L
254 369.654 L
254.037 370.558 L
254.147 371.455 L
254.329 372.339 L
254.583 373.204 L
254.906 374.043 L
255.295 374.851 L
255.749 375.621 L
256.264 376.348 L
256.836 377.027 L
257.461 377.653 L
258.135 378.221 L
258.853 378.727 L
259.608 379.168 L
260.398 379.541 L
261.214 379.842 L
262.052 380.07 L
262.905 380.223 L
263.768 380.299 L
264.634 380.299 L
265.497 380.223 L
266.35 380.07 L
267.188 379.842 L
268.005 379.541 L
268.794 379.168 L
269.55 378.727 L
270.267 378.221 L
270.941 377.653 L
271.566 377.027 L
272.138 376.348 L
272.653 375.621 L
273.107 374.851 L
273.497 374.043 L
273.819 373.204 L
274.073 372.339 L
274.255 371.455 L
274.365 370.558 L
274.402 369.654 L
cp
S
GR
GS
[0.75 0 0 0.75 0 0.5] CT
1 0 0 RC
N
/f-2052089326{677.365 203.558 M
677.402 202.654 L
677.365 201.751 L
677.255 200.854 L
677.073 199.97 L
676.819 199.105 L
676.497 198.266 L
676.107 197.458 L
675.653 196.688 L
675.138 195.961 L
674.566 195.282 L
673.941 194.656 L
673.267 194.088 L
672.549 193.582 L
671.794 193.141 L
671.005 192.768 L
670.188 192.467 L
669.35 192.239 L
668.497 192.086 L
667.634 192.01 L
666.768 192.01 L
665.905 192.086 L
665.052 192.239 L
664.214 192.467 L
663.398 192.768 L
662.609 193.141 L
661.853 193.582 L
661.135 194.088 L
660.461 194.656 L
659.836 195.282 L
659.264 195.961 L
658.749 196.688 L
658.295 197.458 L
657.906 198.266 L
657.583 199.105 L
657.329 199.97 L
657.147 200.854 L
657.037 201.751 L
657 202.654 L
657.037 203.558 L
657.147 204.455 L
657.329 205.339 L
657.583 206.204 L
657.906 207.043 L
658.295 207.851 L
658.749 208.621 L
659.264 209.348 L
659.836 210.027 L
660.461 210.652 L
661.135 211.221 L
661.853 211.727 L
662.609 212.168 L
663.398 212.541 L
664.214 212.842 L
665.052 213.07 L
665.905 213.223 L
666.768 213.299 L
667.634 213.299 L
668.497 213.223 L
669.35 213.07 L
670.188 212.842 L
671.005 212.541 L
671.794 212.168 L
672.549 211.727 L
673.267 211.221 L
673.941 210.652 L
674.566 210.027 L
675.138 209.348 L
675.653 208.621 L
676.107 207.851 L
676.497 207.043 L
676.819 206.204 L
677.073 205.339 L
677.255 204.455 L
cp}def
f-2052089326
f
GR
GS
[0.75 0 0 0.75 0 0.5] CT
1 0 0 RC
1 LJ
0.667 LW
N
677.402 202.654 M
677.365 201.751 L
677.255 200.854 L
677.073 199.97 L
676.819 199.105 L
676.497 198.266 L
676.107 197.458 L
675.653 196.688 L
675.138 195.961 L
674.566 195.282 L
673.941 194.656 L
673.267 194.088 L
672.549 193.582 L
671.794 193.141 L
671.005 192.768 L
670.188 192.467 L
669.35 192.239 L
668.497 192.086 L
667.634 192.01 L
666.768 192.01 L
665.905 192.086 L
665.052 192.239 L
664.214 192.467 L
663.398 192.768 L
662.609 193.141 L
661.853 193.582 L
661.135 194.088 L
660.461 194.656 L
659.836 195.282 L
659.264 195.961 L
658.749 196.688 L
658.295 197.458 L
657.906 198.266 L
657.583 199.105 L
657.329 199.97 L
657.147 200.854 L
657.037 201.751 L
657 202.654 L
657.037 203.558 L
657.147 204.455 L
657.329 205.339 L
657.583 206.204 L
657.906 207.043 L
658.295 207.851 L
658.749 208.621 L
659.264 209.348 L
659.836 210.027 L
660.461 210.652 L
661.135 211.221 L
661.853 211.727 L
662.609 212.168 L
663.398 212.541 L
664.214 212.842 L
665.052 213.07 L
665.905 213.223 L
666.768 213.299 L
667.634 213.299 L
668.497 213.223 L
669.35 213.07 L
670.188 212.842 L
671.005 212.541 L
671.794 212.168 L
672.549 211.727 L
673.267 211.221 L
673.941 210.652 L
674.566 210.027 L
675.138 209.348 L
675.653 208.621 L
676.107 207.851 L
676.497 207.043 L
676.819 206.204 L
677.073 205.339 L
677.255 204.455 L
677.365 203.558 L
677.402 202.654 L
cp
S
GR
GS
[0.75 0 0 0.75 0 0.5] CT
1 0 0 RC
N
/f1340931427{605.365 464.558 M
605.402 463.654 L
605.365 462.751 L
605.255 461.854 L
605.073 460.97 L
604.819 460.105 L
604.497 459.266 L
604.107 458.458 L
603.653 457.688 L
603.138 456.961 L
602.566 456.282 L
601.941 455.656 L
601.267 455.088 L
600.55 454.582 L
599.794 454.141 L
599.005 453.768 L
598.188 453.467 L
597.35 453.239 L
596.497 453.086 L
595.634 453.01 L
594.768 453.01 L
593.905 453.086 L
593.052 453.239 L
592.214 453.467 L
591.398 453.768 L
590.609 454.141 L
589.853 454.582 L
589.135 455.088 L
588.461 455.656 L
587.836 456.282 L
587.264 456.961 L
586.749 457.688 L
586.295 458.458 L
585.906 459.266 L
585.583 460.105 L
585.329 460.97 L
585.147 461.854 L
585.037 462.751 L
585 463.654 L
585.037 464.558 L
585.147 465.455 L
585.329 466.339 L
585.583 467.204 L
585.906 468.043 L
586.295 468.851 L
586.749 469.621 L
587.264 470.348 L
587.836 471.027 L
588.461 471.652 L
589.135 472.221 L
589.853 472.727 L
590.609 473.168 L
591.398 473.541 L
592.214 473.842 L
593.052 474.07 L
593.905 474.223 L
594.768 474.299 L
595.634 474.299 L
596.497 474.223 L
597.35 474.07 L
598.188 473.842 L
599.005 473.541 L
599.794 473.168 L
600.55 472.727 L
601.267 472.221 L
601.941 471.652 L
602.566 471.027 L
603.138 470.348 L
603.653 469.621 L
604.107 468.851 L
604.497 468.043 L
604.819 467.204 L
605.073 466.339 L
605.255 465.455 L
cp}def
f1340931427
f
GR
GS
[0.75 0 0 0.75 0 0.5] CT
1 0 0 RC
1 LJ
0.667 LW
N
605.402 463.654 M
605.365 462.751 L
605.255 461.854 L
605.073 460.97 L
604.819 460.105 L
604.497 459.266 L
604.107 458.458 L
603.653 457.688 L
603.138 456.961 L
602.566 456.282 L
601.941 455.656 L
601.267 455.088 L
600.55 454.582 L
599.794 454.141 L
599.005 453.768 L
598.188 453.467 L
597.35 453.239 L
596.497 453.086 L
595.634 453.01 L
594.768 453.01 L
593.905 453.086 L
593.052 453.239 L
592.214 453.467 L
591.398 453.768 L
590.609 454.141 L
589.853 454.582 L
589.135 455.088 L
588.461 455.656 L
587.836 456.282 L
587.264 456.961 L
586.749 457.688 L
586.295 458.458 L
585.906 459.266 L
585.583 460.105 L
585.329 460.97 L
585.147 461.854 L
585.037 462.751 L
585 463.654 L
585.037 464.558 L
585.147 465.455 L
585.329 466.339 L
585.583 467.204 L
585.906 468.043 L
586.295 468.851 L
586.749 469.621 L
587.264 470.348 L
587.836 471.027 L
588.461 471.652 L
589.135 472.221 L
589.853 472.727 L
590.609 473.168 L
591.398 473.541 L
592.214 473.842 L
593.052 474.07 L
593.905 474.223 L
594.768 474.299 L
595.634 474.299 L
596.497 474.223 L
597.35 474.07 L
598.188 473.842 L
599.005 473.541 L
599.794 473.168 L
600.55 472.727 L
601.267 472.221 L
601.941 471.652 L
602.566 471.027 L
603.138 470.348 L
603.653 469.621 L
604.107 468.851 L
604.497 468.043 L
604.819 467.204 L
605.073 466.339 L
605.255 465.455 L
605.365 464.558 L
605.402 463.654 L
cp
S
GR
GS
[0.75 0 0 0.75 457.34418 337.88018] CT
N
f-1833028947
f
GR
GS
[0.75 0 0 0.75 457.34418 337.88018] CT
N
/f369414846{11.286 24.244 M
11.473 24.79 11.88 25.244 QT
12.286 25.697 12.833 25.955 QT
13.38 26.212 13.973 26.212 QT
15.348 26.212 15.872 25.15 QT
16.395 24.087 16.395 22.556 QT
16.395 21.9 16.372 21.447 QT
16.348 20.994 16.239 20.587 QT
16.067 19.915 15.63 19.415 QT
15.192 18.915 14.552 18.915 QT
13.911 18.915 13.45 19.111 QT
12.989 19.306 12.7 19.564 QT
12.411 19.822 12.192 20.111 QT
11.973 20.4 11.911 20.415 QT
11.692 20.415 L
11.645 20.415 11.583 20.353 QT
11.52 20.29 11.52 20.244 QT
11.52 13.9 L
11.52 13.853 11.575 13.798 QT
11.63 13.744 11.692 13.744 QT
11.755 13.744 L
13.036 14.353 14.473 14.353 QT
15.88 14.353 17.192 13.744 QT
17.239 13.744 L
17.317 13.744 17.372 13.79 QT
17.427 13.837 17.427 13.9 QT
17.427 14.072 L
17.427 14.165 17.38 14.165 QT
16.739 15.025 15.762 15.509 QT
14.786 15.994 13.723 15.994 QT
12.973 15.994 12.177 15.775 QT
12.177 19.369 L
12.802 18.853 13.302 18.634 QT
13.802 18.415 14.567 18.415 QT
15.614 18.415 16.442 19.025 QT
17.27 19.634 17.716 20.603 QT
18.161 21.572 18.161 22.572 QT
18.161 23.712 17.598 24.689 QT
17.036 25.665 16.075 26.244 QT
15.114 26.822 13.973 26.822 QT
13.052 26.822 12.262 26.337 QT
11.473 25.853 11.028 25.033 QT
10.583 24.212 10.583 23.306 QT
10.583 22.869 10.856 22.603 QT
11.13 22.337 11.552 22.337 QT
11.973 22.337 12.255 22.611 QT
12.536 22.884 12.536 23.306 QT
12.536 23.712 12.255 23.994 QT
11.973 24.275 11.552 24.275 QT
11.489 24.275 11.403 24.259 QT
11.317 24.244 11.286 24.244 QT
cp}def
f369414846
f
GR
%%Trailer
%%Pages: 1
%%EOF
