%!PS-Adobe-3.0 EPSF-3.0
%%Creator: (MATLAB, The Mathworks, Inc. Version 9.5.0.944444 \(R2018b\). Operating System: Windows 10)
%%Title: (C:/Users/Alex/Documents/PhD Docs/01. GIT/my_phd_thesis/Chapter4/Figures/paper/Simu12_ranking_042018.eps)
%%CreationDate: 2019-09-02T14:58:10
%%Pages: (atend)
%%BoundingBox: 0 0 596 502
%%LanguageLevel: 3
%%EndComments
%%BeginProlog
%%BeginResource: procset (Apache XML Graphics Std ProcSet) 1.2 0
%%Version: 1.2 0
%%Copyright: (Copyright 2001-2003,2010 The Apache Software Foundation. License terms: http://www.apache.org/licenses/LICENSE-2.0)
/bd{bind def}bind def
/ld{load def}bd
/GR/grestore ld
/GS/gsave ld
/RM/rmoveto ld
/C/curveto ld
/t/show ld
/L/lineto ld
/ML/setmiterlimit ld
/CT/concat ld
/f/fill ld
/N/newpath ld
/S/stroke ld
/CC/setcmykcolor ld
/A/ashow ld
/cp/closepath ld
/RC/setrgbcolor ld
/LJ/setlinejoin ld
/GC/setgray ld
/LW/setlinewidth ld
/M/moveto ld
/re {4 2 roll M
1 index 0 rlineto
0 exch rlineto
neg 0 rlineto
cp } bd
/_ctm matrix def
/_tm matrix def
/BT { _ctm currentmatrix pop matrix _tm copy pop 0 0 moveto } bd
/ET { _ctm setmatrix } bd
/iTm { _ctm setmatrix _tm concat } bd
/Tm { _tm astore pop iTm 0 0 moveto } bd
/ux 0.0 def
/uy 0.0 def
/F {
  /Tp exch def
  /Tf exch def
  Tf findfont Tp scalefont setfont
  /cf Tf def  /cs Tp def
} bd
/ULS {currentpoint /uy exch def /ux exch def} bd
/ULE {
  /Tcx currentpoint pop def
  gsave
  newpath
  cf findfont cs scalefont dup
  /FontMatrix get 0 get /Ts exch def /FontInfo get dup
  /UnderlinePosition get Ts mul /To exch def
  /UnderlineThickness get Ts mul /Tt exch def
  ux uy To add moveto  Tcx uy To add lineto
  Tt setlinewidth stroke
  grestore
} bd
/OLE {
  /Tcx currentpoint pop def
  gsave
  newpath
  cf findfont cs scalefont dup
  /FontMatrix get 0 get /Ts exch def /FontInfo get dup
  /UnderlinePosition get Ts mul /To exch def
  /UnderlineThickness get Ts mul /Tt exch def
  ux uy To add cs add moveto Tcx uy To add cs add lineto
  Tt setlinewidth stroke
  grestore
} bd
/SOE {
  /Tcx currentpoint pop def
  gsave
  newpath
  cf findfont cs scalefont dup
  /FontMatrix get 0 get /Ts exch def /FontInfo get dup
  /UnderlinePosition get Ts mul /To exch def
  /UnderlineThickness get Ts mul /Tt exch def
  ux uy To add cs 10 mul 26 idiv add moveto Tcx uy To add cs 10 mul 26 idiv add lineto
  Tt setlinewidth stroke
  grestore
} bd
/QT {
/Y22 exch store
/X22 exch store
/Y21 exch store
/X21 exch store
currentpoint
/Y21 load 2 mul add 3 div exch
/X21 load 2 mul add 3 div exch
/X21 load 2 mul /X22 load add 3 div
/Y21 load 2 mul /Y22 load add 3 div
/X22 load /Y22 load curveto
} bd
/SSPD {
dup length /d exch dict def
{
/v exch def
/k exch def
currentpagedevice k known {
/cpdv currentpagedevice k get def
v cpdv ne {
/upd false def
/nullv v type /nulltype eq def
/nullcpdv cpdv type /nulltype eq def
nullv nullcpdv or
{
/upd true def
} {
/sametype v type cpdv type eq def
sametype {
v type /arraytype eq {
/vlen v length def
/cpdvlen cpdv length def
vlen cpdvlen eq {
0 1 vlen 1 sub {
/i exch def
/obj v i get def
/cpdobj cpdv i get def
obj cpdobj ne {
/upd true def
exit
} if
} for
} {
/upd true def
} ifelse
} {
v type /dicttype eq {
v {
/dv exch def
/dk exch def
/cpddv cpdv dk get def
dv cpddv ne {
/upd true def
exit
} if
} forall
} {
/upd true def
} ifelse
} ifelse
} if
} ifelse
upd true eq {
d k v put
} if
} if
} if
} forall
d length 0 gt {
d setpagedevice
} if
} bd
/RE { % /NewFontName [NewEncodingArray] /FontName RE -
  findfont dup length dict begin
  {
    1 index /FID ne
    {def} {pop pop} ifelse
  } forall
  /Encoding exch def
  /FontName 1 index def
  currentdict definefont pop
  end
} bind def
%%EndResource
%%BeginResource: procset (Apache XML Graphics EPS ProcSet) 1.0 0
%%Version: 1.0 0
%%Copyright: (Copyright 2002-2003 The Apache Software Foundation. License terms: http://www.apache.org/licenses/LICENSE-2.0)
/BeginEPSF { %def
/b4_Inc_state save def         % Save state for cleanup
/dict_count countdictstack def % Count objects on dict stack
/op_count count 1 sub def      % Count objects on operand stack
userdict begin                 % Push userdict on dict stack
/showpage { } def              % Redefine showpage, { } = null proc
0 setgray 0 setlinecap         % Prepare graphics state
1 setlinewidth 0 setlinejoin
10 setmiterlimit [ ] 0 setdash newpath
/languagelevel where           % If level not equal to 1 then
{pop languagelevel             % set strokeadjust and
1 ne                           % overprint to their defaults.
{false setstrokeadjust false setoverprint
} if
} if
} bd
/EndEPSF { %def
count op_count sub {pop} repeat            % Clean up stacks
countdictstack dict_count sub {end} repeat
b4_Inc_state restore
} bd
%%EndResource
%FOPBeginFontDict
%%IncludeResource: font Courier-Oblique
%%IncludeResource: font Courier-BoldOblique
%%IncludeResource: font Courier-Bold
%%IncludeResource: font ZapfDingbats
%%IncludeResource: font Symbol
%%IncludeResource: font Helvetica
%%IncludeResource: font Helvetica-Oblique
%%IncludeResource: font Helvetica-Bold
%%IncludeResource: font Helvetica-BoldOblique
%%IncludeResource: font Times-Roman
%%IncludeResource: font Times-Italic
%%IncludeResource: font Times-Bold
%%IncludeResource: font Times-BoldItalic
%%IncludeResource: font Courier
%FOPEndFontDict
%%BeginResource: encoding WinAnsiEncoding
/WinAnsiEncoding [
/.notdef /.notdef /.notdef /.notdef /.notdef
/.notdef /.notdef /.notdef /.notdef /.notdef
/.notdef /.notdef /.notdef /.notdef /.notdef
/.notdef /.notdef /.notdef /.notdef /.notdef
/.notdef /.notdef /.notdef /.notdef /.notdef
/.notdef /.notdef /.notdef /.notdef /.notdef
/.notdef /.notdef /space /exclam /quotedbl
/numbersign /dollar /percent /ampersand /quotesingle
/parenleft /parenright /asterisk /plus /comma
/hyphen /period /slash /zero /one
/two /three /four /five /six
/seven /eight /nine /colon /semicolon
/less /equal /greater /question /at
/A /B /C /D /E
/F /G /H /I /J
/K /L /M /N /O
/P /Q /R /S /T
/U /V /W /X /Y
/Z /bracketleft /backslash /bracketright /asciicircum
/underscore /quoteleft /a /b /c
/d /e /f /g /h
/i /j /k /l /m
/n /o /p /q /r
/s /t /u /v /w
/x /y /z /braceleft /bar
/braceright /asciitilde /bullet /Euro /bullet
/quotesinglbase /florin /quotedblbase /ellipsis /dagger
/daggerdbl /circumflex /perthousand /Scaron /guilsinglleft
/OE /bullet /Zcaron /bullet /bullet
/quoteleft /quoteright /quotedblleft /quotedblright /bullet
/endash /emdash /asciitilde /trademark /scaron
/guilsinglright /oe /bullet /zcaron /Ydieresis
/space /exclamdown /cent /sterling /currency
/yen /brokenbar /section /dieresis /copyright
/ordfeminine /guillemotleft /logicalnot /sfthyphen /registered
/macron /degree /plusminus /twosuperior /threesuperior
/acute /mu /paragraph /middot /cedilla
/onesuperior /ordmasculine /guillemotright /onequarter /onehalf
/threequarters /questiondown /Agrave /Aacute /Acircumflex
/Atilde /Adieresis /Aring /AE /Ccedilla
/Egrave /Eacute /Ecircumflex /Edieresis /Igrave
/Iacute /Icircumflex /Idieresis /Eth /Ntilde
/Ograve /Oacute /Ocircumflex /Otilde /Odieresis
/multiply /Oslash /Ugrave /Uacute /Ucircumflex
/Udieresis /Yacute /Thorn /germandbls /agrave
/aacute /acircumflex /atilde /adieresis /aring
/ae /ccedilla /egrave /eacute /ecircumflex
/edieresis /igrave /iacute /icircumflex /idieresis
/eth /ntilde /ograve /oacute /ocircumflex
/otilde /odieresis /divide /oslash /ugrave
/uacute /ucircumflex /udieresis /yacute /thorn
/ydieresis
] def
%%EndResource
%FOPBeginFontReencode
/Courier-Oblique findfont
dup length dict begin
  {1 index /FID ne {def} {pop pop} ifelse} forall
  /Encoding WinAnsiEncoding def
  currentdict
end
/Courier-Oblique exch definefont pop
/Courier-BoldOblique findfont
dup length dict begin
  {1 index /FID ne {def} {pop pop} ifelse} forall
  /Encoding WinAnsiEncoding def
  currentdict
end
/Courier-BoldOblique exch definefont pop
/Courier-Bold findfont
dup length dict begin
  {1 index /FID ne {def} {pop pop} ifelse} forall
  /Encoding WinAnsiEncoding def
  currentdict
end
/Courier-Bold exch definefont pop
/Helvetica findfont
dup length dict begin
  {1 index /FID ne {def} {pop pop} ifelse} forall
  /Encoding WinAnsiEncoding def
  currentdict
end
/Helvetica exch definefont pop
/Helvetica-Oblique findfont
dup length dict begin
  {1 index /FID ne {def} {pop pop} ifelse} forall
  /Encoding WinAnsiEncoding def
  currentdict
end
/Helvetica-Oblique exch definefont pop
/Helvetica-Bold findfont
dup length dict begin
  {1 index /FID ne {def} {pop pop} ifelse} forall
  /Encoding WinAnsiEncoding def
  currentdict
end
/Helvetica-Bold exch definefont pop
/Helvetica-BoldOblique findfont
dup length dict begin
  {1 index /FID ne {def} {pop pop} ifelse} forall
  /Encoding WinAnsiEncoding def
  currentdict
end
/Helvetica-BoldOblique exch definefont pop
/Times-Roman findfont
dup length dict begin
  {1 index /FID ne {def} {pop pop} ifelse} forall
  /Encoding WinAnsiEncoding def
  currentdict
end
/Times-Roman exch definefont pop
/Times-Italic findfont
dup length dict begin
  {1 index /FID ne {def} {pop pop} ifelse} forall
  /Encoding WinAnsiEncoding def
  currentdict
end
/Times-Italic exch definefont pop
/Times-Bold findfont
dup length dict begin
  {1 index /FID ne {def} {pop pop} ifelse} forall
  /Encoding WinAnsiEncoding def
  currentdict
end
/Times-Bold exch definefont pop
/Times-BoldItalic findfont
dup length dict begin
  {1 index /FID ne {def} {pop pop} ifelse} forall
  /Encoding WinAnsiEncoding def
  currentdict
end
/Times-BoldItalic exch definefont pop
/Courier findfont
dup length dict begin
  {1 index /FID ne {def} {pop pop} ifelse} forall
  /Encoding WinAnsiEncoding def
  currentdict
end
/Courier exch definefont pop
%FOPEndFontReencode
%%EndProlog
%%Page: 1 1
%%PageBoundingBox: 0 0 596 502
%%BeginPageSetup
[1 0 0 -1 0 502] CT
%%EndPageSetup
GS
[0.75 0 0 0.75 0 0.25] CT
N
0 0 M
795 0 L
795 669 L
0 669 L
0 0 L
cp
clip
1 GC
N
0 0 795 669 re
f
GR
GS
[0.75 0 0 0.75 0 0.25] CT
1 GC
N
0 0 795 669 re
f
GR
GS
[0.75 0 0 0.75 0 0.25] CT
1 GC
N
103 595 M
719 595 L
719 50 L
103 50 L
cp
f
GR
GS
[0.75 0 0 0.75 0 0.25] CT
0.873 GC
1 LJ
0.667 LW
N
719 595 M
103 595 L
S
GR
GS
[0.75 0 0 0.75 0 0.25] CT
0.873 GC
1 LJ
0.667 LW
N
719 504.167 M
103 504.167 L
S
GR
GS
[0.75 0 0 0.75 0 0.25] CT
0.873 GC
1 LJ
0.667 LW
N
719 413.333 M
103 413.333 L
S
GR
GS
[0.75 0 0 0.75 0 0.25] CT
0.873 GC
1 LJ
0.667 LW
N
719 322.5 M
103 322.5 L
S
GR
GS
[0.75 0 0 0.75 0 0.25] CT
0.873 GC
1 LJ
0.667 LW
N
719 231.667 M
103 231.667 L
S
GR
GS
[0.75 0 0 0.75 0 0.25] CT
0.873 GC
1 LJ
0.667 LW
N
719 140.833 M
103 140.833 L
S
GR
GS
[0.75 0 0 0.75 0 0.25] CT
0.873 GC
1 LJ
0.667 LW
N
719 50 M
103 50 L
S
GR
GS
[0.75 0 0 0.75 0 0.25] CT
0.149 GC
2 setlinecap
1 LJ
0.667 LW
N
103 595 M
719 595 L
S
GR
GS
[0.75 0 0 0.75 0 0.25] CT
0.149 GC
2 setlinecap
1 LJ
0.667 LW
N
103 50 M
719 50 L
S
GR
GS
[0.75 0 0 0.75 0 0.25] CT
0.149 GC
2 setlinecap
1 LJ
0.667 LW
N
103 595 M
103 588.84 L
S
GR
GS
[0.75 0 0 0.75 0 0.25] CT
0.149 GC
2 setlinecap
1 LJ
0.667 LW
N
164.6 595 M
164.6 588.84 L
S
GR
GS
[0.75 0 0 0.75 0 0.25] CT
0.149 GC
2 setlinecap
1 LJ
0.667 LW
N
226.2 595 M
226.2 588.84 L
S
GR
GS
[0.75 0 0 0.75 0 0.25] CT
0.149 GC
2 setlinecap
1 LJ
0.667 LW
N
287.8 595 M
287.8 588.84 L
S
GR
GS
[0.75 0 0 0.75 0 0.25] CT
0.149 GC
2 setlinecap
1 LJ
0.667 LW
N
349.4 595 M
349.4 588.84 L
S
GR
GS
[0.75 0 0 0.75 0 0.25] CT
0.149 GC
2 setlinecap
1 LJ
0.667 LW
N
411 595 M
411 588.84 L
S
GR
GS
[0.75 0 0 0.75 0 0.25] CT
0.149 GC
2 setlinecap
1 LJ
0.667 LW
N
472.6 595 M
472.6 588.84 L
S
GR
GS
[0.75 0 0 0.75 0 0.25] CT
0.149 GC
2 setlinecap
1 LJ
0.667 LW
N
534.2 595 M
534.2 588.84 L
S
GR
GS
[0.75 0 0 0.75 0 0.25] CT
0.149 GC
2 setlinecap
1 LJ
0.667 LW
N
595.8 595 M
595.8 588.84 L
S
GR
GS
[0.75 0 0 0.75 0 0.25] CT
0.149 GC
2 setlinecap
1 LJ
0.667 LW
N
657.4 595 M
657.4 588.84 L
S
GR
GS
[0.75 0 0 0.75 0 0.25] CT
0.149 GC
2 setlinecap
1 LJ
0.667 LW
N
719 595 M
719 588.84 L
S
GR
GS
[0.75 0 0 0.75 0 0.25] CT
0.149 GC
2 setlinecap
1 LJ
0.667 LW
N
103 50 M
103 56.16 L
S
GR
GS
[0.75 0 0 0.75 0 0.25] CT
0.149 GC
2 setlinecap
1 LJ
0.667 LW
N
164.6 50 M
164.6 56.16 L
S
GR
GS
[0.75 0 0 0.75 0 0.25] CT
0.149 GC
2 setlinecap
1 LJ
0.667 LW
N
226.2 50 M
226.2 56.16 L
S
GR
GS
[0.75 0 0 0.75 0 0.25] CT
0.149 GC
2 setlinecap
1 LJ
0.667 LW
N
287.8 50 M
287.8 56.16 L
S
GR
GS
[0.75 0 0 0.75 0 0.25] CT
0.149 GC
2 setlinecap
1 LJ
0.667 LW
N
349.4 50 M
349.4 56.16 L
S
GR
GS
[0.75 0 0 0.75 0 0.25] CT
0.149 GC
2 setlinecap
1 LJ
0.667 LW
N
411 50 M
411 56.16 L
S
GR
GS
[0.75 0 0 0.75 0 0.25] CT
0.149 GC
2 setlinecap
1 LJ
0.667 LW
N
472.6 50 M
472.6 56.16 L
S
GR
GS
[0.75 0 0 0.75 0 0.25] CT
0.149 GC
2 setlinecap
1 LJ
0.667 LW
N
534.2 50 M
534.2 56.16 L
S
GR
GS
[0.75 0 0 0.75 0 0.25] CT
0.149 GC
2 setlinecap
1 LJ
0.667 LW
N
595.8 50 M
595.8 56.16 L
S
GR
GS
[0.75 0 0 0.75 0 0.25] CT
0.149 GC
2 setlinecap
1 LJ
0.667 LW
N
657.4 50 M
657.4 56.16 L
S
GR
GS
[0.75 0 0 0.75 0 0.25] CT
0.149 GC
2 setlinecap
1 LJ
0.667 LW
N
719 50 M
719 56.16 L
S
GR
GS
[0.75 0 0 0.75 123.45 452.10001] CT
0.149 GC
/Helvetica 24 F
GS
[1 0 0 1 0 0] CT
-7 25 moveto 
1 -1 scale
(2) t 
GR
GR
GS
[0.75 0 0 0.75 169.65 452.10001] CT
0.149 GC
/Helvetica 24 F
GS
[1 0 0 1 0 0] CT
-13.5 25 moveto 
1 -1 scale
(26) t 
GR
GR
GS
[0.75 0 0 0.75 215.84999 452.10001] CT
0.149 GC
/Helvetica 24 F
GS
[1 0 0 1 0 0] CT
-7 25 moveto 
1 -1 scale
(1) t 
GR
GR
GS
[0.75 0 0 0.75 262.05 452.10001] CT
0.149 GC
/Helvetica 24 F
GS
[1 0 0 1 0 0] CT
-13.5 25 moveto 
1 -1 scale
(22) t 
GR
GR
GS
[0.75 0 0 0.75 308.25 452.10001] CT
0.149 GC
/Helvetica 24 F
GS
[1 0 0 1 0 0] CT
-13.5 25 moveto 
1 -1 scale
(18) t 
GR
GR
GS
[0.75 0 0 0.75 354.45 452.10001] CT
0.149 GC
/Helvetica 24 F
GS
[1 0 0 1 0 0] CT
-13.5 25 moveto 
1 -1 scale
(17) t 
GR
GR
GS
[0.75 0 0 0.75 400.65001 452.10001] CT
0.149 GC
/Helvetica 24 F
GS
[1 0 0 1 0 0] CT
-13.5 25 moveto 
1 -1 scale
(30) t 
GR
GR
GS
[0.75 0 0 0.75 446.84999 452.10001] CT
0.149 GC
/Helvetica 24 F
GS
[1 0 0 1 0 0] CT
-7 25 moveto 
1 -1 scale
(6) t 
GR
GR
GS
[0.75 0 0 0.75 493.05002 452.10001] CT
0.149 GC
/Helvetica 24 F
GS
[1 0 0 1 0 0] CT
-13.5 25 moveto 
1 -1 scale
(21) t 
GR
GR
GS
[0.75 0 0 0.75 308.25023 476.34999] CT
0.149 GC
N
-27.741 22.176 M
-27.741 21.254 L
-25.053 21.254 -25.053 20.442 QT
-25.053 6.16 L
-25.053 5.332 -27.741 5.332 QT
-27.741 4.41 L
-18.475 4.41 L
-17.053 4.41 -15.631 4.996 QT
-14.209 5.582 -13.295 6.699 QT
-12.381 7.817 -12.381 9.301 QT
-12.381 10.754 -13.303 11.84 QT
-14.225 12.926 -15.639 13.496 QT
-17.053 14.067 -18.475 14.067 QT
-22.647 14.067 L
-22.647 20.442 L
-22.647 21.254 -19.959 21.254 QT
-19.959 22.176 L
-27.741 22.176 L
cp
-22.725 13.285 M
-19.194 13.285 L
-17.756 13.285 -16.866 12.871 QT
-15.975 12.457 -15.569 11.59 QT
-15.163 10.723 -15.163 9.301 QT
-15.163 7.176 -16.092 6.254 QT
-17.022 5.332 -19.194 5.332 QT
-21.397 5.332 L
-21.866 5.332 -22.131 5.371 QT
-22.397 5.41 -22.561 5.59 QT
-22.725 5.77 -22.725 6.16 QT
-22.725 13.285 L
cp
f
GR
GS
[0.75 0 0 0.75 308.25023 476.34999] CT
0.149 GC
N
-9.774 22.176 M
-9.774 21.254 L
-7.086 21.254 -7.086 20.442 QT
-7.086 6.16 L
-7.086 5.332 -9.774 5.332 QT
-9.774 4.41 L
-1.602 4.41 L
-0.149 4.41 1.46 4.942 QT
3.07 5.473 4.148 6.551 QT
5.226 7.629 5.226 9.129 QT
5.226 10.223 4.57 11.074 QT
3.914 11.926 2.89 12.504 QT
1.867 13.082 0.804 13.332 QT
1.976 13.738 2.851 14.629 QT
3.726 15.52 3.898 16.66 QT
4.273 18.973 L
4.523 20.535 4.804 21.301 QT
5.085 22.067 6.039 22.067 QT
6.851 22.067 7.249 21.317 QT
7.648 20.567 7.648 19.676 QT
7.648 19.582 7.734 19.512 QT
7.82 19.442 7.898 19.442 QT
8.148 19.442 L
8.398 19.442 8.398 19.785 QT
8.398 20.504 8.117 21.184 QT
7.835 21.863 7.312 22.309 QT
6.789 22.754 6.054 22.754 QT
4.179 22.754 2.828 21.817 QT
1.476 20.879 1.476 19.082 QT
1.476 16.77 L
1.476 15.473 0.578 14.543 QT
-0.321 13.613 -1.633 13.613 QT
-4.758 13.613 L
-4.758 20.442 L
-4.758 21.254 -2.071 21.254 QT
-2.071 22.176 L
-9.774 22.176 L
cp
-4.758 12.942 M
-1.977 12.942 L
0.179 12.942 1.312 12.074 QT
2.445 11.207 2.445 9.129 QT
2.445 7.051 1.328 6.192 QT
0.21 5.332 -1.977 5.332 QT
-3.43 5.332 L
-3.899 5.332 -4.165 5.371 QT
-4.43 5.41 -4.594 5.59 QT
-4.758 5.77 -4.758 6.16 QT
-4.758 12.942 L
cp
f
GR
GS
[0.75 0 0 0.75 308.25023 476.34999] CT
0.149 GC
N
9.597 22.176 M
9.597 21.254 L
12.284 21.254 12.284 19.723 QT
12.284 5.488 L
11.425 5.332 9.597 5.332 QT
9.597 4.41 L
14.581 4.41 L
14.706 4.41 14.753 4.52 QT
23.956 18.067 L
23.956 6.863 L
23.956 5.332 21.284 5.332 QT
21.284 4.41 L
27.456 4.41 L
27.456 5.332 L
24.8 5.332 24.8 6.863 QT
24.8 21.942 L
24.8 22.02 24.698 22.098 QT
24.597 22.176 24.534 22.176 QT
24.206 22.176 L
24.081 22.176 24.034 22.067 QT
13.113 6.004 L
13.113 19.723 L
13.113 21.254 15.8 21.254 QT
15.8 22.176 L
9.597 22.176 L
cp
f
GR
GS
[0.75 0 0 0.75 0 0.25] CT
0.149 GC
2 setlinecap
1 LJ
0.667 LW
N
103 595 M
103 50 L
S
GR
GS
[0.75 0 0 0.75 0 0.25] CT
0.149 GC
2 setlinecap
1 LJ
0.667 LW
N
719 595 M
719 50 L
S
GR
GS
[0.75 0 0 0.75 0 0.25] CT
0.149 GC
2 setlinecap
1 LJ
0.667 LW
N
103 595 M
109.16 595 L
S
GR
GS
[0.75 0 0 0.75 0 0.25] CT
0.149 GC
2 setlinecap
1 LJ
0.667 LW
N
103 504.167 M
109.16 504.167 L
S
GR
GS
[0.75 0 0 0.75 0 0.25] CT
0.149 GC
2 setlinecap
1 LJ
0.667 LW
N
103 413.333 M
109.16 413.333 L
S
GR
GS
[0.75 0 0 0.75 0 0.25] CT
0.149 GC
2 setlinecap
1 LJ
0.667 LW
N
103 322.5 M
109.16 322.5 L
S
GR
GS
[0.75 0 0 0.75 0 0.25] CT
0.149 GC
2 setlinecap
1 LJ
0.667 LW
N
103 231.667 M
109.16 231.667 L
S
GR
GS
[0.75 0 0 0.75 0 0.25] CT
0.149 GC
2 setlinecap
1 LJ
0.667 LW
N
103 140.833 M
109.16 140.833 L
S
GR
GS
[0.75 0 0 0.75 0 0.25] CT
0.149 GC
2 setlinecap
1 LJ
0.667 LW
N
103 50 M
109.16 50 L
S
GR
GS
[0.75 0 0 0.75 0 0.25] CT
0.149 GC
2 setlinecap
1 LJ
0.667 LW
N
719 595 M
712.84 595 L
S
GR
GS
[0.75 0 0 0.75 0 0.25] CT
0.149 GC
2 setlinecap
1 LJ
0.667 LW
N
719 504.167 M
712.84 504.167 L
S
GR
GS
[0.75 0 0 0.75 0 0.25] CT
0.149 GC
2 setlinecap
1 LJ
0.667 LW
N
719 413.333 M
712.84 413.333 L
S
GR
GS
[0.75 0 0 0.75 0 0.25] CT
0.149 GC
2 setlinecap
1 LJ
0.667 LW
N
719 322.5 M
712.84 322.5 L
S
GR
GS
[0.75 0 0 0.75 0 0.25] CT
0.149 GC
2 setlinecap
1 LJ
0.667 LW
N
719 231.667 M
712.84 231.667 L
S
GR
GS
[0.75 0 0 0.75 0 0.25] CT
0.149 GC
2 setlinecap
1 LJ
0.667 LW
N
719 140.833 M
712.84 140.833 L
S
GR
GS
[0.75 0 0 0.75 0 0.25] CT
0.149 GC
2 setlinecap
1 LJ
0.667 LW
N
719 50 M
712.84 50 L
S
GR
GS
[0.75 0 0 0.75 71.65 446.5] CT
0.149 GC
/Helvetica 24 F
GS
[1 0 0 1 0 0] CT
-14 9.5 moveto 
1 -1 scale
(0) t 
GR
GR
GS
[0.75 0 0 0.75 71.65 378.37499] CT
0.149 GC
/Helvetica 24 F
GS
[1 0 0 1 0 0] CT
-34 9.5 moveto 
1 -1 scale
(0.5) t 
GR
GR
GS
[0.75 0 0 0.75 71.65 310.25001] CT
0.149 GC
/Helvetica 24 F
GS
[1 0 0 1 0 0] CT
-14 9.5 moveto 
1 -1 scale
(1) t 
GR
GR
GS
[0.75 0 0 0.75 71.65 242.125] CT
0.149 GC
/Helvetica 24 F
GS
[1 0 0 1 0 0] CT
-34 9.5 moveto 
1 -1 scale
(1.5) t 
GR
GR
GS
[0.75 0 0 0.75 71.65 174] CT
0.149 GC
/Helvetica 24 F
GS
[1 0 0 1 0 0] CT
-14 9.5 moveto 
1 -1 scale
(2) t 
GR
GR
GS
[0.75 0 0 0.75 71.65 105.875] CT
0.149 GC
/Helvetica 24 F
GS
[1 0 0 1 0 0] CT
-34 9.5 moveto 
1 -1 scale
(2.5) t 
GR
GR
GS
[0.75 0 0 0.75 71.65 37.75] CT
0.149 GC
/Helvetica 24 F
GS
[1 0 0 1 0 0] CT
-14 9.5 moveto 
1 -1 scale
(3) t 
GR
GR
GS
[0 -0.75 0.75 0 43.15 242.12479] CT
0.149 GC
N
-33.819 -9.207 M
-34.976 -9.207 -35.866 -9.762 QT
-36.757 -10.317 -37.249 -11.254 QT
-37.741 -12.192 -37.741 -13.332 QT
-37.741 -14.535 -37.194 -15.863 QT
-36.647 -17.192 -35.702 -18.301 QT
-34.757 -19.41 -33.561 -20.059 QT
-32.366 -20.707 -31.116 -20.707 QT
-24.554 -20.707 L
-24.288 -20.707 -24.101 -20.535 QT
-23.913 -20.363 -23.913 -20.051 QT
-23.913 -19.676 -24.186 -19.387 QT
-24.46 -19.098 -24.835 -19.098 QT
-28.007 -19.098 L
-27.272 -17.988 -27.272 -16.395 QT
-27.272 -15.098 -27.78 -13.824 QT
-28.288 -12.551 -29.186 -11.504 QT
-30.085 -10.457 -31.28 -9.832 QT
-32.476 -9.207 -33.819 -9.207 QT
cp
-33.788 -9.895 M
-32.366 -9.895 -31.272 -11.004 QT
-30.179 -12.113 -29.593 -13.723 QT
-29.007 -15.332 -29.007 -16.707 QT
-29.007 -17.817 -29.624 -18.457 QT
-30.241 -19.098 -31.335 -19.098 QT
-32.851 -19.098 -33.913 -18.082 QT
-34.976 -17.067 -35.499 -15.535 QT
-36.022 -14.004 -36.022 -12.582 QT
-36.022 -11.457 -35.436 -10.676 QT
-34.851 -9.895 -33.788 -9.895 QT
cp
f
GR
GS
[0 -0.75 0.75 0 43.15 242.12479] CT
0.149 GC
N
-17.902 -15.452 M
-18.246 -15.827 L
-15.824 -18.248 L
-13.418 -15.827 L
-13.777 -15.452 L
-15.824 -17.248 L
-17.902 -15.452 L
cp
f
GR
GS
[0 -0.75 0.75 0 43.15 242.12479] CT
0.149 GC
N
-20.468 -0.684 M
-21.593 -0.684 -22.25 -1.544 QT
-22.906 -2.403 -22.906 -3.575 QT
-22.906 -4.716 -22.312 -5.958 QT
-21.718 -7.2 -20.703 -8.02 QT
-19.687 -8.841 -18.515 -8.841 QT
-17.984 -8.841 -17.562 -8.544 QT
-17.14 -8.247 -16.89 -7.762 QT
-15.89 -11.778 L
-15.812 -12.091 -15.796 -12.262 QT
-15.796 -12.544 -16.968 -12.544 QT
-17.156 -12.544 -17.156 -12.794 QT
-17.14 -12.825 -17.109 -12.942 QT
-17.078 -13.059 -17.031 -13.122 QT
-16.984 -13.184 -16.89 -13.184 QT
-14.468 -13.372 L
-14.25 -13.372 -14.25 -13.153 QT
-16.843 -2.794 L
-16.968 -2.497 -16.968 -1.934 QT
-16.968 -1.153 -16.453 -1.153 QT
-15.89 -1.153 -15.593 -1.872 QT
-15.296 -2.591 -15.093 -3.528 QT
-15.062 -3.637 -14.953 -3.637 QT
-14.734 -3.637 L
-14.656 -3.637 -14.617 -3.575 QT
-14.578 -3.512 -14.578 -3.466 QT
-14.89 -2.2 -15.265 -1.442 QT
-15.64 -0.684 -16.484 -0.684 QT
-17.093 -0.684 -17.554 -1.044 QT
-18.015 -1.403 -18.14 -1.981 QT
-19.296 -0.684 -20.468 -0.684 QT
cp
-20.453 -1.153 M
-19.796 -1.153 -19.187 -1.645 QT
-18.578 -2.137 -18.14 -2.794 QT
-18.125 -2.809 -18.125 -2.872 QT
-17.14 -6.825 L
-17.234 -7.466 -17.593 -7.919 QT
-17.953 -8.372 -18.562 -8.372 QT
-19.156 -8.372 -19.679 -7.88 QT
-20.203 -7.387 -20.562 -6.7 QT
-20.921 -5.981 -21.242 -4.723 QT
-21.562 -3.466 -21.562 -2.778 QT
-21.562 -2.153 -21.296 -1.653 QT
-21.031 -1.153 -20.453 -1.153 QT
cp
f
GR
GS
[0 -0.75 0.75 0 43.15 242.12479] CT
0.149 GC
N
4.208 -3.051 M
2.755 -4.192 1.708 -5.676 QT
0.661 -7.16 -0.003 -8.832 QT
-0.667 -10.504 -0.995 -12.332 QT
-1.324 -14.16 -1.324 -16.004 QT
-1.324 -17.863 -0.995 -19.692 QT
-0.667 -21.52 0.012 -23.215 QT
0.692 -24.91 1.747 -26.379 QT
2.801 -27.848 4.208 -28.957 QT
4.208 -29.004 4.333 -29.004 QT
4.583 -29.004 L
4.645 -29.004 4.716 -28.934 QT
4.786 -28.863 4.786 -28.77 QT
4.786 -28.66 4.723 -28.613 QT
3.458 -27.363 2.614 -25.942 QT
1.77 -24.52 1.255 -22.918 QT
0.739 -21.317 0.512 -19.59 QT
0.286 -17.863 0.286 -16.004 QT
0.286 -7.738 4.708 -3.442 QT
4.786 -3.379 4.786 -3.238 QT
4.786 -3.176 4.716 -3.09 QT
4.645 -3.004 4.583 -3.004 QT
4.333 -3.004 L
4.208 -3.004 4.208 -3.051 QT
cp
f
GR
GS
[0 -0.75 0.75 0 43.15 242.12479] CT
0.149 GC
N
7.193 -9.504 M
7.193 -10.426 L
8.068 -10.426 8.646 -10.559 QT
9.224 -10.692 9.224 -11.238 QT
9.224 -18.348 L
9.224 -19.035 9.013 -19.348 QT
8.803 -19.66 8.404 -19.731 QT
8.006 -19.801 7.193 -19.801 QT
7.193 -20.707 L
10.959 -20.988 L
10.959 -18.457 L
11.474 -19.567 12.498 -20.278 QT
13.521 -20.988 14.724 -20.988 QT
17.724 -20.988 18.24 -18.551 QT
18.771 -19.645 19.771 -20.317 QT
20.771 -20.988 21.959 -20.988 QT
23.146 -20.988 23.951 -20.613 QT
24.756 -20.238 25.162 -19.457 QT
25.568 -18.676 25.568 -17.488 QT
25.568 -11.238 L
25.568 -10.692 26.146 -10.559 QT
26.724 -10.426 27.599 -10.426 QT
27.599 -9.504 L
21.646 -9.504 L
21.646 -10.426 L
22.537 -10.426 23.107 -10.559 QT
23.678 -10.692 23.678 -11.238 QT
23.678 -17.41 L
23.678 -18.723 23.31 -19.52 QT
22.943 -20.317 21.803 -20.317 QT
20.303 -20.317 19.326 -19.113 QT
18.349 -17.91 18.349 -16.379 QT
18.349 -11.238 L
18.349 -10.692 18.92 -10.559 QT
19.49 -10.426 20.381 -10.426 QT
20.381 -9.504 L
14.428 -9.504 L
14.428 -10.426 L
15.318 -10.426 15.888 -10.559 QT
16.459 -10.692 16.459 -11.238 QT
16.459 -17.41 L
16.459 -18.676 16.092 -19.496 QT
15.724 -20.317 14.568 -20.317 QT
13.068 -20.317 12.092 -19.113 QT
11.115 -17.91 11.115 -16.379 QT
11.115 -11.238 L
11.115 -10.692 11.693 -10.559 QT
12.271 -10.426 13.146 -10.426 QT
13.146 -9.504 L
7.193 -9.504 L
cp
f
GR
GS
[0 -0.75 0.75 0 43.15 242.12479] CT
0.149 GC
N
30.099 -3.004 M
29.865 -3.004 29.865 -3.238 QT
29.865 -3.348 29.928 -3.395 QT
34.365 -7.738 34.365 -16.004 QT
34.365 -24.27 29.974 -28.567 QT
29.865 -28.629 29.865 -28.77 QT
29.865 -28.863 29.935 -28.934 QT
30.006 -29.004 30.099 -29.004 QT
30.349 -29.004 L
30.412 -29.004 30.474 -28.957 QT
32.334 -27.488 33.576 -25.379 QT
34.818 -23.27 35.396 -20.879 QT
35.974 -18.488 35.974 -16.004 QT
35.974 -14.16 35.662 -12.379 QT
35.349 -10.598 34.678 -8.863 QT
34.006 -7.129 32.959 -5.66 QT
31.912 -4.192 30.474 -3.051 QT
30.412 -3.004 30.349 -3.004 QT
30.099 -3.004 L
cp
f
GR
GS
[0.75 0 0 0.75 0 0.25] CT
0.149 GC
1 LJ
0.667 LW
N
103 595 M
719 595 L
S
GR
GS
[0.75 0 0 0.75 123.45 363.589] CT
N
5.867 0 M
5.867 -3.24 3.24 -5.867 0 -5.867 C
-3.24 -5.867 -5.867 -3.24 -5.867 0 C
-5.867 3.24 -3.24 5.867 0 5.867 C
3.24 5.867 5.867 3.24 5.867 0 C
cp
f
GR
GS
[0.75 0 0 0.75 123.45 363.589] CT
10.0 ML
1.333 LW
N
5.867 0 M
5.867 -3.24 3.24 -5.867 0 -5.867 C
-3.24 -5.867 -5.867 -3.24 -5.867 0 C
-5.867 3.24 -3.24 5.867 0 5.867 C
3.24 5.867 5.867 3.24 5.867 0 C
cp
S
GR
GS
[0.75 0 0 0.75 169.65 334.27443] CT
N
/f-819729944{5.867 0 M
5.867 -3.24 3.24 -5.867 0 -5.867 C
-3.24 -5.867 -5.867 -3.24 -5.867 0 C
-5.867 3.24 -3.24 5.867 0 5.867 C
3.24 5.867 5.867 3.24 5.867 0 C
cp}def
f-819729944
f
GR
GS
[0.75 0 0 0.75 169.65 334.27443] CT
10.0 ML
1.333 LW
N
5.867 0 M
5.867 -3.24 3.24 -5.867 0 -5.867 C
-3.24 -5.867 -5.867 -3.24 -5.867 0 C
-5.867 3.24 -3.24 5.867 0 5.867 C
3.24 5.867 5.867 3.24 5.867 0 C
cp
S
GR
GS
[0.75 0 0 0.75 215.84999 326.45972] CT
N
f-819729944
f
GR
GS
[0.75 0 0 0.75 215.84999 326.45972] CT
10.0 ML
1.333 LW
N
5.867 0 M
5.867 -3.24 3.24 -5.867 0 -5.867 C
-3.24 -5.867 -5.867 -3.24 -5.867 0 C
-5.867 3.24 -3.24 5.867 0 5.867 C
3.24 5.867 5.867 3.24 5.867 0 C
cp
S
GR
GS
[0.75 0 0 0.75 262.05 312.23876] CT
N
f-819729944
f
GR
GS
[0.75 0 0 0.75 262.05 312.23876] CT
10.0 ML
1.333 LW
N
5.867 0 M
5.867 -3.24 3.24 -5.867 0 -5.867 C
-3.24 -5.867 -5.867 -3.24 -5.867 0 C
-5.867 3.24 -3.24 5.867 0 5.867 C
3.24 5.867 5.867 3.24 5.867 0 C
cp
S
GR
GS
[0.75 0 0 0.75 308.25 296.54433] CT
N
f-819729944
f
GR
GS
[0.75 0 0 0.75 308.25 296.54433] CT
10.0 ML
1.333 LW
N
5.867 0 M
5.867 -3.24 3.24 -5.867 0 -5.867 C
-3.24 -5.867 -5.867 -3.24 -5.867 0 C
-5.867 3.24 -3.24 5.867 0 5.867 C
3.24 5.867 5.867 3.24 5.867 0 C
cp
S
GR
GS
[0.75 0 0 0.75 354.45 284.12337] CT
N
f-819729944
f
GR
GS
[0.75 0 0 0.75 354.45 284.12337] CT
10.0 ML
1.333 LW
N
5.867 0 M
5.867 -3.24 3.24 -5.867 0 -5.867 C
-3.24 -5.867 -5.867 -3.24 -5.867 0 C
-5.867 3.24 -3.24 5.867 0 5.867 C
3.24 5.867 5.867 3.24 5.867 0 C
cp
S
GR
GS
[0.75 0 0 0.75 400.65001 252.35123] CT
N
f-819729944
f
GR
GS
[0.75 0 0 0.75 400.65001 252.35123] CT
10.0 ML
1.333 LW
N
5.867 0 M
5.867 -3.24 3.24 -5.867 0 -5.867 C
-3.24 -5.867 -5.867 -3.24 -5.867 0 C
-5.867 3.24 -3.24 5.867 0 5.867 C
3.24 5.867 5.867 3.24 5.867 0 C
cp
S
GR
GS
[0.75 0 0 0.75 446.84999 234.5898] CT
N
f-819729944
f
GR
GS
[0.75 0 0 0.75 446.84999 234.5898] CT
10.0 ML
1.333 LW
N
5.867 0 M
5.867 -3.24 3.24 -5.867 0 -5.867 C
-3.24 -5.867 -5.867 -3.24 -5.867 0 C
-5.867 3.24 -3.24 5.867 0 5.867 C
3.24 5.867 5.867 3.24 5.867 0 C
cp
S
GR
GS
[0.75 0 0 0.75 493.05002 196.524] CT
N
f-819729944
f
GR
GS
[0.75 0 0 0.75 493.05002 196.524] CT
10.0 ML
1.333 LW
N
5.867 0 M
5.867 -3.24 3.24 -5.867 0 -5.867 C
-3.24 -5.867 -5.867 -3.24 -5.867 0 C
-5.867 3.24 -3.24 5.867 0 5.867 C
3.24 5.867 5.867 3.24 5.867 0 C
cp
S
GR
GS
[0.75 0 0 0.75 0 0.25] CT
1 LJ
1.333 LW
N
164.6 595 M
164.6 484.452 L
S
GR
GS
[0.75 0 0 0.75 0 0.25] CT
1 LJ
1.333 LW
N
226.2 595 M
226.2 445.366 L
S
GR
GS
[0.75 0 0 0.75 0 0.25] CT
1 LJ
1.333 LW
N
287.8 595 M
287.8 434.946 L
S
GR
GS
[0.75 0 0 0.75 0 0.25] CT
1 LJ
1.333 LW
N
349.4 595 M
349.4 415.985 L
S
GR
GS
[0.75 0 0 0.75 0 0.25] CT
1 LJ
1.333 LW
N
411 595 M
411 395.059 L
S
GR
GS
[0.75 0 0 0.75 0 0.25] CT
1 LJ
1.333 LW
N
472.6 595 M
472.6 378.498 L
S
GR
GS
[0.75 0 0 0.75 0 0.25] CT
1 LJ
1.333 LW
N
534.2 595 M
534.2 336.135 L
S
GR
GS
[0.75 0 0 0.75 0 0.25] CT
1 LJ
1.333 LW
N
595.8 595 M
595.8 312.453 L
S
GR
GS
[0.75 0 0 0.75 0 0.25] CT
1 LJ
1.333 LW
N
657.4 595 M
657.4 261.699 L
S
GR
GS
[0.75 0 0 0.75 123.45 436.5289] CT
1 0 0 RC
N
/f-719462112{-5 -5 M
-5 5 L
5 5 L
5 -5 L
cp}def
f-719462112
f
GR
GS
[0.75 0 0 0.75 123.45 436.5289] CT
1 0 0 RC
10.0 ML
1.333 LW
N
-5 -5 M
-5 5 L
5 5 L
5 -5 L
cp
S
GR
GS
[0.75 0 0 0.75 169.65 350.90285] CT
1 0 0 RC
N
f-719462112
f
GR
GS
[0.75 0 0 0.75 169.65 350.90285] CT
1 0 0 RC
10.0 ML
1.333 LW
N
-5 -5 M
-5 5 L
5 5 L
5 -5 L
cp
S
GR
GS
[0.75 0 0 0.75 215.84999 326.76239] CT
1 0 0 RC
N
f-719462112
f
GR
GS
[0.75 0 0 0.75 215.84999 326.76239] CT
1 0 0 RC
10.0 ML
1.333 LW
N
-5 -5 M
-5 5 L
5 5 L
5 -5 L
cp
S
GR
GS
[0.75 0 0 0.75 262.05 307.64522] CT
1 0 0 RC
N
f-719462112
f
GR
GS
[0.75 0 0 0.75 262.05 307.64522] CT
1 0 0 RC
10.0 ML
1.333 LW
N
-5 -5 M
-5 5 L
5 5 L
5 -5 L
cp
S
GR
GS
[0.75 0 0 0.75 308.25 296.26011] CT
1 0 0 RC
N
f-719462112
f
GR
GS
[0.75 0 0 0.75 308.25 296.26011] CT
1 0 0 RC
10.0 ML
1.333 LW
N
-5 -5 M
-5 5 L
5 5 L
5 -5 L
cp
S
GR
GS
[0.75 0 0 0.75 354.45 255.39751] CT
1 0 0 RC
N
f-719462112
f
GR
GS
[0.75 0 0 0.75 354.45 255.39751] CT
1 0 0 RC
10.0 ML
1.333 LW
N
-5 -5 M
-5 5 L
5 5 L
5 -5 L
cp
S
GR
GS
[0.75 0 0 0.75 400.65001 239.27087] CT
1 0 0 RC
N
f-719462112
f
GR
GS
[0.75 0 0 0.75 400.65001 239.27087] CT
1 0 0 RC
10.0 ML
1.333 LW
N
-5 -5 M
-5 5 L
5 5 L
5 -5 L
cp
S
GR
GS
[0.75 0 0 0.75 446.84999 197.33791] CT
1 0 0 RC
N
f-719462112
f
GR
GS
[0.75 0 0 0.75 446.84999 197.33791] CT
1 0 0 RC
10.0 ML
1.333 LW
N
-5 -5 M
-5 5 L
5 5 L
5 -5 L
cp
S
GR
GS
[0.75 0 0 0.75 493.05002 185.7115] CT
1 0 0 RC
N
f-719462112
f
GR
GS
[0.75 0 0 0.75 493.05002 185.7115] CT
1 0 0 RC
10.0 ML
1.333 LW
N
-5 -5 M
-5 5 L
5 5 L
5 -5 L
cp
S
GR
GS
[0.75 0 0 0.75 0 0.25] CT
1 0 0 RC
[1 3] 0 setdash
2 LJ
1.333 LW
N
164.6 595 M
164.6 581.705 L
S
GR
GS
[0.75 0 0 0.75 0 0.25] CT
1 0 0 RC
[1 3] 0 setdash
2 LJ
1.333 LW
N
226.2 595 M
226.2 467.537 L
S
GR
GS
[0.75 0 0 0.75 0 0.25] CT
1 0 0 RC
[1 3] 0 setdash
2 LJ
1.333 LW
N
287.8 595 M
287.8 435.35 L
S
GR
GS
[0.75 0 0 0.75 0 0.25] CT
1 0 0 RC
[1 3] 0 setdash
2 LJ
1.333 LW
N
349.4 595 M
349.4 409.86 L
S
GR
GS
[0.75 0 0 0.75 0 0.25] CT
1 0 0 RC
[1 3] 0 setdash
2 LJ
1.333 LW
N
411 595 M
411 394.68 L
S
GR
GS
[0.75 0 0 0.75 0 0.25] CT
1 0 0 RC
[1 3] 0 setdash
2 LJ
1.333 LW
N
472.6 595 M
472.6 340.197 L
S
GR
GS
[0.75 0 0 0.75 0 0.25] CT
1 0 0 RC
[1 3] 0 setdash
2 LJ
1.333 LW
N
534.2 595 M
534.2 318.694 L
S
GR
GS
[0.75 0 0 0.75 0 0.25] CT
1 0 0 RC
[1 3] 0 setdash
2 LJ
1.333 LW
N
595.8 595 M
595.8 262.784 L
S
GR
GS
[0.75 0 0 0.75 0 0.25] CT
1 0 0 RC
[1 3] 0 setdash
2 LJ
1.333 LW
N
657.4 595 M
657.4 247.282 L
S
GR
%%Trailer
%%Pages: 1
%%EOF
