%!PS-Adobe-3.0 EPSF-3.0
%%Creator: (MATLAB, The Mathworks, Inc. Version 9.5.0.944444 \(R2018b\). Operating System: Windows 10)
%%Title: (C:/Users/Alex/Documents/PhD Docs/01. GIT/my_phd_thesis/Chapter4/Figures/paper/rangingHistogramComparison.eps)
%%CreationDate: 2019-12-11T14:06:57
%%Pages: (atend)
%%BoundingBox: 0 0 676 479
%%LanguageLevel: 3
%%EndComments
%%BeginProlog
%%BeginResource: procset (Apache XML Graphics Std ProcSet) 1.2 0
%%Version: 1.2 0
%%Copyright: (Copyright 2001-2003,2010 The Apache Software Foundation. License terms: http://www.apache.org/licenses/LICENSE-2.0)
/bd{bind def}bind def
/ld{load def}bd
/GR/grestore ld
/GS/gsave ld
/RM/rmoveto ld
/C/curveto ld
/t/show ld
/L/lineto ld
/ML/setmiterlimit ld
/CT/concat ld
/f/fill ld
/N/newpath ld
/S/stroke ld
/CC/setcmykcolor ld
/A/ashow ld
/cp/closepath ld
/RC/setrgbcolor ld
/LJ/setlinejoin ld
/GC/setgray ld
/LW/setlinewidth ld
/M/moveto ld
/re {4 2 roll M
1 index 0 rlineto
0 exch rlineto
neg 0 rlineto
cp } bd
/_ctm matrix def
/_tm matrix def
/BT { _ctm currentmatrix pop matrix _tm copy pop 0 0 moveto } bd
/ET { _ctm setmatrix } bd
/iTm { _ctm setmatrix _tm concat } bd
/Tm { _tm astore pop iTm 0 0 moveto } bd
/ux 0.0 def
/uy 0.0 def
/F {
  /Tp exch def
  /Tf exch def
  Tf findfont Tp scalefont setfont
  /cf Tf def  /cs Tp def
} bd
/ULS {currentpoint /uy exch def /ux exch def} bd
/ULE {
  /Tcx currentpoint pop def
  gsave
  newpath
  cf findfont cs scalefont dup
  /FontMatrix get 0 get /Ts exch def /FontInfo get dup
  /UnderlinePosition get Ts mul /To exch def
  /UnderlineThickness get Ts mul /Tt exch def
  ux uy To add moveto  Tcx uy To add lineto
  Tt setlinewidth stroke
  grestore
} bd
/OLE {
  /Tcx currentpoint pop def
  gsave
  newpath
  cf findfont cs scalefont dup
  /FontMatrix get 0 get /Ts exch def /FontInfo get dup
  /UnderlinePosition get Ts mul /To exch def
  /UnderlineThickness get Ts mul /Tt exch def
  ux uy To add cs add moveto Tcx uy To add cs add lineto
  Tt setlinewidth stroke
  grestore
} bd
/SOE {
  /Tcx currentpoint pop def
  gsave
  newpath
  cf findfont cs scalefont dup
  /FontMatrix get 0 get /Ts exch def /FontInfo get dup
  /UnderlinePosition get Ts mul /To exch def
  /UnderlineThickness get Ts mul /Tt exch def
  ux uy To add cs 10 mul 26 idiv add moveto Tcx uy To add cs 10 mul 26 idiv add lineto
  Tt setlinewidth stroke
  grestore
} bd
/QT {
/Y22 exch store
/X22 exch store
/Y21 exch store
/X21 exch store
currentpoint
/Y21 load 2 mul add 3 div exch
/X21 load 2 mul add 3 div exch
/X21 load 2 mul /X22 load add 3 div
/Y21 load 2 mul /Y22 load add 3 div
/X22 load /Y22 load curveto
} bd
/SSPD {
dup length /d exch dict def
{
/v exch def
/k exch def
currentpagedevice k known {
/cpdv currentpagedevice k get def
v cpdv ne {
/upd false def
/nullv v type /nulltype eq def
/nullcpdv cpdv type /nulltype eq def
nullv nullcpdv or
{
/upd true def
} {
/sametype v type cpdv type eq def
sametype {
v type /arraytype eq {
/vlen v length def
/cpdvlen cpdv length def
vlen cpdvlen eq {
0 1 vlen 1 sub {
/i exch def
/obj v i get def
/cpdobj cpdv i get def
obj cpdobj ne {
/upd true def
exit
} if
} for
} {
/upd true def
} ifelse
} {
v type /dicttype eq {
v {
/dv exch def
/dk exch def
/cpddv cpdv dk get def
dv cpddv ne {
/upd true def
exit
} if
} forall
} {
/upd true def
} ifelse
} ifelse
} if
} ifelse
upd true eq {
d k v put
} if
} if
} if
} forall
d length 0 gt {
d setpagedevice
} if
} bd
/RE { % /NewFontName [NewEncodingArray] /FontName RE -
  findfont dup length dict begin
  {
    1 index /FID ne
    {def} {pop pop} ifelse
  } forall
  /Encoding exch def
  /FontName 1 index def
  currentdict definefont pop
  end
} bind def
%%EndResource
%%BeginResource: procset (Apache XML Graphics EPS ProcSet) 1.0 0
%%Version: 1.0 0
%%Copyright: (Copyright 2002-2003 The Apache Software Foundation. License terms: http://www.apache.org/licenses/LICENSE-2.0)
/BeginEPSF { %def
/b4_Inc_state save def         % Save state for cleanup
/dict_count countdictstack def % Count objects on dict stack
/op_count count 1 sub def      % Count objects on operand stack
userdict begin                 % Push userdict on dict stack
/showpage { } def              % Redefine showpage, { } = null proc
0 setgray 0 setlinecap         % Prepare graphics state
1 setlinewidth 0 setlinejoin
10 setmiterlimit [ ] 0 setdash newpath
/languagelevel where           % If level not equal to 1 then
{pop languagelevel             % set strokeadjust and
1 ne                           % overprint to their defaults.
{false setstrokeadjust false setoverprint
} if
} if
} bd
/EndEPSF { %def
count op_count sub {pop} repeat            % Clean up stacks
countdictstack dict_count sub {end} repeat
b4_Inc_state restore
} bd
%%EndResource
%FOPBeginFontDict
%%IncludeResource: font Courier-Oblique
%%IncludeResource: font Courier-BoldOblique
%%IncludeResource: font Courier-Bold
%%IncludeResource: font ZapfDingbats
%%IncludeResource: font Symbol
%%IncludeResource: font Helvetica
%%IncludeResource: font Helvetica-Oblique
%%IncludeResource: font Helvetica-Bold
%%IncludeResource: font Helvetica-BoldOblique
%%IncludeResource: font Times-Roman
%%IncludeResource: font Times-Italic
%%IncludeResource: font Times-Bold
%%IncludeResource: font Times-BoldItalic
%%IncludeResource: font Courier
%FOPEndFontDict
%%BeginResource: encoding WinAnsiEncoding
/WinAnsiEncoding [
/.notdef /.notdef /.notdef /.notdef /.notdef
/.notdef /.notdef /.notdef /.notdef /.notdef
/.notdef /.notdef /.notdef /.notdef /.notdef
/.notdef /.notdef /.notdef /.notdef /.notdef
/.notdef /.notdef /.notdef /.notdef /.notdef
/.notdef /.notdef /.notdef /.notdef /.notdef
/.notdef /.notdef /space /exclam /quotedbl
/numbersign /dollar /percent /ampersand /quotesingle
/parenleft /parenright /asterisk /plus /comma
/hyphen /period /slash /zero /one
/two /three /four /five /six
/seven /eight /nine /colon /semicolon
/less /equal /greater /question /at
/A /B /C /D /E
/F /G /H /I /J
/K /L /M /N /O
/P /Q /R /S /T
/U /V /W /X /Y
/Z /bracketleft /backslash /bracketright /asciicircum
/underscore /quoteleft /a /b /c
/d /e /f /g /h
/i /j /k /l /m
/n /o /p /q /r
/s /t /u /v /w
/x /y /z /braceleft /bar
/braceright /asciitilde /bullet /Euro /bullet
/quotesinglbase /florin /quotedblbase /ellipsis /dagger
/daggerdbl /circumflex /perthousand /Scaron /guilsinglleft
/OE /bullet /Zcaron /bullet /bullet
/quoteleft /quoteright /quotedblleft /quotedblright /bullet
/endash /emdash /asciitilde /trademark /scaron
/guilsinglright /oe /bullet /zcaron /Ydieresis
/space /exclamdown /cent /sterling /currency
/yen /brokenbar /section /dieresis /copyright
/ordfeminine /guillemotleft /logicalnot /sfthyphen /registered
/macron /degree /plusminus /twosuperior /threesuperior
/acute /mu /paragraph /middot /cedilla
/onesuperior /ordmasculine /guillemotright /onequarter /onehalf
/threequarters /questiondown /Agrave /Aacute /Acircumflex
/Atilde /Adieresis /Aring /AE /Ccedilla
/Egrave /Eacute /Ecircumflex /Edieresis /Igrave
/Iacute /Icircumflex /Idieresis /Eth /Ntilde
/Ograve /Oacute /Ocircumflex /Otilde /Odieresis
/multiply /Oslash /Ugrave /Uacute /Ucircumflex
/Udieresis /Yacute /Thorn /germandbls /agrave
/aacute /acircumflex /atilde /adieresis /aring
/ae /ccedilla /egrave /eacute /ecircumflex
/edieresis /igrave /iacute /icircumflex /idieresis
/eth /ntilde /ograve /oacute /ocircumflex
/otilde /odieresis /divide /oslash /ugrave
/uacute /ucircumflex /udieresis /yacute /thorn
/ydieresis
] def
%%EndResource
%FOPBeginFontReencode
/Courier-Oblique findfont
dup length dict begin
  {1 index /FID ne {def} {pop pop} ifelse} forall
  /Encoding WinAnsiEncoding def
  currentdict
end
/Courier-Oblique exch definefont pop
/Courier-BoldOblique findfont
dup length dict begin
  {1 index /FID ne {def} {pop pop} ifelse} forall
  /Encoding WinAnsiEncoding def
  currentdict
end
/Courier-BoldOblique exch definefont pop
/Courier-Bold findfont
dup length dict begin
  {1 index /FID ne {def} {pop pop} ifelse} forall
  /Encoding WinAnsiEncoding def
  currentdict
end
/Courier-Bold exch definefont pop
/Helvetica findfont
dup length dict begin
  {1 index /FID ne {def} {pop pop} ifelse} forall
  /Encoding WinAnsiEncoding def
  currentdict
end
/Helvetica exch definefont pop
/Helvetica-Oblique findfont
dup length dict begin
  {1 index /FID ne {def} {pop pop} ifelse} forall
  /Encoding WinAnsiEncoding def
  currentdict
end
/Helvetica-Oblique exch definefont pop
/Helvetica-Bold findfont
dup length dict begin
  {1 index /FID ne {def} {pop pop} ifelse} forall
  /Encoding WinAnsiEncoding def
  currentdict
end
/Helvetica-Bold exch definefont pop
/Helvetica-BoldOblique findfont
dup length dict begin
  {1 index /FID ne {def} {pop pop} ifelse} forall
  /Encoding WinAnsiEncoding def
  currentdict
end
/Helvetica-BoldOblique exch definefont pop
/Times-Roman findfont
dup length dict begin
  {1 index /FID ne {def} {pop pop} ifelse} forall
  /Encoding WinAnsiEncoding def
  currentdict
end
/Times-Roman exch definefont pop
/Times-Italic findfont
dup length dict begin
  {1 index /FID ne {def} {pop pop} ifelse} forall
  /Encoding WinAnsiEncoding def
  currentdict
end
/Times-Italic exch definefont pop
/Times-Bold findfont
dup length dict begin
  {1 index /FID ne {def} {pop pop} ifelse} forall
  /Encoding WinAnsiEncoding def
  currentdict
end
/Times-Bold exch definefont pop
/Times-BoldItalic findfont
dup length dict begin
  {1 index /FID ne {def} {pop pop} ifelse} forall
  /Encoding WinAnsiEncoding def
  currentdict
end
/Times-BoldItalic exch definefont pop
/Courier findfont
dup length dict begin
  {1 index /FID ne {def} {pop pop} ifelse} forall
  /Encoding WinAnsiEncoding def
  currentdict
end
/Courier exch definefont pop
%FOPEndFontReencode
%%EndProlog
%%Page: 1 1
%%PageBoundingBox: 0 0 676 479
%%BeginPageSetup
[1 0 0 -1 0 479] CT
%%EndPageSetup
GS
[0.75 0 0 0.75 0 -0.25] CT
1 GC
N
0 0 901 639 re
f
GR
GS
[0.75 0 0 0.75 0 -0.25] CT
1 GC
N
0 0 901 639 re
f
GR
GS
[0.75 0 0 0.75 0 -0.25] CT
1 GC
N
117 566 M
815 566 L
815 48 L
117 48 L
cp
f
GR
GS
[0.75 0 0 0.75 0 -0.25] CT
0.149 GC
2 setlinecap
1 LJ
0.667 LW
N
117 566 M
815 566 L
S
GR
GS
[0.75 0 0 0.75 0 -0.25] CT
0.149 GC
2 setlinecap
1 LJ
0.667 LW
N
117 48 M
815 48 L
S
GR
GS
[0.75 0 0 0.75 0 -0.25] CT
0.149 GC
2 setlinecap
1 LJ
0.667 LW
N
117 566 M
117 559.02 L
S
GR
GS
[0.75 0 0 0.75 0 -0.25] CT
0.149 GC
2 setlinecap
1 LJ
0.667 LW
N
256.6 566 M
256.6 559.02 L
S
GR
GS
[0.75 0 0 0.75 0 -0.25] CT
0.149 GC
2 setlinecap
1 LJ
0.667 LW
N
396.2 566 M
396.2 559.02 L
S
GR
GS
[0.75 0 0 0.75 0 -0.25] CT
0.149 GC
2 setlinecap
1 LJ
0.667 LW
N
535.8 566 M
535.8 559.02 L
S
GR
GS
[0.75 0 0 0.75 0 -0.25] CT
0.149 GC
2 setlinecap
1 LJ
0.667 LW
N
675.4 566 M
675.4 559.02 L
S
GR
GS
[0.75 0 0 0.75 0 -0.25] CT
0.149 GC
2 setlinecap
1 LJ
0.667 LW
N
815 566 M
815 559.02 L
S
GR
GS
[0.75 0 0 0.75 0 -0.25] CT
0.149 GC
2 setlinecap
1 LJ
0.667 LW
N
117 48 M
117 54.98 L
S
GR
GS
[0.75 0 0 0.75 0 -0.25] CT
0.149 GC
2 setlinecap
1 LJ
0.667 LW
N
256.6 48 M
256.6 54.98 L
S
GR
GS
[0.75 0 0 0.75 0 -0.25] CT
0.149 GC
2 setlinecap
1 LJ
0.667 LW
N
396.2 48 M
396.2 54.98 L
S
GR
GS
[0.75 0 0 0.75 0 -0.25] CT
0.149 GC
2 setlinecap
1 LJ
0.667 LW
N
535.8 48 M
535.8 54.98 L
S
GR
GS
[0.75 0 0 0.75 0 -0.25] CT
0.149 GC
2 setlinecap
1 LJ
0.667 LW
N
675.4 48 M
675.4 54.98 L
S
GR
GS
[0.75 0 0 0.75 0 -0.25] CT
0.149 GC
2 setlinecap
1 LJ
0.667 LW
N
815 48 M
815 54.98 L
S
GR
GS
[0.75 0 0 0.75 87.75 429.85001] CT
0.149 GC
/Helvetica 24 F
GS
[1 0 0 1 0 0] CT
-17.5 25 moveto 
1 -1 scale
(-20) t 
GR
GR
GS
[0.75 0 0 0.75 192.45 429.85001] CT
0.149 GC
/Helvetica 24 F
GS
[1 0 0 1 0 0] CT
-17.5 25 moveto 
1 -1 scale
(-10) t 
GR
GR
GS
[0.75 0 0 0.75 297.15001 429.85001] CT
0.149 GC
/Helvetica 24 F
GS
[1 0 0 1 0 0] CT
-7 25 moveto 
1 -1 scale
(0) t 
GR
GR
GS
[0.75 0 0 0.75 401.84999 429.85001] CT
0.149 GC
/Helvetica 24 F
GS
[1 0 0 1 0 0] CT
-13.5 25 moveto 
1 -1 scale
(10) t 
GR
GR
GS
[0.75 0 0 0.75 506.55002 429.85001] CT
0.149 GC
/Helvetica 24 F
GS
[1 0 0 1 0 0] CT
-13.5 25 moveto 
1 -1 scale
(20) t 
GR
GR
GS
[0.75 0 0 0.75 611.25 429.85001] CT
0.149 GC
/Helvetica 24 F
GS
[1 0 0 1 0 0] CT
-13.5 25 moveto 
1 -1 scale
(30) t 
GR
GR
GS
[0.75 0 0 0.75 349.50025 454.09999] CT
0.149 GC
/Helvetica 26.4 F
GS
[1 0 0 1 0 0] CT
-106 27 moveto 
1 -1 scale
(Baseline error \(m\)) t 
GR
GR
GS
[0.75 0 0 0.75 0 -0.25] CT
0.149 GC
2 setlinecap
1 LJ
0.667 LW
N
117 566 M
117 48 L
S
GR
GS
[0.75 0 0 0.75 0 -0.25] CT
0.149 GC
2 setlinecap
1 LJ
0.667 LW
N
815 566 M
815 48 L
S
GR
GS
[0.75 0 0 0.75 0 -0.25] CT
0.149 GC
2 setlinecap
1 LJ
0.667 LW
N
117 566 M
123.98 566 L
S
GR
GS
[0.75 0 0 0.75 0 -0.25] CT
0.149 GC
2 setlinecap
1 LJ
0.667 LW
N
117 508.444 M
123.98 508.444 L
S
GR
GS
[0.75 0 0 0.75 0 -0.25] CT
0.149 GC
2 setlinecap
1 LJ
0.667 LW
N
117 450.889 M
123.98 450.889 L
S
GR
GS
[0.75 0 0 0.75 0 -0.25] CT
0.149 GC
2 setlinecap
1 LJ
0.667 LW
N
117 393.333 M
123.98 393.333 L
S
GR
GS
[0.75 0 0 0.75 0 -0.25] CT
0.149 GC
2 setlinecap
1 LJ
0.667 LW
N
117 335.778 M
123.98 335.778 L
S
GR
GS
[0.75 0 0 0.75 0 -0.25] CT
0.149 GC
2 setlinecap
1 LJ
0.667 LW
N
117 278.222 M
123.98 278.222 L
S
GR
GS
[0.75 0 0 0.75 0 -0.25] CT
0.149 GC
2 setlinecap
1 LJ
0.667 LW
N
117 220.667 M
123.98 220.667 L
S
GR
GS
[0.75 0 0 0.75 0 -0.25] CT
0.149 GC
2 setlinecap
1 LJ
0.667 LW
N
117 163.111 M
123.98 163.111 L
S
GR
GS
[0.75 0 0 0.75 0 -0.25] CT
0.149 GC
2 setlinecap
1 LJ
0.667 LW
N
117 105.556 M
123.98 105.556 L
S
GR
GS
[0.75 0 0 0.75 0 -0.25] CT
0.149 GC
2 setlinecap
1 LJ
0.667 LW
N
117 48 M
123.98 48 L
S
GR
GS
[0.75 0 0 0.75 0 -0.25] CT
0.149 GC
2 setlinecap
1 LJ
0.667 LW
N
815 566 M
808.02 566 L
S
GR
GS
[0.75 0 0 0.75 0 -0.25] CT
0.149 GC
2 setlinecap
1 LJ
0.667 LW
N
815 508.444 M
808.02 508.444 L
S
GR
GS
[0.75 0 0 0.75 0 -0.25] CT
0.149 GC
2 setlinecap
1 LJ
0.667 LW
N
815 450.889 M
808.02 450.889 L
S
GR
GS
[0.75 0 0 0.75 0 -0.25] CT
0.149 GC
2 setlinecap
1 LJ
0.667 LW
N
815 393.333 M
808.02 393.333 L
S
GR
GS
[0.75 0 0 0.75 0 -0.25] CT
0.149 GC
2 setlinecap
1 LJ
0.667 LW
N
815 335.778 M
808.02 335.778 L
S
GR
GS
[0.75 0 0 0.75 0 -0.25] CT
0.149 GC
2 setlinecap
1 LJ
0.667 LW
N
815 278.222 M
808.02 278.222 L
S
GR
GS
[0.75 0 0 0.75 0 -0.25] CT
0.149 GC
2 setlinecap
1 LJ
0.667 LW
N
815 220.667 M
808.02 220.667 L
S
GR
GS
[0.75 0 0 0.75 0 -0.25] CT
0.149 GC
2 setlinecap
1 LJ
0.667 LW
N
815 163.111 M
808.02 163.111 L
S
GR
GS
[0.75 0 0 0.75 0 -0.25] CT
0.149 GC
2 setlinecap
1 LJ
0.667 LW
N
815 105.556 M
808.02 105.556 L
S
GR
GS
[0.75 0 0 0.75 0 -0.25] CT
0.149 GC
2 setlinecap
1 LJ
0.667 LW
N
815 48 M
808.02 48 L
S
GR
GS
[0.75 0 0 0.75 82.15001 424.25] CT
0.149 GC
/Helvetica 24 F
GS
[1 0 0 1 0 0] CT
-14 9.5 moveto 
1 -1 scale
(0) t 
GR
GR
GS
[0.75 0 0 0.75 82.15001 381.08334] CT
0.149 GC
/Helvetica 24 F
GS
[1 0 0 1 0 0] CT
-47 9.5 moveto 
1 -1 scale
(0.01) t 
GR
GR
GS
[0.75 0 0 0.75 82.15001 337.91666] CT
0.149 GC
/Helvetica 24 F
GS
[1 0 0 1 0 0] CT
-47 9.5 moveto 
1 -1 scale
(0.02) t 
GR
GR
GS
[0.75 0 0 0.75 82.15001 294.75001] CT
0.149 GC
/Helvetica 24 F
GS
[1 0 0 1 0 0] CT
-47 9.5 moveto 
1 -1 scale
(0.03) t 
GR
GR
GS
[0.75 0 0 0.75 82.15001 251.58333] CT
0.149 GC
/Helvetica 24 F
GS
[1 0 0 1 0 0] CT
-47 9.5 moveto 
1 -1 scale
(0.04) t 
GR
GR
GS
[0.75 0 0 0.75 82.15001 208.41667] CT
0.149 GC
/Helvetica 24 F
GS
[1 0 0 1 0 0] CT
-47 9.5 moveto 
1 -1 scale
(0.05) t 
GR
GR
GS
[0.75 0 0 0.75 82.15001 165.25] CT
0.149 GC
/Helvetica 24 F
GS
[1 0 0 1 0 0] CT
-47 9.5 moveto 
1 -1 scale
(0.06) t 
GR
GR
GS
[0.75 0 0 0.75 82.15001 122.08334] CT
0.149 GC
/Helvetica 24 F
GS
[1 0 0 1 0 0] CT
-47 9.5 moveto 
1 -1 scale
(0.07) t 
GR
GR
GS
[0.75 0 0 0.75 82.15001 78.91667] CT
0.149 GC
/Helvetica 24 F
GS
[1 0 0 1 0 0] CT
-47 9.5 moveto 
1 -1 scale
(0.08) t 
GR
GR
GS
[0.75 0 0 0.75 82.15001 35.74999] CT
0.149 GC
/Helvetica 24 F
GS
[1 0 0 1 0 0] CT
-47 9.5 moveto 
1 -1 scale
(0.09) t 
GR
GR
GS
[0 -0.75 0.75 0 43.90001 229.99979] CT
0.149 GC
/Helvetica 26.4 F
GS
[1 0 0 1 0 0] CT
-95 -6 moveto 
1 -1 scale
(Error Probability) t 
GR
GR
GS
[0.75 0 0 0.75 0 -0.25] CT
1 LJ
0.667 LW
N
150.436 558.5 M
172.518 540.333 L
194.601 505.46 L
216.683 466.136 L
238.766 413.55 L
260.848 352.557 L
282.931 282.747 L
305.014 211.576 L
327.096 145.552 L
349.179 93.558 L
371.261 60.811 L
393.344 54.165 L
415.426 71.981 L
437.509 112.366 L
459.591 168.814 L
481.674 233.131 L
503.756 298.348 L
525.839 359.572 L
547.921 412.812 L
570.004 455.851 L
592.086 489.752 L
614.169 514.791 L
636.251 532.999 L
658.334 545.207 L
680.417 553.469 L
702.499 558.731 L
724.582 562.008 L
746.664 563.531 L
768.747 564.315 L
790.829 564.846 L
812.912 564.846 L
S
GR
GS
[0.75 0 0 0.75 112.82685 418.62486] CT
N
4 0 M
4 -2.209 2.209 -4 0 -4 C
-2.209 -4 -4 -2.209 -4 0 C
-4 2.209 -2.209 4 0 4 C
2.209 4 4 2.209 4 0 C
cp
f
GR
GS
[0.75 0 0 0.75 112.82685 418.62486] CT
10.0 ML
N
4 0 M
4 -2.209 2.209 -4 0 -4 C
-2.209 -4 -4 -2.209 -4 0 C
-4 2.209 -2.209 4 0 4 C
2.209 4 4 2.209 4 0 C
cp
S
GR
GS
[0.75 0 0 0.75 129.38877 404.99957] CT
N
/f351177404{4 0 M
4 -2.209 2.209 -4 0 -4 C
-2.209 -4 -4 -2.209 -4 0 C
-4 2.209 -2.209 4 0 4 C
2.209 4 4 2.209 4 0 C
cp}def
f351177404
f
GR
GS
[0.75 0 0 0.75 129.38877 404.99957] CT
10.0 ML
N
4 0 M
4 -2.209 2.209 -4 0 -4 C
-2.209 -4 -4 -2.209 -4 0 C
-4 2.209 -2.209 4 0 4 C
2.209 4 4 2.209 4 0 C
cp
S
GR
GS
[0.75 0 0 0.75 145.95066 378.84511] CT
N
f351177404
f
GR
GS
[0.75 0 0 0.75 145.95066 378.84511] CT
10.0 ML
N
4 0 M
4 -2.209 2.209 -4 0 -4 C
-2.209 -4 -4 -2.209 -4 0 C
-4 2.209 -2.209 4 0 4 C
2.209 4 4 2.209 4 0 C
cp
S
GR
GS
[0.75 0 0 0.75 162.51256 349.35213] CT
N
f351177404
f
GR
GS
[0.75 0 0 0.75 162.51256 349.35213] CT
10.0 ML
N
4 0 M
4 -2.209 2.209 -4 0 -4 C
-2.209 -4 -4 -2.209 -4 0 C
-4 2.209 -2.209 4 0 4 C
2.209 4 4 2.209 4 0 C
cp
S
GR
GS
[0.75 0 0 0.75 179.07446 309.91274] CT
N
f351177404
f
GR
GS
[0.75 0 0 0.75 179.07446 309.91274] CT
10.0 ML
N
4 0 M
4 -2.209 2.209 -4 0 -4 C
-2.209 -4 -4 -2.209 -4 0 C
-4 2.209 -2.209 4 0 4 C
2.209 4 4 2.209 4 0 C
cp
S
GR
GS
[0.75 0 0 0.75 195.63634 264.16748] CT
N
f351177404
f
GR
GS
[0.75 0 0 0.75 195.63634 264.16748] CT
10.0 ML
N
4 0 M
4 -2.209 2.209 -4 0 -4 C
-2.209 -4 -4 -2.209 -4 0 C
-4 2.209 -2.209 4 0 4 C
2.209 4 4 2.209 4 0 C
cp
S
GR
GS
[0.75 0 0 0.75 212.19825 211.81049] CT
N
f351177404
f
GR
GS
[0.75 0 0 0.75 212.19825 211.81049] CT
10.0 ML
N
4 0 M
4 -2.209 2.209 -4 0 -4 C
-2.209 -4 -4 -2.209 -4 0 C
-4 2.209 -2.209 4 0 4 C
2.209 4 4 2.209 4 0 C
cp
S
GR
GS
[0.75 0 0 0.75 228.76014 158.43235] CT
N
f351177404
f
GR
GS
[0.75 0 0 0.75 228.76014 158.43235] CT
10.0 ML
N
4 0 M
4 -2.209 2.209 -4 0 -4 C
-2.209 -4 -4 -2.209 -4 0 C
-4 2.209 -2.209 4 0 4 C
2.209 4 4 2.209 4 0 C
cp
S
GR
GS
[0.75 0 0 0.75 245.32205 108.9139] CT
N
f351177404
f
GR
GS
[0.75 0 0 0.75 245.32205 108.9139] CT
10.0 ML
N
4 0 M
4 -2.209 2.209 -4 0 -4 C
-2.209 -4 -4 -2.209 -4 0 C
-4 2.209 -2.209 4 0 4 C
2.209 4 4 2.209 4 0 C
cp
S
GR
GS
[0.75 0 0 0.75 261.88394 69.91877] CT
N
f351177404
f
GR
GS
[0.75 0 0 0.75 261.88394 69.91877] CT
10.0 ML
N
4 0 M
4 -2.209 2.209 -4 0 -4 C
-2.209 -4 -4 -2.209 -4 0 C
-4 2.209 -2.209 4 0 4 C
2.209 4 4 2.209 4 0 C
cp
S
GR
GS
[0.75 0 0 0.75 278.44583 45.35857] CT
N
f351177404
f
GR
GS
[0.75 0 0 0.75 278.44583 45.35857] CT
10.0 ML
N
4 0 M
4 -2.209 2.209 -4 0 -4 C
-2.209 -4 -4 -2.209 -4 0 C
-4 2.209 -2.209 4 0 4 C
2.209 4 4 2.209 4 0 C
cp
S
GR
GS
[0.75 0 0 0.75 295.00774 40.37387] CT
N
f351177404
f
GR
GS
[0.75 0 0 0.75 295.00774 40.37387] CT
10.0 ML
N
4 0 M
4 -2.209 2.209 -4 0 -4 C
-2.209 -4 -4 -2.209 -4 0 C
-4 2.209 -2.209 4 0 4 C
2.209 4 4 2.209 4 0 C
cp
S
GR
GS
[0.75 0 0 0.75 311.56963 53.73569] CT
N
f351177404
f
GR
GS
[0.75 0 0 0.75 311.56963 53.73569] CT
10.0 ML
N
4 0 M
4 -2.209 2.209 -4 0 -4 C
-2.209 -4 -4 -2.209 -4 0 C
-4 2.209 -2.209 4 0 4 C
2.209 4 4 2.209 4 0 C
cp
S
GR
GS
[0.75 0 0 0.75 328.13152 84.02485] CT
N
f351177404
f
GR
GS
[0.75 0 0 0.75 328.13152 84.02485] CT
10.0 ML
N
4 0 M
4 -2.209 2.209 -4 0 -4 C
-2.209 -4 -4 -2.209 -4 0 C
-4 2.209 -2.209 4 0 4 C
2.209 4 4 2.209 4 0 C
cp
S
GR
GS
[0.75 0 0 0.75 344.69344 126.36045] CT
N
f351177404
f
GR
GS
[0.75 0 0 0.75 344.69344 126.36045] CT
10.0 ML
N
4 0 M
4 -2.209 2.209 -4 0 -4 C
-2.209 -4 -4 -2.209 -4 0 C
-4 2.209 -2.209 4 0 4 C
2.209 4 4 2.209 4 0 C
cp
S
GR
GS
[0.75 0 0 0.75 361.25533 174.5981] CT
N
f351177404
f
GR
GS
[0.75 0 0 0.75 361.25533 174.5981] CT
10.0 ML
N
4 0 M
4 -2.209 2.209 -4 0 -4 C
-2.209 -4 -4 -2.209 -4 0 C
-4 2.209 -2.209 4 0 4 C
2.209 4 4 2.209 4 0 C
cp
S
GR
GS
[0.75 0 0 0.75 377.81721 223.51077] CT
N
f351177404
f
GR
GS
[0.75 0 0 0.75 377.81721 223.51077] CT
10.0 ML
N
4 0 M
4 -2.209 2.209 -4 0 -4 C
-2.209 -4 -4 -2.209 -4 0 C
-4 2.209 -2.209 4 0 4 C
2.209 4 4 2.209 4 0 C
cp
S
GR
GS
[0.75 0 0 0.75 394.3791 269.42913] CT
N
f351177404
f
GR
GS
[0.75 0 0 0.75 394.3791 269.42913] CT
10.0 ML
N
4 0 M
4 -2.209 2.209 -4 0 -4 C
-2.209 -4 -4 -2.209 -4 0 C
-4 2.209 -2.209 4 0 4 C
2.209 4 4 2.209 4 0 C
cp
S
GR
GS
[0.75 0 0 0.75 410.94104 309.35889] CT
N
f351177404
f
GR
GS
[0.75 0 0 0.75 410.94104 309.35889] CT
10.0 ML
N
4 0 M
4 -2.209 2.209 -4 0 -4 C
-2.209 -4 -4 -2.209 -4 0 C
-4 2.209 -2.209 4 0 4 C
2.209 4 4 2.209 4 0 C
cp
S
GR
GS
[0.75 0 0 0.75 427.50293 341.63849] CT
N
f351177404
f
GR
GS
[0.75 0 0 0.75 427.50293 341.63849] CT
10.0 ML
N
4 0 M
4 -2.209 2.209 -4 0 -4 C
-2.209 -4 -4 -2.209 -4 0 C
-4 2.209 -2.209 4 0 4 C
2.209 4 4 2.209 4 0 C
cp
S
GR
GS
[0.75 0 0 0.75 444.06482 367.06408] CT
N
f351177404
f
GR
GS
[0.75 0 0 0.75 444.06482 367.06408] CT
10.0 ML
N
4 0 M
4 -2.209 2.209 -4 0 -4 C
-2.209 -4 -4 -2.209 -4 0 C
-4 2.209 -2.209 4 0 4 C
2.209 4 4 2.209 4 0 C
cp
S
GR
GS
[0.75 0 0 0.75 460.62671 385.84335] CT
N
f351177404
f
GR
GS
[0.75 0 0 0.75 460.62671 385.84335] CT
10.0 ML
N
4 0 M
4 -2.209 2.209 -4 0 -4 C
-2.209 -4 -4 -2.209 -4 0 C
-4 2.209 -2.209 4 0 4 C
2.209 4 4 2.209 4 0 C
cp
S
GR
GS
[0.75 0 0 0.75 477.1886 399.49945] CT
N
f351177404
f
GR
GS
[0.75 0 0 0.75 477.1886 399.49945] CT
10.0 ML
N
4 0 M
4 -2.209 2.209 -4 0 -4 C
-2.209 -4 -4 -2.209 -4 0 C
-4 2.209 -2.209 4 0 4 C
2.209 4 4 2.209 4 0 C
cp
S
GR
GS
[0.75 0 0 0.75 493.75049 408.65541] CT
N
f351177404
f
GR
GS
[0.75 0 0 0.75 493.75049 408.65541] CT
10.0 ML
N
4 0 M
4 -2.209 2.209 -4 0 -4 C
-2.209 -4 -4 -2.209 -4 0 C
-4 2.209 -2.209 4 0 4 C
2.209 4 4 2.209 4 0 C
cp
S
GR
GS
[0.75 0 0 0.75 510.31242 414.8517] CT
N
f351177404
f
GR
GS
[0.75 0 0 0.75 510.31242 414.8517] CT
10.0 ML
N
4 0 M
4 -2.209 2.209 -4 0 -4 C
-2.209 -4 -4 -2.209 -4 0 C
-4 2.209 -2.209 4 0 4 C
2.209 4 4 2.209 4 0 C
cp
S
GR
GS
[0.75 0 0 0.75 526.87431 418.79794] CT
N
f351177404
f
GR
GS
[0.75 0 0 0.75 526.87431 418.79794] CT
10.0 ML
N
4 0 M
4 -2.209 2.209 -4 0 -4 C
-2.209 -4 -4 -2.209 -4 0 C
-4 2.209 -2.209 4 0 4 C
2.209 4 4 2.209 4 0 C
cp
S
GR
GS
[0.75 0 0 0.75 543.4362 421.25572] CT
N
f351177404
f
GR
GS
[0.75 0 0 0.75 543.4362 421.25572] CT
10.0 ML
N
4 0 M
4 -2.209 2.209 -4 0 -4 C
-2.209 -4 -4 -2.209 -4 0 C
-4 2.209 -2.209 4 0 4 C
2.209 4 4 2.209 4 0 C
cp
S
GR
GS
[0.75 0 0 0.75 559.99809 422.39803] CT
N
f351177404
f
GR
GS
[0.75 0 0 0.75 559.99809 422.39803] CT
10.0 ML
N
4 0 M
4 -2.209 2.209 -4 0 -4 C
-2.209 -4 -4 -2.209 -4 0 C
-4 2.209 -2.209 4 0 4 C
2.209 4 4 2.209 4 0 C
cp
S
GR
GS
[0.75 0 0 0.75 576.55998 422.98653] CT
N
f351177404
f
GR
GS
[0.75 0 0 0.75 576.55998 422.98653] CT
10.0 ML
N
4 0 M
4 -2.209 2.209 -4 0 -4 C
-2.209 -4 -4 -2.209 -4 0 C
-4 2.209 -2.209 4 0 4 C
2.209 4 4 2.209 4 0 C
cp
S
GR
GS
[0.75 0 0 0.75 593.12192 423.3846] CT
N
f351177404
f
GR
GS
[0.75 0 0 0.75 593.12192 423.3846] CT
10.0 ML
N
4 0 M
4 -2.209 2.209 -4 0 -4 C
-2.209 -4 -4 -2.209 -4 0 C
-4 2.209 -2.209 4 0 4 C
2.209 4 4 2.209 4 0 C
cp
S
GR
GS
[0.75 0 0 0.75 609.68381 423.3846] CT
N
f351177404
f
GR
GS
[0.75 0 0 0.75 609.68381 423.3846] CT
10.0 ML
N
4 0 M
4 -2.209 2.209 -4 0 -4 C
-2.209 -4 -4 -2.209 -4 0 C
-4 2.209 -2.209 4 0 4 C
2.209 4 4 2.209 4 0 C
cp
S
GR
GS
[0.75 0 0 0.75 0 -0.25] CT
1 LJ
0.667 LW
N
292.63 565.424 M
299.951 561.712 L
307.271 553.819 L
314.592 543.382 L
321.912 526.508 L
329.233 502.085 L
336.554 467.846 L
343.874 421.465 L
351.195 364.739 L
358.515 299.833 L
365.836 230.434 L
373.156 162.694 L
380.477 107.096 L
387.798 67.927 L
395.118 52.121 L
402.439 62.351 L
409.759 97.58 L
417.08 150.275 L
424.401 215.572 L
431.721 284.418 L
439.042 350.522 L
446.362 407.825 L
453.683 455.588 L
461.004 492.2 L
468.324 519.02 L
475.645 537.222 L
482.965 549.434 L
490.286 556.876 L
497.607 561.184 L
504.927 564.08 L
512.248 564.848 L
S
GR
GS
[0.75 0 0 0.75 219.47248 423.81796] CT
N
2.222 0 M
2.222 1.227 1.227 2.222 0 2.222 C
-1.227 2.222 -2.222 1.227 -2.222 0 C
-2.222 -1.227 -1.227 -2.222 0 -2.222 C
1.227 -2.222 2.222 -1.227 2.222 0 C
cp
f
GR
GS
[0.75 0 0 0.75 224.96292 421.03389] CT
N
/f-1759579234{2.222 0 M
2.222 1.227 1.227 2.222 0 2.222 C
-1.227 2.222 -2.222 1.227 -2.222 0 C
-2.222 -1.227 -1.227 -2.222 0 -2.222 C
1.227 -2.222 2.222 -1.227 2.222 0 C
cp}def
f-1759579234
f
GR
GS
[0.75 0 0 0.75 230.45336 415.11432] CT
N
f-1759579234
f
GR
GS
[0.75 0 0 0.75 235.9438 407.28619] CT
N
f-1759579234
f
GR
GS
[0.75 0 0 0.75 241.43427 394.63104] CT
N
f-1759579234
f
GR
GS
[0.75 0 0 0.75 246.92471 376.31361] CT
N
f-1759579234
f
GR
GS
[0.75 0 0 0.75 252.41515 350.63462] CT
N
f-1759579234
f
GR
GS
[0.75 0 0 0.75 257.90559 315.84877] CT
N
f-1759579234
f
GR
GS
[0.75 0 0 0.75 263.39603 273.30389] CT
N
f-1759579234
f
GR
GS
[0.75 0 0 0.75 268.88647 224.62444] CT
N
f-1759579234
f
GR
GS
[0.75 0 0 0.75 274.37691 172.57524] CT
N
f-1759579234
f
GR
GS
[0.75 0 0 0.75 279.86735 121.77027] CT
N
f-1759579234
f
GR
GS
[0.75 0 0 0.75 285.35779 80.07218] CT
N
f-1759579234
f
GR
GS
[0.75 0 0 0.75 290.84823 50.69513] CT
N
f-1759579234
f
GR
GS
[0.75 0 0 0.75 296.33867 38.84063] CT
N
f-1759579234
f
GR
GS
[0.75 0 0 0.75 301.82913 46.51321] CT
N
f-1759579234
f
GR
GS
[0.75 0 0 0.75 307.31957 72.93528] CT
N
f-1759579234
f
GR
GS
[0.75 0 0 0.75 312.81001 112.45603] CT
N
f-1759579234
f
GR
GS
[0.75 0 0 0.75 318.30045 161.42927] CT
N
f-1759579234
f
GR
GS
[0.75 0 0 0.75 323.79089 213.06371] CT
N
f-1759579234
f
GR
GS
[0.75 0 0 0.75 329.28133 262.64178] CT
N
f-1759579234
f
GR
GS
[0.75 0 0 0.75 334.77177 305.61864] CT
N
f-1759579234
f
GR
GS
[0.75 0 0 0.75 340.26221 341.44133] CT
N
f-1759579234
f
GR
GS
[0.75 0 0 0.75 345.75266 368.90022] CT
N
f-1759579234
f
GR
GS
[0.75 0 0 0.75 351.2431 389.01483] CT
N
f-1759579234
f
GR
GS
[0.75 0 0 0.75 356.73354 402.66653] CT
N
f-1759579234
f
GR
GS
[0.75 0 0 0.75 362.22398 411.82524] CT
N
f-1759579234
f
GR
GS
[0.75 0 0 0.75 367.71444 417.40689] CT
N
f-1759579234
f
GR
GS
[0.75 0 0 0.75 373.20488 420.63834] CT
N
f-1759579234
f
GR
GS
[0.75 0 0 0.75 378.69532 422.80997] CT
N
f-1759579234
f
GR
GS
[0.75 0 0 0.75 384.18576 423.38597] CT
N
f-1759579234
f
GR
GS
[0.75 0 0 0.75 0 -0.25] CT
1 LJ
0.667 LW
N
143.044 560.232 M
165.351 546.39 L
187.658 515.06 L
209.965 478.493 L
232.273 428.914 L
254.58 368.538 L
276.887 299.395 L
299.194 225.754 L
321.502 157.072 L
343.809 99.511 L
366.116 61.352 L
388.423 48.317 L
410.731 62.483 L
433.038 99.373 L
455.345 154.304 L
477.652 219.409 L
499.959 285.714 L
522.267 347.913 L
544.574 403.075 L
566.881 448.57 L
589.188 483.845 L
611.496 510.607 L
633.803 530.31 L
656.11 543.668 L
678.417 552.458 L
700.725 558.202 L
723.032 561.87 L
745.339 563.601 L
767.646 564.362 L
789.953 564.846 L
812.261 564.846 L
S
GR
GS
[0.75 0 0 0.75 107.28282 419.92427] CT
N
/f1737057230{-3.464 -2 M
-1.155 -2 L
0 -4 L
1.155 -2 L
3.464 -2 L
2 0 L
3.464 2 L
1.155 2 L
0 4 L
-1.155 2 L
-3.464 2 L
-2 0 L
cp}def
f1737057230
f
GR
GS
[0.75 0 0 0.75 107.28282 419.92427] CT
10.0 ML
N
-3.464 -2 M
-1.155 -2 L
0 -4 L
1.155 -2 L
3.464 -2 L
2 0 L
3.464 2 L
1.155 2 L
0 4 L
-1.155 2 L
-3.464 2 L
-2 0 L
cp
S
GR
GS
[0.75 0 0 0.75 124.01324 409.54247] CT
N
f1737057230
f
GR
GS
[0.75 0 0 0.75 124.01324 409.54247] CT
10.0 ML
N
-3.464 -2 M
-1.155 -2 L
0 -4 L
1.155 -2 L
3.464 -2 L
2 0 L
3.464 2 L
1.155 2 L
0 4 L
-1.155 2 L
-3.464 2 L
-2 0 L
cp
S
GR
GS
[0.75 0 0 0.75 140.74366 386.04495] CT
N
f1737057230
f
GR
GS
[0.75 0 0 0.75 140.74366 386.04495] CT
10.0 ML
N
-3.464 -2 M
-1.155 -2 L
0 -4 L
1.155 -2 L
3.464 -2 L
2 0 L
3.464 2 L
1.155 2 L
0 4 L
-1.155 2 L
-3.464 2 L
-2 0 L
cp
S
GR
GS
[0.75 0 0 0.75 157.47409 358.61971] CT
N
f1737057230
f
GR
GS
[0.75 0 0 0.75 157.47409 358.61971] CT
10.0 ML
N
-3.464 -2 M
-1.155 -2 L
0 -4 L
1.155 -2 L
3.464 -2 L
2 0 L
3.464 2 L
1.155 2 L
0 4 L
-1.155 2 L
-3.464 2 L
-2 0 L
cp
S
GR
GS
[0.75 0 0 0.75 174.20451 321.43555] CT
N
f1737057230
f
GR
GS
[0.75 0 0 0.75 174.20451 321.43555] CT
10.0 ML
N
-3.464 -2 M
-1.155 -2 L
0 -4 L
1.155 -2 L
3.464 -2 L
2 0 L
3.464 2 L
1.155 2 L
0 4 L
-1.155 2 L
-3.464 2 L
-2 0 L
cp
S
GR
GS
[0.75 0 0 0.75 190.93493 276.15361] CT
N
f1737057230
f
GR
GS
[0.75 0 0 0.75 190.93493 276.15361] CT
10.0 ML
N
-3.464 -2 M
-1.155 -2 L
0 -4 L
1.155 -2 L
3.464 -2 L
2 0 L
3.464 2 L
1.155 2 L
0 4 L
-1.155 2 L
-3.464 2 L
-2 0 L
cp
S
GR
GS
[0.75 0 0 0.75 207.66536 224.29652] CT
N
f1737057230
f
GR
GS
[0.75 0 0 0.75 207.66536 224.29652] CT
10.0 ML
N
-3.464 -2 M
-1.155 -2 L
0 -4 L
1.155 -2 L
3.464 -2 L
2 0 L
3.464 2 L
1.155 2 L
0 4 L
-1.155 2 L
-3.464 2 L
-2 0 L
cp
S
GR
GS
[0.75 0 0 0.75 224.39577 169.06532] CT
N
f1737057230
f
GR
GS
[0.75 0 0 0.75 224.39577 169.06532] CT
10.0 ML
N
-3.464 -2 M
-1.155 -2 L
0 -4 L
1.155 -2 L
3.464 -2 L
2 0 L
3.464 2 L
1.155 2 L
0 4 L
-1.155 2 L
-3.464 2 L
-2 0 L
cp
S
GR
GS
[0.75 0 0 0.75 241.12621 117.55426] CT
N
f1737057230
f
GR
GS
[0.75 0 0 0.75 241.12621 117.55426] CT
10.0 ML
N
-3.464 -2 M
-1.155 -2 L
0 -4 L
1.155 -2 L
3.464 -2 L
2 0 L
3.464 2 L
1.155 2 L
0 4 L
-1.155 2 L
-3.464 2 L
-2 0 L
cp
S
GR
GS
[0.75 0 0 0.75 257.85663 74.38329] CT
N
f1737057230
f
GR
GS
[0.75 0 0 0.75 257.85663 74.38329] CT
10.0 ML
N
-3.464 -2 M
-1.155 -2 L
0 -4 L
1.155 -2 L
3.464 -2 L
2 0 L
3.464 2 L
1.155 2 L
0 4 L
-1.155 2 L
-3.464 2 L
-2 0 L
cp
S
GR
GS
[0.75 0 0 0.75 274.58707 45.7641] CT
N
f1737057230
f
GR
GS
[0.75 0 0 0.75 274.58707 45.7641] CT
10.0 ML
N
-3.464 -2 M
-1.155 -2 L
0 -4 L
1.155 -2 L
3.464 -2 L
2 0 L
3.464 2 L
1.155 2 L
0 4 L
-1.155 2 L
-3.464 2 L
-2 0 L
cp
S
GR
GS
[0.75 0 0 0.75 291.31748 35.98792] CT
N
f1737057230
f
GR
GS
[0.75 0 0 0.75 291.31748 35.98792] CT
10.0 ML
N
-3.464 -2 M
-1.155 -2 L
0 -4 L
1.155 -2 L
3.464 -2 L
2 0 L
3.464 2 L
1.155 2 L
0 4 L
-1.155 2 L
-3.464 2 L
-2 0 L
cp
S
GR
GS
[0.75 0 0 0.75 308.0479 46.61195] CT
N
f1737057230
f
GR
GS
[0.75 0 0 0.75 308.0479 46.61195] CT
10.0 ML
N
-3.464 -2 M
-1.155 -2 L
0 -4 L
1.155 -2 L
3.464 -2 L
2 0 L
3.464 2 L
1.155 2 L
0 4 L
-1.155 2 L
-3.464 2 L
-2 0 L
cp
S
GR
GS
[0.75 0 0 0.75 324.77834 74.27948] CT
N
f1737057230
f
GR
GS
[0.75 0 0 0.75 324.77834 74.27948] CT
10.0 ML
N
-3.464 -2 M
-1.155 -2 L
0 -4 L
1.155 -2 L
3.464 -2 L
2 0 L
3.464 2 L
1.155 2 L
0 4 L
-1.155 2 L
-3.464 2 L
-2 0 L
cp
S
GR
GS
[0.75 0 0 0.75 341.50875 115.4779] CT
N
f1737057230
f
GR
GS
[0.75 0 0 0.75 341.50875 115.4779] CT
10.0 ML
N
-3.464 -2 M
-1.155 -2 L
0 -4 L
1.155 -2 L
3.464 -2 L
2 0 L
3.464 2 L
1.155 2 L
0 4 L
-1.155 2 L
-3.464 2 L
-2 0 L
cp
S
GR
GS
[0.75 0 0 0.75 358.23917 164.30699] CT
N
f1737057230
f
GR
GS
[0.75 0 0 0.75 358.23917 164.30699] CT
10.0 ML
N
-3.464 -2 M
-1.155 -2 L
0 -4 L
1.155 -2 L
3.464 -2 L
2 0 L
3.464 2 L
1.155 2 L
0 4 L
-1.155 2 L
-3.464 2 L
-2 0 L
cp
S
GR
GS
[0.75 0 0 0.75 374.9696 214.03581] CT
N
f1737057230
f
GR
GS
[0.75 0 0 0.75 374.9696 214.03581] CT
10.0 ML
N
-3.464 -2 M
-1.155 -2 L
0 -4 L
1.155 -2 L
3.464 -2 L
2 0 L
3.464 2 L
1.155 2 L
0 4 L
-1.155 2 L
-3.464 2 L
-2 0 L
cp
S
GR
GS
[0.75 0 0 0.75 391.70004 260.68472] CT
N
f1737057230
f
GR
GS
[0.75 0 0 0.75 391.70004 260.68472] CT
10.0 ML
N
-3.464 -2 M
-1.155 -2 L
0 -4 L
1.155 -2 L
3.464 -2 L
2 0 L
3.464 2 L
1.155 2 L
0 4 L
-1.155 2 L
-3.464 2 L
-2 0 L
cp
S
GR
GS
[0.75 0 0 0.75 408.43044 302.05619] CT
N
f1737057230
f
GR
GS
[0.75 0 0 0.75 408.43044 302.05619] CT
10.0 ML
N
-3.464 -2 M
-1.155 -2 L
0 -4 L
1.155 -2 L
3.464 -2 L
2 0 L
3.464 2 L
1.155 2 L
0 4 L
-1.155 2 L
-3.464 2 L
-2 0 L
cp
S
GR
GS
[0.75 0 0 0.75 425.16087 336.17771] CT
N
f1737057230
f
GR
GS
[0.75 0 0 0.75 425.16087 336.17771] CT
10.0 ML
N
-3.464 -2 M
-1.155 -2 L
0 -4 L
1.155 -2 L
3.464 -2 L
2 0 L
3.464 2 L
1.155 2 L
0 4 L
-1.155 2 L
-3.464 2 L
-2 0 L
cp
S
GR
GS
[0.75 0 0 0.75 441.89131 362.634] CT
N
f1737057230
f
GR
GS
[0.75 0 0 0.75 441.89131 362.634] CT
10.0 ML
N
-3.464 -2 M
-1.155 -2 L
0 -4 L
1.155 -2 L
3.464 -2 L
2 0 L
3.464 2 L
1.155 2 L
0 4 L
-1.155 2 L
-3.464 2 L
-2 0 L
cp
S
GR
GS
[0.75 0 0 0.75 458.6217 382.7055] CT
N
f1737057230
f
GR
GS
[0.75 0 0 0.75 458.6217 382.7055] CT
10.0 ML
N
-3.464 -2 M
-1.155 -2 L
0 -4 L
1.155 -2 L
3.464 -2 L
2 0 L
3.464 2 L
1.155 2 L
0 4 L
-1.155 2 L
-3.464 2 L
-2 0 L
cp
S
GR
GS
[0.75 0 0 0.75 475.35214 397.48227] CT
N
f1737057230
f
GR
GS
[0.75 0 0 0.75 475.35214 397.48227] CT
10.0 ML
N
-3.464 -2 M
-1.155 -2 L
0 -4 L
1.155 -2 L
3.464 -2 L
2 0 L
3.464 2 L
1.155 2 L
0 4 L
-1.155 2 L
-3.464 2 L
-2 0 L
cp
S
GR
GS
[0.75 0 0 0.75 492.08258 407.5007] CT
N
f1737057230
f
GR
GS
[0.75 0 0 0.75 492.08258 407.5007] CT
10.0 ML
N
-3.464 -2 M
-1.155 -2 L
0 -4 L
1.155 -2 L
3.464 -2 L
2 0 L
3.464 2 L
1.155 2 L
0 4 L
-1.155 2 L
-3.464 2 L
-2 0 L
cp
S
GR
GS
[0.75 0 0 0.75 508.81297 414.09314] CT
N
f1737057230
f
GR
GS
[0.75 0 0 0.75 508.81297 414.09314] CT
10.0 ML
N
-3.464 -2 M
-1.155 -2 L
0 -4 L
1.155 -2 L
3.464 -2 L
2 0 L
3.464 2 L
1.155 2 L
0 4 L
-1.155 2 L
-3.464 2 L
-2 0 L
cp
S
GR
GS
[0.75 0 0 0.75 525.54341 418.40157] CT
N
f1737057230
f
GR
GS
[0.75 0 0 0.75 525.54341 418.40157] CT
10.0 ML
N
-3.464 -2 M
-1.155 -2 L
0 -4 L
1.155 -2 L
3.464 -2 L
2 0 L
3.464 2 L
1.155 2 L
0 4 L
-1.155 2 L
-3.464 2 L
-2 0 L
cp
S
GR
GS
[0.75 0 0 0.75 542.27385 421.15277] CT
N
f1737057230
f
GR
GS
[0.75 0 0 0.75 542.27385 421.15277] CT
10.0 ML
N
-3.464 -2 M
-1.155 -2 L
0 -4 L
1.155 -2 L
3.464 -2 L
2 0 L
3.464 2 L
1.155 2 L
0 4 L
-1.155 2 L
-3.464 2 L
-2 0 L
cp
S
GR
GS
[0.75 0 0 0.75 559.00424 422.45049] CT
N
f1737057230
f
GR
GS
[0.75 0 0 0.75 559.00424 422.45049] CT
10.0 ML
N
-3.464 -2 M
-1.155 -2 L
0 -4 L
1.155 -2 L
3.464 -2 L
2 0 L
3.464 2 L
1.155 2 L
0 4 L
-1.155 2 L
-3.464 2 L
-2 0 L
cp
S
GR
GS
[0.75 0 0 0.75 575.73468 423.0215] CT
N
f1737057230
f
GR
GS
[0.75 0 0 0.75 575.73468 423.0215] CT
10.0 ML
N
-3.464 -2 M
-1.155 -2 L
0 -4 L
1.155 -2 L
3.464 -2 L
2 0 L
3.464 2 L
1.155 2 L
0 4 L
-1.155 2 L
-3.464 2 L
-2 0 L
cp
S
GR
GS
[0.75 0 0 0.75 592.46512 423.38487] CT
N
f1737057230
f
GR
GS
[0.75 0 0 0.75 592.46512 423.38487] CT
10.0 ML
N
-3.464 -2 M
-1.155 -2 L
0 -4 L
1.155 -2 L
3.464 -2 L
2 0 L
3.464 2 L
1.155 2 L
0 4 L
-1.155 2 L
-3.464 2 L
-2 0 L
cp
S
GR
GS
[0.75 0 0 0.75 609.19556 423.38487] CT
N
f1737057230
f
GR
GS
[0.75 0 0 0.75 609.19556 423.38487] CT
10.0 ML
N
-3.464 -2 M
-1.155 -2 L
0 -4 L
1.155 -2 L
3.464 -2 L
2 0 L
3.464 2 L
1.155 2 L
0 4 L
-1.155 2 L
-3.464 2 L
-2 0 L
cp
S
GR
GS
[0.75 0 0 0.75 0 -0.25] CT
1 LJ
0.667 LW
N
143.044 560.232 M
165.351 546.39 L
187.658 515.06 L
209.965 478.493 L
232.273 428.914 L
254.58 368.538 L
276.887 299.395 L
299.194 225.754 L
321.502 157.072 L
343.809 99.511 L
366.116 61.352 L
388.423 48.317 L
410.731 62.483 L
433.038 99.373 L
455.345 154.304 L
477.652 219.409 L
499.959 285.714 L
522.267 347.913 L
544.574 403.075 L
566.881 448.57 L
589.188 483.845 L
611.496 510.607 L
633.803 530.31 L
656.11 543.668 L
678.417 552.458 L
700.725 558.202 L
723.032 561.87 L
745.339 563.601 L
767.646 564.362 L
789.953 564.846 L
812.261 564.846 L
S
GR
GS
[0.75 0 0 0.75 107.28282 419.92427] CT
N
/f1022997606{0 5.332 M
-4.618 -2.666 L
4.618 -2.666 L
cp}def
f1022997606
f
GR
GS
[0.75 0 0 0.75 107.28282 419.92427] CT
10.0 ML
N
0 5.332 M
-4.618 -2.666 L
4.618 -2.666 L
cp
S
GR
GS
[0.75 0 0 0.75 124.01324 409.54247] CT
N
f1022997606
f
GR
GS
[0.75 0 0 0.75 124.01324 409.54247] CT
10.0 ML
N
0 5.332 M
-4.618 -2.666 L
4.618 -2.666 L
cp
S
GR
GS
[0.75 0 0 0.75 140.74366 386.04495] CT
N
f1022997606
f
GR
GS
[0.75 0 0 0.75 140.74366 386.04495] CT
10.0 ML
N
0 5.332 M
-4.618 -2.666 L
4.618 -2.666 L
cp
S
GR
GS
[0.75 0 0 0.75 157.47409 358.61971] CT
N
f1022997606
f
GR
GS
[0.75 0 0 0.75 157.47409 358.61971] CT
10.0 ML
N
0 5.332 M
-4.618 -2.666 L
4.618 -2.666 L
cp
S
GR
GS
[0.75 0 0 0.75 174.20451 321.43555] CT
N
f1022997606
f
GR
GS
[0.75 0 0 0.75 174.20451 321.43555] CT
10.0 ML
N
0 5.332 M
-4.618 -2.666 L
4.618 -2.666 L
cp
S
GR
GS
[0.75 0 0 0.75 190.93493 276.15361] CT
N
f1022997606
f
GR
GS
[0.75 0 0 0.75 190.93493 276.15361] CT
10.0 ML
N
0 5.332 M
-4.618 -2.666 L
4.618 -2.666 L
cp
S
GR
GS
[0.75 0 0 0.75 207.66536 224.29652] CT
N
f1022997606
f
GR
GS
[0.75 0 0 0.75 207.66536 224.29652] CT
10.0 ML
N
0 5.332 M
-4.618 -2.666 L
4.618 -2.666 L
cp
S
GR
GS
[0.75 0 0 0.75 224.39577 169.06532] CT
N
f1022997606
f
GR
GS
[0.75 0 0 0.75 224.39577 169.06532] CT
10.0 ML
N
0 5.332 M
-4.618 -2.666 L
4.618 -2.666 L
cp
S
GR
GS
[0.75 0 0 0.75 241.12621 117.55426] CT
N
f1022997606
f
GR
GS
[0.75 0 0 0.75 241.12621 117.55426] CT
10.0 ML
N
0 5.332 M
-4.618 -2.666 L
4.618 -2.666 L
cp
S
GR
GS
[0.75 0 0 0.75 257.85663 74.38329] CT
N
f1022997606
f
GR
GS
[0.75 0 0 0.75 257.85663 74.38329] CT
10.0 ML
N
0 5.332 M
-4.618 -2.666 L
4.618 -2.666 L
cp
S
GR
GS
[0.75 0 0 0.75 274.58707 45.7641] CT
N
f1022997606
f
GR
GS
[0.75 0 0 0.75 274.58707 45.7641] CT
10.0 ML
N
0 5.332 M
-4.618 -2.666 L
4.618 -2.666 L
cp
S
GR
GS
[0.75 0 0 0.75 291.31748 35.98792] CT
N
f1022997606
f
GR
GS
[0.75 0 0 0.75 291.31748 35.98792] CT
10.0 ML
N
0 5.332 M
-4.618 -2.666 L
4.618 -2.666 L
cp
S
GR
GS
[0.75 0 0 0.75 308.0479 46.61195] CT
N
f1022997606
f
GR
GS
[0.75 0 0 0.75 308.0479 46.61195] CT
10.0 ML
N
0 5.332 M
-4.618 -2.666 L
4.618 -2.666 L
cp
S
GR
GS
[0.75 0 0 0.75 324.77834 74.27948] CT
N
f1022997606
f
GR
GS
[0.75 0 0 0.75 324.77834 74.27948] CT
10.0 ML
N
0 5.332 M
-4.618 -2.666 L
4.618 -2.666 L
cp
S
GR
GS
[0.75 0 0 0.75 341.50875 115.4779] CT
N
f1022997606
f
GR
GS
[0.75 0 0 0.75 341.50875 115.4779] CT
10.0 ML
N
0 5.332 M
-4.618 -2.666 L
4.618 -2.666 L
cp
S
GR
GS
[0.75 0 0 0.75 358.23917 164.30699] CT
N
f1022997606
f
GR
GS
[0.75 0 0 0.75 358.23917 164.30699] CT
10.0 ML
N
0 5.332 M
-4.618 -2.666 L
4.618 -2.666 L
cp
S
GR
GS
[0.75 0 0 0.75 374.9696 214.03581] CT
N
f1022997606
f
GR
GS
[0.75 0 0 0.75 374.9696 214.03581] CT
10.0 ML
N
0 5.332 M
-4.618 -2.666 L
4.618 -2.666 L
cp
S
GR
GS
[0.75 0 0 0.75 391.70004 260.68472] CT
N
f1022997606
f
GR
GS
[0.75 0 0 0.75 391.70004 260.68472] CT
10.0 ML
N
0 5.332 M
-4.618 -2.666 L
4.618 -2.666 L
cp
S
GR
GS
[0.75 0 0 0.75 408.43044 302.05619] CT
N
f1022997606
f
GR
GS
[0.75 0 0 0.75 408.43044 302.05619] CT
10.0 ML
N
0 5.332 M
-4.618 -2.666 L
4.618 -2.666 L
cp
S
GR
GS
[0.75 0 0 0.75 425.16087 336.17771] CT
N
f1022997606
f
GR
GS
[0.75 0 0 0.75 425.16087 336.17771] CT
10.0 ML
N
0 5.332 M
-4.618 -2.666 L
4.618 -2.666 L
cp
S
GR
GS
[0.75 0 0 0.75 441.89131 362.634] CT
N
f1022997606
f
GR
GS
[0.75 0 0 0.75 441.89131 362.634] CT
10.0 ML
N
0 5.332 M
-4.618 -2.666 L
4.618 -2.666 L
cp
S
GR
GS
[0.75 0 0 0.75 458.6217 382.7055] CT
N
f1022997606
f
GR
GS
[0.75 0 0 0.75 458.6217 382.7055] CT
10.0 ML
N
0 5.332 M
-4.618 -2.666 L
4.618 -2.666 L
cp
S
GR
GS
[0.75 0 0 0.75 475.35214 397.48227] CT
N
f1022997606
f
GR
GS
[0.75 0 0 0.75 475.35214 397.48227] CT
10.0 ML
N
0 5.332 M
-4.618 -2.666 L
4.618 -2.666 L
cp
S
GR
GS
[0.75 0 0 0.75 492.08258 407.5007] CT
N
f1022997606
f
GR
GS
[0.75 0 0 0.75 492.08258 407.5007] CT
10.0 ML
N
0 5.332 M
-4.618 -2.666 L
4.618 -2.666 L
cp
S
GR
GS
[0.75 0 0 0.75 508.81297 414.09314] CT
N
f1022997606
f
GR
GS
[0.75 0 0 0.75 508.81297 414.09314] CT
10.0 ML
N
0 5.332 M
-4.618 -2.666 L
4.618 -2.666 L
cp
S
GR
GS
[0.75 0 0 0.75 525.54341 418.40157] CT
N
f1022997606
f
GR
GS
[0.75 0 0 0.75 525.54341 418.40157] CT
10.0 ML
N
0 5.332 M
-4.618 -2.666 L
4.618 -2.666 L
cp
S
GR
GS
[0.75 0 0 0.75 542.27385 421.15277] CT
N
f1022997606
f
GR
GS
[0.75 0 0 0.75 542.27385 421.15277] CT
10.0 ML
N
0 5.332 M
-4.618 -2.666 L
4.618 -2.666 L
cp
S
GR
GS
[0.75 0 0 0.75 559.00424 422.45049] CT
N
f1022997606
f
GR
GS
[0.75 0 0 0.75 559.00424 422.45049] CT
10.0 ML
N
0 5.332 M
-4.618 -2.666 L
4.618 -2.666 L
cp
S
GR
GS
[0.75 0 0 0.75 575.73468 423.0215] CT
N
f1022997606
f
GR
GS
[0.75 0 0 0.75 575.73468 423.0215] CT
10.0 ML
N
0 5.332 M
-4.618 -2.666 L
4.618 -2.666 L
cp
S
GR
GS
[0.75 0 0 0.75 592.46512 423.38487] CT
N
f1022997606
f
GR
GS
[0.75 0 0 0.75 592.46512 423.38487] CT
10.0 ML
N
0 5.332 M
-4.618 -2.666 L
4.618 -2.666 L
cp
S
GR
GS
[0.75 0 0 0.75 609.19556 423.38487] CT
N
f1022997606
f
GR
GS
[0.75 0 0 0.75 609.19556 423.38487] CT
10.0 ML
N
0 5.332 M
-4.618 -2.666 L
4.618 -2.666 L
cp
S
GR
GS
[0.75 0 0 0.75 0 -0.25] CT
1 GC
N
/f-2041188830{803 217 M
803 60 L
716 60 L
716 217 L
cp}def
f-2041188830
f
GR
GS
[0.75 0 0 0.75 572.25 60.8304] CT
/Helvetica 21.6 F
GS
[1 0 0 1 0 0] CT
0 8.5 moveto 
1 -1 scale
(PR) t 
GR
GR
GS
[0.75 0 0 0.75 0 -0.25] CT
1 LJ
0.667 LW
N
720 81.441 M
760 81.441 L
S
GR
GS
[0.75 0 0 0.75 555 60.8304] CT
N
f351177404
f
GR
GS
[0.75 0 0 0.75 555 60.8304] CT
10.0 ML
N
4 0 M
4 -2.209 2.209 -4 0 -4 C
-2.209 -4 -4 -2.209 -4 0 C
-4 2.209 -2.209 4 0 4 C
2.209 4 4 2.209 4 0 C
cp
S
GR
GS
[0.75 0 0 0.75 572.25 89.36013] CT
/Helvetica 21.6 F
GS
[1 0 0 1 0 0] CT
0 8.5 moveto 
1 -1 scale
(IAR) t 
GR
GR
GS
[0.75 0 0 0.75 0 -0.25] CT
1 LJ
0.667 LW
N
720 119.48 M
760 119.48 L
S
GR
GS
[0.75 0 0 0.75 555 89.36013] CT
N
f-1759579234
f
GR
GS
[0.75 0 0 0.75 572.25 117.88987] CT
/Helvetica 21.6 F
GS
[1 0 0 1 0 0] CT
0 8.5 moveto 
1 -1 scale
(DD) t 
GR
GR
GS
[0.75 0 0 0.75 0 -0.25] CT
1 LJ
0.667 LW
N
720 157.52 M
760 157.52 L
S
GR
GS
[0.75 0 0 0.75 555 117.88987] CT
N
f1737057230
f
GR
GS
[0.75 0 0 0.75 555 117.88987] CT
10.0 ML
N
-3.464 -2 M
-1.155 -2 L
0 -4 L
1.155 -2 L
3.464 -2 L
2 0 L
3.464 2 L
1.155 2 L
0 4 L
-1.155 2 L
-3.464 2 L
-2 0 L
cp
S
GR
GS
[0.75 0 0 0.75 572.25 146.4196] CT
/Helvetica 21.6 F
GS
[1 0 0 1 0 0] CT
0 8.5 moveto 
1 -1 scale
(SD) t 
GR
GR
GS
[0.75 0 0 0.75 0 -0.25] CT
1 LJ
0.667 LW
N
720 195.559 M
760 195.559 L
S
GR
GS
[0.75 0 0 0.75 555 146.41961] CT
N
f1022997606
f
GR
GS
[0.75 0 0 0.75 555 146.41961] CT
10.0 ML
N
0 5.332 M
-4.618 -2.666 L
4.618 -2.666 L
cp
S
GR
GS
[0.75 0 0 0.75 0 -0.25] CT
0.149 GC
10.0 ML
0.667 LW
N
716 217 M
716 60 L
803 60 L
803 217 L
cp
S
GR
%%Trailer
%%Pages: 1
%%EOF
