%!PS-Adobe-3.0 EPSF-3.0
%%Creator: (MATLAB, The Mathworks, Inc. Version 9.5.0.944444 \(R2018b\). Operating System: Windows 10)
%%Title: (C:/Users/Alex/Documents/PhD Docs/01. GIT/my_phd_thesis/Chapter8/Figures/capsloc_res/02102019_meanPosError3D2D_v2.eps)
%%CreationDate: 2019-11-02T00:19:53
%%Pages: (atend)
%%BoundingBox: 0 0 603 390
%%LanguageLevel: 3
%%EndComments
%%BeginProlog
%%BeginResource: procset (Apache XML Graphics Std ProcSet) 1.2 0
%%Version: 1.2 0
%%Copyright: (Copyright 2001-2003,2010 The Apache Software Foundation. License terms: http://www.apache.org/licenses/LICENSE-2.0)
/bd{bind def}bind def
/ld{load def}bd
/GR/grestore ld
/GS/gsave ld
/RM/rmoveto ld
/C/curveto ld
/t/show ld
/L/lineto ld
/ML/setmiterlimit ld
/CT/concat ld
/f/fill ld
/N/newpath ld
/S/stroke ld
/CC/setcmykcolor ld
/A/ashow ld
/cp/closepath ld
/RC/setrgbcolor ld
/LJ/setlinejoin ld
/GC/setgray ld
/LW/setlinewidth ld
/M/moveto ld
/re {4 2 roll M
1 index 0 rlineto
0 exch rlineto
neg 0 rlineto
cp } bd
/_ctm matrix def
/_tm matrix def
/BT { _ctm currentmatrix pop matrix _tm copy pop 0 0 moveto } bd
/ET { _ctm setmatrix } bd
/iTm { _ctm setmatrix _tm concat } bd
/Tm { _tm astore pop iTm 0 0 moveto } bd
/ux 0.0 def
/uy 0.0 def
/F {
  /Tp exch def
  /Tf exch def
  Tf findfont Tp scalefont setfont
  /cf Tf def  /cs Tp def
} bd
/ULS {currentpoint /uy exch def /ux exch def} bd
/ULE {
  /Tcx currentpoint pop def
  gsave
  newpath
  cf findfont cs scalefont dup
  /FontMatrix get 0 get /Ts exch def /FontInfo get dup
  /UnderlinePosition get Ts mul /To exch def
  /UnderlineThickness get Ts mul /Tt exch def
  ux uy To add moveto  Tcx uy To add lineto
  Tt setlinewidth stroke
  grestore
} bd
/OLE {
  /Tcx currentpoint pop def
  gsave
  newpath
  cf findfont cs scalefont dup
  /FontMatrix get 0 get /Ts exch def /FontInfo get dup
  /UnderlinePosition get Ts mul /To exch def
  /UnderlineThickness get Ts mul /Tt exch def
  ux uy To add cs add moveto Tcx uy To add cs add lineto
  Tt setlinewidth stroke
  grestore
} bd
/SOE {
  /Tcx currentpoint pop def
  gsave
  newpath
  cf findfont cs scalefont dup
  /FontMatrix get 0 get /Ts exch def /FontInfo get dup
  /UnderlinePosition get Ts mul /To exch def
  /UnderlineThickness get Ts mul /Tt exch def
  ux uy To add cs 10 mul 26 idiv add moveto Tcx uy To add cs 10 mul 26 idiv add lineto
  Tt setlinewidth stroke
  grestore
} bd
/QT {
/Y22 exch store
/X22 exch store
/Y21 exch store
/X21 exch store
currentpoint
/Y21 load 2 mul add 3 div exch
/X21 load 2 mul add 3 div exch
/X21 load 2 mul /X22 load add 3 div
/Y21 load 2 mul /Y22 load add 3 div
/X22 load /Y22 load curveto
} bd
/SSPD {
dup length /d exch dict def
{
/v exch def
/k exch def
currentpagedevice k known {
/cpdv currentpagedevice k get def
v cpdv ne {
/upd false def
/nullv v type /nulltype eq def
/nullcpdv cpdv type /nulltype eq def
nullv nullcpdv or
{
/upd true def
} {
/sametype v type cpdv type eq def
sametype {
v type /arraytype eq {
/vlen v length def
/cpdvlen cpdv length def
vlen cpdvlen eq {
0 1 vlen 1 sub {
/i exch def
/obj v i get def
/cpdobj cpdv i get def
obj cpdobj ne {
/upd true def
exit
} if
} for
} {
/upd true def
} ifelse
} {
v type /dicttype eq {
v {
/dv exch def
/dk exch def
/cpddv cpdv dk get def
dv cpddv ne {
/upd true def
exit
} if
} forall
} {
/upd true def
} ifelse
} ifelse
} if
} ifelse
upd true eq {
d k v put
} if
} if
} if
} forall
d length 0 gt {
d setpagedevice
} if
} bd
/RE { % /NewFontName [NewEncodingArray] /FontName RE -
  findfont dup length dict begin
  {
    1 index /FID ne
    {def} {pop pop} ifelse
  } forall
  /Encoding exch def
  /FontName 1 index def
  currentdict definefont pop
  end
} bind def
%%EndResource
%%BeginResource: procset (Apache XML Graphics EPS ProcSet) 1.0 0
%%Version: 1.0 0
%%Copyright: (Copyright 2002-2003 The Apache Software Foundation. License terms: http://www.apache.org/licenses/LICENSE-2.0)
/BeginEPSF { %def
/b4_Inc_state save def         % Save state for cleanup
/dict_count countdictstack def % Count objects on dict stack
/op_count count 1 sub def      % Count objects on operand stack
userdict begin                 % Push userdict on dict stack
/showpage { } def              % Redefine showpage, { } = null proc
0 setgray 0 setlinecap         % Prepare graphics state
1 setlinewidth 0 setlinejoin
10 setmiterlimit [ ] 0 setdash newpath
/languagelevel where           % If level not equal to 1 then
{pop languagelevel             % set strokeadjust and
1 ne                           % overprint to their defaults.
{false setstrokeadjust false setoverprint
} if
} if
} bd
/EndEPSF { %def
count op_count sub {pop} repeat            % Clean up stacks
countdictstack dict_count sub {end} repeat
b4_Inc_state restore
} bd
%%EndResource
%FOPBeginFontDict
%%IncludeResource: font Courier-Oblique
%%IncludeResource: font Courier-BoldOblique
%%IncludeResource: font Courier-Bold
%%IncludeResource: font ZapfDingbats
%%IncludeResource: font Symbol
%%IncludeResource: font Helvetica
%%IncludeResource: font Helvetica-Oblique
%%IncludeResource: font Helvetica-Bold
%%IncludeResource: font Helvetica-BoldOblique
%%IncludeResource: font Times-Roman
%%IncludeResource: font Times-Italic
%%IncludeResource: font Times-Bold
%%IncludeResource: font Times-BoldItalic
%%IncludeResource: font Courier
%FOPEndFontDict
%%BeginResource: encoding WinAnsiEncoding
/WinAnsiEncoding [
/.notdef /.notdef /.notdef /.notdef /.notdef
/.notdef /.notdef /.notdef /.notdef /.notdef
/.notdef /.notdef /.notdef /.notdef /.notdef
/.notdef /.notdef /.notdef /.notdef /.notdef
/.notdef /.notdef /.notdef /.notdef /.notdef
/.notdef /.notdef /.notdef /.notdef /.notdef
/.notdef /.notdef /space /exclam /quotedbl
/numbersign /dollar /percent /ampersand /quotesingle
/parenleft /parenright /asterisk /plus /comma
/hyphen /period /slash /zero /one
/two /three /four /five /six
/seven /eight /nine /colon /semicolon
/less /equal /greater /question /at
/A /B /C /D /E
/F /G /H /I /J
/K /L /M /N /O
/P /Q /R /S /T
/U /V /W /X /Y
/Z /bracketleft /backslash /bracketright /asciicircum
/underscore /quoteleft /a /b /c
/d /e /f /g /h
/i /j /k /l /m
/n /o /p /q /r
/s /t /u /v /w
/x /y /z /braceleft /bar
/braceright /asciitilde /bullet /Euro /bullet
/quotesinglbase /florin /quotedblbase /ellipsis /dagger
/daggerdbl /circumflex /perthousand /Scaron /guilsinglleft
/OE /bullet /Zcaron /bullet /bullet
/quoteleft /quoteright /quotedblleft /quotedblright /bullet
/endash /emdash /asciitilde /trademark /scaron
/guilsinglright /oe /bullet /zcaron /Ydieresis
/space /exclamdown /cent /sterling /currency
/yen /brokenbar /section /dieresis /copyright
/ordfeminine /guillemotleft /logicalnot /sfthyphen /registered
/macron /degree /plusminus /twosuperior /threesuperior
/acute /mu /paragraph /middot /cedilla
/onesuperior /ordmasculine /guillemotright /onequarter /onehalf
/threequarters /questiondown /Agrave /Aacute /Acircumflex
/Atilde /Adieresis /Aring /AE /Ccedilla
/Egrave /Eacute /Ecircumflex /Edieresis /Igrave
/Iacute /Icircumflex /Idieresis /Eth /Ntilde
/Ograve /Oacute /Ocircumflex /Otilde /Odieresis
/multiply /Oslash /Ugrave /Uacute /Ucircumflex
/Udieresis /Yacute /Thorn /germandbls /agrave
/aacute /acircumflex /atilde /adieresis /aring
/ae /ccedilla /egrave /eacute /ecircumflex
/edieresis /igrave /iacute /icircumflex /idieresis
/eth /ntilde /ograve /oacute /ocircumflex
/otilde /odieresis /divide /oslash /ugrave
/uacute /ucircumflex /udieresis /yacute /thorn
/ydieresis
] def
%%EndResource
%FOPBeginFontReencode
/Courier-Oblique findfont
dup length dict begin
  {1 index /FID ne {def} {pop pop} ifelse} forall
  /Encoding WinAnsiEncoding def
  currentdict
end
/Courier-Oblique exch definefont pop
/Courier-BoldOblique findfont
dup length dict begin
  {1 index /FID ne {def} {pop pop} ifelse} forall
  /Encoding WinAnsiEncoding def
  currentdict
end
/Courier-BoldOblique exch definefont pop
/Courier-Bold findfont
dup length dict begin
  {1 index /FID ne {def} {pop pop} ifelse} forall
  /Encoding WinAnsiEncoding def
  currentdict
end
/Courier-Bold exch definefont pop
/Helvetica findfont
dup length dict begin
  {1 index /FID ne {def} {pop pop} ifelse} forall
  /Encoding WinAnsiEncoding def
  currentdict
end
/Helvetica exch definefont pop
/Helvetica-Oblique findfont
dup length dict begin
  {1 index /FID ne {def} {pop pop} ifelse} forall
  /Encoding WinAnsiEncoding def
  currentdict
end
/Helvetica-Oblique exch definefont pop
/Helvetica-Bold findfont
dup length dict begin
  {1 index /FID ne {def} {pop pop} ifelse} forall
  /Encoding WinAnsiEncoding def
  currentdict
end
/Helvetica-Bold exch definefont pop
/Helvetica-BoldOblique findfont
dup length dict begin
  {1 index /FID ne {def} {pop pop} ifelse} forall
  /Encoding WinAnsiEncoding def
  currentdict
end
/Helvetica-BoldOblique exch definefont pop
/Times-Roman findfont
dup length dict begin
  {1 index /FID ne {def} {pop pop} ifelse} forall
  /Encoding WinAnsiEncoding def
  currentdict
end
/Times-Roman exch definefont pop
/Times-Italic findfont
dup length dict begin
  {1 index /FID ne {def} {pop pop} ifelse} forall
  /Encoding WinAnsiEncoding def
  currentdict
end
/Times-Italic exch definefont pop
/Times-Bold findfont
dup length dict begin
  {1 index /FID ne {def} {pop pop} ifelse} forall
  /Encoding WinAnsiEncoding def
  currentdict
end
/Times-Bold exch definefont pop
/Times-BoldItalic findfont
dup length dict begin
  {1 index /FID ne {def} {pop pop} ifelse} forall
  /Encoding WinAnsiEncoding def
  currentdict
end
/Times-BoldItalic exch definefont pop
/Courier findfont
dup length dict begin
  {1 index /FID ne {def} {pop pop} ifelse} forall
  /Encoding WinAnsiEncoding def
  currentdict
end
/Courier exch definefont pop
%FOPEndFontReencode
%%EndProlog
%%Page: 1 1
%%PageBoundingBox: 0 0 603 390
%%BeginPageSetup
[1 0 0 -1 0 390] CT
%%EndPageSetup
GS
[0.75 0 0 0.75 0 0] CT
1 GC
N
0 0 804 520 re
f
GR
GS
[0.75 0 0 0.75 0 0] CT
1 GC
N
0 0 804 520 re
f
GR
GS
[0.75 0 0 0.75 0 0] CT
1 GC
N
105 463 M
366 463 L
366 39 L
105 39 L
cp
f
GR
GS
[0.75 0 0 0.75 0 0] CT
0.149 GC
1 LJ
0.667 LW
N
105 463 M
366 463 L
S
GR
GS
[0.75 0 0 0.75 0 0] CT
0 0.447 0.741 RC
N
227.824 463 M
227.824 217.606 L
166.412 217.606 L
166.412 463 L
cp
304.588 463 M
304.588 394.576 L
243.176 394.576 L
243.176 463 L
cp
f
GR
GS
[0.75 0 0 0.75 0 0] CT
0 0.447 0.741 RC
10.0 ML
0.667 LW
N
166.412 463 M
166.412 217.606 L
227.824 217.606 L
227.824 463 L
cp
S
GR
GS
[0.75 0 0 0.75 0 0] CT
0 0.447 0.741 RC
10.0 ML
0.667 LW
N
243.176 463 M
243.176 394.576 L
304.588 394.576 L
304.588 463 L
cp
S
GR
GS
[0.75 0 0 0.75 0 0] CT
0.8 GC
N
227.824 217.606 M
227.824 92.839 L
166.412 92.839 L
166.412 217.606 L
cp
304.588 394.576 M
304.588 346.562 L
243.176 346.562 L
243.176 394.576 L
cp
f
GR
GS
[0.75 0 0 0.75 0 0] CT
0.8 GC
10.0 ML
0.667 LW
N
166.412 217.606 M
166.412 92.839 L
227.824 92.839 L
227.824 217.606 L
cp
S
GR
GS
[0.75 0 0 0.75 0 0] CT
0.8 GC
10.0 ML
0.667 LW
N
243.176 394.576 M
243.176 346.562 L
304.588 346.562 L
304.588 394.576 L
cp
S
GR
GS
[0.75 0 0 0.75 0 0] CT
0.149 GC
2 setlinecap
1 LJ
0.667 LW
N
105 463 M
366 463 L
S
GR
GS
[0.75 0 0 0.75 0 0] CT
0.149 GC
2 setlinecap
1 LJ
0.667 LW
N
105 39 M
366 39 L
S
GR
GS
[0.75 0 0 0.75 0 0] CT
0.149 GC
2 setlinecap
1 LJ
0.667 LW
N
197.118 463 M
197.118 458.76 L
S
GR
GS
[0.75 0 0 0.75 0 0] CT
0.149 GC
2 setlinecap
1 LJ
0.667 LW
N
273.882 463 M
273.882 458.76 L
S
GR
GS
[0.75 0 0 0.75 0 0] CT
0.149 GC
2 setlinecap
1 LJ
0.667 LW
N
197.118 39 M
197.118 43.24 L
S
GR
GS
[0.75 0 0 0.75 0 0] CT
0.149 GC
2 setlinecap
1 LJ
0.667 LW
N
273.882 39 M
273.882 43.24 L
S
GR
GS
[0.75 0 0 0.75 147.83823 352.05] CT
0.149 GC
/Helvetica 18.667 F
GS
[1 0 0 1 0 0] CT
-15.5 19 moveto 
1 -1 scale
(3-D) t 
GR
GR
GS
[0.75 0 0 0.75 205.41177 352.05] CT
0.149 GC
/Helvetica 18.667 F
GS
[1 0 0 1 0 0] CT
-15.5 19 moveto 
1 -1 scale
(2-D) t 
GR
GR
GS
[0.75 0 0 0.75 0 0] CT
0.149 GC
2 setlinecap
1 LJ
0.667 LW
N
105 463 M
105 39 L
S
GR
GS
[0.75 0 0 0.75 0 0] CT
0.149 GC
2 setlinecap
1 LJ
0.667 LW
N
366 463 M
366 39 L
S
GR
GS
[0.75 0 0 0.75 0 0] CT
0.149 GC
2 setlinecap
1 LJ
0.667 LW
N
105 463 M
109.24 463 L
S
GR
GS
[0.75 0 0 0.75 0 0] CT
0.149 GC
2 setlinecap
1 LJ
0.667 LW
N
105 402.429 M
109.24 402.429 L
S
GR
GS
[0.75 0 0 0.75 0 0] CT
0.149 GC
2 setlinecap
1 LJ
0.667 LW
N
105 341.857 M
109.24 341.857 L
S
GR
GS
[0.75 0 0 0.75 0 0] CT
0.149 GC
2 setlinecap
1 LJ
0.667 LW
N
105 281.286 M
109.24 281.286 L
S
GR
GS
[0.75 0 0 0.75 0 0] CT
0.149 GC
2 setlinecap
1 LJ
0.667 LW
N
105 220.714 M
109.24 220.714 L
S
GR
GS
[0.75 0 0 0.75 0 0] CT
0.149 GC
2 setlinecap
1 LJ
0.667 LW
N
105 160.143 M
109.24 160.143 L
S
GR
GS
[0.75 0 0 0.75 0 0] CT
0.149 GC
2 setlinecap
1 LJ
0.667 LW
N
105 99.571 M
109.24 99.571 L
S
GR
GS
[0.75 0 0 0.75 0 0] CT
0.149 GC
2 setlinecap
1 LJ
0.667 LW
N
105 39 M
109.24 39 L
S
GR
GS
[0.75 0 0 0.75 0 0] CT
0.149 GC
2 setlinecap
1 LJ
0.667 LW
N
366 463 M
361.76 463 L
S
GR
GS
[0.75 0 0 0.75 0 0] CT
0.149 GC
2 setlinecap
1 LJ
0.667 LW
N
366 402.429 M
361.76 402.429 L
S
GR
GS
[0.75 0 0 0.75 0 0] CT
0.149 GC
2 setlinecap
1 LJ
0.667 LW
N
366 341.857 M
361.76 341.857 L
S
GR
GS
[0.75 0 0 0.75 0 0] CT
0.149 GC
2 setlinecap
1 LJ
0.667 LW
N
366 281.286 M
361.76 281.286 L
S
GR
GS
[0.75 0 0 0.75 0 0] CT
0.149 GC
2 setlinecap
1 LJ
0.667 LW
N
366 220.714 M
361.76 220.714 L
S
GR
GS
[0.75 0 0 0.75 0 0] CT
0.149 GC
2 setlinecap
1 LJ
0.667 LW
N
366 160.143 M
361.76 160.143 L
S
GR
GS
[0.75 0 0 0.75 0 0] CT
0.149 GC
2 setlinecap
1 LJ
0.667 LW
N
366 99.571 M
361.76 99.571 L
S
GR
GS
[0.75 0 0 0.75 0 0] CT
0.149 GC
2 setlinecap
1 LJ
0.667 LW
N
366 39 M
361.76 39 L
S
GR
GS
[0.75 0 0 0.75 73.95 347.25] CT
0.149 GC
/Helvetica 18.667 F
GS
[1 0 0 1 0 0] CT
-11 7 moveto 
1 -1 scale
(0) t 
GR
GR
GS
[0.75 0 0 0.75 73.95 301.82142] CT
0.149 GC
/Helvetica 18.667 F
GS
[1 0 0 1 0 0] CT
-11 7 moveto 
1 -1 scale
(5) t 
GR
GR
GS
[0.75 0 0 0.75 73.95 256.39286] CT
0.149 GC
/Helvetica 18.667 F
GS
[1 0 0 1 0 0] CT
-21 7 moveto 
1 -1 scale
(10) t 
GR
GR
GS
[0.75 0 0 0.75 73.95 210.96428] CT
0.149 GC
/Helvetica 18.667 F
GS
[1 0 0 1 0 0] CT
-21 7 moveto 
1 -1 scale
(15) t 
GR
GR
GS
[0.75 0 0 0.75 73.95 165.53571] CT
0.149 GC
/Helvetica 18.667 F
GS
[1 0 0 1 0 0] CT
-21 7 moveto 
1 -1 scale
(20) t 
GR
GR
GS
[0.75 0 0 0.75 73.95 120.10714] CT
0.149 GC
/Helvetica 18.667 F
GS
[1 0 0 1 0 0] CT
-21 7 moveto 
1 -1 scale
(25) t 
GR
GR
GS
[0.75 0 0 0.75 73.95 74.67857] CT
0.149 GC
/Helvetica 18.667 F
GS
[1 0 0 1 0 0] CT
-21 7 moveto 
1 -1 scale
(30) t 
GR
GR
GS
[0.75 0 0 0.75 73.95 29.25] CT
0.149 GC
/Helvetica 18.667 F
GS
[1 0 0 1 0 0] CT
-21 7 moveto 
1 -1 scale
(35) t 
GR
GR
GS
[0 -0.75 0.75 0 55.2 188.24984] CT
0.149 GC
N
-25.69 -9.533 M
-25.69 -10.626 -25.034 -11.705 QT
-24.378 -12.783 -23.362 -13.642 QT
-22.347 -14.501 -21.362 -14.986 QT
-22.222 -15.33 -22.737 -15.916 QT
-23.253 -16.501 -23.253 -17.345 QT
-23.253 -18.361 -22.636 -19.244 QT
-22.019 -20.126 -21.026 -20.791 QT
-20.034 -21.455 -18.909 -21.83 QT
-17.784 -22.205 -16.862 -22.205 QT
-16.737 -22.205 L
-15.847 -22.205 -15.151 -21.884 QT
-14.456 -21.564 -14.456 -20.798 QT
-14.456 -20.283 -14.729 -19.822 QT
-15.003 -19.361 -15.456 -19.056 QT
-15.909 -18.751 -16.409 -18.72 QT
-16.519 -18.72 L
-16.565 -18.736 -16.612 -18.775 QT
-16.659 -18.814 -16.659 -18.876 QT
-16.659 -18.939 -16.644 -18.986 QT
-16.534 -19.158 -16.472 -19.306 QT
-16.409 -19.455 -16.362 -19.587 QT
-16.315 -19.72 -16.315 -19.876 QT
-16.315 -20.501 -16.909 -20.728 QT
-17.503 -20.955 -18.253 -20.955 QT
-19.065 -20.955 -19.792 -20.626 QT
-20.519 -20.298 -20.956 -19.689 QT
-21.394 -19.08 -21.394 -18.251 QT
-21.394 -17.048 -20.261 -16.47 QT
-19.128 -15.892 -17.815 -15.892 QT
-17.659 -15.814 -17.659 -15.736 QT
-17.659 -15.408 -18.276 -15.056 QT
-18.894 -14.705 -19.269 -14.658 QT
-21.097 -14.658 -22.409 -13.408 QT
-23.003 -12.783 -23.409 -11.978 QT
-23.815 -11.173 -23.815 -10.455 QT
-23.815 -9.705 -23.347 -9.181 QT
-22.878 -8.658 -22.167 -8.416 QT
-21.456 -8.173 -20.706 -8.173 QT
-19.784 -8.173 -19.198 -8.501 QT
-18.612 -8.83 -17.987 -9.533 QT
-17.362 -10.236 -17.019 -10.533 QT
-16.675 -10.83 -16.081 -10.876 QT
-15.956 -10.876 L
-15.815 -10.814 -15.815 -10.72 QT
-15.815 -10.642 -15.909 -10.486 QT
-16.565 -9.501 -17.573 -8.697 QT
-18.581 -7.892 -19.769 -7.408 QT
-20.956 -6.923 -22.097 -6.923 QT
-22.222 -6.923 L
-23.034 -6.923 -23.847 -7.22 QT
-24.659 -7.517 -25.175 -8.103 QT
-25.69 -8.689 -25.69 -9.533 QT
cp
f
GR
GS
[0 -0.75 0.75 0 55.2 188.24984] CT
0.149 GC
N
-0.266 -2.189 M
-1.438 -3.111 -2.282 -4.306 QT
-3.126 -5.501 -3.665 -6.853 QT
-4.204 -8.205 -4.469 -9.681 QT
-4.735 -11.158 -4.735 -12.642 QT
-4.735 -14.142 -4.469 -15.619 QT
-4.204 -17.095 -3.657 -18.462 QT
-3.11 -19.83 -2.258 -21.017 QT
-1.407 -22.205 -0.266 -23.095 QT
-0.266 -23.142 -0.172 -23.142 QT
0.031 -23.142 L
0.093 -23.142 0.14 -23.087 QT
0.187 -23.033 0.187 -22.955 QT
0.187 -22.861 0.156 -22.83 QT
-0.876 -21.814 -1.555 -20.666 QT
-2.235 -19.517 -2.649 -18.22 QT
-3.063 -16.923 -3.251 -15.533 QT
-3.438 -14.142 -3.438 -12.642 QT
-3.438 -5.97 0.124 -2.501 QT
0.187 -2.439 0.187 -2.33 QT
0.187 -2.283 0.132 -2.212 QT
0.078 -2.142 0.031 -2.142 QT
-0.172 -2.142 L
-0.266 -2.142 -0.266 -2.189 QT
cp
f
GR
GS
[0 -0.75 0.75 0 55.2 188.24984] CT
0.149 GC
N
1.828 -7.392 M
1.828 -8.126 L
2.547 -8.126 3.008 -8.244 QT
3.469 -8.361 3.469 -8.798 QT
3.469 -14.533 L
3.469 -15.095 3.297 -15.345 QT
3.125 -15.595 2.813 -15.65 QT
2.5 -15.705 1.828 -15.705 QT
1.828 -16.439 L
4.875 -16.673 L
4.875 -14.626 L
5.297 -15.517 6.125 -16.095 QT
6.953 -16.673 7.922 -16.673 QT
10.344 -16.673 10.766 -14.705 QT
11.188 -15.58 11.993 -16.126 QT
12.797 -16.673 13.766 -16.673 QT
14.719 -16.673 15.368 -16.369 QT
16.016 -16.064 16.344 -15.431 QT
16.672 -14.798 16.672 -13.845 QT
16.672 -8.798 L
16.672 -8.361 17.141 -8.244 QT
17.61 -8.126 18.313 -8.126 QT
18.313 -7.392 L
13.516 -7.392 L
13.516 -8.126 L
14.219 -8.126 14.688 -8.244 QT
15.157 -8.361 15.157 -8.798 QT
15.157 -13.783 L
15.157 -14.83 14.852 -15.478 QT
14.547 -16.126 13.625 -16.126 QT
12.422 -16.126 11.633 -15.15 QT
10.844 -14.173 10.844 -12.939 QT
10.844 -8.798 L
10.844 -8.361 11.305 -8.244 QT
11.766 -8.126 12.485 -8.126 QT
12.485 -7.392 L
7.672 -7.392 L
7.672 -8.126 L
8.391 -8.126 8.852 -8.244 QT
9.313 -8.361 9.313 -8.798 QT
9.313 -13.783 L
9.313 -14.798 9.016 -15.462 QT
8.719 -16.126 7.797 -16.126 QT
6.578 -16.126 5.789 -15.15 QT
5 -14.173 5 -12.939 QT
5 -8.798 L
5 -8.361 5.469 -8.244 QT
5.938 -8.126 6.641 -8.126 QT
6.641 -7.392 L
1.828 -7.392 L
cp
f
GR
GS
[0 -0.75 0.75 0 55.2 188.24984] CT
0.149 GC
N
19.674 -2.142 M
19.486 -2.142 19.486 -2.33 QT
19.486 -2.423 19.533 -2.455 QT
23.127 -5.97 23.127 -12.642 QT
23.127 -19.314 19.58 -22.783 QT
19.486 -22.83 19.486 -22.955 QT
19.486 -23.033 19.549 -23.087 QT
19.611 -23.142 19.674 -23.142 QT
19.877 -23.142 L
19.94 -23.142 19.971 -23.095 QT
21.486 -21.908 22.486 -20.205 QT
23.486 -18.501 23.955 -16.58 QT
24.424 -14.658 24.424 -12.642 QT
24.424 -11.158 24.174 -9.712 QT
23.924 -8.267 23.377 -6.869 QT
22.83 -5.47 21.986 -4.291 QT
21.143 -3.111 19.971 -2.189 QT
19.94 -2.142 19.877 -2.142 QT
19.674 -2.142 L
cp
f
GR
GS
[0.75 0 0 0.75 0 0] CT
1 GC
N
356 102 M
356 50 L
265 50 L
265 102 L
cp
f
GR
GS
[0.75 0 0 0.75 234 47.9] CT
/Helvetica 18.667 F
GS
[1 0 0 1 0 0] CT
0 7 moveto 
1 -1 scale
(CP) t 
GR
GR
GS
[0.75 0 0 0.75 0 0] CT
0 0.447 0.741 RC
N
309 72.781 M
309 54.952 L
269 54.952 L
269 72.781 L
cp
f
GR
GS
[0.75 0 0 0.75 0 0] CT
0 0.447 0.741 RC
10.0 ML
0.667 LW
N
269 72.781 M
269 54.952 L
309 54.952 L
309 72.781 L
cp
S
GR
GS
[0.75 0 0 0.75 234 66.1] CT
/Helvetica 18.667 F
GS
[1 0 0 1 0 0] CT
0 7 moveto 
1 -1 scale
(GPS) t 
GR
GR
GS
[0.75 0 0 0.75 0 0] CT
0.8 GC
N
309 97.048 M
309 79.219 L
269 79.219 L
269 97.048 L
cp
f
GR
GS
[0.75 0 0 0.75 0 0] CT
0.8 GC
10.0 ML
0.667 LW
N
269 97.048 M
269 79.219 L
309 79.219 L
309 97.048 L
cp
S
GR
GS
[0.75 0 0 0.75 0 0] CT
1 GC
10.0 ML
0.667 LW
N
265 102 M
265 50 L
356 50 L
356 102 L
cp
S
GR
GS
[0.75 0 0 0.75 0 0] CT
1 GC
N
435 463 M
696 463 L
696 39 L
435 39 L
cp
f
GR
GS
[0.75 0 0 0.75 0 0] CT
0.149 GC
1 LJ
0.667 LW
N
435 463 M
696 463 L
S
GR
GS
[0.75 0 0 0.75 0 0] CT
0 0.447 0.741 RC
N
557.824 463 M
557.824 227.739 L
496.412 227.739 L
496.412 463 L
cp
634.588 463 M
634.588 369.72 L
573.176 369.72 L
573.176 463 L
cp
f
GR
GS
[0.75 0 0 0.75 0 0] CT
0 0.447 0.741 RC
10.0 ML
0.667 LW
N
496.412 463 M
496.412 227.739 L
557.824 227.739 L
557.824 463 L
cp
S
GR
GS
[0.75 0 0 0.75 0 0] CT
0 0.447 0.741 RC
10.0 ML
0.667 LW
N
573.176 463 M
573.176 369.72 L
634.588 369.72 L
634.588 463 L
cp
S
GR
GS
[0.75 0 0 0.75 0 0] CT
0.8 GC
N
557.824 227.739 M
557.824 95.408 L
496.412 95.408 L
496.412 227.739 L
cp
634.588 369.72 M
634.588 287.767 L
573.176 287.767 L
573.176 369.72 L
cp
f
GR
GS
[0.75 0 0 0.75 0 0] CT
0.8 GC
10.0 ML
0.667 LW
N
496.412 227.739 M
496.412 95.408 L
557.824 95.408 L
557.824 227.739 L
cp
S
GR
GS
[0.75 0 0 0.75 0 0] CT
0.8 GC
10.0 ML
0.667 LW
N
573.176 369.72 M
573.176 287.767 L
634.588 287.767 L
634.588 369.72 L
cp
S
GR
GS
[0.75 0 0 0.75 0 0] CT
0.149 GC
2 setlinecap
1 LJ
0.667 LW
N
435 463 M
696 463 L
S
GR
GS
[0.75 0 0 0.75 0 0] CT
0.149 GC
2 setlinecap
1 LJ
0.667 LW
N
435 39 M
696 39 L
S
GR
GS
[0.75 0 0 0.75 0 0] CT
0.149 GC
2 setlinecap
1 LJ
0.667 LW
N
527.118 463 M
527.118 458.76 L
S
GR
GS
[0.75 0 0 0.75 0 0] CT
0.149 GC
2 setlinecap
1 LJ
0.667 LW
N
603.882 463 M
603.882 458.76 L
S
GR
GS
[0.75 0 0 0.75 0 0] CT
0.149 GC
2 setlinecap
1 LJ
0.667 LW
N
527.118 39 M
527.118 43.24 L
S
GR
GS
[0.75 0 0 0.75 0 0] CT
0.149 GC
2 setlinecap
1 LJ
0.667 LW
N
603.882 39 M
603.882 43.24 L
S
GR
GS
[0.75 0 0 0.75 395.33826 352.05] CT
0.149 GC
/Helvetica 18.667 F
GS
[1 0 0 1 0 0] CT
-15.5 19 moveto 
1 -1 scale
(3-D) t 
GR
GR
GS
[0.75 0 0 0.75 452.91174 352.05] CT
0.149 GC
/Helvetica 18.667 F
GS
[1 0 0 1 0 0] CT
-15.5 19 moveto 
1 -1 scale
(2-D) t 
GR
GR
GS
[0.75 0 0 0.75 0 0] CT
0.149 GC
2 setlinecap
1 LJ
0.667 LW
N
435 463 M
435 39 L
S
GR
GS
[0.75 0 0 0.75 0 0] CT
0.149 GC
2 setlinecap
1 LJ
0.667 LW
N
696 463 M
696 39 L
S
GR
GS
[0.75 0 0 0.75 0 0] CT
0.149 GC
2 setlinecap
1 LJ
0.667 LW
N
435 463 M
439.24 463 L
S
GR
GS
[0.75 0 0 0.75 0 0] CT
0.149 GC
2 setlinecap
1 LJ
0.667 LW
N
435 402.429 M
439.24 402.429 L
S
GR
GS
[0.75 0 0 0.75 0 0] CT
0.149 GC
2 setlinecap
1 LJ
0.667 LW
N
435 341.857 M
439.24 341.857 L
S
GR
GS
[0.75 0 0 0.75 0 0] CT
0.149 GC
2 setlinecap
1 LJ
0.667 LW
N
435 281.286 M
439.24 281.286 L
S
GR
GS
[0.75 0 0 0.75 0 0] CT
0.149 GC
2 setlinecap
1 LJ
0.667 LW
N
435 220.714 M
439.24 220.714 L
S
GR
GS
[0.75 0 0 0.75 0 0] CT
0.149 GC
2 setlinecap
1 LJ
0.667 LW
N
435 160.143 M
439.24 160.143 L
S
GR
GS
[0.75 0 0 0.75 0 0] CT
0.149 GC
2 setlinecap
1 LJ
0.667 LW
N
435 99.571 M
439.24 99.571 L
S
GR
GS
[0.75 0 0 0.75 0 0] CT
0.149 GC
2 setlinecap
1 LJ
0.667 LW
N
435 39 M
439.24 39 L
S
GR
GS
[0.75 0 0 0.75 0 0] CT
0.149 GC
2 setlinecap
1 LJ
0.667 LW
N
696 463 M
691.76 463 L
S
GR
GS
[0.75 0 0 0.75 0 0] CT
0.149 GC
2 setlinecap
1 LJ
0.667 LW
N
696 402.429 M
691.76 402.429 L
S
GR
GS
[0.75 0 0 0.75 0 0] CT
0.149 GC
2 setlinecap
1 LJ
0.667 LW
N
696 341.857 M
691.76 341.857 L
S
GR
GS
[0.75 0 0 0.75 0 0] CT
0.149 GC
2 setlinecap
1 LJ
0.667 LW
N
696 281.286 M
691.76 281.286 L
S
GR
GS
[0.75 0 0 0.75 0 0] CT
0.149 GC
2 setlinecap
1 LJ
0.667 LW
N
696 220.714 M
691.76 220.714 L
S
GR
GS
[0.75 0 0 0.75 0 0] CT
0.149 GC
2 setlinecap
1 LJ
0.667 LW
N
696 160.143 M
691.76 160.143 L
S
GR
GS
[0.75 0 0 0.75 0 0] CT
0.149 GC
2 setlinecap
1 LJ
0.667 LW
N
696 99.571 M
691.76 99.571 L
S
GR
GS
[0.75 0 0 0.75 0 0] CT
0.149 GC
2 setlinecap
1 LJ
0.667 LW
N
696 39 M
691.76 39 L
S
GR
GS
[0.75 0 0 0.75 321.45 347.25] CT
0.149 GC
/Helvetica 18.667 F
GS
[1 0 0 1 0 0] CT
-11 7 moveto 
1 -1 scale
(0) t 
GR
GR
GS
[0.75 0 0 0.75 321.45 301.82142] CT
0.149 GC
/Helvetica 18.667 F
GS
[1 0 0 1 0 0] CT
-11 7 moveto 
1 -1 scale
(5) t 
GR
GR
GS
[0.75 0 0 0.75 321.45 256.39286] CT
0.149 GC
/Helvetica 18.667 F
GS
[1 0 0 1 0 0] CT
-21 7 moveto 
1 -1 scale
(10) t 
GR
GR
GS
[0.75 0 0 0.75 321.45 210.96428] CT
0.149 GC
/Helvetica 18.667 F
GS
[1 0 0 1 0 0] CT
-21 7 moveto 
1 -1 scale
(15) t 
GR
GR
GS
[0.75 0 0 0.75 321.45 165.53571] CT
0.149 GC
/Helvetica 18.667 F
GS
[1 0 0 1 0 0] CT
-21 7 moveto 
1 -1 scale
(20) t 
GR
GR
GS
[0.75 0 0 0.75 321.45 120.10714] CT
0.149 GC
/Helvetica 18.667 F
GS
[1 0 0 1 0 0] CT
-21 7 moveto 
1 -1 scale
(25) t 
GR
GR
GS
[0.75 0 0 0.75 321.45 74.67857] CT
0.149 GC
/Helvetica 18.667 F
GS
[1 0 0 1 0 0] CT
-21 7 moveto 
1 -1 scale
(30) t 
GR
GR
GS
[0.75 0 0 0.75 321.45 29.25] CT
0.149 GC
/Helvetica 18.667 F
GS
[1 0 0 1 0 0] CT
-21 7 moveto 
1 -1 scale
(35) t 
GR
GR
GS
[0 -0.75 0.75 0 302.7 188.24984] CT
0.149 GC
N
/f-171159257{-25.69 -9.533 M
-25.69 -10.626 -25.034 -11.705 QT
-24.378 -12.783 -23.362 -13.642 QT
-22.347 -14.501 -21.362 -14.986 QT
-22.222 -15.33 -22.737 -15.916 QT
-23.253 -16.501 -23.253 -17.345 QT
-23.253 -18.361 -22.636 -19.244 QT
-22.019 -20.126 -21.026 -20.791 QT
-20.034 -21.455 -18.909 -21.83 QT
-17.784 -22.205 -16.862 -22.205 QT
-16.737 -22.205 L
-15.847 -22.205 -15.151 -21.884 QT
-14.456 -21.564 -14.456 -20.798 QT
-14.456 -20.283 -14.729 -19.822 QT
-15.003 -19.361 -15.456 -19.056 QT
-15.909 -18.751 -16.409 -18.72 QT
-16.519 -18.72 L
-16.565 -18.736 -16.612 -18.775 QT
-16.659 -18.814 -16.659 -18.876 QT
-16.659 -18.939 -16.644 -18.986 QT
-16.534 -19.158 -16.472 -19.306 QT
-16.409 -19.455 -16.362 -19.587 QT
-16.315 -19.72 -16.315 -19.876 QT
-16.315 -20.501 -16.909 -20.728 QT
-17.503 -20.955 -18.253 -20.955 QT
-19.065 -20.955 -19.792 -20.626 QT
-20.519 -20.298 -20.956 -19.689 QT
-21.394 -19.08 -21.394 -18.251 QT
-21.394 -17.048 -20.261 -16.47 QT
-19.128 -15.892 -17.815 -15.892 QT
-17.659 -15.814 -17.659 -15.736 QT
-17.659 -15.408 -18.276 -15.056 QT
-18.894 -14.705 -19.269 -14.658 QT
-21.097 -14.658 -22.409 -13.408 QT
-23.003 -12.783 -23.409 -11.978 QT
-23.815 -11.173 -23.815 -10.455 QT
-23.815 -9.705 -23.347 -9.181 QT
-22.878 -8.658 -22.167 -8.416 QT
-21.456 -8.173 -20.706 -8.173 QT
-19.784 -8.173 -19.198 -8.501 QT
-18.612 -8.83 -17.987 -9.533 QT
-17.362 -10.236 -17.019 -10.533 QT
-16.675 -10.83 -16.081 -10.876 QT
-15.956 -10.876 L
-15.815 -10.814 -15.815 -10.72 QT
-15.815 -10.642 -15.909 -10.486 QT
-16.565 -9.501 -17.573 -8.697 QT
-18.581 -7.892 -19.769 -7.408 QT
-20.956 -6.923 -22.097 -6.923 QT
-22.222 -6.923 L
-23.034 -6.923 -23.847 -7.22 QT
-24.659 -7.517 -25.175 -8.103 QT
-25.69 -8.689 -25.69 -9.533 QT
cp}def
f-171159257
f
GR
GS
[0 -0.75 0.75 0 302.7 188.24984] CT
0.149 GC
N
/f-2071569522{-0.266 -2.189 M
-1.438 -3.111 -2.282 -4.306 QT
-3.126 -5.501 -3.665 -6.853 QT
-4.204 -8.205 -4.469 -9.681 QT
-4.735 -11.158 -4.735 -12.642 QT
-4.735 -14.142 -4.469 -15.619 QT
-4.204 -17.095 -3.657 -18.462 QT
-3.11 -19.83 -2.258 -21.017 QT
-1.407 -22.205 -0.266 -23.095 QT
-0.266 -23.142 -0.172 -23.142 QT
0.031 -23.142 L
0.093 -23.142 0.14 -23.087 QT
0.187 -23.033 0.187 -22.955 QT
0.187 -22.861 0.156 -22.83 QT
-0.876 -21.814 -1.555 -20.666 QT
-2.235 -19.517 -2.649 -18.22 QT
-3.063 -16.923 -3.251 -15.533 QT
-3.438 -14.142 -3.438 -12.642 QT
-3.438 -5.97 0.124 -2.501 QT
0.187 -2.439 0.187 -2.33 QT
0.187 -2.283 0.132 -2.212 QT
0.078 -2.142 0.031 -2.142 QT
-0.172 -2.142 L
-0.266 -2.142 -0.266 -2.189 QT
cp}def
f-2071569522
f
GR
GS
[0 -0.75 0.75 0 302.7 188.24984] CT
0.149 GC
N
/f-1927603967{1.828 -7.392 M
1.828 -8.126 L
2.547 -8.126 3.008 -8.244 QT
3.469 -8.361 3.469 -8.798 QT
3.469 -14.533 L
3.469 -15.095 3.297 -15.345 QT
3.125 -15.595 2.813 -15.65 QT
2.5 -15.705 1.828 -15.705 QT
1.828 -16.439 L
4.875 -16.673 L
4.875 -14.626 L
5.297 -15.517 6.125 -16.095 QT
6.953 -16.673 7.922 -16.673 QT
10.344 -16.673 10.766 -14.705 QT
11.188 -15.58 11.993 -16.126 QT
12.797 -16.673 13.766 -16.673 QT
14.719 -16.673 15.368 -16.369 QT
16.016 -16.064 16.344 -15.431 QT
16.672 -14.798 16.672 -13.845 QT
16.672 -8.798 L
16.672 -8.361 17.141 -8.244 QT
17.61 -8.126 18.313 -8.126 QT
18.313 -7.392 L
13.516 -7.392 L
13.516 -8.126 L
14.219 -8.126 14.688 -8.244 QT
15.157 -8.361 15.157 -8.798 QT
15.157 -13.783 L
15.157 -14.83 14.852 -15.478 QT
14.547 -16.126 13.625 -16.126 QT
12.422 -16.126 11.633 -15.15 QT
10.844 -14.173 10.844 -12.939 QT
10.844 -8.798 L
10.844 -8.361 11.305 -8.244 QT
11.766 -8.126 12.485 -8.126 QT
12.485 -7.392 L
7.672 -7.392 L
7.672 -8.126 L
8.391 -8.126 8.852 -8.244 QT
9.313 -8.361 9.313 -8.798 QT
9.313 -13.783 L
9.313 -14.798 9.016 -15.462 QT
8.719 -16.126 7.797 -16.126 QT
6.578 -16.126 5.789 -15.15 QT
5 -14.173 5 -12.939 QT
5 -8.798 L
5 -8.361 5.469 -8.244 QT
5.938 -8.126 6.641 -8.126 QT
6.641 -7.392 L
1.828 -7.392 L
cp}def
f-1927603967
f
GR
GS
[0 -0.75 0.75 0 302.7 188.24984] CT
0.149 GC
N
/f-2011297977{19.674 -2.142 M
19.486 -2.142 19.486 -2.33 QT
19.486 -2.423 19.533 -2.455 QT
23.127 -5.97 23.127 -12.642 QT
23.127 -19.314 19.58 -22.783 QT
19.486 -22.83 19.486 -22.955 QT
19.486 -23.033 19.549 -23.087 QT
19.611 -23.142 19.674 -23.142 QT
19.877 -23.142 L
19.94 -23.142 19.971 -23.095 QT
21.486 -21.908 22.486 -20.205 QT
23.486 -18.501 23.955 -16.58 QT
24.424 -14.658 24.424 -12.642 QT
24.424 -11.158 24.174 -9.712 QT
23.924 -8.267 23.377 -6.869 QT
22.83 -5.47 21.986 -4.291 QT
21.143 -3.111 19.971 -2.189 QT
19.94 -2.142 19.877 -2.142 QT
19.674 -2.142 L
cp}def
f-2011297977
f
GR
GS
[0.75 0 0 0.75 0 0] CT
1 GC
N
686 102 M
686 50 L
595 50 L
595 102 L
cp
f
GR
GS
[0.75 0 0 0.75 481.5 47.9] CT
/Helvetica 18.667 F
GS
[1 0 0 1 0 0] CT
0 7 moveto 
1 -1 scale
(CP) t 
GR
GR
GS
[0.75 0 0 0.75 0 0] CT
0 0.447 0.741 RC
N
639 72.781 M
639 54.952 L
599 54.952 L
599 72.781 L
cp
f
GR
GS
[0.75 0 0 0.75 0 0] CT
0 0.447 0.741 RC
10.0 ML
0.667 LW
N
599 72.781 M
599 54.952 L
639 54.952 L
639 72.781 L
cp
S
GR
GS
[0.75 0 0 0.75 481.5 66.1] CT
/Helvetica 18.667 F
GS
[1 0 0 1 0 0] CT
0 7 moveto 
1 -1 scale
(GPS) t 
GR
GR
GS
[0.75 0 0 0.75 0 0] CT
0.8 GC
N
639 97.048 M
639 79.219 L
599 79.219 L
599 97.048 L
cp
f
GR
GS
[0.75 0 0 0.75 0 0] CT
0.8 GC
10.0 ML
0.667 LW
N
599 97.048 M
599 79.219 L
639 79.219 L
639 97.048 L
cp
S
GR
GS
[0.75 0 0 0.75 0 0] CT
1 GC
10.0 ML
0.667 LW
N
595 102 M
595 50 L
686 50 L
686 102 L
cp
S
GR
%%Trailer
%%Pages: 1
%%EOF
