%!PS-Adobe-3.0 EPSF-3.0
%%Creator: (MATLAB, The Mathworks, Inc. Version 9.5.0.944444 \(R2018b\). Operating System: Windows 10)
%%Title: (C:/Users/Alex/Dropbox/Analisi Statistica Metodi/Barplots/IAR_combined_histDistrib.eps)
%%CreationDate: 2019-09-06T11:45:54
%%Pages: (atend)
%%BoundingBox: 0 0 402 425
%%LanguageLevel: 3
%%EndComments
%%BeginProlog
%%BeginResource: procset (Apache XML Graphics Std ProcSet) 1.2 0
%%Version: 1.2 0
%%Copyright: (Copyright 2001-2003,2010 The Apache Software Foundation. License terms: http://www.apache.org/licenses/LICENSE-2.0)
/bd{bind def}bind def
/ld{load def}bd
/GR/grestore ld
/GS/gsave ld
/RM/rmoveto ld
/C/curveto ld
/t/show ld
/L/lineto ld
/ML/setmiterlimit ld
/CT/concat ld
/f/fill ld
/N/newpath ld
/S/stroke ld
/CC/setcmykcolor ld
/A/ashow ld
/cp/closepath ld
/RC/setrgbcolor ld
/LJ/setlinejoin ld
/GC/setgray ld
/LW/setlinewidth ld
/M/moveto ld
/re {4 2 roll M
1 index 0 rlineto
0 exch rlineto
neg 0 rlineto
cp } bd
/_ctm matrix def
/_tm matrix def
/BT { _ctm currentmatrix pop matrix _tm copy pop 0 0 moveto } bd
/ET { _ctm setmatrix } bd
/iTm { _ctm setmatrix _tm concat } bd
/Tm { _tm astore pop iTm 0 0 moveto } bd
/ux 0.0 def
/uy 0.0 def
/F {
  /Tp exch def
  /Tf exch def
  Tf findfont Tp scalefont setfont
  /cf Tf def  /cs Tp def
} bd
/ULS {currentpoint /uy exch def /ux exch def} bd
/ULE {
  /Tcx currentpoint pop def
  gsave
  newpath
  cf findfont cs scalefont dup
  /FontMatrix get 0 get /Ts exch def /FontInfo get dup
  /UnderlinePosition get Ts mul /To exch def
  /UnderlineThickness get Ts mul /Tt exch def
  ux uy To add moveto  Tcx uy To add lineto
  Tt setlinewidth stroke
  grestore
} bd
/OLE {
  /Tcx currentpoint pop def
  gsave
  newpath
  cf findfont cs scalefont dup
  /FontMatrix get 0 get /Ts exch def /FontInfo get dup
  /UnderlinePosition get Ts mul /To exch def
  /UnderlineThickness get Ts mul /Tt exch def
  ux uy To add cs add moveto Tcx uy To add cs add lineto
  Tt setlinewidth stroke
  grestore
} bd
/SOE {
  /Tcx currentpoint pop def
  gsave
  newpath
  cf findfont cs scalefont dup
  /FontMatrix get 0 get /Ts exch def /FontInfo get dup
  /UnderlinePosition get Ts mul /To exch def
  /UnderlineThickness get Ts mul /Tt exch def
  ux uy To add cs 10 mul 26 idiv add moveto Tcx uy To add cs 10 mul 26 idiv add lineto
  Tt setlinewidth stroke
  grestore
} bd
/QT {
/Y22 exch store
/X22 exch store
/Y21 exch store
/X21 exch store
currentpoint
/Y21 load 2 mul add 3 div exch
/X21 load 2 mul add 3 div exch
/X21 load 2 mul /X22 load add 3 div
/Y21 load 2 mul /Y22 load add 3 div
/X22 load /Y22 load curveto
} bd
/SSPD {
dup length /d exch dict def
{
/v exch def
/k exch def
currentpagedevice k known {
/cpdv currentpagedevice k get def
v cpdv ne {
/upd false def
/nullv v type /nulltype eq def
/nullcpdv cpdv type /nulltype eq def
nullv nullcpdv or
{
/upd true def
} {
/sametype v type cpdv type eq def
sametype {
v type /arraytype eq {
/vlen v length def
/cpdvlen cpdv length def
vlen cpdvlen eq {
0 1 vlen 1 sub {
/i exch def
/obj v i get def
/cpdobj cpdv i get def
obj cpdobj ne {
/upd true def
exit
} if
} for
} {
/upd true def
} ifelse
} {
v type /dicttype eq {
v {
/dv exch def
/dk exch def
/cpddv cpdv dk get def
dv cpddv ne {
/upd true def
exit
} if
} forall
} {
/upd true def
} ifelse
} ifelse
} if
} ifelse
upd true eq {
d k v put
} if
} if
} if
} forall
d length 0 gt {
d setpagedevice
} if
} bd
/RE { % /NewFontName [NewEncodingArray] /FontName RE -
  findfont dup length dict begin
  {
    1 index /FID ne
    {def} {pop pop} ifelse
  } forall
  /Encoding exch def
  /FontName 1 index def
  currentdict definefont pop
  end
} bind def
%%EndResource
%%BeginResource: procset (Apache XML Graphics EPS ProcSet) 1.0 0
%%Version: 1.0 0
%%Copyright: (Copyright 2002-2003 The Apache Software Foundation. License terms: http://www.apache.org/licenses/LICENSE-2.0)
/BeginEPSF { %def
/b4_Inc_state save def         % Save state for cleanup
/dict_count countdictstack def % Count objects on dict stack
/op_count count 1 sub def      % Count objects on operand stack
userdict begin                 % Push userdict on dict stack
/showpage { } def              % Redefine showpage, { } = null proc
0 setgray 0 setlinecap         % Prepare graphics state
1 setlinewidth 0 setlinejoin
10 setmiterlimit [ ] 0 setdash newpath
/languagelevel where           % If level not equal to 1 then
{pop languagelevel             % set strokeadjust and
1 ne                           % overprint to their defaults.
{false setstrokeadjust false setoverprint
} if
} if
} bd
/EndEPSF { %def
count op_count sub {pop} repeat            % Clean up stacks
countdictstack dict_count sub {end} repeat
b4_Inc_state restore
} bd
%%EndResource
%FOPBeginFontDict
%%IncludeResource: font Courier-Oblique
%%IncludeResource: font Courier-BoldOblique
%%IncludeResource: font Courier-Bold
%%IncludeResource: font ZapfDingbats
%%IncludeResource: font Symbol
%%IncludeResource: font Helvetica
%%IncludeResource: font Helvetica-Oblique
%%IncludeResource: font Helvetica-Bold
%%IncludeResource: font Helvetica-BoldOblique
%%IncludeResource: font Times-Roman
%%IncludeResource: font Times-Italic
%%IncludeResource: font Times-Bold
%%IncludeResource: font Times-BoldItalic
%%IncludeResource: font Courier
%FOPEndFontDict
%%BeginResource: encoding WinAnsiEncoding
/WinAnsiEncoding [
/.notdef /.notdef /.notdef /.notdef /.notdef
/.notdef /.notdef /.notdef /.notdef /.notdef
/.notdef /.notdef /.notdef /.notdef /.notdef
/.notdef /.notdef /.notdef /.notdef /.notdef
/.notdef /.notdef /.notdef /.notdef /.notdef
/.notdef /.notdef /.notdef /.notdef /.notdef
/.notdef /.notdef /space /exclam /quotedbl
/numbersign /dollar /percent /ampersand /quotesingle
/parenleft /parenright /asterisk /plus /comma
/hyphen /period /slash /zero /one
/two /three /four /five /six
/seven /eight /nine /colon /semicolon
/less /equal /greater /question /at
/A /B /C /D /E
/F /G /H /I /J
/K /L /M /N /O
/P /Q /R /S /T
/U /V /W /X /Y
/Z /bracketleft /backslash /bracketright /asciicircum
/underscore /quoteleft /a /b /c
/d /e /f /g /h
/i /j /k /l /m
/n /o /p /q /r
/s /t /u /v /w
/x /y /z /braceleft /bar
/braceright /asciitilde /bullet /Euro /bullet
/quotesinglbase /florin /quotedblbase /ellipsis /dagger
/daggerdbl /circumflex /perthousand /Scaron /guilsinglleft
/OE /bullet /Zcaron /bullet /bullet
/quoteleft /quoteright /quotedblleft /quotedblright /bullet
/endash /emdash /asciitilde /trademark /scaron
/guilsinglright /oe /bullet /zcaron /Ydieresis
/space /exclamdown /cent /sterling /currency
/yen /brokenbar /section /dieresis /copyright
/ordfeminine /guillemotleft /logicalnot /sfthyphen /registered
/macron /degree /plusminus /twosuperior /threesuperior
/acute /mu /paragraph /middot /cedilla
/onesuperior /ordmasculine /guillemotright /onequarter /onehalf
/threequarters /questiondown /Agrave /Aacute /Acircumflex
/Atilde /Adieresis /Aring /AE /Ccedilla
/Egrave /Eacute /Ecircumflex /Edieresis /Igrave
/Iacute /Icircumflex /Idieresis /Eth /Ntilde
/Ograve /Oacute /Ocircumflex /Otilde /Odieresis
/multiply /Oslash /Ugrave /Uacute /Ucircumflex
/Udieresis /Yacute /Thorn /germandbls /agrave
/aacute /acircumflex /atilde /adieresis /aring
/ae /ccedilla /egrave /eacute /ecircumflex
/edieresis /igrave /iacute /icircumflex /idieresis
/eth /ntilde /ograve /oacute /ocircumflex
/otilde /odieresis /divide /oslash /ugrave
/uacute /ucircumflex /udieresis /yacute /thorn
/ydieresis
] def
%%EndResource
%FOPBeginFontReencode
/Courier-Oblique findfont
dup length dict begin
  {1 index /FID ne {def} {pop pop} ifelse} forall
  /Encoding WinAnsiEncoding def
  currentdict
end
/Courier-Oblique exch definefont pop
/Courier-BoldOblique findfont
dup length dict begin
  {1 index /FID ne {def} {pop pop} ifelse} forall
  /Encoding WinAnsiEncoding def
  currentdict
end
/Courier-BoldOblique exch definefont pop
/Courier-Bold findfont
dup length dict begin
  {1 index /FID ne {def} {pop pop} ifelse} forall
  /Encoding WinAnsiEncoding def
  currentdict
end
/Courier-Bold exch definefont pop
/Helvetica findfont
dup length dict begin
  {1 index /FID ne {def} {pop pop} ifelse} forall
  /Encoding WinAnsiEncoding def
  currentdict
end
/Helvetica exch definefont pop
/Helvetica-Oblique findfont
dup length dict begin
  {1 index /FID ne {def} {pop pop} ifelse} forall
  /Encoding WinAnsiEncoding def
  currentdict
end
/Helvetica-Oblique exch definefont pop
/Helvetica-Bold findfont
dup length dict begin
  {1 index /FID ne {def} {pop pop} ifelse} forall
  /Encoding WinAnsiEncoding def
  currentdict
end
/Helvetica-Bold exch definefont pop
/Helvetica-BoldOblique findfont
dup length dict begin
  {1 index /FID ne {def} {pop pop} ifelse} forall
  /Encoding WinAnsiEncoding def
  currentdict
end
/Helvetica-BoldOblique exch definefont pop
/Times-Roman findfont
dup length dict begin
  {1 index /FID ne {def} {pop pop} ifelse} forall
  /Encoding WinAnsiEncoding def
  currentdict
end
/Times-Roman exch definefont pop
/Times-Italic findfont
dup length dict begin
  {1 index /FID ne {def} {pop pop} ifelse} forall
  /Encoding WinAnsiEncoding def
  currentdict
end
/Times-Italic exch definefont pop
/Times-Bold findfont
dup length dict begin
  {1 index /FID ne {def} {pop pop} ifelse} forall
  /Encoding WinAnsiEncoding def
  currentdict
end
/Times-Bold exch definefont pop
/Times-BoldItalic findfont
dup length dict begin
  {1 index /FID ne {def} {pop pop} ifelse} forall
  /Encoding WinAnsiEncoding def
  currentdict
end
/Times-BoldItalic exch definefont pop
/Courier findfont
dup length dict begin
  {1 index /FID ne {def} {pop pop} ifelse} forall
  /Encoding WinAnsiEncoding def
  currentdict
end
/Courier exch definefont pop
%FOPEndFontReencode
%%EndProlog
%%Page: 1 1
%%PageBoundingBox: 0 0 402 425
%%BeginPageSetup
[1 0 0 -1 0 425] CT
%%EndPageSetup
GS
[0.75 0 0 0.75 0 0.5] CT
1 GC
N
0 0 536 566 re
f
GR
GS
[0.75 0 0 0.75 0 0.5] CT
1 GC
N
0 0 536 566 re
f
GR
GS
[0.75 0 0 0.75 0 0.5] CT
0.149 GC
1 LJ
0.667 LW
N
151 198 M
151 42 L
S
GR
GS
[0.75 0 0 0.75 0 0.5] CT
0 0.447 0.741 RC
N
151 174 M
442.348 174 L
442.348 150 L
151 150 L
cp
151 114 M
185.122 114 L
185.122 90 L
151 90 L
cp
151 84 M
159.53 84 L
159.53 60 L
151 60 L
cp
f
GR
GS
[0.75 0 0 0.75 0 0.5] CT
10.0 ML
0.667 LW
N
151 174 M
442.348 174 L
442.348 150 L
151 150 L
cp
S
GR
GS
[0.75 0 0 0.75 0 0.5] CT
10.0 ML
0.667 LW
N
151 144 M
151 144 L
151 120 L
151 120 L
cp
S
GR
GS
[0.75 0 0 0.75 0 0.5] CT
10.0 ML
0.667 LW
N
151 114 M
185.122 114 L
185.122 90 L
151 90 L
cp
S
GR
GS
[0.75 0 0 0.75 0 0.5] CT
10.0 ML
0.667 LW
N
151 84 M
159.53 84 L
159.53 60 L
151 60 L
cp
S
GR
GS
[0.75 0 0 0.75 0 0.5] CT
10.0 ML
0.667 LW
N
151 41.981 M
151 54 L
151 54 L
151 41.981 L
S
GR
GS
[0.75 0 0 0.75 0 0.5] CT
0.149 GC
1 LJ
0.667 LW
N
152 366 M
152 214 L
S
GR
GS
[0.75 0 0 0.75 0 0.5] CT
0 0.447 0.741 RC
N
152 342.615 M
436.212 342.615 L
436.212 319.231 L
152 319.231 L
cp
152 284.154 M
180.554 284.154 L
180.554 260.769 L
152 260.769 L
cp
152 254.923 M
177.234 254.923 L
177.234 231.538 L
152 231.538 L
cp
f
GR
GS
[0.75 0 0 0.75 0 0.5] CT
10.0 ML
0.667 LW
N
152 342.615 M
436.212 342.615 L
436.212 319.231 L
152 319.231 L
cp
S
GR
GS
[0.75 0 0 0.75 0 0.5] CT
10.0 ML
0.667 LW
N
152 313.385 M
152 313.385 L
152 290 L
152 290 L
cp
S
GR
GS
[0.75 0 0 0.75 0 0.5] CT
10.0 ML
0.667 LW
N
152 284.154 M
180.554 284.154 L
180.554 260.769 L
152 260.769 L
cp
S
GR
GS
[0.75 0 0 0.75 0 0.5] CT
10.0 ML
0.667 LW
N
152 254.923 M
177.234 254.923 L
177.234 231.538 L
152 231.538 L
cp
S
GR
GS
[0.75 0 0 0.75 0 0.5] CT
10.0 ML
0.667 LW
N
152 213.982 M
152 225.692 L
152 225.692 L
152 213.982 L
S
GR
GS
[0.75 0 0 0.75 0 0.5] CT
0.149 GC
1 LJ
0.667 LW
N
152 533 M
152 385 L
S
GR
GS
[0.75 0 0 0.75 0 0.5] CT
0 0.447 0.741 RC
N
152 510.231 M
442.654 510.231 L
442.654 487.462 L
152 487.462 L
cp
152 453.308 M
174.511 453.308 L
174.511 430.538 L
152 430.538 L
cp
152 424.846 M
175.835 424.846 L
175.835 402.077 L
152 402.077 L
cp
f
GR
GS
[0.75 0 0 0.75 0 0.5] CT
10.0 ML
0.667 LW
N
152 510.231 M
442.654 510.231 L
442.654 487.462 L
152 487.462 L
cp
S
GR
GS
[0.75 0 0 0.75 0 0.5] CT
10.0 ML
0.667 LW
N
152 481.769 M
152 481.769 L
152 459 L
152 459 L
cp
S
GR
GS
[0.75 0 0 0.75 0 0.5] CT
10.0 ML
0.667 LW
N
152 453.308 M
174.511 453.308 L
174.511 430.538 L
152 430.538 L
cp
S
GR
GS
[0.75 0 0 0.75 0 0.5] CT
10.0 ML
0.667 LW
N
152 424.846 M
175.835 424.846 L
175.835 402.077 L
152 402.077 L
cp
S
GR
GS
[0.75 0 0 0.75 0 0.5] CT
10.0 ML
0.667 LW
N
152 384.982 M
152 396.385 L
152 396.385 L
152 384.982 L
S
GR
GS
[0.75 0 0 0.75 106 47.75001] CT
/Helvetica 16 F
GS
[1 0 0 1 0 0] CT
-34 17 moveto 
1 -1 scale
(GEV) t 
GR
GR
GS
[0.75 0 0 0.75 106 71] CT
/Helvetica 16 F
GS
[1 0 0 1 0 0] CT
-81 17 moveto 
1 -1 scale
(T-loc Scale) t 
GR
GR
GS
[0.75 0 0 0.75 106 176.00001] CT
/Helvetica 16 F
GS
[1 0 0 1 0 0] CT
-34 17 moveto 
1 -1 scale
(GEV) t 
GR
GR
GS
[0.75 0 0 0.75 106 197] CT
/Helvetica 16 F
GS
[1 0 0 1 0 0] CT
-81 17 moveto 
1 -1 scale
(T-loc Scale) t 
GR
GR
GS
[0.75 0 0 0.75 106 303.5] CT
/Helvetica 16 F
GS
[1 0 0 1 0 0] CT
-34 17 moveto 
1 -1 scale
(GEV) t 
GR
GR
GS
[0.75 0 0 0.75 106 323.75] CT
/Helvetica 16 F
GS
[1 0 0 1 0 0] CT
-81 17 moveto 
1 -1 scale
(T-loc Scale) t 
GR
GR
GS
[0.75 0 0 0.75 135.152 319.59241] CT
/Helvetica-Bold 21.333 F
GS
[1 0 0 1 0 0] CT
0 22 moveto 
1 -1 scale
(8.45%) t 
GR
GR
GS
[0.75 0 0 0.75 135.152 297.84241] CT
/Helvetica-Bold 21.333 F
GS
[1 0 0 1 0 0] CT
0 22 moveto 
1 -1 scale
(7.07%) t 
GR
GR
GS
[0.75 0 0 0.75 138.152 191.34242] CT
/Helvetica-Bold 21.333 F
GS
[1 0 0 1 0 0] CT
0 22 moveto 
1 -1 scale
(8.45%) t 
GR
GR
GS
[0.75 0 0 0.75 137.402 170.34242] CT
/Helvetica-Bold 21.333 F
GS
[1 0 0 1 0 0] CT
0 22 moveto 
1 -1 scale
(7.47%) t 
GR
GR
GS
[0.75 0 0 0.75 141.152 64.0025] CT
/Helvetica-Bold 21.333 F
GS
[1 0 0 1 0 0] CT
0 22 moveto 
1 -1 scale
(10.22%) t 
GR
GR
GS
[0.75 0 0 0.75 124.652 41.34241] CT
/Helvetica-Bold 21.333 F
GS
[1 0 0 1 0 0] CT
0 22 moveto 
1 -1 scale
(2.55%) t 
GR
GR
GS
[0.75 0 0 0.75 261.90198 362.73837] CT
1 GC
/Helvetica-Bold 21.333 F
GS
[1 0 0 1 0 0] CT
0 22 moveto 
1 -1 scale
(86.25%) t 
GR
GR
GS
[0.75 0 0 0.75 263.402 236.73837] CT
1 GC
/Helvetica-Bold 21.333 F
GS
[1 0 0 1 0 0] CT
0 22 moveto 
1 -1 scale
(84.09%) t 
GR
GR
GS
[0.75 0 0 0.75 262.652 110.73837] CT
1 GC
/Helvetica-Bold 21.333 F
GS
[1 0 0 1 0 0] CT
0 22 moveto 
1 -1 scale
(87.23%) t 
GR
GR
GS
[0.75 0 0 0.75 106 114.5] CT
/Helvetica-Bold 16 F
GS
[1 0 0 1 0 0] CT
-56 17 moveto 
1 -1 scale
(Normal) t 
GR
GR
GS
[0.75 0 0 0.75 106 368] CT
/Helvetica-Bold 16 F
GS
[1 0 0 1 0 0] CT
-56 17 moveto 
1 -1 scale
(Normal) t 
GR
GR
GS
[0.75 0 0 0.75 106 239.75] CT
/Helvetica-Bold 16 F
GS
[1 0 0 1 0 0] CT
-56 17 moveto 
1 -1 scale
(Normal) t 
GR
GR
%%Trailer
%%Pages: 1
%%EOF
