%!PS-Adobe-3.0 EPSF-3.0
%%Creator: (MATLAB, The Mathworks, Inc. Version 9.5.0.944444 \(R2018b\). Operating System: Windows 10)
%%Title: (C:/Users/navsas/Dropbox/Collaborative ranging CRLB/fig/lemniscateTraj_peer.eps)
%%CreationDate: 2018-11-19T11:31:51
%%Pages: (atend)
%%BoundingBox: 0 0 584 254
%%LanguageLevel: 3
%%EndComments
%%BeginProlog
%%BeginResource: procset (Apache XML Graphics Std ProcSet) 1.2 0
%%Version: 1.2 0
%%Copyright: (Copyright 2001-2003,2010 The Apache Software Foundation. License terms: http://www.apache.org/licenses/LICENSE-2.0)
/bd{bind def}bind def
/ld{load def}bd
/GR/grestore ld
/GS/gsave ld
/RM/rmoveto ld
/C/curveto ld
/t/show ld
/L/lineto ld
/ML/setmiterlimit ld
/CT/concat ld
/f/fill ld
/N/newpath ld
/S/stroke ld
/CC/setcmykcolor ld
/A/ashow ld
/cp/closepath ld
/RC/setrgbcolor ld
/LJ/setlinejoin ld
/GC/setgray ld
/LW/setlinewidth ld
/M/moveto ld
/re {4 2 roll M
1 index 0 rlineto
0 exch rlineto
neg 0 rlineto
cp } bd
/_ctm matrix def
/_tm matrix def
/BT { _ctm currentmatrix pop matrix _tm copy pop 0 0 moveto } bd
/ET { _ctm setmatrix } bd
/iTm { _ctm setmatrix _tm concat } bd
/Tm { _tm astore pop iTm 0 0 moveto } bd
/ux 0.0 def
/uy 0.0 def
/F {
  /Tp exch def
  /Tf exch def
  Tf findfont Tp scalefont setfont
  /cf Tf def  /cs Tp def
} bd
/ULS {currentpoint /uy exch def /ux exch def} bd
/ULE {
  /Tcx currentpoint pop def
  gsave
  newpath
  cf findfont cs scalefont dup
  /FontMatrix get 0 get /Ts exch def /FontInfo get dup
  /UnderlinePosition get Ts mul /To exch def
  /UnderlineThickness get Ts mul /Tt exch def
  ux uy To add moveto  Tcx uy To add lineto
  Tt setlinewidth stroke
  grestore
} bd
/OLE {
  /Tcx currentpoint pop def
  gsave
  newpath
  cf findfont cs scalefont dup
  /FontMatrix get 0 get /Ts exch def /FontInfo get dup
  /UnderlinePosition get Ts mul /To exch def
  /UnderlineThickness get Ts mul /Tt exch def
  ux uy To add cs add moveto Tcx uy To add cs add lineto
  Tt setlinewidth stroke
  grestore
} bd
/SOE {
  /Tcx currentpoint pop def
  gsave
  newpath
  cf findfont cs scalefont dup
  /FontMatrix get 0 get /Ts exch def /FontInfo get dup
  /UnderlinePosition get Ts mul /To exch def
  /UnderlineThickness get Ts mul /Tt exch def
  ux uy To add cs 10 mul 26 idiv add moveto Tcx uy To add cs 10 mul 26 idiv add lineto
  Tt setlinewidth stroke
  grestore
} bd
/QT {
/Y22 exch store
/X22 exch store
/Y21 exch store
/X21 exch store
currentpoint
/Y21 load 2 mul add 3 div exch
/X21 load 2 mul add 3 div exch
/X21 load 2 mul /X22 load add 3 div
/Y21 load 2 mul /Y22 load add 3 div
/X22 load /Y22 load curveto
} bd
/SSPD {
dup length /d exch dict def
{
/v exch def
/k exch def
currentpagedevice k known {
/cpdv currentpagedevice k get def
v cpdv ne {
/upd false def
/nullv v type /nulltype eq def
/nullcpdv cpdv type /nulltype eq def
nullv nullcpdv or
{
/upd true def
} {
/sametype v type cpdv type eq def
sametype {
v type /arraytype eq {
/vlen v length def
/cpdvlen cpdv length def
vlen cpdvlen eq {
0 1 vlen 1 sub {
/i exch def
/obj v i get def
/cpdobj cpdv i get def
obj cpdobj ne {
/upd true def
exit
} if
} for
} {
/upd true def
} ifelse
} {
v type /dicttype eq {
v {
/dv exch def
/dk exch def
/cpddv cpdv dk get def
dv cpddv ne {
/upd true def
exit
} if
} forall
} {
/upd true def
} ifelse
} ifelse
} if
} ifelse
upd true eq {
d k v put
} if
} if
} if
} forall
d length 0 gt {
d setpagedevice
} if
} bd
/RE { % /NewFontName [NewEncodingArray] /FontName RE -
  findfont dup length dict begin
  {
    1 index /FID ne
    {def} {pop pop} ifelse
  } forall
  /Encoding exch def
  /FontName 1 index def
  currentdict definefont pop
  end
} bind def
%%EndResource
%%BeginResource: procset (Apache XML Graphics EPS ProcSet) 1.0 0
%%Version: 1.0 0
%%Copyright: (Copyright 2002-2003 The Apache Software Foundation. License terms: http://www.apache.org/licenses/LICENSE-2.0)
/BeginEPSF { %def
/b4_Inc_state save def         % Save state for cleanup
/dict_count countdictstack def % Count objects on dict stack
/op_count count 1 sub def      % Count objects on operand stack
userdict begin                 % Push userdict on dict stack
/showpage { } def              % Redefine showpage, { } = null proc
0 setgray 0 setlinecap         % Prepare graphics state
1 setlinewidth 0 setlinejoin
10 setmiterlimit [ ] 0 setdash newpath
/languagelevel where           % If level not equal to 1 then
{pop languagelevel             % set strokeadjust and
1 ne                           % overprint to their defaults.
{false setstrokeadjust false setoverprint
} if
} if
} bd
/EndEPSF { %def
count op_count sub {pop} repeat            % Clean up stacks
countdictstack dict_count sub {end} repeat
b4_Inc_state restore
} bd
%%EndResource
%FOPBeginFontDict
%%IncludeResource: font Courier-Oblique
%%IncludeResource: font Courier-BoldOblique
%%IncludeResource: font Courier-Bold
%%IncludeResource: font ZapfDingbats
%%IncludeResource: font Symbol
%%IncludeResource: font Helvetica
%%IncludeResource: font Helvetica-Oblique
%%IncludeResource: font Helvetica-Bold
%%IncludeResource: font Helvetica-BoldOblique
%%IncludeResource: font Times-Roman
%%IncludeResource: font Times-Italic
%%IncludeResource: font Times-Bold
%%IncludeResource: font Times-BoldItalic
%%IncludeResource: font Courier
%FOPEndFontDict
%%BeginResource: encoding WinAnsiEncoding
/WinAnsiEncoding [
/.notdef /.notdef /.notdef /.notdef /.notdef
/.notdef /.notdef /.notdef /.notdef /.notdef
/.notdef /.notdef /.notdef /.notdef /.notdef
/.notdef /.notdef /.notdef /.notdef /.notdef
/.notdef /.notdef /.notdef /.notdef /.notdef
/.notdef /.notdef /.notdef /.notdef /.notdef
/.notdef /.notdef /space /exclam /quotedbl
/numbersign /dollar /percent /ampersand /quotesingle
/parenleft /parenright /asterisk /plus /comma
/hyphen /period /slash /zero /one
/two /three /four /five /six
/seven /eight /nine /colon /semicolon
/less /equal /greater /question /at
/A /B /C /D /E
/F /G /H /I /J
/K /L /M /N /O
/P /Q /R /S /T
/U /V /W /X /Y
/Z /bracketleft /backslash /bracketright /asciicircum
/underscore /quoteleft /a /b /c
/d /e /f /g /h
/i /j /k /l /m
/n /o /p /q /r
/s /t /u /v /w
/x /y /z /braceleft /bar
/braceright /asciitilde /bullet /Euro /bullet
/quotesinglbase /florin /quotedblbase /ellipsis /dagger
/daggerdbl /circumflex /perthousand /Scaron /guilsinglleft
/OE /bullet /Zcaron /bullet /bullet
/quoteleft /quoteright /quotedblleft /quotedblright /bullet
/endash /emdash /asciitilde /trademark /scaron
/guilsinglright /oe /bullet /zcaron /Ydieresis
/space /exclamdown /cent /sterling /currency
/yen /brokenbar /section /dieresis /copyright
/ordfeminine /guillemotleft /logicalnot /sfthyphen /registered
/macron /degree /plusminus /twosuperior /threesuperior
/acute /mu /paragraph /middot /cedilla
/onesuperior /ordmasculine /guillemotright /onequarter /onehalf
/threequarters /questiondown /Agrave /Aacute /Acircumflex
/Atilde /Adieresis /Aring /AE /Ccedilla
/Egrave /Eacute /Ecircumflex /Edieresis /Igrave
/Iacute /Icircumflex /Idieresis /Eth /Ntilde
/Ograve /Oacute /Ocircumflex /Otilde /Odieresis
/multiply /Oslash /Ugrave /Uacute /Ucircumflex
/Udieresis /Yacute /Thorn /germandbls /agrave
/aacute /acircumflex /atilde /adieresis /aring
/ae /ccedilla /egrave /eacute /ecircumflex
/edieresis /igrave /iacute /icircumflex /idieresis
/eth /ntilde /ograve /oacute /ocircumflex
/otilde /odieresis /divide /oslash /ugrave
/uacute /ucircumflex /udieresis /yacute /thorn
/ydieresis
] def
%%EndResource
%FOPBeginFontReencode
/Courier-Oblique findfont
dup length dict begin
  {1 index /FID ne {def} {pop pop} ifelse} forall
  /Encoding WinAnsiEncoding def
  currentdict
end
/Courier-Oblique exch definefont pop
/Courier-BoldOblique findfont
dup length dict begin
  {1 index /FID ne {def} {pop pop} ifelse} forall
  /Encoding WinAnsiEncoding def
  currentdict
end
/Courier-BoldOblique exch definefont pop
/Courier-Bold findfont
dup length dict begin
  {1 index /FID ne {def} {pop pop} ifelse} forall
  /Encoding WinAnsiEncoding def
  currentdict
end
/Courier-Bold exch definefont pop
/Helvetica findfont
dup length dict begin
  {1 index /FID ne {def} {pop pop} ifelse} forall
  /Encoding WinAnsiEncoding def
  currentdict
end
/Helvetica exch definefont pop
/Helvetica-Oblique findfont
dup length dict begin
  {1 index /FID ne {def} {pop pop} ifelse} forall
  /Encoding WinAnsiEncoding def
  currentdict
end
/Helvetica-Oblique exch definefont pop
/Helvetica-Bold findfont
dup length dict begin
  {1 index /FID ne {def} {pop pop} ifelse} forall
  /Encoding WinAnsiEncoding def
  currentdict
end
/Helvetica-Bold exch definefont pop
/Helvetica-BoldOblique findfont
dup length dict begin
  {1 index /FID ne {def} {pop pop} ifelse} forall
  /Encoding WinAnsiEncoding def
  currentdict
end
/Helvetica-BoldOblique exch definefont pop
/Times-Roman findfont
dup length dict begin
  {1 index /FID ne {def} {pop pop} ifelse} forall
  /Encoding WinAnsiEncoding def
  currentdict
end
/Times-Roman exch definefont pop
/Times-Italic findfont
dup length dict begin
  {1 index /FID ne {def} {pop pop} ifelse} forall
  /Encoding WinAnsiEncoding def
  currentdict
end
/Times-Italic exch definefont pop
/Times-Bold findfont
dup length dict begin
  {1 index /FID ne {def} {pop pop} ifelse} forall
  /Encoding WinAnsiEncoding def
  currentdict
end
/Times-Bold exch definefont pop
/Times-BoldItalic findfont
dup length dict begin
  {1 index /FID ne {def} {pop pop} ifelse} forall
  /Encoding WinAnsiEncoding def
  currentdict
end
/Times-BoldItalic exch definefont pop
/Courier findfont
dup length dict begin
  {1 index /FID ne {def} {pop pop} ifelse} forall
  /Encoding WinAnsiEncoding def
  currentdict
end
/Courier exch definefont pop
%FOPEndFontReencode
%%EndProlog
%%Page: 1 1
%%PageBoundingBox: 0 0 584 254
%%BeginPageSetup
[1 0 0 -1 0 254] CT
%%EndPageSetup
GS
[0.75 0 0 0.75 0 0.5] CT
N
0 0 M
779 0 L
779 338 L
0 338 L
0 0 L
cp
clip
1 GC
N
0 0 779 338 re
f
GR
GS
[0.75 0 0 0.75 0 0.5] CT
1 GC
N
0 0 779 338 re
f
GR
GS
[0.75 0 0 0.75 0 0.5] CT
1 GC
N
101 301 M
705 301 L
705 25 L
101 25 L
cp
f
GR
GS
[0.75 0 0 0.75 0 0.5] CT
0.149 GC
2 setlinecap
1 LJ
0.667 LW
N
101 301 M
705 301 L
S
GR
GS
[0.75 0 0 0.75 0 0.5] CT
0.149 GC
2 setlinecap
1 LJ
0.667 LW
N
101 25 M
705 25 L
S
GR
GS
[0.75 0 0 0.75 0 0.5] CT
0.149 GC
2 setlinecap
1 LJ
0.667 LW
N
115.212 301 M
115.212 294.96 L
S
GR
GS
[0.75 0 0 0.75 0 0.5] CT
0.149 GC
2 setlinecap
1 LJ
0.667 LW
N
257.329 301 M
257.329 294.96 L
S
GR
GS
[0.75 0 0 0.75 0 0.5] CT
0.149 GC
2 setlinecap
1 LJ
0.667 LW
N
399.447 301 M
399.447 294.96 L
S
GR
GS
[0.75 0 0 0.75 0 0.5] CT
0.149 GC
2 setlinecap
1 LJ
0.667 LW
N
541.565 301 M
541.565 294.96 L
S
GR
GS
[0.75 0 0 0.75 0 0.5] CT
0.149 GC
2 setlinecap
1 LJ
0.667 LW
N
683.682 301 M
683.682 294.96 L
S
GR
GS
[0.75 0 0 0.75 0 0.5] CT
0.149 GC
2 setlinecap
1 LJ
0.667 LW
N
115.212 25 M
115.212 31.04 L
S
GR
GS
[0.75 0 0 0.75 0 0.5] CT
0.149 GC
2 setlinecap
1 LJ
0.667 LW
N
257.329 25 M
257.329 31.04 L
S
GR
GS
[0.75 0 0 0.75 0 0.5] CT
0.149 GC
2 setlinecap
1 LJ
0.667 LW
N
399.447 25 M
399.447 31.04 L
S
GR
GS
[0.75 0 0 0.75 0 0.5] CT
0.149 GC
2 setlinecap
1 LJ
0.667 LW
N
541.565 25 M
541.565 31.04 L
S
GR
GS
[0.75 0 0 0.75 0 0.5] CT
0.149 GC
2 setlinecap
1 LJ
0.667 LW
N
683.682 25 M
683.682 31.04 L
S
GR
GS
[0.75 0 0 0.75 86.40882 231.85001] CT
0.149 GC
N
-21.734 15.722 M
-21.734 14.222 L
-15.375 14.222 L
-15.375 15.722 L
-21.734 15.722 L
cp
f
GR
GS
[0.75 0 0 0.75 86.40882 231.85001] CT
0.149 GC
N
-12.797 20.16 M
-12.797 19.519 L
-12.797 19.457 -12.75 19.379 QT
-9.031 15.254 L
-8.188 14.347 -7.656 13.722 QT
-7.125 13.097 -6.609 12.293 QT
-6.094 11.488 -5.797 10.652 QT
-5.5 9.816 -5.5 8.879 QT
-5.5 7.894 -5.867 6.996 QT
-6.234 6.097 -6.953 5.558 QT
-7.672 5.019 -8.688 5.019 QT
-9.734 5.019 -10.563 5.644 QT
-11.391 6.269 -11.734 7.269 QT
-11.641 7.238 -11.484 7.238 QT
-10.938 7.238 -10.555 7.605 QT
-10.172 7.972 -10.172 8.551 QT
-10.172 9.097 -10.555 9.48 QT
-10.938 9.863 -11.484 9.863 QT
-12.047 9.863 -12.422 9.465 QT
-12.797 9.066 -12.797 8.551 QT
-12.797 7.644 -12.461 6.855 QT
-12.125 6.066 -11.484 5.449 QT
-10.844 4.832 -10.039 4.504 QT
-9.234 4.176 -8.344 4.176 QT
-6.969 4.176 -5.781 4.754 QT
-4.594 5.332 -3.906 6.394 QT
-3.219 7.457 -3.219 8.879 QT
-3.219 9.91 -3.672 10.847 QT
-4.125 11.785 -4.844 12.558 QT
-5.563 13.332 -6.672 14.301 QT
-7.781 15.269 -8.141 15.597 QT
-10.859 18.207 L
-8.547 18.207 L
-6.844 18.207 -5.703 18.183 QT
-4.563 18.16 -4.5 18.097 QT
-4.219 17.785 -3.922 15.879 QT
-3.219 15.879 L
-3.891 20.16 L
-12.797 20.16 L
cp
f
GR
GS
[0.75 0 0 0.75 86.40882 231.85001] CT
0.149 GC
N
4 20.691 M
1.062 20.691 0 18.269 QT
-1.063 15.847 -1.063 12.504 QT
-1.063 10.426 -0.68 8.582 QT
-0.297 6.738 0.836 5.457 QT
1.969 4.176 4 4.176 QT
5.578 4.176 6.586 4.949 QT
7.594 5.722 8.125 6.949 QT
8.656 8.176 8.852 9.574 QT
9.047 10.972 9.047 12.504 QT
9.047 14.566 8.664 16.363 QT
8.281 18.16 7.164 19.426 QT
6.047 20.691 4 20.691 QT
cp
4 20.066 M
5.344 20.066 6 18.691 QT
6.656 17.316 6.805 15.652 QT
6.953 13.988 6.953 12.113 QT
6.953 10.316 6.805 8.793 QT
6.656 7.269 6 6.035 QT
5.344 4.801 4 4.801 QT
2.641 4.801 1.984 6.043 QT
1.328 7.285 1.18 8.801 QT
1.031 10.316 1.031 12.113 QT
1.031 13.457 1.094 14.636 QT
1.156 15.816 1.437 17.082 QT
1.719 18.347 2.344 19.207 QT
2.969 20.066 4 20.066 QT
cp
f
GR
GS
[0.75 0 0 0.75 86.40882 231.85001] CT
0.149 GC
N
16 20.691 M
13.063 20.691 12 18.269 QT
10.938 15.847 10.938 12.504 QT
10.938 10.426 11.32 8.582 QT
11.703 6.738 12.836 5.457 QT
13.969 4.176 16 4.176 QT
17.578 4.176 18.586 4.949 QT
19.594 5.722 20.125 6.949 QT
20.656 8.176 20.852 9.574 QT
21.047 10.972 21.047 12.504 QT
21.047 14.566 20.664 16.363 QT
20.281 18.16 19.164 19.426 QT
18.047 20.691 16 20.691 QT
cp
16 20.066 M
17.344 20.066 18 18.691 QT
18.656 17.316 18.805 15.652 QT
18.953 13.988 18.953 12.113 QT
18.953 10.316 18.805 8.793 QT
18.656 7.269 18 6.035 QT
17.344 4.801 16 4.801 QT
14.641 4.801 13.984 6.043 QT
13.328 7.285 13.18 8.801 QT
13.031 10.316 13.031 12.113 QT
13.031 13.457 13.094 14.636 QT
13.156 15.816 13.438 17.082 QT
13.719 18.347 14.344 19.207 QT
14.969 20.066 16 20.066 QT
cp
f
GR
GS
[0.75 0 0 0.75 192.99706 231.85001] CT
0.149 GC
N
/f-206737773{-21.734 15.722 M
-21.734 14.222 L
-15.375 14.222 L
-15.375 15.722 L
-21.734 15.722 L
cp}def
f-206737773
f
GR
GS
[0.75 0 0 0.75 192.99706 231.85001] CT
0.149 GC
N
/f2138193672{-11.766 20.16 M
-11.766 19.316 L
-8.766 19.316 -8.766 18.551 QT
-8.766 5.957 L
-10.016 6.551 -11.906 6.551 QT
-11.906 5.707 L
-8.969 5.707 -7.469 4.176 QT
-7.125 4.176 L
-7.047 4.176 -6.969 4.238 QT
-6.891 4.301 -6.891 4.379 QT
-6.891 18.551 L
-6.891 19.316 -3.891 19.316 QT
-3.891 20.16 L
-11.766 20.16 L
cp}def
f2138193672
f
GR
GS
[0.75 0 0 0.75 192.99706 231.85001] CT
0.149 GC
N
/f-1976923049{4 20.691 M
1.062 20.691 0 18.269 QT
-1.063 15.847 -1.063 12.504 QT
-1.063 10.426 -0.68 8.582 QT
-0.297 6.738 0.836 5.457 QT
1.969 4.176 4 4.176 QT
5.578 4.176 6.586 4.949 QT
7.594 5.722 8.125 6.949 QT
8.656 8.176 8.852 9.574 QT
9.047 10.972 9.047 12.504 QT
9.047 14.566 8.664 16.363 QT
8.281 18.16 7.164 19.426 QT
6.047 20.691 4 20.691 QT
cp
4 20.066 M
5.344 20.066 6 18.691 QT
6.656 17.316 6.805 15.652 QT
6.953 13.988 6.953 12.113 QT
6.953 10.316 6.805 8.793 QT
6.656 7.269 6 6.035 QT
5.344 4.801 4 4.801 QT
2.641 4.801 1.984 6.043 QT
1.328 7.285 1.18 8.801 QT
1.031 10.316 1.031 12.113 QT
1.031 13.457 1.094 14.636 QT
1.156 15.816 1.437 17.082 QT
1.719 18.347 2.344 19.207 QT
2.969 20.066 4 20.066 QT
cp}def
f-1976923049
f
GR
GS
[0.75 0 0 0.75 192.99706 231.85001] CT
0.149 GC
N
/f770891007{16 20.691 M
13.063 20.691 12 18.269 QT
10.938 15.847 10.938 12.504 QT
10.938 10.426 11.32 8.582 QT
11.703 6.738 12.836 5.457 QT
13.969 4.176 16 4.176 QT
17.578 4.176 18.586 4.949 QT
19.594 5.722 20.125 6.949 QT
20.656 8.176 20.852 9.574 QT
21.047 10.972 21.047 12.504 QT
21.047 14.566 20.664 16.363 QT
20.281 18.16 19.164 19.426 QT
18.047 20.691 16 20.691 QT
cp
16 20.066 M
17.344 20.066 18 18.691 QT
18.656 17.316 18.805 15.652 QT
18.953 13.988 18.953 12.113 QT
18.953 10.316 18.805 8.793 QT
18.656 7.269 18 6.035 QT
17.344 4.801 16 4.801 QT
14.641 4.801 13.984 6.043 QT
13.328 7.285 13.18 8.801 QT
13.031 10.316 13.031 12.113 QT
13.031 13.457 13.094 14.636 QT
13.156 15.816 13.438 17.082 QT
13.719 18.347 14.344 19.207 QT
14.969 20.066 16 20.066 QT
cp}def
f770891007
f
GR
GS
[0.75 0 0 0.75 299.58529 231.85001] CT
0.149 GC
N
/f-1749699357{0 20.691 M
-2.938 20.691 -4 18.269 QT
-5.063 15.847 -5.063 12.504 QT
-5.063 10.426 -4.68 8.582 QT
-4.297 6.738 -3.164 5.457 QT
-2.031 4.176 0 4.176 QT
1.578 4.176 2.586 4.949 QT
3.594 5.722 4.125 6.949 QT
4.656 8.176 4.852 9.574 QT
5.047 10.972 5.047 12.504 QT
5.047 14.566 4.664 16.363 QT
4.281 18.16 3.164 19.426 QT
2.047 20.691 0 20.691 QT
cp
0 20.066 M
1.344 20.066 2 18.691 QT
2.656 17.316 2.805 15.652 QT
2.953 13.988 2.953 12.113 QT
2.953 10.316 2.805 8.793 QT
2.656 7.269 2 6.035 QT
1.344 4.801 0 4.801 QT
-1.359 4.801 -2.016 6.043 QT
-2.672 7.285 -2.82 8.801 QT
-2.969 10.316 -2.969 12.113 QT
-2.969 13.457 -2.906 14.636 QT
-2.844 15.816 -2.563 17.082 QT
-2.281 18.347 -1.656 19.207 QT
-1.031 20.066 0 20.066 QT
cp}def
f-1749699357
f
GR
GS
[0.75 0 0 0.75 406.17352 231.85001] CT
0.149 GC
N
/f-336516700{-15.766 20.16 M
-15.766 19.316 L
-12.766 19.316 -12.766 18.551 QT
-12.766 5.957 L
-14.016 6.551 -15.906 6.551 QT
-15.906 5.707 L
-12.969 5.707 -11.469 4.176 QT
-11.125 4.176 L
-11.047 4.176 -10.969 4.238 QT
-10.891 4.301 -10.891 4.379 QT
-10.891 18.551 L
-10.891 19.316 -7.891 19.316 QT
-7.891 20.16 L
-15.766 20.16 L
cp}def
f-336516700
f
GR
GS
[0.75 0 0 0.75 406.17352 231.85001] CT
0.149 GC
N
f-1749699357
f
GR
GS
[0.75 0 0 0.75 406.17352 231.85001] CT
0.149 GC
N
/f1314376594{12 20.691 M
9.063 20.691 8 18.269 QT
6.938 15.847 6.938 12.504 QT
6.938 10.426 7.32 8.582 QT
7.703 6.738 8.836 5.457 QT
9.969 4.176 12 4.176 QT
13.578 4.176 14.586 4.949 QT
15.594 5.722 16.125 6.949 QT
16.656 8.176 16.852 9.574 QT
17.047 10.972 17.047 12.504 QT
17.047 14.566 16.664 16.363 QT
16.281 18.16 15.164 19.426 QT
14.047 20.691 12 20.691 QT
cp
12 20.066 M
13.344 20.066 14 18.691 QT
14.656 17.316 14.805 15.652 QT
14.953 13.988 14.953 12.113 QT
14.953 10.316 14.805 8.793 QT
14.656 7.269 14 6.035 QT
13.344 4.801 12 4.801 QT
10.641 4.801 9.984 6.043 QT
9.328 7.285 9.18 8.801 QT
9.031 10.316 9.031 12.113 QT
9.031 13.457 9.094 14.636 QT
9.156 15.816 9.438 17.082 QT
9.719 18.347 10.344 19.207 QT
10.969 20.066 12 20.066 QT
cp}def
f1314376594
f
GR
GS
[0.75 0 0 0.75 512.76178 231.85001] CT
0.149 GC
N
/f-136497593{-16.797 20.16 M
-16.797 19.519 L
-16.797 19.457 -16.75 19.379 QT
-13.031 15.254 L
-12.188 14.347 -11.656 13.722 QT
-11.125 13.097 -10.609 12.293 QT
-10.094 11.488 -9.797 10.652 QT
-9.5 9.816 -9.5 8.879 QT
-9.5 7.894 -9.867 6.996 QT
-10.234 6.097 -10.953 5.558 QT
-11.672 5.019 -12.688 5.019 QT
-13.734 5.019 -14.563 5.644 QT
-15.391 6.269 -15.734 7.269 QT
-15.641 7.238 -15.484 7.238 QT
-14.938 7.238 -14.555 7.605 QT
-14.172 7.972 -14.172 8.551 QT
-14.172 9.097 -14.555 9.48 QT
-14.938 9.863 -15.484 9.863 QT
-16.047 9.863 -16.422 9.465 QT
-16.797 9.066 -16.797 8.551 QT
-16.797 7.644 -16.461 6.855 QT
-16.125 6.066 -15.484 5.449 QT
-14.844 4.832 -14.039 4.504 QT
-13.234 4.176 -12.344 4.176 QT
-10.969 4.176 -9.781 4.754 QT
-8.594 5.332 -7.906 6.394 QT
-7.219 7.457 -7.219 8.879 QT
-7.219 9.91 -7.672 10.847 QT
-8.125 11.785 -8.844 12.558 QT
-9.563 13.332 -10.672 14.301 QT
-11.781 15.269 -12.141 15.597 QT
-14.859 18.207 L
-12.547 18.207 L
-10.844 18.207 -9.703 18.183 QT
-8.563 18.16 -8.5 18.097 QT
-8.219 17.785 -7.922 15.879 QT
-7.219 15.879 L
-7.891 20.16 L
-16.797 20.16 L
cp}def
f-136497593
f
GR
GS
[0.75 0 0 0.75 512.76178 231.85001] CT
0.149 GC
N
f-1749699357
f
GR
GS
[0.75 0 0 0.75 512.76178 231.85001] CT
0.149 GC
N
f1314376594
f
GR
GS
[0.75 0 0 0.75 0 0.5] CT
0.149 GC
2 setlinecap
1 LJ
0.667 LW
N
101 301 M
101 25 L
S
GR
GS
[0.75 0 0 0.75 0 0.5] CT
0.149 GC
2 setlinecap
1 LJ
0.667 LW
N
705 301 M
705 25 L
S
GR
GS
[0.75 0 0 0.75 0 0.5] CT
0.149 GC
2 setlinecap
1 LJ
0.667 LW
N
101 249.25 M
107.04 249.25 L
S
GR
GS
[0.75 0 0 0.75 0 0.5] CT
0.149 GC
2 setlinecap
1 LJ
0.667 LW
N
101 163 M
107.04 163 L
S
GR
GS
[0.75 0 0 0.75 0 0.5] CT
0.149 GC
2 setlinecap
1 LJ
0.667 LW
N
101 76.75 M
107.04 76.75 L
S
GR
GS
[0.75 0 0 0.75 0 0.5] CT
0.149 GC
2 setlinecap
1 LJ
0.667 LW
N
705 249.25 M
698.96 249.25 L
S
GR
GS
[0.75 0 0 0.75 0 0.5] CT
0.149 GC
2 setlinecap
1 LJ
0.667 LW
N
705 163 M
698.96 163 L
S
GR
GS
[0.75 0 0 0.75 0 0.5] CT
0.149 GC
2 setlinecap
1 LJ
0.667 LW
N
705 76.75 M
698.96 76.75 L
S
GR
GS
[0.75 0 0 0.75 70.15001 187.4375] CT
0.149 GC
N
/f1974064997{-31.734 1.322 M
-31.734 -0.178 L
-25.375 -0.178 L
-25.375 1.322 L
-31.734 1.322 L
cp}def
f1974064997
f
GR
GS
[0.75 0 0 0.75 70.15001 187.4375] CT
0.149 GC
N
/f16918706{-21.906 3.026 M
-21.672 3.729 -21.156 4.307 QT
-20.641 4.885 -19.945 5.205 QT
-19.25 5.526 -18.5 5.526 QT
-16.766 5.526 -16.109 4.174 QT
-15.453 2.822 -15.453 0.901 QT
-15.453 0.072 -15.484 -0.498 QT
-15.516 -1.068 -15.641 -1.584 QT
-15.859 -2.428 -16.422 -3.06 QT
-16.984 -3.693 -17.781 -3.693 QT
-18.594 -3.693 -19.172 -3.451 QT
-19.75 -3.209 -20.117 -2.881 QT
-20.484 -2.553 -20.766 -2.185 QT
-21.047 -1.818 -21.109 -1.803 QT
-21.391 -1.803 L
-21.438 -1.803 -21.531 -1.881 QT
-21.625 -1.959 -21.625 -2.021 QT
-21.625 -10.037 L
-21.625 -10.099 -21.547 -10.162 QT
-21.469 -10.224 -21.391 -10.224 QT
-21.313 -10.224 L
-19.703 -9.459 -17.875 -9.459 QT
-16.094 -9.459 -14.453 -10.224 QT
-14.375 -10.224 L
-14.297 -10.224 -14.227 -10.17 QT
-14.156 -10.115 -14.156 -10.037 QT
-14.156 -9.818 L
-14.156 -9.693 -14.203 -9.693 QT
-15.016 -8.615 -16.258 -8.006 QT
-17.5 -7.396 -18.813 -7.396 QT
-19.781 -7.396 -20.781 -7.662 QT
-20.781 -3.131 L
-19.984 -3.771 -19.359 -4.045 QT
-18.734 -4.318 -17.766 -4.318 QT
-16.438 -4.318 -15.391 -3.56 QT
-14.344 -2.803 -13.781 -1.576 QT
-13.219 -0.349 -13.219 0.932 QT
-13.219 2.369 -13.93 3.604 QT
-14.641 4.838 -15.859 5.565 QT
-17.078 6.291 -18.5 6.291 QT
-19.688 6.291 -20.68 5.682 QT
-21.672 5.072 -22.234 4.041 QT
-22.797 3.01 -22.797 1.838 QT
-22.797 1.307 -22.445 0.963 QT
-22.094 0.619 -21.578 0.619 QT
-21.047 0.619 -20.688 0.971 QT
-20.328 1.322 -20.328 1.838 QT
-20.328 2.354 -20.688 2.713 QT
-21.047 3.072 -21.578 3.072 QT
-21.656 3.072 -21.758 3.057 QT
-21.859 3.041 -21.906 3.026 QT
cp}def
f16918706
f
GR
GS
[0.75 0 0 0.75 70.15001 187.4375] CT
0.149 GC
N
/f1219663315{-6 6.291 M
-8.938 6.291 -10 3.869 QT
-11.063 1.447 -11.063 -1.896 QT
-11.063 -3.974 -10.68 -5.818 QT
-10.297 -7.662 -9.164 -8.943 QT
-8.031 -10.224 -6 -10.224 QT
-4.422 -10.224 -3.414 -9.451 QT
-2.406 -8.678 -1.875 -7.451 QT
-1.344 -6.224 -1.148 -4.826 QT
-0.953 -3.428 -0.953 -1.896 QT
-0.953 0.166 -1.336 1.963 QT
-1.719 3.76 -2.836 5.026 QT
-3.953 6.291 -6 6.291 QT
cp
-6 5.666 M
-4.656 5.666 -4 4.291 QT
-3.344 2.916 -3.195 1.252 QT
-3.047 -0.412 -3.047 -2.287 QT
-3.047 -4.084 -3.195 -5.607 QT
-3.344 -7.131 -4 -8.365 QT
-4.656 -9.599 -6 -9.599 QT
-7.359 -9.599 -8.016 -8.357 QT
-8.672 -7.115 -8.82 -5.599 QT
-8.969 -4.084 -8.969 -2.287 QT
-8.969 -0.943 -8.906 0.236 QT
-8.844 1.416 -8.563 2.682 QT
-8.281 3.947 -7.656 4.807 QT
-7.031 5.666 -6 5.666 QT
cp}def
f1219663315
f
GR
GS
[0.75 0 0 0.75 70.15001 122.75] CT
0.149 GC
N
f1219663315
f
GR
GS
[0.75 0 0 0.75 70.15001 58.0625] CT
0.149 GC
N
f16918706
f
GR
GS
[0.75 0 0 0.75 70.15001 58.0625] CT
0.149 GC
N
f1219663315
f
GR
GS
[0.75 0 0 0.75 0 0.5] CT
1 LJ
5.333 LW
N
683.682 163 M
683.582 157.698 L
683.28 152.408 L
682.778 147.143 L
682.077 141.915 L
681.181 136.736 L
680.092 131.618 L
678.813 126.572 L
677.35 121.61 L
675.707 116.741 L
673.89 111.977 L
671.904 107.326 L
669.755 102.797 L
667.452 98.399 L
664.999 94.138 L
662.406 90.023 L
659.679 86.058 L
656.826 82.249 L
653.856 78.602 L
650.775 75.119 L
647.592 71.805 L
644.315 68.662 L
640.952 65.692 L
637.511 62.897 L
633.998 60.276 L
630.423 57.831 L
626.791 55.562 L
623.11 53.466 L
619.387 51.544 L
615.629 49.792 L
611.841 48.21 L
608.031 46.795 L
604.202 45.544 L
600.362 44.453 L
596.515 43.52 L
592.666 42.742 L
588.819 42.113 L
584.979 41.631 L
581.149 41.292 L
577.333 41.091 L
573.536 41.024 L
569.758 41.087 L
566.004 41.276 L
562.276 41.587 L
558.576 42.015 L
554.906 42.555 L
551.268 43.205 L
547.664 43.959 L
544.095 44.814 L
540.562 45.765 L
537.066 46.809 L
533.609 47.941 L
530.19 49.158 L
526.81 50.457 L
523.471 51.833 L
520.171 53.284 L
516.911 54.805 L
513.691 56.393 L
510.511 58.046 L
507.372 59.76 L
504.271 61.533 L
501.21 63.361 L
498.188 65.242 L
495.204 67.173 L
492.258 69.151 L
489.349 71.175 L
486.476 73.241 L
483.64 75.349 L
480.838 77.494 L
478.07 79.676 L
475.336 81.892 L
472.635 84.141 L
469.965 86.421 L
467.326 88.729 L
464.716 91.065 L
462.136 93.427 L
459.583 95.813 L
457.057 98.222 L
454.558 100.653 L
452.083 103.104 L
449.632 105.573 L
447.204 108.061 L
444.798 110.564 L
442.413 113.084 L
440.048 115.618 L
437.702 118.165 L
435.373 120.725 L
433.061 123.296 L
430.765 125.878 L
428.483 128.47 L
426.216 131.071 L
423.96 133.679 L
421.716 136.296 L
419.483 138.919 L
417.259 141.547 L
415.044 144.182 L
412.836 146.82 L
410.635 149.463 L
408.438 152.108 L
406.246 154.757 L
404.058 157.407 L
401.871 160.058 L
399.686 162.71 L
397.501 165.362 L
395.315 168.014 L
393.127 170.664 L
390.936 173.312 L
388.741 175.958 L
386.541 178.601 L
384.335 181.24 L
382.122 183.874 L
379.901 186.503 L
377.671 189.127 L
375.43 191.743 L
373.179 194.353 L
370.915 196.954 L
368.638 199.547 L
366.346 202.129 L
364.039 204.702 L
361.716 207.262 L
359.375 209.811 L
357.016 212.346 L
354.637 214.867 L
352.238 217.372 L
349.817 219.862 L
347.374 222.333 L
344.907 224.786 L
342.415 227.219 L
339.898 229.631 L
337.355 232.02 L
334.783 234.385 L
332.184 236.725 L
329.554 239.037 L
326.895 241.321 L
324.204 243.575 L
321.481 245.797 L
318.725 247.984 L
315.935 250.136 L
313.111 252.25 L
310.251 254.324 L
307.355 256.355 L
304.422 258.342 L
301.452 260.283 L
298.443 262.173 L
295.397 264.012 L
292.311 265.796 L
289.186 267.523 L
286.022 269.189 L
282.817 270.792 L
279.573 272.329 L
276.289 273.795 L
272.965 275.189 L
269.602 276.506 L
266.199 277.743 L
262.758 278.897 L
259.278 279.963 L
255.761 280.938 L
252.208 281.817 L
248.62 282.598 L
244.997 283.276 L
241.343 283.846 L
237.658 284.305 L
233.944 284.648 L
230.204 284.872 L
226.44 284.971 L
222.654 284.942 L
218.85 284.78 L
215.031 284.482 L
211.201 284.043 L
207.362 283.459 L
203.52 282.726 L
199.679 281.841 L
195.843 280.8 L
192.017 279.6 L
188.207 278.237 L
184.418 276.708 L
180.656 275.012 L
176.928 273.145 L
173.24 271.107 L
169.598 268.895 L
166.009 266.508 L
162.481 263.947 L
159.022 261.21 L
155.638 258.3 L
152.337 255.216 L
149.128 251.961 L
146.018 248.536 L
143.014 244.946 L
140.126 241.194 L
137.361 237.284 L
134.726 233.221 L
132.229 229.011 L
129.878 224.661 L
127.68 220.179 L
125.641 215.571 L
123.769 210.846 L
122.069 206.014 L
120.546 201.085 L
119.207 196.069 L
118.055 190.976 L
117.094 185.818 L
116.328 180.606 L
115.76 175.353 L
115.391 170.071 L
115.223 164.772 L
115.256 159.468 L
115.491 154.173 L
115.927 148.898 L
116.561 143.656 L
117.392 138.459 L
118.417 133.32 L
119.633 128.249 L
121.035 123.257 L
122.619 118.356 L
124.378 113.556 L
126.309 108.866 L
128.404 104.296 L
130.656 99.853 L
133.06 95.546 L
135.607 91.381 L
138.29 87.365 L
141.101 83.504 L
144.033 79.802 L
147.078 76.264 L
150.228 72.893 L
153.474 69.693 L
156.809 66.665 L
160.225 63.811 L
163.715 61.132 L
167.271 58.629 L
170.884 56.3 L
174.55 54.147 L
178.259 52.167 L
182.006 50.358 L
185.785 48.72 L
189.588 47.249 L
193.411 45.944 L
197.248 44.8 L
201.094 43.815 L
204.943 42.985 L
208.791 42.307 L
212.634 41.776 L
216.467 41.39 L
220.288 41.143 L
224.092 41.032 L
227.877 41.052 L
231.639 41.199 L
235.376 41.47 L
239.086 41.859 L
242.766 42.362 L
246.414 42.976 L
250.03 43.696 L
253.611 44.517 L
257.156 45.437 L
260.664 46.45 L
264.135 47.553 L
267.566 48.743 L
270.959 50.014 L
274.312 51.365 L
277.626 52.791 L
280.899 54.289 L
284.132 55.855 L
287.325 57.487 L
290.478 59.181 L
293.592 60.935 L
296.666 62.744 L
299.701 64.608 L
302.697 66.522 L
305.656 68.485 L
308.578 70.494 L
311.462 72.547 L
314.311 74.64 L
317.124 76.773 L
319.903 78.943 L
322.648 81.148 L
325.361 83.386 L
328.041 85.656 L
330.69 87.955 L
333.31 90.282 L
335.9 92.636 L
338.461 95.014 L
340.996 97.415 L
343.504 99.839 L
345.987 102.283 L
348.446 104.746 L
350.881 107.228 L
353.294 109.726 L
355.686 112.241 L
358.058 114.77 L
360.411 117.313 L
362.745 119.868 L
365.063 122.436 L
367.364 125.014 L
369.65 127.603 L
371.922 130.201 L
374.182 132.807 L
376.429 135.421 L
378.666 138.042 L
380.893 140.669 L
383.111 143.301 L
385.321 145.938 L
387.525 148.58 L
389.723 151.224 L
391.916 153.872 L
394.106 156.521 L
396.293 159.172 L
398.478 161.824 L
400.663 164.476 L
402.849 167.128 L
405.036 169.779 L
407.226 172.428 L
409.419 175.075 L
411.618 177.718 L
413.821 180.359 L
416.032 182.995 L
418.25 185.626 L
420.477 188.251 L
422.714 190.87 L
424.962 193.482 L
427.222 196.086 L
429.494 198.682 L
431.781 201.268 L
434.083 203.844 L
436.4 206.408 L
438.735 208.961 L
441.088 211.501 L
443.46 214.026 L
445.852 216.537 L
448.266 219.032 L
450.702 221.51 L
453.161 223.969 L
455.644 226.409 L
458.152 228.828 L
460.687 231.224 L
463.249 233.598 L
465.839 235.946 L
468.458 238.268 L
471.107 240.562 L
473.788 242.826 L
476.5 245.058 L
479.245 247.257 L
482.023 249.421 L
484.836 251.548 L
487.684 253.636 L
490.568 255.681 L
493.488 257.684 L
496.446 259.64 L
499.441 261.547 L
502.475 263.404 L
505.548 265.207 L
508.66 266.953 L
511.811 268.639 L
515.002 270.264 L
518.233 271.823 L
521.504 273.313 L
524.814 274.732 L
528.165 276.075 L
531.554 277.339 L
534.983 278.521 L
538.45 279.617 L
541.954 280.622 L
545.495 281.534 L
549.072 282.349 L
552.683 283.061 L
556.327 283.668 L
560.002 284.164 L
563.706 284.547 L
567.438 284.811 L
571.195 284.952 L
574.973 284.966 L
578.771 284.849 L
582.586 284.597 L
586.413 284.206 L
590.249 283.67 L
594.09 282.988 L
597.933 282.154 L
601.771 281.166 L
605.601 280.019 L
609.417 278.71 L
613.213 277.237 L
616.985 275.597 L
620.725 273.788 L
624.427 271.807 L
628.086 269.653 L
631.693 267.325 L
635.241 264.822 L
638.725 262.144 L
642.135 259.291 L
645.464 256.265 L
648.705 253.067 L
651.849 249.699 L
654.889 246.164 L
657.817 242.465 L
660.624 238.607 L
663.303 234.595 L
665.847 230.433 L
668.247 226.13 L
670.497 221.69 L
672.59 217.123 L
674.518 212.437 L
676.277 207.64 L
677.859 202.742 L
679.26 197.753 L
680.476 192.685 L
681.501 187.547 L
682.332 182.352 L
682.966 177.112 L
683.402 171.838 L
683.637 166.543 L
S
GR
GS
[0.75 0 0 0.75 192.99706 122.75] CT
1 0 0 RC
N
10 0 M
10 -5.523 5.523 -10 0 -10 C
-5.523 -10 -10 -5.523 -10 0 C
-10 5.523 -5.523 10 0 10 C
5.523 10 10 5.523 10 0 C
cp
f
GR
GS
[0.75 0 0 0.75 192.99706 122.75] CT
1 0 0 RC
10.0 ML
2.667 LW
N
10 0 M
10 -5.523 5.523 -10 0 -10 C
-5.523 -10 -10 -5.523 -10 0 C
-10 5.523 -5.523 10 0 10 C
5.523 10 10 5.523 10 0 C
cp
S
GR
GS
[0.75 0 0 0.75 0 0.5] CT
1 0 0 RC
1 LJ
0.667 LW
N
684 160.338 M
684 159.667 L
S
GR
GS
[0.75 0 0 0.75 0 0.5] CT
1 0 0 RC
1 LJ
0.667 LW
N
671.5 171.333 M
684 138 L
684 159.667 L
671.5 171.333 L
S
GR
GS
[0.75 0 0 0.75 0 0.5] CT
1 0 0 RC
1 LJ
0.667 LW
N
684 138 M
696.5 171.333 L
684 159.667 L
684 138 L
S
GR
GS
[0.75 0 0 0.75 0 0.5] CT
1 0 0 RC
N
684 138 M
671.5 171.333 L
684 159.667 L
696.5 171.333 L
cp
f
GR
GS
[0.75 0 0 0.75 0 0.5] CT
1 0 0 RC
1 LJ
0.667 LW
N
609 47.338 M
610.859 47.86 L
S
GR
GS
[0.75 0 0 0.75 0 0.5] CT
1 0 0 RC
1 LJ
0.667 LW
N
618.71 63.05 M
590 42 L
610.859 47.86 L
618.71 63.05 L
S
GR
GS
[0.75 0 0 0.75 0 0.5] CT
1 0 0 RC
1 LJ
0.667 LW
N
590 42 M
625.472 38.982 L
610.859 47.86 L
590 42 L
S
GR
GS
[0.75 0 0 0.75 0 0.5] CT
1 0 0 RC
N
590 42 M
618.71 63.05 L
610.859 47.86 L
625.472 38.982 L
cp
f
GR
GS
[0.75 0 0 0.75 0 0.5] CT
1 0 0 RC
1 LJ
0.667 LW
N
356 214.338 M
352.24 217.658 L
S
GR
GS
[0.75 0 0 0.75 0 0.5] CT
1 0 0 RC
1 LJ
0.667 LW
N
369.26 219.305 M
336 232 L
352.24 217.658 L
369.26 219.305 L
S
GR
GS
[0.75 0 0 0.75 0 0.5] CT
1 0 0 RC
1 LJ
0.667 LW
N
336 232 M
352.711 200.566 L
352.24 217.658 L
336 232 L
S
GR
GS
[0.75 0 0 0.75 0 0.5] CT
1 0 0 RC
N
336 232 M
369.26 219.305 L
352.24 217.658 L
352.711 200.566 L
cp
f
GR
%%Trailer
%%Pages: 1
%%EOF
