%!PS-Adobe-3.0 EPSF-3.0
%%Creator: (MATLAB, The Mathworks, Inc. Version 9.5.0.944444 \(R2018b\). Operating System: Windows 10)
%%Title: (C:/Users/Alex/Documents/PhD Docs/01. GIT/my_phd_thesis/Chapter4/Figures/paper/Simu08_ranking_042018_new.eps)
%%CreationDate: 2019-12-09T18:02:53
%%Pages: (atend)
%%BoundingBox: 0 0 599 479
%%LanguageLevel: 3
%%EndComments
%%BeginProlog
%%BeginResource: procset (Apache XML Graphics Std ProcSet) 1.2 0
%%Version: 1.2 0
%%Copyright: (Copyright 2001-2003,2010 The Apache Software Foundation. License terms: http://www.apache.org/licenses/LICENSE-2.0)
/bd{bind def}bind def
/ld{load def}bd
/GR/grestore ld
/GS/gsave ld
/RM/rmoveto ld
/C/curveto ld
/t/show ld
/L/lineto ld
/ML/setmiterlimit ld
/CT/concat ld
/f/fill ld
/N/newpath ld
/S/stroke ld
/CC/setcmykcolor ld
/A/ashow ld
/cp/closepath ld
/RC/setrgbcolor ld
/LJ/setlinejoin ld
/GC/setgray ld
/LW/setlinewidth ld
/M/moveto ld
/re {4 2 roll M
1 index 0 rlineto
0 exch rlineto
neg 0 rlineto
cp } bd
/_ctm matrix def
/_tm matrix def
/BT { _ctm currentmatrix pop matrix _tm copy pop 0 0 moveto } bd
/ET { _ctm setmatrix } bd
/iTm { _ctm setmatrix _tm concat } bd
/Tm { _tm astore pop iTm 0 0 moveto } bd
/ux 0.0 def
/uy 0.0 def
/F {
  /Tp exch def
  /Tf exch def
  Tf findfont Tp scalefont setfont
  /cf Tf def  /cs Tp def
} bd
/ULS {currentpoint /uy exch def /ux exch def} bd
/ULE {
  /Tcx currentpoint pop def
  gsave
  newpath
  cf findfont cs scalefont dup
  /FontMatrix get 0 get /Ts exch def /FontInfo get dup
  /UnderlinePosition get Ts mul /To exch def
  /UnderlineThickness get Ts mul /Tt exch def
  ux uy To add moveto  Tcx uy To add lineto
  Tt setlinewidth stroke
  grestore
} bd
/OLE {
  /Tcx currentpoint pop def
  gsave
  newpath
  cf findfont cs scalefont dup
  /FontMatrix get 0 get /Ts exch def /FontInfo get dup
  /UnderlinePosition get Ts mul /To exch def
  /UnderlineThickness get Ts mul /Tt exch def
  ux uy To add cs add moveto Tcx uy To add cs add lineto
  Tt setlinewidth stroke
  grestore
} bd
/SOE {
  /Tcx currentpoint pop def
  gsave
  newpath
  cf findfont cs scalefont dup
  /FontMatrix get 0 get /Ts exch def /FontInfo get dup
  /UnderlinePosition get Ts mul /To exch def
  /UnderlineThickness get Ts mul /Tt exch def
  ux uy To add cs 10 mul 26 idiv add moveto Tcx uy To add cs 10 mul 26 idiv add lineto
  Tt setlinewidth stroke
  grestore
} bd
/QT {
/Y22 exch store
/X22 exch store
/Y21 exch store
/X21 exch store
currentpoint
/Y21 load 2 mul add 3 div exch
/X21 load 2 mul add 3 div exch
/X21 load 2 mul /X22 load add 3 div
/Y21 load 2 mul /Y22 load add 3 div
/X22 load /Y22 load curveto
} bd
/SSPD {
dup length /d exch dict def
{
/v exch def
/k exch def
currentpagedevice k known {
/cpdv currentpagedevice k get def
v cpdv ne {
/upd false def
/nullv v type /nulltype eq def
/nullcpdv cpdv type /nulltype eq def
nullv nullcpdv or
{
/upd true def
} {
/sametype v type cpdv type eq def
sametype {
v type /arraytype eq {
/vlen v length def
/cpdvlen cpdv length def
vlen cpdvlen eq {
0 1 vlen 1 sub {
/i exch def
/obj v i get def
/cpdobj cpdv i get def
obj cpdobj ne {
/upd true def
exit
} if
} for
} {
/upd true def
} ifelse
} {
v type /dicttype eq {
v {
/dv exch def
/dk exch def
/cpddv cpdv dk get def
dv cpddv ne {
/upd true def
exit
} if
} forall
} {
/upd true def
} ifelse
} ifelse
} if
} ifelse
upd true eq {
d k v put
} if
} if
} if
} forall
d length 0 gt {
d setpagedevice
} if
} bd
/RE { % /NewFontName [NewEncodingArray] /FontName RE -
  findfont dup length dict begin
  {
    1 index /FID ne
    {def} {pop pop} ifelse
  } forall
  /Encoding exch def
  /FontName 1 index def
  currentdict definefont pop
  end
} bind def
%%EndResource
%%BeginResource: procset (Apache XML Graphics EPS ProcSet) 1.0 0
%%Version: 1.0 0
%%Copyright: (Copyright 2002-2003 The Apache Software Foundation. License terms: http://www.apache.org/licenses/LICENSE-2.0)
/BeginEPSF { %def
/b4_Inc_state save def         % Save state for cleanup
/dict_count countdictstack def % Count objects on dict stack
/op_count count 1 sub def      % Count objects on operand stack
userdict begin                 % Push userdict on dict stack
/showpage { } def              % Redefine showpage, { } = null proc
0 setgray 0 setlinecap         % Prepare graphics state
1 setlinewidth 0 setlinejoin
10 setmiterlimit [ ] 0 setdash newpath
/languagelevel where           % If level not equal to 1 then
{pop languagelevel             % set strokeadjust and
1 ne                           % overprint to their defaults.
{false setstrokeadjust false setoverprint
} if
} if
} bd
/EndEPSF { %def
count op_count sub {pop} repeat            % Clean up stacks
countdictstack dict_count sub {end} repeat
b4_Inc_state restore
} bd
%%EndResource
%FOPBeginFontDict
%%IncludeResource: font Courier-Oblique
%%IncludeResource: font Courier-BoldOblique
%%IncludeResource: font Courier-Bold
%%IncludeResource: font ZapfDingbats
%%IncludeResource: font Symbol
%%IncludeResource: font Helvetica
%%IncludeResource: font Helvetica-Oblique
%%IncludeResource: font Helvetica-Bold
%%IncludeResource: font Helvetica-BoldOblique
%%IncludeResource: font Times-Roman
%%IncludeResource: font Times-Italic
%%IncludeResource: font Times-Bold
%%IncludeResource: font Times-BoldItalic
%%IncludeResource: font Courier
%FOPEndFontDict
%%BeginResource: encoding WinAnsiEncoding
/WinAnsiEncoding [
/.notdef /.notdef /.notdef /.notdef /.notdef
/.notdef /.notdef /.notdef /.notdef /.notdef
/.notdef /.notdef /.notdef /.notdef /.notdef
/.notdef /.notdef /.notdef /.notdef /.notdef
/.notdef /.notdef /.notdef /.notdef /.notdef
/.notdef /.notdef /.notdef /.notdef /.notdef
/.notdef /.notdef /space /exclam /quotedbl
/numbersign /dollar /percent /ampersand /quotesingle
/parenleft /parenright /asterisk /plus /comma
/hyphen /period /slash /zero /one
/two /three /four /five /six
/seven /eight /nine /colon /semicolon
/less /equal /greater /question /at
/A /B /C /D /E
/F /G /H /I /J
/K /L /M /N /O
/P /Q /R /S /T
/U /V /W /X /Y
/Z /bracketleft /backslash /bracketright /asciicircum
/underscore /quoteleft /a /b /c
/d /e /f /g /h
/i /j /k /l /m
/n /o /p /q /r
/s /t /u /v /w
/x /y /z /braceleft /bar
/braceright /asciitilde /bullet /Euro /bullet
/quotesinglbase /florin /quotedblbase /ellipsis /dagger
/daggerdbl /circumflex /perthousand /Scaron /guilsinglleft
/OE /bullet /Zcaron /bullet /bullet
/quoteleft /quoteright /quotedblleft /quotedblright /bullet
/endash /emdash /asciitilde /trademark /scaron
/guilsinglright /oe /bullet /zcaron /Ydieresis
/space /exclamdown /cent /sterling /currency
/yen /brokenbar /section /dieresis /copyright
/ordfeminine /guillemotleft /logicalnot /sfthyphen /registered
/macron /degree /plusminus /twosuperior /threesuperior
/acute /mu /paragraph /middot /cedilla
/onesuperior /ordmasculine /guillemotright /onequarter /onehalf
/threequarters /questiondown /Agrave /Aacute /Acircumflex
/Atilde /Adieresis /Aring /AE /Ccedilla
/Egrave /Eacute /Ecircumflex /Edieresis /Igrave
/Iacute /Icircumflex /Idieresis /Eth /Ntilde
/Ograve /Oacute /Ocircumflex /Otilde /Odieresis
/multiply /Oslash /Ugrave /Uacute /Ucircumflex
/Udieresis /Yacute /Thorn /germandbls /agrave
/aacute /acircumflex /atilde /adieresis /aring
/ae /ccedilla /egrave /eacute /ecircumflex
/edieresis /igrave /iacute /icircumflex /idieresis
/eth /ntilde /ograve /oacute /ocircumflex
/otilde /odieresis /divide /oslash /ugrave
/uacute /ucircumflex /udieresis /yacute /thorn
/ydieresis
] def
%%EndResource
%FOPBeginFontReencode
/Courier-Oblique findfont
dup length dict begin
  {1 index /FID ne {def} {pop pop} ifelse} forall
  /Encoding WinAnsiEncoding def
  currentdict
end
/Courier-Oblique exch definefont pop
/Courier-BoldOblique findfont
dup length dict begin
  {1 index /FID ne {def} {pop pop} ifelse} forall
  /Encoding WinAnsiEncoding def
  currentdict
end
/Courier-BoldOblique exch definefont pop
/Courier-Bold findfont
dup length dict begin
  {1 index /FID ne {def} {pop pop} ifelse} forall
  /Encoding WinAnsiEncoding def
  currentdict
end
/Courier-Bold exch definefont pop
/Helvetica findfont
dup length dict begin
  {1 index /FID ne {def} {pop pop} ifelse} forall
  /Encoding WinAnsiEncoding def
  currentdict
end
/Helvetica exch definefont pop
/Helvetica-Oblique findfont
dup length dict begin
  {1 index /FID ne {def} {pop pop} ifelse} forall
  /Encoding WinAnsiEncoding def
  currentdict
end
/Helvetica-Oblique exch definefont pop
/Helvetica-Bold findfont
dup length dict begin
  {1 index /FID ne {def} {pop pop} ifelse} forall
  /Encoding WinAnsiEncoding def
  currentdict
end
/Helvetica-Bold exch definefont pop
/Helvetica-BoldOblique findfont
dup length dict begin
  {1 index /FID ne {def} {pop pop} ifelse} forall
  /Encoding WinAnsiEncoding def
  currentdict
end
/Helvetica-BoldOblique exch definefont pop
/Times-Roman findfont
dup length dict begin
  {1 index /FID ne {def} {pop pop} ifelse} forall
  /Encoding WinAnsiEncoding def
  currentdict
end
/Times-Roman exch definefont pop
/Times-Italic findfont
dup length dict begin
  {1 index /FID ne {def} {pop pop} ifelse} forall
  /Encoding WinAnsiEncoding def
  currentdict
end
/Times-Italic exch definefont pop
/Times-Bold findfont
dup length dict begin
  {1 index /FID ne {def} {pop pop} ifelse} forall
  /Encoding WinAnsiEncoding def
  currentdict
end
/Times-Bold exch definefont pop
/Times-BoldItalic findfont
dup length dict begin
  {1 index /FID ne {def} {pop pop} ifelse} forall
  /Encoding WinAnsiEncoding def
  currentdict
end
/Times-BoldItalic exch definefont pop
/Courier findfont
dup length dict begin
  {1 index /FID ne {def} {pop pop} ifelse} forall
  /Encoding WinAnsiEncoding def
  currentdict
end
/Courier exch definefont pop
%FOPEndFontReencode
%%EndProlog
%%Page: 1 1
%%PageBoundingBox: 0 0 599 479
%%BeginPageSetup
[1 0 0 -1 0 479] CT
%%EndPageSetup
GS
[0.75 0 0 0.75 0 -0.25] CT
1 GC
N
0 0 799 639 re
f
GR
GS
[0.75 0 0 0.75 0 -0.25] CT
1 GC
N
0 0 799 639 re
f
GR
GS
[0.75 0 0 0.75 0 -0.25] CT
1 GC
N
104 569 M
723 569 L
723 48 L
104 48 L
cp
f
GR
GS
[0.75 0 0 0.75 0 -0.25] CT
0.873 GC
1 LJ
0.667 LW
N
160.273 569 M
160.273 48 L
S
GR
GS
[0.75 0 0 0.75 0 -0.25] CT
0.873 GC
1 LJ
0.667 LW
N
216.545 569 M
216.545 48 L
S
GR
GS
[0.75 0 0 0.75 0 -0.25] CT
0.873 GC
1 LJ
0.667 LW
N
272.818 569 M
272.818 48 L
S
GR
GS
[0.75 0 0 0.75 0 -0.25] CT
0.873 GC
1 LJ
0.667 LW
N
329.091 569 M
329.091 48 L
S
GR
GS
[0.75 0 0 0.75 0 -0.25] CT
0.873 GC
1 LJ
0.667 LW
N
385.364 569 M
385.364 48 L
S
GR
GS
[0.75 0 0 0.75 0 -0.25] CT
0.873 GC
1 LJ
0.667 LW
N
441.636 569 M
441.636 48 L
S
GR
GS
[0.75 0 0 0.75 0 -0.25] CT
0.873 GC
1 LJ
0.667 LW
N
497.909 569 M
497.909 48 L
S
GR
GS
[0.75 0 0 0.75 0 -0.25] CT
0.873 GC
1 LJ
0.667 LW
N
554.182 569 M
554.182 48 L
S
GR
GS
[0.75 0 0 0.75 0 -0.25] CT
0.873 GC
1 LJ
0.667 LW
N
610.455 569 M
610.455 48 L
S
GR
GS
[0.75 0 0 0.75 0 -0.25] CT
0.873 GC
1 LJ
0.667 LW
N
666.727 569 M
666.727 48 L
S
GR
GS
[0.75 0 0 0.75 0 -0.25] CT
0.873 GC
1 LJ
0.667 LW
N
723 569 M
104 569 L
S
GR
GS
[0.75 0 0 0.75 0 -0.25] CT
0.873 GC
1 LJ
0.667 LW
N
723 482.167 M
104 482.167 L
S
GR
GS
[0.75 0 0 0.75 0 -0.25] CT
0.873 GC
1 LJ
0.667 LW
N
723 395.333 M
104 395.333 L
S
GR
GS
[0.75 0 0 0.75 0 -0.25] CT
0.873 GC
1 LJ
0.667 LW
N
723 308.5 M
104 308.5 L
S
GR
GS
[0.75 0 0 0.75 0 -0.25] CT
0.873 GC
1 LJ
0.667 LW
N
723 221.667 M
104 221.667 L
S
GR
GS
[0.75 0 0 0.75 0 -0.25] CT
0.873 GC
1 LJ
0.667 LW
N
723 134.833 M
104 134.833 L
S
GR
GS
[0.75 0 0 0.75 0 -0.25] CT
0.873 GC
1 LJ
0.667 LW
N
723 48 M
104 48 L
S
GR
GS
[0.75 0 0 0.75 0 -0.25] CT
0.149 GC
2 setlinecap
1 LJ
0.667 LW
N
104 569 M
723 569 L
S
GR
GS
[0.75 0 0 0.75 0 -0.25] CT
0.149 GC
2 setlinecap
1 LJ
0.667 LW
N
104 48 M
723 48 L
S
GR
GS
[0.75 0 0 0.75 0 -0.25] CT
0.149 GC
2 setlinecap
1 LJ
0.667 LW
N
160.273 569 M
160.273 562.81 L
S
GR
GS
[0.75 0 0 0.75 0 -0.25] CT
0.149 GC
2 setlinecap
1 LJ
0.667 LW
N
216.545 569 M
216.545 562.81 L
S
GR
GS
[0.75 0 0 0.75 0 -0.25] CT
0.149 GC
2 setlinecap
1 LJ
0.667 LW
N
272.818 569 M
272.818 562.81 L
S
GR
GS
[0.75 0 0 0.75 0 -0.25] CT
0.149 GC
2 setlinecap
1 LJ
0.667 LW
N
329.091 569 M
329.091 562.81 L
S
GR
GS
[0.75 0 0 0.75 0 -0.25] CT
0.149 GC
2 setlinecap
1 LJ
0.667 LW
N
385.364 569 M
385.364 562.81 L
S
GR
GS
[0.75 0 0 0.75 0 -0.25] CT
0.149 GC
2 setlinecap
1 LJ
0.667 LW
N
441.636 569 M
441.636 562.81 L
S
GR
GS
[0.75 0 0 0.75 0 -0.25] CT
0.149 GC
2 setlinecap
1 LJ
0.667 LW
N
497.909 569 M
497.909 562.81 L
S
GR
GS
[0.75 0 0 0.75 0 -0.25] CT
0.149 GC
2 setlinecap
1 LJ
0.667 LW
N
554.182 569 M
554.182 562.81 L
S
GR
GS
[0.75 0 0 0.75 0 -0.25] CT
0.149 GC
2 setlinecap
1 LJ
0.667 LW
N
610.455 569 M
610.455 562.81 L
S
GR
GS
[0.75 0 0 0.75 0 -0.25] CT
0.149 GC
2 setlinecap
1 LJ
0.667 LW
N
666.727 569 M
666.727 562.81 L
S
GR
GS
[0.75 0 0 0.75 0 -0.25] CT
0.149 GC
2 setlinecap
1 LJ
0.667 LW
N
160.273 48 M
160.273 54.19 L
S
GR
GS
[0.75 0 0 0.75 0 -0.25] CT
0.149 GC
2 setlinecap
1 LJ
0.667 LW
N
216.545 48 M
216.545 54.19 L
S
GR
GS
[0.75 0 0 0.75 0 -0.25] CT
0.149 GC
2 setlinecap
1 LJ
0.667 LW
N
272.818 48 M
272.818 54.19 L
S
GR
GS
[0.75 0 0 0.75 0 -0.25] CT
0.149 GC
2 setlinecap
1 LJ
0.667 LW
N
329.091 48 M
329.091 54.19 L
S
GR
GS
[0.75 0 0 0.75 0 -0.25] CT
0.149 GC
2 setlinecap
1 LJ
0.667 LW
N
385.364 48 M
385.364 54.19 L
S
GR
GS
[0.75 0 0 0.75 0 -0.25] CT
0.149 GC
2 setlinecap
1 LJ
0.667 LW
N
441.636 48 M
441.636 54.19 L
S
GR
GS
[0.75 0 0 0.75 0 -0.25] CT
0.149 GC
2 setlinecap
1 LJ
0.667 LW
N
497.909 48 M
497.909 54.19 L
S
GR
GS
[0.75 0 0 0.75 0 -0.25] CT
0.149 GC
2 setlinecap
1 LJ
0.667 LW
N
554.182 48 M
554.182 54.19 L
S
GR
GS
[0.75 0 0 0.75 0 -0.25] CT
0.149 GC
2 setlinecap
1 LJ
0.667 LW
N
610.455 48 M
610.455 54.19 L
S
GR
GS
[0.75 0 0 0.75 0 -0.25] CT
0.149 GC
2 setlinecap
1 LJ
0.667 LW
N
666.727 48 M
666.727 54.19 L
S
GR
GS
[0.75 0 0 0.75 120.20454 432.10001] CT
0.149 GC
N
-10.797 20.16 M
-10.797 19.519 L
-10.797 19.457 -10.75 19.379 QT
-7.031 15.254 L
-6.188 14.347 -5.656 13.722 QT
-5.125 13.097 -4.609 12.293 QT
-4.094 11.488 -3.797 10.652 QT
-3.5 9.816 -3.5 8.879 QT
-3.5 7.894 -3.867 6.996 QT
-4.234 6.097 -4.953 5.558 QT
-5.672 5.019 -6.688 5.019 QT
-7.734 5.019 -8.563 5.644 QT
-9.391 6.269 -9.734 7.269 QT
-9.641 7.238 -9.484 7.238 QT
-8.938 7.238 -8.555 7.605 QT
-8.172 7.972 -8.172 8.551 QT
-8.172 9.097 -8.555 9.48 QT
-8.938 9.863 -9.484 9.863 QT
-10.047 9.863 -10.422 9.465 QT
-10.797 9.066 -10.797 8.551 QT
-10.797 7.644 -10.461 6.855 QT
-10.125 6.066 -9.484 5.449 QT
-8.844 4.832 -8.039 4.504 QT
-7.234 4.176 -6.344 4.176 QT
-4.969 4.176 -3.781 4.754 QT
-2.594 5.332 -1.906 6.394 QT
-1.219 7.457 -1.219 8.879 QT
-1.219 9.91 -1.672 10.847 QT
-2.125 11.785 -2.844 12.558 QT
-3.563 13.332 -4.672 14.301 QT
-5.781 15.269 -6.141 15.597 QT
-8.859 18.207 L
-6.547 18.207 L
-4.844 18.207 -3.703 18.183 QT
-2.563 18.16 -2.5 18.097 QT
-2.219 17.785 -1.922 15.879 QT
-1.219 15.879 L
-1.891 20.16 L
-10.797 20.16 L
cp
f
GR
GS
[0.75 0 0 0.75 120.20454 432.10001] CT
0.149 GC
N
1.016 16.519 M
1.016 15.066 1.961 13.965 QT
2.906 12.863 4.391 12.113 QT
3.5 11.551 L
2.688 11.004 2.172 10.105 QT
1.656 9.207 1.656 8.222 QT
1.656 7.082 2.258 6.152 QT
2.859 5.222 3.859 4.699 QT
4.859 4.176 6 4.176 QT
7.063 4.176 8.055 4.605 QT
9.047 5.035 9.688 5.847 QT
10.328 6.66 10.328 7.769 QT
10.328 8.582 9.945 9.269 QT
9.563 9.957 8.898 10.511 QT
8.234 11.066 7.484 11.457 QT
8.859 12.332 L
9.813 12.957 10.391 13.965 QT
10.969 14.972 10.969 16.082 QT
10.969 17.379 10.273 18.449 QT
9.578 19.519 8.43 20.105 QT
7.281 20.691 6 20.691 QT
4.766 20.691 3.609 20.183 QT
2.453 19.676 1.734 18.722 QT
1.016 17.769 1.016 16.519 QT
cp
2.313 16.519 M
2.313 17.457 2.836 18.246 QT
3.359 19.035 4.211 19.48 QT
5.063 19.926 6 19.926 QT
7.391 19.926 8.531 19.113 QT
9.672 18.301 9.672 16.941 QT
9.672 16.488 9.492 16.035 QT
9.313 15.582 8.984 15.215 QT
8.656 14.847 8.266 14.613 QT
5.047 12.535 L
4.297 12.926 3.664 13.535 QT
3.031 14.144 2.672 14.91 QT
2.313 15.676 2.313 16.519 QT
cp
3.969 9.191 M
6.875 11.066 L
7.875 10.472 8.523 9.644 QT
9.172 8.816 9.172 7.769 QT
9.172 6.957 8.719 6.285 QT
8.266 5.613 7.539 5.238 QT
6.813 4.863 5.984 4.863 QT
5.25 4.863 4.516 5.144 QT
3.781 5.426 3.297 5.98 QT
2.813 6.535 2.813 7.285 QT
2.813 8.41 3.969 9.191 QT
cp
f
GR
GS
[0.75 0 0 0.75 162.40909 432.10001] CT
0.149 GC
N
/f-678663693{-10.797 20.16 M
-10.797 19.519 L
-10.797 19.457 -10.75 19.379 QT
-7.031 15.254 L
-6.188 14.347 -5.656 13.722 QT
-5.125 13.097 -4.609 12.293 QT
-4.094 11.488 -3.797 10.652 QT
-3.5 9.816 -3.5 8.879 QT
-3.5 7.894 -3.867 6.996 QT
-4.234 6.097 -4.953 5.558 QT
-5.672 5.019 -6.688 5.019 QT
-7.734 5.019 -8.563 5.644 QT
-9.391 6.269 -9.734 7.269 QT
-9.641 7.238 -9.484 7.238 QT
-8.938 7.238 -8.555 7.605 QT
-8.172 7.972 -8.172 8.551 QT
-8.172 9.097 -8.555 9.48 QT
-8.938 9.863 -9.484 9.863 QT
-10.047 9.863 -10.422 9.465 QT
-10.797 9.066 -10.797 8.551 QT
-10.797 7.644 -10.461 6.855 QT
-10.125 6.066 -9.484 5.449 QT
-8.844 4.832 -8.039 4.504 QT
-7.234 4.176 -6.344 4.176 QT
-4.969 4.176 -3.781 4.754 QT
-2.594 5.332 -1.906 6.394 QT
-1.219 7.457 -1.219 8.879 QT
-1.219 9.91 -1.672 10.847 QT
-2.125 11.785 -2.844 12.558 QT
-3.563 13.332 -4.672 14.301 QT
-5.781 15.269 -6.141 15.597 QT
-8.859 18.207 L
-6.547 18.207 L
-4.844 18.207 -3.703 18.183 QT
-2.563 18.16 -2.5 18.097 QT
-2.219 17.785 -1.922 15.879 QT
-1.219 15.879 L
-1.891 20.16 L
-10.797 20.16 L
cp}def
f-678663693
f
GR
GS
[0.75 0 0 0.75 162.40909 432.10001] CT
0.149 GC
N
/f-697139623{2.281 18.301 M
2.844 19.129 3.797 19.527 QT
4.75 19.926 5.844 19.926 QT
7.234 19.926 7.82 18.738 QT
8.406 17.551 8.406 16.035 QT
8.406 15.347 8.281 14.668 QT
8.156 13.988 7.867 13.402 QT
7.578 12.816 7.063 12.465 QT
6.547 12.113 5.813 12.113 QT
4.219 12.113 L
4.016 12.113 4.016 11.894 QT
4.016 11.691 L
4.016 11.504 4.219 11.504 QT
5.547 11.394 L
6.391 11.394 6.945 10.761 QT
7.5 10.129 7.758 9.222 QT
8.016 8.316 8.016 7.488 QT
8.016 6.347 7.477 5.605 QT
6.938 4.863 5.844 4.863 QT
4.922 4.863 4.094 5.207 QT
3.266 5.551 2.766 6.254 QT
2.813 6.254 2.852 6.246 QT
2.891 6.238 2.938 6.238 QT
3.469 6.238 3.836 6.613 QT
4.203 6.988 4.203 7.519 QT
4.203 8.035 3.836 8.41 QT
3.469 8.785 2.938 8.785 QT
2.406 8.785 2.031 8.41 QT
1.656 8.035 1.656 7.519 QT
1.656 6.488 2.273 5.722 QT
2.891 4.957 3.875 4.566 QT
4.859 4.176 5.844 4.176 QT
6.563 4.176 7.375 4.394 QT
8.188 4.613 8.844 5.011 QT
9.5 5.41 9.914 6.043 QT
10.328 6.676 10.328 7.488 QT
10.328 8.504 9.875 9.355 QT
9.422 10.207 8.641 10.832 QT
7.859 11.457 6.922 11.754 QT
7.953 11.957 8.891 12.543 QT
9.828 13.129 10.398 14.043 QT
10.969 14.957 10.969 16.004 QT
10.969 17.332 10.242 18.402 QT
9.516 19.472 8.336 20.082 QT
7.156 20.691 5.844 20.691 QT
4.719 20.691 3.586 20.261 QT
2.453 19.832 1.734 18.972 QT
1.016 18.113 1.016 16.926 QT
1.016 16.332 1.414 15.933 QT
1.813 15.535 2.406 15.535 QT
2.797 15.535 3.117 15.715 QT
3.438 15.894 3.617 16.222 QT
3.797 16.551 3.797 16.926 QT
3.797 17.504 3.391 17.902 QT
2.984 18.301 2.406 18.301 QT
2.281 18.301 L
cp}def
f-697139623
f
GR
GS
[0.75 0 0 0.75 204.61363 432.10001] CT
0.149 GC
N
f-678663693
f
GR
GS
[0.75 0 0 0.75 204.61363 432.10001] CT
0.149 GC
N
/f1089235638{4.172 19.535 M
4.172 18.207 4.406 16.926 QT
4.641 15.644 5.094 14.394 QT
5.547 13.144 6.188 11.949 QT
6.828 10.754 7.578 9.691 QT
9.781 6.644 L
7.031 6.644 L
2.766 6.644 2.641 6.769 QT
2.328 7.144 2.047 8.972 QT
1.344 8.972 L
2.141 3.941 L
2.844 3.941 L
2.844 4.004 L
2.844 4.441 4.305 4.574 QT
5.766 4.707 7.172 4.707 QT
11.641 4.707 L
11.641 5.316 L
11.641 5.347 11.633 5.355 QT
11.625 5.363 11.609 5.394 QT
8.313 10.035 L
7.094 11.832 6.789 14.035 QT
6.484 16.238 6.484 19.535 QT
6.484 20.004 6.141 20.347 QT
5.797 20.691 5.328 20.691 QT
4.859 20.691 4.516 20.347 QT
4.172 20.004 4.172 19.535 QT
cp}def
f1089235638
f
GR
GS
[0.75 0 0 0.75 246.81818 432.10001] CT
0.149 GC
N
/f75073062{-3.719 18.301 M
-3.156 19.129 -2.203 19.527 QT
-1.25 19.926 -0.156 19.926 QT
1.234 19.926 1.82 18.738 QT
2.406 17.551 2.406 16.035 QT
2.406 15.347 2.281 14.668 QT
2.156 13.988 1.867 13.402 QT
1.578 12.816 1.063 12.465 QT
0.547 12.113 -0.188 12.113 QT
-1.781 12.113 L
-1.984 12.113 -1.984 11.894 QT
-1.984 11.691 L
-1.984 11.504 -1.781 11.504 QT
-0.453 11.394 L
0.391 11.394 0.945 10.761 QT
1.5 10.129 1.758 9.222 QT
2.016 8.316 2.016 7.488 QT
2.016 6.347 1.477 5.605 QT
0.938 4.863 -0.156 4.863 QT
-1.078 4.863 -1.906 5.207 QT
-2.734 5.551 -3.234 6.254 QT
-3.188 6.254 -3.148 6.246 QT
-3.109 6.238 -3.063 6.238 QT
-2.531 6.238 -2.164 6.613 QT
-1.797 6.988 -1.797 7.519 QT
-1.797 8.035 -2.164 8.41 QT
-2.531 8.785 -3.063 8.785 QT
-3.594 8.785 -3.969 8.41 QT
-4.344 8.035 -4.344 7.519 QT
-4.344 6.488 -3.727 5.722 QT
-3.109 4.957 -2.125 4.566 QT
-1.141 4.176 -0.156 4.176 QT
0.563 4.176 1.375 4.394 QT
2.188 4.613 2.844 5.011 QT
3.5 5.41 3.914 6.043 QT
4.328 6.676 4.328 7.488 QT
4.328 8.504 3.875 9.355 QT
3.422 10.207 2.641 10.832 QT
1.859 11.457 0.922 11.754 QT
1.953 11.957 2.891 12.543 QT
3.828 13.129 4.398 14.043 QT
4.969 14.957 4.969 16.004 QT
4.969 17.332 4.242 18.402 QT
3.516 19.472 2.336 20.082 QT
1.156 20.691 -0.156 20.691 QT
-1.281 20.691 -2.414 20.261 QT
-3.547 19.832 -4.266 18.972 QT
-4.984 18.113 -4.984 16.926 QT
-4.984 16.332 -4.586 15.933 QT
-4.188 15.535 -3.594 15.535 QT
-3.203 15.535 -2.883 15.715 QT
-2.563 15.894 -2.383 16.222 QT
-2.203 16.551 -2.203 16.926 QT
-2.203 17.504 -2.609 17.902 QT
-3.016 18.301 -3.594 18.301 QT
-3.719 18.301 L
cp}def
f75073062
f
GR
GS
[0.75 0 0 0.75 289.02274 432.10001] CT
0.149 GC
N
/f143727194{-9.766 20.16 M
-9.766 19.316 L
-6.766 19.316 -6.766 18.551 QT
-6.766 5.957 L
-8.016 6.551 -9.906 6.551 QT
-9.906 5.707 L
-6.969 5.707 -5.469 4.176 QT
-5.125 4.176 L
-5.047 4.176 -4.969 4.238 QT
-4.891 4.301 -4.891 4.379 QT
-4.891 18.551 L
-4.891 19.316 -1.891 19.316 QT
-1.891 20.16 L
-9.766 20.16 L
cp}def
f143727194
f
GR
GS
[0.75 0 0 0.75 289.02274 432.10001] CT
0.149 GC
N
/f-1909175845{2.094 17.426 M
2.328 18.129 2.844 18.707 QT
3.359 19.285 4.055 19.605 QT
4.75 19.926 5.5 19.926 QT
7.234 19.926 7.891 18.574 QT
8.547 17.222 8.547 15.301 QT
8.547 14.472 8.516 13.902 QT
8.484 13.332 8.359 12.816 QT
8.141 11.972 7.578 11.34 QT
7.016 10.707 6.219 10.707 QT
5.406 10.707 4.828 10.949 QT
4.25 11.191 3.883 11.519 QT
3.516 11.847 3.234 12.215 QT
2.953 12.582 2.891 12.597 QT
2.609 12.597 L
2.563 12.597 2.469 12.519 QT
2.375 12.441 2.375 12.379 QT
2.375 4.363 L
2.375 4.301 2.453 4.238 QT
2.531 4.176 2.609 4.176 QT
2.688 4.176 L
4.297 4.941 6.125 4.941 QT
7.906 4.941 9.547 4.176 QT
9.625 4.176 L
9.703 4.176 9.773 4.23 QT
9.844 4.285 9.844 4.363 QT
9.844 4.582 L
9.844 4.707 9.797 4.707 QT
8.984 5.785 7.742 6.394 QT
6.5 7.004 5.188 7.004 QT
4.219 7.004 3.219 6.738 QT
3.219 11.269 L
4.016 10.629 4.641 10.355 QT
5.266 10.082 6.234 10.082 QT
7.563 10.082 8.609 10.84 QT
9.656 11.597 10.219 12.824 QT
10.781 14.051 10.781 15.332 QT
10.781 16.769 10.07 18.004 QT
9.359 19.238 8.141 19.965 QT
6.922 20.691 5.5 20.691 QT
4.313 20.691 3.32 20.082 QT
2.328 19.472 1.766 18.441 QT
1.203 17.41 1.203 16.238 QT
1.203 15.707 1.555 15.363 QT
1.906 15.019 2.422 15.019 QT
2.953 15.019 3.313 15.371 QT
3.672 15.722 3.672 16.238 QT
3.672 16.754 3.313 17.113 QT
2.953 17.472 2.422 17.472 QT
2.344 17.472 2.242 17.457 QT
2.141 17.441 2.094 17.426 QT
cp}def
f-1909175845
f
GR
GS
[0.75 0 0 0.75 331.22726 432.10001] CT
0.149 GC
N
f143727194
f
GR
GS
[0.75 0 0 0.75 331.22726 432.10001] CT
0.149 GC
N
/f-1962291288{2.703 19.144 M
3.359 19.926 5 19.926 QT
5.906 19.926 6.695 19.301 QT
7.484 18.676 7.922 17.785 QT
8.422 16.754 8.563 15.605 QT
8.703 14.457 8.703 12.738 QT
8.297 13.707 7.531 14.332 QT
6.766 14.957 5.766 14.957 QT
4.375 14.957 3.281 14.199 QT
2.188 13.441 1.602 12.207 QT
1.016 10.972 1.016 9.582 QT
1.016 8.129 1.672 6.886 QT
2.328 5.644 3.484 4.91 QT
4.641 4.176 6.125 4.176 QT
7.578 4.176 8.555 4.965 QT
9.531 5.754 10.047 7.004 QT
10.563 8.254 10.766 9.644 QT
10.969 11.035 10.969 12.394 QT
10.969 14.254 10.289 16.183 QT
9.609 18.113 8.258 19.402 QT
6.906 20.691 5 20.691 QT
3.578 20.691 2.594 20.019 QT
1.609 19.347 1.609 18.004 QT
1.609 17.504 1.945 17.176 QT
2.281 16.847 2.766 16.847 QT
3.25 16.847 3.586 17.176 QT
3.922 17.504 3.922 18.004 QT
3.922 18.472 3.578 18.808 QT
3.234 19.144 2.766 19.144 QT
2.703 19.144 L
cp
5.859 14.316 M
6.844 14.316 7.469 13.66 QT
8.094 13.004 8.375 12.019 QT
8.656 11.035 8.656 10.051 QT
8.656 9.597 L
8.656 9.504 L
8.656 7.707 8.133 6.285 QT
7.609 4.863 6.125 4.863 QT
5.172 4.863 4.578 5.277 QT
3.984 5.691 3.703 6.386 QT
3.422 7.082 3.344 7.863 QT
3.266 8.644 3.266 9.582 QT
3.266 10.941 3.398 11.902 QT
3.531 12.863 4.102 13.59 QT
4.672 14.316 5.859 14.316 QT
cp}def
f-1962291288
f
GR
GS
[0.75 0 0 0.75 373.43182 432.10001] CT
0.149 GC
N
f143727194
f
GR
GS
[0.75 0 0 0.75 373.43182 432.10001] CT
0.149 GC
N
/f724770427{1.016 16.519 M
1.016 15.066 1.961 13.965 QT
2.906 12.863 4.391 12.113 QT
3.5 11.551 L
2.688 11.004 2.172 10.105 QT
1.656 9.207 1.656 8.222 QT
1.656 7.082 2.258 6.152 QT
2.859 5.222 3.859 4.699 QT
4.859 4.176 6 4.176 QT
7.063 4.176 8.055 4.605 QT
9.047 5.035 9.688 5.847 QT
10.328 6.66 10.328 7.769 QT
10.328 8.582 9.945 9.269 QT
9.563 9.957 8.898 10.511 QT
8.234 11.066 7.484 11.457 QT
8.859 12.332 L
9.813 12.957 10.391 13.965 QT
10.969 14.972 10.969 16.082 QT
10.969 17.379 10.273 18.449 QT
9.578 19.519 8.43 20.105 QT
7.281 20.691 6 20.691 QT
4.766 20.691 3.609 20.183 QT
2.453 19.676 1.734 18.722 QT
1.016 17.769 1.016 16.519 QT
cp
2.313 16.519 M
2.313 17.457 2.836 18.246 QT
3.359 19.035 4.211 19.48 QT
5.063 19.926 6 19.926 QT
7.391 19.926 8.531 19.113 QT
9.672 18.301 9.672 16.941 QT
9.672 16.488 9.492 16.035 QT
9.313 15.582 8.984 15.215 QT
8.656 14.847 8.266 14.613 QT
5.047 12.535 L
4.297 12.926 3.664 13.535 QT
3.031 14.144 2.672 14.91 QT
2.313 15.676 2.313 16.519 QT
cp
3.969 9.191 M
6.875 11.066 L
7.875 10.472 8.523 9.644 QT
9.172 8.816 9.172 7.769 QT
9.172 6.957 8.719 6.285 QT
8.266 5.613 7.539 5.238 QT
6.813 4.863 5.984 4.863 QT
5.25 4.863 4.516 5.144 QT
3.781 5.426 3.297 5.98 QT
2.813 6.535 2.813 7.285 QT
2.813 8.41 3.969 9.191 QT
cp}def
f724770427
f
GR
GS
[0.75 0 0 0.75 415.63637 432.10001] CT
0.149 GC
N
f143727194
f
GR
GS
[0.75 0 0 0.75 415.63637 432.10001] CT
0.149 GC
N
/f-1723195823{0.672 16.191 M
0.672 15.347 L
8.094 4.285 L
8.172 4.176 8.328 4.176 QT
8.688 4.176 L
8.953 4.176 8.953 4.441 QT
8.953 15.347 L
11.313 15.347 L
11.313 16.191 L
8.953 16.191 L
8.953 18.551 L
8.953 19.051 9.656 19.183 QT
10.359 19.316 11.281 19.316 QT
11.281 20.16 L
4.672 20.16 L
4.672 19.316 L
5.609 19.316 6.313 19.183 QT
7.016 19.051 7.016 18.551 QT
7.016 16.191 L
0.672 16.191 L
cp
1.469 15.347 M
7.156 15.347 L
7.156 6.863 L
1.469 15.347 L
cp}def
f-1723195823
f
GR
GS
[0.75 0 0 0.75 457.8409 432.10001] CT
0.149 GC
N
/f-462289577{-3.297 19.144 M
-2.641 19.926 -1 19.926 QT
-0.094 19.926 0.695 19.301 QT
1.484 18.676 1.922 17.785 QT
2.422 16.754 2.563 15.605 QT
2.703 14.457 2.703 12.738 QT
2.297 13.707 1.531 14.332 QT
0.766 14.957 -0.234 14.957 QT
-1.625 14.957 -2.719 14.199 QT
-3.813 13.441 -4.398 12.207 QT
-4.984 10.972 -4.984 9.582 QT
-4.984 8.129 -4.328 6.886 QT
-3.672 5.644 -2.516 4.91 QT
-1.359 4.176 0.125 4.176 QT
1.578 4.176 2.555 4.965 QT
3.531 5.754 4.047 7.004 QT
4.563 8.254 4.766 9.644 QT
4.969 11.035 4.969 12.394 QT
4.969 14.254 4.289 16.183 QT
3.609 18.113 2.258 19.402 QT
0.906 20.691 -1 20.691 QT
-2.422 20.691 -3.406 20.019 QT
-4.391 19.347 -4.391 18.004 QT
-4.391 17.504 -4.055 17.176 QT
-3.719 16.847 -3.234 16.847 QT
-2.75 16.847 -2.414 17.176 QT
-2.078 17.504 -2.078 18.004 QT
-2.078 18.472 -2.422 18.808 QT
-2.766 19.144 -3.234 19.144 QT
-3.297 19.144 L
cp
-0.141 14.316 M
0.844 14.316 1.469 13.66 QT
2.094 13.004 2.375 12.019 QT
2.656 11.035 2.656 10.051 QT
2.656 9.597 L
2.656 9.504 L
2.656 7.707 2.133 6.285 QT
1.609 4.863 0.125 4.863 QT
-0.828 4.863 -1.422 5.277 QT
-2.016 5.691 -2.297 6.386 QT
-2.578 7.082 -2.656 7.863 QT
-2.734 8.644 -2.734 9.582 QT
-2.734 10.941 -2.602 11.902 QT
-2.469 12.863 -1.898 13.59 QT
-1.328 14.316 -0.141 14.316 QT
cp}def
f-462289577
f
GR
GS
[0.75 0 0 0.75 500.04547 432.10001] CT
0.149 GC
N
f-678663693
f
GR
GS
[0.75 0 0 0.75 500.04547 432.10001] CT
0.149 GC
N
/f743179189{1.203 20.16 M
1.203 19.519 L
1.203 19.457 1.25 19.379 QT
4.969 15.254 L
5.813 14.347 6.344 13.722 QT
6.875 13.097 7.391 12.293 QT
7.906 11.488 8.203 10.652 QT
8.5 9.816 8.5 8.879 QT
8.5 7.894 8.133 6.996 QT
7.766 6.097 7.047 5.558 QT
6.328 5.019 5.313 5.019 QT
4.266 5.019 3.438 5.644 QT
2.609 6.269 2.266 7.269 QT
2.359 7.238 2.516 7.238 QT
3.063 7.238 3.445 7.605 QT
3.828 7.972 3.828 8.551 QT
3.828 9.097 3.445 9.48 QT
3.063 9.863 2.516 9.863 QT
1.953 9.863 1.578 9.465 QT
1.203 9.066 1.203 8.551 QT
1.203 7.644 1.539 6.855 QT
1.875 6.066 2.516 5.449 QT
3.156 4.832 3.961 4.504 QT
4.766 4.176 5.656 4.176 QT
7.031 4.176 8.219 4.754 QT
9.406 5.332 10.094 6.394 QT
10.781 7.457 10.781 8.879 QT
10.781 9.91 10.328 10.847 QT
9.875 11.785 9.156 12.558 QT
8.438 13.332 7.328 14.301 QT
6.219 15.269 5.859 15.597 QT
3.141 18.207 L
5.453 18.207 L
7.156 18.207 8.297 18.183 QT
9.438 18.16 9.5 18.097 QT
9.781 17.785 10.078 15.879 QT
10.781 15.879 L
10.109 20.16 L
1.203 20.16 L
cp}def
f743179189
f
GR
GS
[0.75 0 0 0.75 310.12523 454.69998] CT
0.149 GC
N
/f-891252455{-27.741 22.176 M
-27.741 21.254 L
-25.053 21.254 -25.053 20.442 QT
-25.053 6.16 L
-25.053 5.332 -27.741 5.332 QT
-27.741 4.41 L
-18.475 4.41 L
-17.053 4.41 -15.631 4.996 QT
-14.209 5.582 -13.295 6.699 QT
-12.381 7.817 -12.381 9.301 QT
-12.381 10.754 -13.303 11.84 QT
-14.225 12.926 -15.639 13.496 QT
-17.053 14.067 -18.475 14.067 QT
-22.647 14.067 L
-22.647 20.442 L
-22.647 21.254 -19.959 21.254 QT
-19.959 22.176 L
-27.741 22.176 L
cp
-22.725 13.285 M
-19.194 13.285 L
-17.756 13.285 -16.866 12.871 QT
-15.975 12.457 -15.569 11.59 QT
-15.163 10.723 -15.163 9.301 QT
-15.163 7.176 -16.092 6.254 QT
-17.022 5.332 -19.194 5.332 QT
-21.397 5.332 L
-21.866 5.332 -22.131 5.371 QT
-22.397 5.41 -22.561 5.59 QT
-22.725 5.77 -22.725 6.16 QT
-22.725 13.285 L
cp}def
f-891252455
f
GR
GS
[0.75 0 0 0.75 310.12523 454.69998] CT
0.149 GC
N
/f-831788594{-9.774 22.176 M
-9.774 21.254 L
-7.086 21.254 -7.086 20.442 QT
-7.086 6.16 L
-7.086 5.332 -9.774 5.332 QT
-9.774 4.41 L
-1.602 4.41 L
-0.149 4.41 1.46 4.942 QT
3.07 5.473 4.148 6.551 QT
5.226 7.629 5.226 9.129 QT
5.226 10.223 4.57 11.074 QT
3.914 11.926 2.89 12.504 QT
1.867 13.082 0.804 13.332 QT
1.976 13.738 2.851 14.629 QT
3.726 15.52 3.898 16.66 QT
4.273 18.973 L
4.523 20.535 4.804 21.301 QT
5.085 22.067 6.039 22.067 QT
6.851 22.067 7.249 21.317 QT
7.648 20.567 7.648 19.676 QT
7.648 19.582 7.734 19.512 QT
7.82 19.442 7.898 19.442 QT
8.148 19.442 L
8.398 19.442 8.398 19.785 QT
8.398 20.504 8.117 21.184 QT
7.835 21.863 7.312 22.309 QT
6.789 22.754 6.054 22.754 QT
4.179 22.754 2.828 21.817 QT
1.476 20.879 1.476 19.082 QT
1.476 16.77 L
1.476 15.473 0.578 14.543 QT
-0.321 13.613 -1.633 13.613 QT
-4.758 13.613 L
-4.758 20.442 L
-4.758 21.254 -2.071 21.254 QT
-2.071 22.176 L
-9.774 22.176 L
cp
-4.758 12.942 M
-1.977 12.942 L
0.179 12.942 1.312 12.074 QT
2.445 11.207 2.445 9.129 QT
2.445 7.051 1.328 6.192 QT
0.21 5.332 -1.977 5.332 QT
-3.43 5.332 L
-3.899 5.332 -4.165 5.371 QT
-4.43 5.41 -4.594 5.59 QT
-4.758 5.77 -4.758 6.16 QT
-4.758 12.942 L
cp}def
f-831788594
f
GR
GS
[0.75 0 0 0.75 310.12523 454.69998] CT
0.149 GC
N
/f1585619083{9.597 22.176 M
9.597 21.254 L
12.284 21.254 12.284 19.723 QT
12.284 5.488 L
11.425 5.332 9.597 5.332 QT
9.597 4.41 L
14.581 4.41 L
14.706 4.41 14.753 4.52 QT
23.956 18.067 L
23.956 6.863 L
23.956 5.332 21.284 5.332 QT
21.284 4.41 L
27.456 4.41 L
27.456 5.332 L
24.8 5.332 24.8 6.863 QT
24.8 21.942 L
24.8 22.02 24.698 22.098 QT
24.597 22.176 24.534 22.176 QT
24.206 22.176 L
24.081 22.176 24.034 22.067 QT
13.113 6.004 L
13.113 19.723 L
13.113 21.254 15.8 21.254 QT
15.8 22.176 L
9.597 22.176 L
cp}def
f1585619083
f
GR
GS
[0.75 0 0 0.75 0 -0.25] CT
0.149 GC
2 setlinecap
1 LJ
0.667 LW
N
104 569 M
104 48 L
S
GR
GS
[0.75 0 0 0.75 0 -0.25] CT
0.149 GC
2 setlinecap
1 LJ
0.667 LW
N
723 569 M
723 48 L
S
GR
GS
[0.75 0 0 0.75 0 -0.25] CT
0.149 GC
2 setlinecap
1 LJ
0.667 LW
N
104 569 M
110.19 569 L
S
GR
GS
[0.75 0 0 0.75 0 -0.25] CT
0.149 GC
2 setlinecap
1 LJ
0.667 LW
N
104 482.167 M
110.19 482.167 L
S
GR
GS
[0.75 0 0 0.75 0 -0.25] CT
0.149 GC
2 setlinecap
1 LJ
0.667 LW
N
104 395.333 M
110.19 395.333 L
S
GR
GS
[0.75 0 0 0.75 0 -0.25] CT
0.149 GC
2 setlinecap
1 LJ
0.667 LW
N
104 308.5 M
110.19 308.5 L
S
GR
GS
[0.75 0 0 0.75 0 -0.25] CT
0.149 GC
2 setlinecap
1 LJ
0.667 LW
N
104 221.667 M
110.19 221.667 L
S
GR
GS
[0.75 0 0 0.75 0 -0.25] CT
0.149 GC
2 setlinecap
1 LJ
0.667 LW
N
104 134.833 M
110.19 134.833 L
S
GR
GS
[0.75 0 0 0.75 0 -0.25] CT
0.149 GC
2 setlinecap
1 LJ
0.667 LW
N
104 48 M
110.19 48 L
S
GR
GS
[0.75 0 0 0.75 0 -0.25] CT
0.149 GC
2 setlinecap
1 LJ
0.667 LW
N
723 569 M
716.81 569 L
S
GR
GS
[0.75 0 0 0.75 0 -0.25] CT
0.149 GC
2 setlinecap
1 LJ
0.667 LW
N
723 482.167 M
716.81 482.167 L
S
GR
GS
[0.75 0 0 0.75 0 -0.25] CT
0.149 GC
2 setlinecap
1 LJ
0.667 LW
N
723 395.333 M
716.81 395.333 L
S
GR
GS
[0.75 0 0 0.75 0 -0.25] CT
0.149 GC
2 setlinecap
1 LJ
0.667 LW
N
723 308.5 M
716.81 308.5 L
S
GR
GS
[0.75 0 0 0.75 0 -0.25] CT
0.149 GC
2 setlinecap
1 LJ
0.667 LW
N
723 221.667 M
716.81 221.667 L
S
GR
GS
[0.75 0 0 0.75 0 -0.25] CT
0.149 GC
2 setlinecap
1 LJ
0.667 LW
N
723 134.833 M
716.81 134.833 L
S
GR
GS
[0.75 0 0 0.75 0 -0.25] CT
0.149 GC
2 setlinecap
1 LJ
0.667 LW
N
723 48 M
716.81 48 L
S
GR
GS
[0.75 0 0 0.75 72.4 426.5] CT
0.149 GC
N
/f1219663315{-6 6.291 M
-8.938 6.291 -10 3.869 QT
-11.063 1.447 -11.063 -1.896 QT
-11.063 -3.974 -10.68 -5.818 QT
-10.297 -7.662 -9.164 -8.943 QT
-8.031 -10.224 -6 -10.224 QT
-4.422 -10.224 -3.414 -9.451 QT
-2.406 -8.678 -1.875 -7.451 QT
-1.344 -6.224 -1.148 -4.826 QT
-0.953 -3.428 -0.953 -1.896 QT
-0.953 0.166 -1.336 1.963 QT
-1.719 3.76 -2.836 5.026 QT
-3.953 6.291 -6 6.291 QT
cp
-6 5.666 M
-4.656 5.666 -4 4.291 QT
-3.344 2.916 -3.195 1.252 QT
-3.047 -0.412 -3.047 -2.287 QT
-3.047 -4.084 -3.195 -5.607 QT
-3.344 -7.131 -4 -8.365 QT
-4.656 -9.599 -6 -9.599 QT
-7.359 -9.599 -8.016 -8.357 QT
-8.672 -7.115 -8.82 -5.599 QT
-8.969 -4.084 -8.969 -2.287 QT
-8.969 -0.943 -8.906 0.236 QT
-8.844 1.416 -8.563 2.682 QT
-8.281 3.947 -7.656 4.807 QT
-7.031 5.666 -6 5.666 QT
cp}def
f1219663315
f
GR
GS
[0.75 0 0 0.75 72.4 361.37499] CT
0.149 GC
N
/f-1055894690{-24.667 6.291 M
-27.604 6.291 -28.667 3.869 QT
-29.729 1.447 -29.729 -1.896 QT
-29.729 -3.974 -29.346 -5.818 QT
-28.964 -7.662 -27.831 -8.943 QT
-26.698 -10.224 -24.667 -10.224 QT
-23.089 -10.224 -22.081 -9.451 QT
-21.073 -8.678 -20.542 -7.451 QT
-20.011 -6.224 -19.815 -4.826 QT
-19.62 -3.428 -19.62 -1.896 QT
-19.62 0.166 -20.003 1.963 QT
-20.386 3.76 -21.503 5.026 QT
-22.62 6.291 -24.667 6.291 QT
cp
-24.667 5.666 M
-23.323 5.666 -22.667 4.291 QT
-22.011 2.916 -21.862 1.252 QT
-21.714 -0.412 -21.714 -2.287 QT
-21.714 -4.084 -21.862 -5.607 QT
-22.011 -7.131 -22.667 -8.365 QT
-23.323 -9.599 -24.667 -9.599 QT
-26.026 -9.599 -26.682 -8.357 QT
-27.339 -7.115 -27.487 -5.599 QT
-27.636 -4.084 -27.636 -2.287 QT
-27.636 -0.943 -27.573 0.236 QT
-27.511 1.416 -27.229 2.682 QT
-26.948 3.947 -26.323 4.807 QT
-25.698 5.666 -24.667 5.666 QT
cp}def
f-1055894690
f
GR
GS
[0.75 0 0 0.75 72.4 361.37499] CT
0.149 GC
N
/f-1543496504{-16.651 4.432 M
-16.651 3.901 -16.253 3.51 QT
-15.854 3.119 -15.323 3.119 QT
-14.995 3.119 -14.682 3.299 QT
-14.37 3.479 -14.19 3.791 QT
-14.01 4.104 -14.01 4.432 QT
-14.01 4.963 -14.401 5.361 QT
-14.792 5.76 -15.323 5.76 QT
-15.854 5.76 -16.253 5.361 QT
-16.651 4.963 -16.651 4.432 QT
cp}def
f-1543496504
f
GR
GS
[0.75 0 0 0.75 72.4 361.37499] CT
0.149 GC
N
/f429638810{-9.906 3.026 M
-9.672 3.729 -9.156 4.307 QT
-8.641 4.885 -7.945 5.205 QT
-7.25 5.526 -6.5 5.526 QT
-4.766 5.526 -4.109 4.174 QT
-3.453 2.822 -3.453 0.901 QT
-3.453 0.072 -3.484 -0.498 QT
-3.516 -1.068 -3.641 -1.584 QT
-3.859 -2.428 -4.422 -3.06 QT
-4.984 -3.693 -5.781 -3.693 QT
-6.594 -3.693 -7.172 -3.451 QT
-7.75 -3.209 -8.117 -2.881 QT
-8.484 -2.553 -8.766 -2.185 QT
-9.047 -1.818 -9.109 -1.803 QT
-9.391 -1.803 L
-9.438 -1.803 -9.531 -1.881 QT
-9.625 -1.959 -9.625 -2.021 QT
-9.625 -10.037 L
-9.625 -10.099 -9.547 -10.162 QT
-9.469 -10.224 -9.391 -10.224 QT
-9.313 -10.224 L
-7.703 -9.459 -5.875 -9.459 QT
-4.094 -9.459 -2.453 -10.224 QT
-2.375 -10.224 L
-2.297 -10.224 -2.227 -10.17 QT
-2.156 -10.115 -2.156 -10.037 QT
-2.156 -9.818 L
-2.156 -9.693 -2.203 -9.693 QT
-3.016 -8.615 -4.258 -8.006 QT
-5.5 -7.396 -6.813 -7.396 QT
-7.781 -7.396 -8.781 -7.662 QT
-8.781 -3.131 L
-7.984 -3.771 -7.359 -4.045 QT
-6.734 -4.318 -5.766 -4.318 QT
-4.438 -4.318 -3.391 -3.56 QT
-2.344 -2.803 -1.781 -1.576 QT
-1.219 -0.349 -1.219 0.932 QT
-1.219 2.369 -1.93 3.604 QT
-2.641 4.838 -3.859 5.565 QT
-5.078 6.291 -6.5 6.291 QT
-7.688 6.291 -8.68 5.682 QT
-9.672 5.072 -10.234 4.041 QT
-10.797 3.01 -10.797 1.838 QT
-10.797 1.307 -10.445 0.963 QT
-10.094 0.619 -9.578 0.619 QT
-9.047 0.619 -8.688 0.971 QT
-8.328 1.322 -8.328 1.838 QT
-8.328 2.354 -8.688 2.713 QT
-9.047 3.072 -9.578 3.072 QT
-9.656 3.072 -9.758 3.057 QT
-9.859 3.041 -9.906 3.026 QT
cp}def
f429638810
f
GR
GS
[0.75 0 0 0.75 72.4 296.25001] CT
0.149 GC
N
/f361407121{-9.766 5.76 M
-9.766 4.916 L
-6.766 4.916 -6.766 4.151 QT
-6.766 -8.443 L
-8.016 -7.849 -9.906 -7.849 QT
-9.906 -8.693 L
-6.969 -8.693 -5.469 -10.224 QT
-5.125 -10.224 L
-5.047 -10.224 -4.969 -10.162 QT
-4.891 -10.099 -4.891 -10.021 QT
-4.891 4.151 L
-4.891 4.916 -1.891 4.916 QT
-1.891 5.76 L
-9.766 5.76 L
cp}def
f361407121
f
GR
GS
[0.75 0 0 0.75 72.4 231.125] CT
0.149 GC
N
/f-820689371{-28.432 5.76 M
-28.432 4.916 L
-25.432 4.916 -25.432 4.151 QT
-25.432 -8.443 L
-26.682 -7.849 -28.573 -7.849 QT
-28.573 -8.693 L
-25.636 -8.693 -24.136 -10.224 QT
-23.792 -10.224 L
-23.714 -10.224 -23.636 -10.162 QT
-23.557 -10.099 -23.557 -10.021 QT
-23.557 4.151 L
-23.557 4.916 -20.557 4.916 QT
-20.557 5.76 L
-28.432 5.76 L
cp}def
f-820689371
f
GR
GS
[0.75 0 0 0.75 72.4 231.125] CT
0.149 GC
N
f-1543496504
f
GR
GS
[0.75 0 0 0.75 72.4 231.125] CT
0.149 GC
N
f429638810
f
GR
GS
[0.75 0 0 0.75 72.4 166] CT
0.149 GC
N
/f-939971694{-10.797 5.76 M
-10.797 5.119 L
-10.797 5.057 -10.75 4.979 QT
-7.031 0.854 L
-6.188 -0.053 -5.656 -0.678 QT
-5.125 -1.303 -4.609 -2.107 QT
-4.094 -2.912 -3.797 -3.748 QT
-3.5 -4.584 -3.5 -5.521 QT
-3.5 -6.506 -3.867 -7.404 QT
-4.234 -8.303 -4.953 -8.842 QT
-5.672 -9.381 -6.688 -9.381 QT
-7.734 -9.381 -8.563 -8.756 QT
-9.391 -8.131 -9.734 -7.131 QT
-9.641 -7.162 -9.484 -7.162 QT
-8.938 -7.162 -8.555 -6.795 QT
-8.172 -6.428 -8.172 -5.849 QT
-8.172 -5.303 -8.555 -4.92 QT
-8.938 -4.537 -9.484 -4.537 QT
-10.047 -4.537 -10.422 -4.935 QT
-10.797 -5.334 -10.797 -5.849 QT
-10.797 -6.756 -10.461 -7.545 QT
-10.125 -8.334 -9.484 -8.951 QT
-8.844 -9.568 -8.039 -9.896 QT
-7.234 -10.224 -6.344 -10.224 QT
-4.969 -10.224 -3.781 -9.646 QT
-2.594 -9.068 -1.906 -8.006 QT
-1.219 -6.943 -1.219 -5.521 QT
-1.219 -4.49 -1.672 -3.553 QT
-2.125 -2.615 -2.844 -1.842 QT
-3.563 -1.068 -4.672 -0.099 QT
-5.781 0.869 -6.141 1.197 QT
-8.859 3.807 L
-6.547 3.807 L
-4.844 3.807 -3.703 3.783 QT
-2.563 3.76 -2.5 3.697 QT
-2.219 3.385 -1.922 1.479 QT
-1.219 1.479 L
-1.891 5.76 L
-10.797 5.76 L
cp}def
f-939971694
f
GR
GS
[0.75 0 0 0.75 72.4 100.875] CT
0.149 GC
N
/f-2074444030{-29.464 5.76 M
-29.464 5.119 L
-29.464 5.057 -29.417 4.979 QT
-25.698 0.854 L
-24.854 -0.053 -24.323 -0.678 QT
-23.792 -1.303 -23.276 -2.107 QT
-22.761 -2.912 -22.464 -3.748 QT
-22.167 -4.584 -22.167 -5.521 QT
-22.167 -6.506 -22.534 -7.404 QT
-22.901 -8.303 -23.62 -8.842 QT
-24.339 -9.381 -25.354 -9.381 QT
-26.401 -9.381 -27.229 -8.756 QT
-28.057 -8.131 -28.401 -7.131 QT
-28.307 -7.162 -28.151 -7.162 QT
-27.604 -7.162 -27.221 -6.795 QT
-26.839 -6.428 -26.839 -5.849 QT
-26.839 -5.303 -27.221 -4.92 QT
-27.604 -4.537 -28.151 -4.537 QT
-28.714 -4.537 -29.089 -4.935 QT
-29.464 -5.334 -29.464 -5.849 QT
-29.464 -6.756 -29.128 -7.545 QT
-28.792 -8.334 -28.151 -8.951 QT
-27.511 -9.568 -26.706 -9.896 QT
-25.901 -10.224 -25.011 -10.224 QT
-23.636 -10.224 -22.448 -9.646 QT
-21.261 -9.068 -20.573 -8.006 QT
-19.886 -6.943 -19.886 -5.521 QT
-19.886 -4.49 -20.339 -3.553 QT
-20.792 -2.615 -21.511 -1.842 QT
-22.229 -1.068 -23.339 -0.099 QT
-24.448 0.869 -24.807 1.197 QT
-27.526 3.807 L
-25.214 3.807 L
-23.511 3.807 -22.37 3.783 QT
-21.229 3.76 -21.167 3.697 QT
-20.886 3.385 -20.589 1.479 QT
-19.886 1.479 L
-20.557 5.76 L
-29.464 5.76 L
cp}def
f-2074444030
f
GR
GS
[0.75 0 0 0.75 72.4 100.875] CT
0.149 GC
N
f-1543496504
f
GR
GS
[0.75 0 0 0.75 72.4 100.875] CT
0.149 GC
N
f429638810
f
GR
GS
[0.75 0 0 0.75 72.4 35.75] CT
0.149 GC
N
/f1381578633{-9.719 3.901 M
-9.156 4.729 -8.203 5.127 QT
-7.25 5.526 -6.156 5.526 QT
-4.766 5.526 -4.18 4.338 QT
-3.594 3.151 -3.594 1.635 QT
-3.594 0.947 -3.719 0.268 QT
-3.844 -0.412 -4.133 -0.998 QT
-4.422 -1.584 -4.938 -1.935 QT
-5.453 -2.287 -6.188 -2.287 QT
-7.781 -2.287 L
-7.984 -2.287 -7.984 -2.506 QT
-7.984 -2.709 L
-7.984 -2.896 -7.781 -2.896 QT
-6.453 -3.006 L
-5.609 -3.006 -5.055 -3.639 QT
-4.5 -4.271 -4.242 -5.178 QT
-3.984 -6.084 -3.984 -6.912 QT
-3.984 -8.053 -4.523 -8.795 QT
-5.063 -9.537 -6.156 -9.537 QT
-7.078 -9.537 -7.906 -9.193 QT
-8.734 -8.849 -9.234 -8.146 QT
-9.188 -8.146 -9.148 -8.154 QT
-9.109 -8.162 -9.063 -8.162 QT
-8.531 -8.162 -8.164 -7.787 QT
-7.797 -7.412 -7.797 -6.881 QT
-7.797 -6.365 -8.164 -5.99 QT
-8.531 -5.615 -9.063 -5.615 QT
-9.594 -5.615 -9.969 -5.99 QT
-10.344 -6.365 -10.344 -6.881 QT
-10.344 -7.912 -9.727 -8.678 QT
-9.109 -9.443 -8.125 -9.834 QT
-7.141 -10.224 -6.156 -10.224 QT
-5.438 -10.224 -4.625 -10.006 QT
-3.813 -9.787 -3.156 -9.389 QT
-2.5 -8.99 -2.086 -8.357 QT
-1.672 -7.724 -1.672 -6.912 QT
-1.672 -5.896 -2.125 -5.045 QT
-2.578 -4.193 -3.359 -3.568 QT
-4.141 -2.943 -5.078 -2.646 QT
-4.047 -2.443 -3.109 -1.857 QT
-2.172 -1.271 -1.602 -0.357 QT
-1.031 0.557 -1.031 1.604 QT
-1.031 2.932 -1.758 4.002 QT
-2.484 5.072 -3.664 5.682 QT
-4.844 6.291 -6.156 6.291 QT
-7.281 6.291 -8.414 5.861 QT
-9.547 5.432 -10.266 4.572 QT
-10.984 3.713 -10.984 2.526 QT
-10.984 1.932 -10.586 1.533 QT
-10.188 1.135 -9.594 1.135 QT
-9.203 1.135 -8.883 1.315 QT
-8.563 1.494 -8.383 1.822 QT
-8.203 2.151 -8.203 2.526 QT
-8.203 3.104 -8.609 3.502 QT
-9.016 3.901 -9.594 3.901 QT
-9.719 3.901 L
cp}def
f1381578633
f
GR
GS
[0 -0.75 0.75 0 47.19711 228.14766] CT
0.149 GC
N
/f-705616379{-33.819 -9.207 M
-34.976 -9.207 -35.866 -9.762 QT
-36.757 -10.317 -37.249 -11.254 QT
-37.741 -12.192 -37.741 -13.332 QT
-37.741 -14.535 -37.194 -15.863 QT
-36.647 -17.192 -35.702 -18.301 QT
-34.757 -19.41 -33.561 -20.059 QT
-32.366 -20.707 -31.116 -20.707 QT
-24.554 -20.707 L
-24.288 -20.707 -24.101 -20.535 QT
-23.913 -20.363 -23.913 -20.051 QT
-23.913 -19.676 -24.186 -19.387 QT
-24.46 -19.098 -24.835 -19.098 QT
-28.007 -19.098 L
-27.272 -17.988 -27.272 -16.395 QT
-27.272 -15.098 -27.78 -13.824 QT
-28.288 -12.551 -29.186 -11.504 QT
-30.085 -10.457 -31.28 -9.832 QT
-32.476 -9.207 -33.819 -9.207 QT
cp
-33.788 -9.895 M
-32.366 -9.895 -31.272 -11.004 QT
-30.179 -12.113 -29.593 -13.723 QT
-29.007 -15.332 -29.007 -16.707 QT
-29.007 -17.817 -29.624 -18.457 QT
-30.241 -19.098 -31.335 -19.098 QT
-32.851 -19.098 -33.913 -18.082 QT
-34.976 -17.067 -35.499 -15.535 QT
-36.022 -14.004 -36.022 -12.582 QT
-36.022 -11.457 -35.436 -10.676 QT
-34.851 -9.895 -33.788 -9.895 QT
cp}def
f-705616379
f
GR
GS
[0 -0.75 0.75 0 47.19711 228.14766] CT
0.149 GC
N
/f-169296765{-17.902 -15.452 M
-18.246 -15.827 L
-15.824 -18.248 L
-13.418 -15.827 L
-13.777 -15.452 L
-15.824 -17.248 L
-17.902 -15.452 L
cp}def
f-169296765
f
GR
GS
[0 -0.75 0.75 0 47.19711 228.14766] CT
0.149 GC
N
/f-766268280{-20.468 -0.684 M
-21.593 -0.684 -22.25 -1.544 QT
-22.906 -2.403 -22.906 -3.575 QT
-22.906 -4.716 -22.312 -5.958 QT
-21.718 -7.2 -20.703 -8.02 QT
-19.687 -8.841 -18.515 -8.841 QT
-17.984 -8.841 -17.562 -8.544 QT
-17.14 -8.247 -16.89 -7.762 QT
-15.89 -11.778 L
-15.812 -12.091 -15.796 -12.262 QT
-15.796 -12.544 -16.968 -12.544 QT
-17.156 -12.544 -17.156 -12.794 QT
-17.14 -12.825 -17.109 -12.942 QT
-17.078 -13.059 -17.031 -13.122 QT
-16.984 -13.184 -16.89 -13.184 QT
-14.468 -13.372 L
-14.25 -13.372 -14.25 -13.153 QT
-16.843 -2.794 L
-16.968 -2.497 -16.968 -1.934 QT
-16.968 -1.153 -16.453 -1.153 QT
-15.89 -1.153 -15.593 -1.872 QT
-15.296 -2.591 -15.093 -3.528 QT
-15.062 -3.637 -14.953 -3.637 QT
-14.734 -3.637 L
-14.656 -3.637 -14.617 -3.575 QT
-14.578 -3.512 -14.578 -3.466 QT
-14.89 -2.2 -15.265 -1.442 QT
-15.64 -0.684 -16.484 -0.684 QT
-17.093 -0.684 -17.554 -1.044 QT
-18.015 -1.403 -18.14 -1.981 QT
-19.296 -0.684 -20.468 -0.684 QT
cp
-20.453 -1.153 M
-19.796 -1.153 -19.187 -1.645 QT
-18.578 -2.137 -18.14 -2.794 QT
-18.125 -2.809 -18.125 -2.872 QT
-17.14 -6.825 L
-17.234 -7.466 -17.593 -7.919 QT
-17.953 -8.372 -18.562 -8.372 QT
-19.156 -8.372 -19.679 -7.88 QT
-20.203 -7.387 -20.562 -6.7 QT
-20.921 -5.981 -21.242 -4.723 QT
-21.562 -3.466 -21.562 -2.778 QT
-21.562 -2.153 -21.296 -1.653 QT
-21.031 -1.153 -20.453 -1.153 QT
cp}def
f-766268280
f
GR
GS
[0 -0.75 0.75 0 47.19711 228.14766] CT
0.149 GC
N
/f1198782535{4.208 -3.051 M
2.755 -4.192 1.708 -5.676 QT
0.661 -7.16 -0.003 -8.832 QT
-0.667 -10.504 -0.995 -12.332 QT
-1.324 -14.16 -1.324 -16.004 QT
-1.324 -17.863 -0.995 -19.692 QT
-0.667 -21.52 0.012 -23.215 QT
0.692 -24.91 1.747 -26.379 QT
2.801 -27.848 4.208 -28.957 QT
4.208 -29.004 4.333 -29.004 QT
4.583 -29.004 L
4.645 -29.004 4.716 -28.934 QT
4.786 -28.863 4.786 -28.77 QT
4.786 -28.66 4.723 -28.613 QT
3.458 -27.363 2.614 -25.942 QT
1.77 -24.52 1.255 -22.918 QT
0.739 -21.317 0.512 -19.59 QT
0.286 -17.863 0.286 -16.004 QT
0.286 -7.738 4.708 -3.442 QT
4.786 -3.379 4.786 -3.238 QT
4.786 -3.176 4.716 -3.09 QT
4.645 -3.004 4.583 -3.004 QT
4.333 -3.004 L
4.208 -3.004 4.208 -3.051 QT
cp}def
f1198782535
f
GR
GS
[0 -0.75 0.75 0 47.19711 228.14766] CT
0.149 GC
N
/f1823455369{7.193 -9.504 M
7.193 -10.426 L
8.068 -10.426 8.646 -10.559 QT
9.224 -10.692 9.224 -11.238 QT
9.224 -18.348 L
9.224 -19.035 9.013 -19.348 QT
8.803 -19.66 8.404 -19.731 QT
8.006 -19.801 7.193 -19.801 QT
7.193 -20.707 L
10.959 -20.988 L
10.959 -18.457 L
11.474 -19.567 12.498 -20.278 QT
13.521 -20.988 14.724 -20.988 QT
17.724 -20.988 18.24 -18.551 QT
18.771 -19.645 19.771 -20.317 QT
20.771 -20.988 21.959 -20.988 QT
23.146 -20.988 23.951 -20.613 QT
24.756 -20.238 25.162 -19.457 QT
25.568 -18.676 25.568 -17.488 QT
25.568 -11.238 L
25.568 -10.692 26.146 -10.559 QT
26.724 -10.426 27.599 -10.426 QT
27.599 -9.504 L
21.646 -9.504 L
21.646 -10.426 L
22.537 -10.426 23.107 -10.559 QT
23.678 -10.692 23.678 -11.238 QT
23.678 -17.41 L
23.678 -18.723 23.31 -19.52 QT
22.943 -20.317 21.803 -20.317 QT
20.303 -20.317 19.326 -19.113 QT
18.349 -17.91 18.349 -16.379 QT
18.349 -11.238 L
18.349 -10.692 18.92 -10.559 QT
19.49 -10.426 20.381 -10.426 QT
20.381 -9.504 L
14.428 -9.504 L
14.428 -10.426 L
15.318 -10.426 15.888 -10.559 QT
16.459 -10.692 16.459 -11.238 QT
16.459 -17.41 L
16.459 -18.676 16.092 -19.496 QT
15.724 -20.317 14.568 -20.317 QT
13.068 -20.317 12.092 -19.113 QT
11.115 -17.91 11.115 -16.379 QT
11.115 -11.238 L
11.115 -10.692 11.693 -10.559 QT
12.271 -10.426 13.146 -10.426 QT
13.146 -9.504 L
7.193 -9.504 L
cp}def
f1823455369
f
GR
GS
[0 -0.75 0.75 0 47.19711 228.14766] CT
0.149 GC
N
/f43075594{30.099 -3.004 M
29.865 -3.004 29.865 -3.238 QT
29.865 -3.348 29.928 -3.395 QT
34.365 -7.738 34.365 -16.004 QT
34.365 -24.27 29.974 -28.567 QT
29.865 -28.629 29.865 -28.77 QT
29.865 -28.863 29.935 -28.934 QT
30.006 -29.004 30.099 -29.004 QT
30.349 -29.004 L
30.412 -29.004 30.474 -28.957 QT
32.334 -27.488 33.576 -25.379 QT
34.818 -23.27 35.396 -20.879 QT
35.974 -18.488 35.974 -16.004 QT
35.974 -14.16 35.662 -12.379 QT
35.349 -10.598 34.678 -8.863 QT
34.006 -7.129 32.959 -5.66 QT
31.912 -4.192 30.474 -3.051 QT
30.412 -3.004 30.349 -3.004 QT
30.099 -3.004 L
cp}def
f43075594
f
GR
GS
[0.75 0 0 0.75 0 -0.25] CT
0.149 GC
1 LJ
0.667 LW
N
104 569 M
723 569 L
S
GR
GS
[0.75 0 0 0.75 120.20454 331.31615] CT
N
5.867 0 M
5.867 -3.24 3.24 -5.867 0 -5.867 C
-3.24 -5.867 -5.867 -3.24 -5.867 0 C
-5.867 3.24 -3.24 5.867 0 5.867 C
3.24 5.867 5.867 3.24 5.867 0 C
cp
f
GR
GS
[0.75 0 0 0.75 120.20454 331.31615] CT
10.0 ML
2.667 LW
N
5.867 0 M
5.867 -3.24 3.24 -5.867 0 -5.867 C
-3.24 -5.867 -5.867 -3.24 -5.867 0 C
-5.867 3.24 -3.24 5.867 0 5.867 C
3.24 5.867 5.867 3.24 5.867 0 C
cp
S
GR
GS
[0.75 0 0 0.75 162.40909 327.6888] CT
N
/f-819729944{5.867 0 M
5.867 -3.24 3.24 -5.867 0 -5.867 C
-3.24 -5.867 -5.867 -3.24 -5.867 0 C
-5.867 3.24 -3.24 5.867 0 5.867 C
3.24 5.867 5.867 3.24 5.867 0 C
cp}def
f-819729944
f
GR
GS
[0.75 0 0 0.75 162.40909 327.6888] CT
10.0 ML
2.667 LW
N
5.867 0 M
5.867 -3.24 3.24 -5.867 0 -5.867 C
-3.24 -5.867 -5.867 -3.24 -5.867 0 C
-5.867 3.24 -3.24 5.867 0 5.867 C
3.24 5.867 5.867 3.24 5.867 0 C
cp
S
GR
GS
[0.75 0 0 0.75 204.61363 300.36718] CT
N
f-819729944
f
GR
GS
[0.75 0 0 0.75 204.61363 300.36718] CT
10.0 ML
2.667 LW
N
5.867 0 M
5.867 -3.24 3.24 -5.867 0 -5.867 C
-3.24 -5.867 -5.867 -3.24 -5.867 0 C
-5.867 3.24 -3.24 5.867 0 5.867 C
3.24 5.867 5.867 3.24 5.867 0 C
cp
S
GR
GS
[0.75 0 0 0.75 246.81818 267.12461] CT
N
f-819729944
f
GR
GS
[0.75 0 0 0.75 246.81818 267.12461] CT
10.0 ML
2.667 LW
N
5.867 0 M
5.867 -3.24 3.24 -5.867 0 -5.867 C
-3.24 -5.867 -5.867 -3.24 -5.867 0 C
-5.867 3.24 -3.24 5.867 0 5.867 C
3.24 5.867 5.867 3.24 5.867 0 C
cp
S
GR
GS
[0.75 0 0 0.75 289.02274 249.99386] CT
N
f-819729944
f
GR
GS
[0.75 0 0 0.75 289.02274 249.99386] CT
10.0 ML
2.667 LW
N
5.867 0 M
5.867 -3.24 3.24 -5.867 0 -5.867 C
-3.24 -5.867 -5.867 -3.24 -5.867 0 C
-5.867 3.24 -3.24 5.867 0 5.867 C
3.24 5.867 5.867 3.24 5.867 0 C
cp
S
GR
GS
[0.75 0 0 0.75 331.22726 237.70451] CT
N
f-819729944
f
GR
GS
[0.75 0 0 0.75 331.22726 237.70451] CT
10.0 ML
2.667 LW
N
5.867 0 M
5.867 -3.24 3.24 -5.867 0 -5.867 C
-3.24 -5.867 -5.867 -3.24 -5.867 0 C
-5.867 3.24 -3.24 5.867 0 5.867 C
3.24 5.867 5.867 3.24 5.867 0 C
cp
S
GR
GS
[0.75 0 0 0.75 373.43182 233.49722] CT
N
f-819729944
f
GR
GS
[0.75 0 0 0.75 373.43182 233.49722] CT
10.0 ML
2.667 LW
N
5.867 0 M
5.867 -3.24 3.24 -5.867 0 -5.867 C
-3.24 -5.867 -5.867 -3.24 -5.867 0 C
-5.867 3.24 -3.24 5.867 0 5.867 C
3.24 5.867 5.867 3.24 5.867 0 C
cp
S
GR
GS
[0.75 0 0 0.75 415.63637 220.66759] CT
N
f-819729944
f
GR
GS
[0.75 0 0 0.75 415.63637 220.66759] CT
10.0 ML
2.667 LW
N
5.867 0 M
5.867 -3.24 3.24 -5.867 0 -5.867 C
-3.24 -5.867 -5.867 -3.24 -5.867 0 C
-5.867 3.24 -3.24 5.867 0 5.867 C
3.24 5.867 5.867 3.24 5.867 0 C
cp
S
GR
GS
[0.75 0 0 0.75 457.8409 213.4006] CT
N
f-819729944
f
GR
GS
[0.75 0 0 0.75 457.8409 213.4006] CT
10.0 ML
2.667 LW
N
5.867 0 M
5.867 -3.24 3.24 -5.867 0 -5.867 C
-3.24 -5.867 -5.867 -3.24 -5.867 0 C
-5.867 3.24 -3.24 5.867 0 5.867 C
3.24 5.867 5.867 3.24 5.867 0 C
cp
S
GR
GS
[0.75 0 0 0.75 500.04547 212.12044] CT
N
f-819729944
f
GR
GS
[0.75 0 0 0.75 500.04547 212.12044] CT
10.0 ML
2.667 LW
N
5.867 0 M
5.867 -3.24 3.24 -5.867 0 -5.867 C
-3.24 -5.867 -5.867 -3.24 -5.867 0 C
-5.867 3.24 -3.24 5.867 0 5.867 C
3.24 5.867 5.867 3.24 5.867 0 C
cp
S
GR
GS
[0.75 0 0 0.75 0 -0.25] CT
1 LJ
2.667 LW
N
160.273 569 M
160.273 442.088 L
S
GR
GS
[0.75 0 0 0.75 0 -0.25] CT
1 LJ
2.667 LW
N
216.545 569 M
216.545 437.252 L
S
GR
GS
[0.75 0 0 0.75 0 -0.25] CT
1 LJ
2.667 LW
N
272.818 569 M
272.818 400.823 L
S
GR
GS
[0.75 0 0 0.75 0 -0.25] CT
1 LJ
2.667 LW
N
329.091 569 M
329.091 356.499 L
S
GR
GS
[0.75 0 0 0.75 0 -0.25] CT
1 LJ
2.667 LW
N
385.364 569 M
385.364 333.658 L
S
GR
GS
[0.75 0 0 0.75 0 -0.25] CT
1 LJ
2.667 LW
N
441.636 569 M
441.636 317.273 L
S
GR
GS
[0.75 0 0 0.75 0 -0.25] CT
1 LJ
2.667 LW
N
497.909 569 M
497.909 311.663 L
S
GR
GS
[0.75 0 0 0.75 0 -0.25] CT
1 LJ
2.667 LW
N
554.182 569 M
554.182 294.557 L
S
GR
GS
[0.75 0 0 0.75 0 -0.25] CT
1 LJ
2.667 LW
N
610.455 569 M
610.455 284.867 L
S
GR
GS
[0.75 0 0 0.75 0 -0.25] CT
1 LJ
2.667 LW
N
666.727 569 M
666.727 283.161 L
S
GR
GS
[0.75 0 0 0.75 120.20454 337.71779] CT
1 0 0 RC
N
f-819729944
f
GR
GS
[0.75 0 0 0.75 120.20454 337.71779] CT
1 0 0 RC
10.0 ML
2.667 LW
N
5.867 0 M
5.867 -3.24 3.24 -5.867 0 -5.867 C
-3.24 -5.867 -5.867 -3.24 -5.867 0 C
-5.867 3.24 -3.24 5.867 0 5.867 C
3.24 5.867 5.867 3.24 5.867 0 C
cp
S
GR
GS
[0.75 0 0 0.75 162.40909 379.86798] CT
1 0 0 RC
N
f-819729944
f
GR
GS
[0.75 0 0 0.75 162.40909 379.86798] CT
1 0 0 RC
10.0 ML
2.667 LW
N
5.867 0 M
5.867 -3.24 3.24 -5.867 0 -5.867 C
-3.24 -5.867 -5.867 -3.24 -5.867 0 C
-5.867 3.24 -3.24 5.867 0 5.867 C
3.24 5.867 5.867 3.24 5.867 0 C
cp
S
GR
GS
[0.75 0 0 0.75 204.61363 262.83315] CT
1 0 0 RC
N
f-819729944
f
GR
GS
[0.75 0 0 0.75 204.61363 262.83315] CT
1 0 0 RC
10.0 ML
2.667 LW
N
5.867 0 M
5.867 -3.24 3.24 -5.867 0 -5.867 C
-3.24 -5.867 -5.867 -3.24 -5.867 0 C
-5.867 3.24 -3.24 5.867 0 5.867 C
3.24 5.867 5.867 3.24 5.867 0 C
cp
S
GR
GS
[0.75 0 0 0.75 246.81818 175.57492] CT
1 0 0 RC
N
f-819729944
f
GR
GS
[0.75 0 0 0.75 246.81818 175.57492] CT
1 0 0 RC
10.0 ML
2.667 LW
N
5.867 0 M
5.867 -3.24 3.24 -5.867 0 -5.867 C
-3.24 -5.867 -5.867 -3.24 -5.867 0 C
-5.867 3.24 -3.24 5.867 0 5.867 C
3.24 5.867 5.867 3.24 5.867 0 C
cp
S
GR
GS
[0.75 0 0 0.75 289.02274 199.16893] CT
1 0 0 RC
N
f-819729944
f
GR
GS
[0.75 0 0 0.75 289.02274 199.16893] CT
1 0 0 RC
10.0 ML
2.667 LW
N
5.867 0 M
5.867 -3.24 3.24 -5.867 0 -5.867 C
-3.24 -5.867 -5.867 -3.24 -5.867 0 C
-5.867 3.24 -3.24 5.867 0 5.867 C
3.24 5.867 5.867 3.24 5.867 0 C
cp
S
GR
GS
[0.75 0 0 0.75 331.22726 183.07691] CT
1 0 0 RC
N
f-819729944
f
GR
GS
[0.75 0 0 0.75 331.22726 183.07691] CT
1 0 0 RC
10.0 ML
2.667 LW
N
5.867 0 M
5.867 -3.24 3.24 -5.867 0 -5.867 C
-3.24 -5.867 -5.867 -3.24 -5.867 0 C
-5.867 3.24 -3.24 5.867 0 5.867 C
3.24 5.867 5.867 3.24 5.867 0 C
cp
S
GR
GS
[0.75 0 0 0.75 373.43182 155.17821] CT
1 0 0 RC
N
f-819729944
f
GR
GS
[0.75 0 0 0.75 373.43182 155.17821] CT
1 0 0 RC
10.0 ML
2.667 LW
N
5.867 0 M
5.867 -3.24 3.24 -5.867 0 -5.867 C
-3.24 -5.867 -5.867 -3.24 -5.867 0 C
-5.867 3.24 -3.24 5.867 0 5.867 C
3.24 5.867 5.867 3.24 5.867 0 C
cp
S
GR
GS
[0.75 0 0 0.75 415.63637 257.35889] CT
1 0 0 RC
N
f-819729944
f
GR
GS
[0.75 0 0 0.75 415.63637 257.35889] CT
1 0 0 RC
10.0 ML
2.667 LW
N
5.867 0 M
5.867 -3.24 3.24 -5.867 0 -5.867 C
-3.24 -5.867 -5.867 -3.24 -5.867 0 C
-5.867 3.24 -3.24 5.867 0 5.867 C
3.24 5.867 5.867 3.24 5.867 0 C
cp
S
GR
GS
[0.75 0 0 0.75 457.8409 80.96897] CT
1 0 0 RC
N
f-819729944
f
GR
GS
[0.75 0 0 0.75 457.8409 80.96897] CT
1 0 0 RC
10.0 ML
2.667 LW
N
5.867 0 M
5.867 -3.24 3.24 -5.867 0 -5.867 C
-3.24 -5.867 -5.867 -3.24 -5.867 0 C
-5.867 3.24 -3.24 5.867 0 5.867 C
3.24 5.867 5.867 3.24 5.867 0 C
cp
S
GR
GS
[0.75 0 0 0.75 500.04547 184.38277] CT
1 0 0 RC
N
f-819729944
f
GR
GS
[0.75 0 0 0.75 500.04547 184.38277] CT
1 0 0 RC
10.0 ML
2.667 LW
N
5.867 0 M
5.867 -3.24 3.24 -5.867 0 -5.867 C
-3.24 -5.867 -5.867 -3.24 -5.867 0 C
-5.867 3.24 -3.24 5.867 0 5.867 C
3.24 5.867 5.867 3.24 5.867 0 C
cp
S
GR
GS
[0.75 0 0 0.75 0 -0.25] CT
1 0 0 RC
[8 8] 0 setdash
2 LJ
2.667 LW
N
160.273 569 M
160.273 450.624 L
S
GR
GS
[0.75 0 0 0.75 0 -0.25] CT
1 0 0 RC
[8 8] 0 setdash
2 LJ
2.667 LW
N
216.545 569 M
216.545 506.824 L
S
GR
GS
[0.75 0 0 0.75 0 -0.25] CT
1 0 0 RC
[8 8] 0 setdash
2 LJ
2.667 LW
N
272.818 569 M
272.818 350.778 L
S
GR
GS
[0.75 0 0 0.75 0 -0.25] CT
1 0 0 RC
[8 8] 0 setdash
2 LJ
2.667 LW
N
329.091 569 M
329.091 234.433 L
S
GR
GS
[0.75 0 0 0.75 0 -0.25] CT
1 0 0 RC
[8 8] 0 setdash
2 LJ
2.667 LW
N
385.364 569 M
385.364 265.892 L
S
GR
GS
[0.75 0 0 0.75 0 -0.25] CT
1 0 0 RC
[8 8] 0 setdash
2 LJ
2.667 LW
N
441.636 569 M
441.636 244.436 L
S
GR
GS
[0.75 0 0 0.75 0 -0.25] CT
1 0 0 RC
[8 8] 0 setdash
2 LJ
2.667 LW
N
497.909 569 M
497.909 207.238 L
S
GR
GS
[0.75 0 0 0.75 0 -0.25] CT
1 0 0 RC
[8 8] 0 setdash
2 LJ
2.667 LW
N
554.182 569 M
554.182 343.479 L
S
GR
GS
[0.75 0 0 0.75 0 -0.25] CT
1 0 0 RC
[8 8] 0 setdash
2 LJ
2.667 LW
N
610.455 569 M
610.455 108.292 L
S
GR
GS
[0.75 0 0 0.75 0 -0.25] CT
1 0 0 RC
[8 8] 0 setdash
2 LJ
2.667 LW
N
666.727 569 M
666.727 246.177 L
S
GR
GS
[0.75 0 0 0.75 0 -0.25] CT
0.502 GC
1 LJ
0.667 LW
N
185.724 444.026 M
185.633 441.796 L
185.361 439.582 L
184.91 437.4 L
184.283 435.266 L
183.484 433.195 L
182.52 431.202 L
181.397 429.302 L
180.123 427.507 L
178.708 425.832 L
177.161 424.287 L
175.495 422.885 L
173.72 421.635 L
171.85 420.547 L
169.898 419.627 L
167.879 418.884 L
165.806 418.322 L
163.695 417.944 L
161.561 417.755 L
159.419 417.755 L
157.284 417.944 L
155.173 418.322 L
153.101 418.884 L
151.081 419.627 L
149.129 420.547 L
147.259 421.635 L
145.485 422.885 L
143.818 424.287 L
142.272 425.832 L
140.857 427.507 L
139.583 429.302 L
138.46 431.202 L
137.495 433.195 L
136.697 435.266 L
136.07 437.4 L
135.618 439.582 L
135.346 441.796 L
135.255 444.026 L
135.346 446.256 L
135.618 448.469 L
136.07 450.651 L
136.697 452.785 L
137.495 454.856 L
138.46 456.849 L
139.583 458.75 L
140.857 460.544 L
142.272 462.22 L
143.818 463.764 L
145.485 465.166 L
147.259 466.416 L
149.129 467.504 L
151.081 468.424 L
153.101 469.167 L
155.173 469.73 L
157.284 470.107 L
159.419 470.296 L
161.561 470.296 L
163.695 470.107 L
165.806 469.73 L
167.879 469.167 L
169.898 468.424 L
171.85 467.504 L
173.72 466.416 L
175.495 465.166 L
177.161 463.764 L
178.708 462.22 L
180.123 460.544 L
181.397 458.75 L
182.52 456.849 L
183.484 454.856 L
184.283 452.785 L
184.91 450.651 L
185.361 448.469 L
185.633 446.256 L
185.724 444.026 L
cp
S
GR
%%Trailer
%%Pages: 1
%%EOF
