%!PS-Adobe-3.0 EPSF-3.0
%%Creator: (MATLAB, The Mathworks, Inc. Version 9.5.0.944444 \(R2018b\). Operating System: Windows 10)
%%Title: (C:/Users/Alex/Documents/PhD Docs/01. GIT/my_phd_thesis/Chapter7/Figures/AVAIL/axis-accuracy_RESTYLE01.eps)
%%CreationDate: 2019-10-03T16:15:15
%%Pages: (atend)
%%BoundingBox: 0 0 718 467
%%LanguageLevel: 3
%%EndComments
%%BeginProlog
%%BeginResource: procset (Apache XML Graphics Std ProcSet) 1.2 0
%%Version: 1.2 0
%%Copyright: (Copyright 2001-2003,2010 The Apache Software Foundation. License terms: http://www.apache.org/licenses/LICENSE-2.0)
/bd{bind def}bind def
/ld{load def}bd
/GR/grestore ld
/GS/gsave ld
/RM/rmoveto ld
/C/curveto ld
/t/show ld
/L/lineto ld
/ML/setmiterlimit ld
/CT/concat ld
/f/fill ld
/N/newpath ld
/S/stroke ld
/CC/setcmykcolor ld
/A/ashow ld
/cp/closepath ld
/RC/setrgbcolor ld
/LJ/setlinejoin ld
/GC/setgray ld
/LW/setlinewidth ld
/M/moveto ld
/re {4 2 roll M
1 index 0 rlineto
0 exch rlineto
neg 0 rlineto
cp } bd
/_ctm matrix def
/_tm matrix def
/BT { _ctm currentmatrix pop matrix _tm copy pop 0 0 moveto } bd
/ET { _ctm setmatrix } bd
/iTm { _ctm setmatrix _tm concat } bd
/Tm { _tm astore pop iTm 0 0 moveto } bd
/ux 0.0 def
/uy 0.0 def
/F {
  /Tp exch def
  /Tf exch def
  Tf findfont Tp scalefont setfont
  /cf Tf def  /cs Tp def
} bd
/ULS {currentpoint /uy exch def /ux exch def} bd
/ULE {
  /Tcx currentpoint pop def
  gsave
  newpath
  cf findfont cs scalefont dup
  /FontMatrix get 0 get /Ts exch def /FontInfo get dup
  /UnderlinePosition get Ts mul /To exch def
  /UnderlineThickness get Ts mul /Tt exch def
  ux uy To add moveto  Tcx uy To add lineto
  Tt setlinewidth stroke
  grestore
} bd
/OLE {
  /Tcx currentpoint pop def
  gsave
  newpath
  cf findfont cs scalefont dup
  /FontMatrix get 0 get /Ts exch def /FontInfo get dup
  /UnderlinePosition get Ts mul /To exch def
  /UnderlineThickness get Ts mul /Tt exch def
  ux uy To add cs add moveto Tcx uy To add cs add lineto
  Tt setlinewidth stroke
  grestore
} bd
/SOE {
  /Tcx currentpoint pop def
  gsave
  newpath
  cf findfont cs scalefont dup
  /FontMatrix get 0 get /Ts exch def /FontInfo get dup
  /UnderlinePosition get Ts mul /To exch def
  /UnderlineThickness get Ts mul /Tt exch def
  ux uy To add cs 10 mul 26 idiv add moveto Tcx uy To add cs 10 mul 26 idiv add lineto
  Tt setlinewidth stroke
  grestore
} bd
/QT {
/Y22 exch store
/X22 exch store
/Y21 exch store
/X21 exch store
currentpoint
/Y21 load 2 mul add 3 div exch
/X21 load 2 mul add 3 div exch
/X21 load 2 mul /X22 load add 3 div
/Y21 load 2 mul /Y22 load add 3 div
/X22 load /Y22 load curveto
} bd
/SSPD {
dup length /d exch dict def
{
/v exch def
/k exch def
currentpagedevice k known {
/cpdv currentpagedevice k get def
v cpdv ne {
/upd false def
/nullv v type /nulltype eq def
/nullcpdv cpdv type /nulltype eq def
nullv nullcpdv or
{
/upd true def
} {
/sametype v type cpdv type eq def
sametype {
v type /arraytype eq {
/vlen v length def
/cpdvlen cpdv length def
vlen cpdvlen eq {
0 1 vlen 1 sub {
/i exch def
/obj v i get def
/cpdobj cpdv i get def
obj cpdobj ne {
/upd true def
exit
} if
} for
} {
/upd true def
} ifelse
} {
v type /dicttype eq {
v {
/dv exch def
/dk exch def
/cpddv cpdv dk get def
dv cpddv ne {
/upd true def
exit
} if
} forall
} {
/upd true def
} ifelse
} ifelse
} if
} ifelse
upd true eq {
d k v put
} if
} if
} if
} forall
d length 0 gt {
d setpagedevice
} if
} bd
/RE { % /NewFontName [NewEncodingArray] /FontName RE -
  findfont dup length dict begin
  {
    1 index /FID ne
    {def} {pop pop} ifelse
  } forall
  /Encoding exch def
  /FontName 1 index def
  currentdict definefont pop
  end
} bind def
%%EndResource
%%BeginResource: procset (Apache XML Graphics EPS ProcSet) 1.0 0
%%Version: 1.0 0
%%Copyright: (Copyright 2002-2003 The Apache Software Foundation. License terms: http://www.apache.org/licenses/LICENSE-2.0)
/BeginEPSF { %def
/b4_Inc_state save def         % Save state for cleanup
/dict_count countdictstack def % Count objects on dict stack
/op_count count 1 sub def      % Count objects on operand stack
userdict begin                 % Push userdict on dict stack
/showpage { } def              % Redefine showpage, { } = null proc
0 setgray 0 setlinecap         % Prepare graphics state
1 setlinewidth 0 setlinejoin
10 setmiterlimit [ ] 0 setdash newpath
/languagelevel where           % If level not equal to 1 then
{pop languagelevel             % set strokeadjust and
1 ne                           % overprint to their defaults.
{false setstrokeadjust false setoverprint
} if
} if
} bd
/EndEPSF { %def
count op_count sub {pop} repeat            % Clean up stacks
countdictstack dict_count sub {end} repeat
b4_Inc_state restore
} bd
%%EndResource
%FOPBeginFontDict
%%IncludeResource: font Courier-Oblique
%%IncludeResource: font Courier-BoldOblique
%%IncludeResource: font Courier-Bold
%%IncludeResource: font ZapfDingbats
%%IncludeResource: font Symbol
%%IncludeResource: font Helvetica
%%IncludeResource: font Helvetica-Oblique
%%IncludeResource: font Helvetica-Bold
%%IncludeResource: font Helvetica-BoldOblique
%%IncludeResource: font Times-Roman
%%IncludeResource: font Times-Italic
%%IncludeResource: font Times-Bold
%%IncludeResource: font Times-BoldItalic
%%IncludeResource: font Courier
%FOPEndFontDict
%%BeginResource: encoding WinAnsiEncoding
/WinAnsiEncoding [
/.notdef /.notdef /.notdef /.notdef /.notdef
/.notdef /.notdef /.notdef /.notdef /.notdef
/.notdef /.notdef /.notdef /.notdef /.notdef
/.notdef /.notdef /.notdef /.notdef /.notdef
/.notdef /.notdef /.notdef /.notdef /.notdef
/.notdef /.notdef /.notdef /.notdef /.notdef
/.notdef /.notdef /space /exclam /quotedbl
/numbersign /dollar /percent /ampersand /quotesingle
/parenleft /parenright /asterisk /plus /comma
/hyphen /period /slash /zero /one
/two /three /four /five /six
/seven /eight /nine /colon /semicolon
/less /equal /greater /question /at
/A /B /C /D /E
/F /G /H /I /J
/K /L /M /N /O
/P /Q /R /S /T
/U /V /W /X /Y
/Z /bracketleft /backslash /bracketright /asciicircum
/underscore /quoteleft /a /b /c
/d /e /f /g /h
/i /j /k /l /m
/n /o /p /q /r
/s /t /u /v /w
/x /y /z /braceleft /bar
/braceright /asciitilde /bullet /Euro /bullet
/quotesinglbase /florin /quotedblbase /ellipsis /dagger
/daggerdbl /circumflex /perthousand /Scaron /guilsinglleft
/OE /bullet /Zcaron /bullet /bullet
/quoteleft /quoteright /quotedblleft /quotedblright /bullet
/endash /emdash /asciitilde /trademark /scaron
/guilsinglright /oe /bullet /zcaron /Ydieresis
/space /exclamdown /cent /sterling /currency
/yen /brokenbar /section /dieresis /copyright
/ordfeminine /guillemotleft /logicalnot /sfthyphen /registered
/macron /degree /plusminus /twosuperior /threesuperior
/acute /mu /paragraph /middot /cedilla
/onesuperior /ordmasculine /guillemotright /onequarter /onehalf
/threequarters /questiondown /Agrave /Aacute /Acircumflex
/Atilde /Adieresis /Aring /AE /Ccedilla
/Egrave /Eacute /Ecircumflex /Edieresis /Igrave
/Iacute /Icircumflex /Idieresis /Eth /Ntilde
/Ograve /Oacute /Ocircumflex /Otilde /Odieresis
/multiply /Oslash /Ugrave /Uacute /Ucircumflex
/Udieresis /Yacute /Thorn /germandbls /agrave
/aacute /acircumflex /atilde /adieresis /aring
/ae /ccedilla /egrave /eacute /ecircumflex
/edieresis /igrave /iacute /icircumflex /idieresis
/eth /ntilde /ograve /oacute /ocircumflex
/otilde /odieresis /divide /oslash /ugrave
/uacute /ucircumflex /udieresis /yacute /thorn
/ydieresis
] def
%%EndResource
%FOPBeginFontReencode
/Courier-Oblique findfont
dup length dict begin
  {1 index /FID ne {def} {pop pop} ifelse} forall
  /Encoding WinAnsiEncoding def
  currentdict
end
/Courier-Oblique exch definefont pop
/Courier-BoldOblique findfont
dup length dict begin
  {1 index /FID ne {def} {pop pop} ifelse} forall
  /Encoding WinAnsiEncoding def
  currentdict
end
/Courier-BoldOblique exch definefont pop
/Courier-Bold findfont
dup length dict begin
  {1 index /FID ne {def} {pop pop} ifelse} forall
  /Encoding WinAnsiEncoding def
  currentdict
end
/Courier-Bold exch definefont pop
/Helvetica findfont
dup length dict begin
  {1 index /FID ne {def} {pop pop} ifelse} forall
  /Encoding WinAnsiEncoding def
  currentdict
end
/Helvetica exch definefont pop
/Helvetica-Oblique findfont
dup length dict begin
  {1 index /FID ne {def} {pop pop} ifelse} forall
  /Encoding WinAnsiEncoding def
  currentdict
end
/Helvetica-Oblique exch definefont pop
/Helvetica-Bold findfont
dup length dict begin
  {1 index /FID ne {def} {pop pop} ifelse} forall
  /Encoding WinAnsiEncoding def
  currentdict
end
/Helvetica-Bold exch definefont pop
/Helvetica-BoldOblique findfont
dup length dict begin
  {1 index /FID ne {def} {pop pop} ifelse} forall
  /Encoding WinAnsiEncoding def
  currentdict
end
/Helvetica-BoldOblique exch definefont pop
/Times-Roman findfont
dup length dict begin
  {1 index /FID ne {def} {pop pop} ifelse} forall
  /Encoding WinAnsiEncoding def
  currentdict
end
/Times-Roman exch definefont pop
/Times-Italic findfont
dup length dict begin
  {1 index /FID ne {def} {pop pop} ifelse} forall
  /Encoding WinAnsiEncoding def
  currentdict
end
/Times-Italic exch definefont pop
/Times-Bold findfont
dup length dict begin
  {1 index /FID ne {def} {pop pop} ifelse} forall
  /Encoding WinAnsiEncoding def
  currentdict
end
/Times-Bold exch definefont pop
/Times-BoldItalic findfont
dup length dict begin
  {1 index /FID ne {def} {pop pop} ifelse} forall
  /Encoding WinAnsiEncoding def
  currentdict
end
/Times-BoldItalic exch definefont pop
/Courier findfont
dup length dict begin
  {1 index /FID ne {def} {pop pop} ifelse} forall
  /Encoding WinAnsiEncoding def
  currentdict
end
/Courier exch definefont pop
%FOPEndFontReencode
%%EndProlog
%%Page: 1 1
%%PageBoundingBox: 0 0 718 467
%%BeginPageSetup
[1 0 0 -1 0 467] CT
%%EndPageSetup
GS
[0.75 0 0 0.75 0 -0.25] CT
1 GC
N
0 0 957 623 re
f
GR
GS
[0.75 0 0 0.75 0 -0.25] CT
1 GC
N
0 0 957 623 re
f
GR
GS
[0.75 0 0 0.75 0 -0.25] CT
1 GC
N
124 166 M
866 166 L
866 23 L
124 23 L
cp
f
GR
GS
[0.75 0 0 0.75 0 -0.25] CT
0.873 GC
1 LJ
0.667 LW
N
124 166 M
124 23 L
S
GR
GS
[0.75 0 0 0.75 0 -0.25] CT
0.873 GC
1 LJ
0.667 LW
N
272.4 166 M
272.4 23 L
S
GR
GS
[0.75 0 0 0.75 0 -0.25] CT
0.873 GC
1 LJ
0.667 LW
N
420.8 166 M
420.8 23 L
S
GR
GS
[0.75 0 0 0.75 0 -0.25] CT
0.873 GC
1 LJ
0.667 LW
N
569.2 166 M
569.2 23 L
S
GR
GS
[0.75 0 0 0.75 0 -0.25] CT
0.873 GC
1 LJ
0.667 LW
N
717.6 166 M
717.6 23 L
S
GR
GS
[0.75 0 0 0.75 0 -0.25] CT
0.873 GC
1 LJ
0.667 LW
N
866 166 M
866 23 L
S
GR
GS
[0.75 0 0 0.75 0 -0.25] CT
0.873 GC
1 LJ
0.667 LW
N
866 133 M
124 133 L
S
GR
GS
[0.75 0 0 0.75 0 -0.25] CT
0.873 GC
1 LJ
0.667 LW
N
866 89 M
124 89 L
S
GR
GS
[0.75 0 0 0.75 0 -0.25] CT
0.873 GC
1 LJ
0.667 LW
N
866 45 M
124 45 L
S
GR
GS
[0.75 0 0 0.75 0 -0.25] CT
0.149 GC
2 setlinecap
1 LJ
0.667 LW
N
124 166 M
866 166 L
S
GR
GS
[0.75 0 0 0.75 0 -0.25] CT
0.149 GC
2 setlinecap
1 LJ
0.667 LW
N
124 23 M
866 23 L
S
GR
GS
[0.75 0 0 0.75 0 -0.25] CT
0.149 GC
2 setlinecap
1 LJ
0.667 LW
N
124 166 M
124 158.58 L
S
GR
GS
[0.75 0 0 0.75 0 -0.25] CT
0.149 GC
2 setlinecap
1 LJ
0.667 LW
N
272.4 166 M
272.4 158.58 L
S
GR
GS
[0.75 0 0 0.75 0 -0.25] CT
0.149 GC
2 setlinecap
1 LJ
0.667 LW
N
420.8 166 M
420.8 158.58 L
S
GR
GS
[0.75 0 0 0.75 0 -0.25] CT
0.149 GC
2 setlinecap
1 LJ
0.667 LW
N
569.2 166 M
569.2 158.58 L
S
GR
GS
[0.75 0 0 0.75 0 -0.25] CT
0.149 GC
2 setlinecap
1 LJ
0.667 LW
N
717.6 166 M
717.6 158.58 L
S
GR
GS
[0.75 0 0 0.75 0 -0.25] CT
0.149 GC
2 setlinecap
1 LJ
0.667 LW
N
866 166 M
866 158.58 L
S
GR
GS
[0.75 0 0 0.75 0 -0.25] CT
0.149 GC
2 setlinecap
1 LJ
0.667 LW
N
124 23 M
124 30.42 L
S
GR
GS
[0.75 0 0 0.75 0 -0.25] CT
0.149 GC
2 setlinecap
1 LJ
0.667 LW
N
272.4 23 M
272.4 30.42 L
S
GR
GS
[0.75 0 0 0.75 0 -0.25] CT
0.149 GC
2 setlinecap
1 LJ
0.667 LW
N
420.8 23 M
420.8 30.42 L
S
GR
GS
[0.75 0 0 0.75 0 -0.25] CT
0.149 GC
2 setlinecap
1 LJ
0.667 LW
N
569.2 23 M
569.2 30.42 L
S
GR
GS
[0.75 0 0 0.75 0 -0.25] CT
0.149 GC
2 setlinecap
1 LJ
0.667 LW
N
717.6 23 M
717.6 30.42 L
S
GR
GS
[0.75 0 0 0.75 0 -0.25] CT
0.149 GC
2 setlinecap
1 LJ
0.667 LW
N
866 23 M
866 30.42 L
S
GR
GS
[0.75 0 0 0.75 93 129.85001] CT
0.149 GC
/Helvetica 24 F
GS
[1 0 0 1 0 0] CT
-7 25 moveto 
1 -1 scale
(0) t 
GR
GR
GS
[0.75 0 0 0.75 204.3 129.85001] CT
0.149 GC
/Helvetica 24 F
GS
[1 0 0 1 0 0] CT
-13.5 25 moveto 
1 -1 scale
(20) t 
GR
GR
GS
[0.75 0 0 0.75 315.59999 129.85001] CT
0.149 GC
/Helvetica 24 F
GS
[1 0 0 1 0 0] CT
-13.5 25 moveto 
1 -1 scale
(40) t 
GR
GR
GS
[0.75 0 0 0.75 426.90001 129.85001] CT
0.149 GC
/Helvetica 24 F
GS
[1 0 0 1 0 0] CT
-13.5 25 moveto 
1 -1 scale
(60) t 
GR
GR
GS
[0.75 0 0 0.75 538.19998 129.85001] CT
0.149 GC
/Helvetica 24 F
GS
[1 0 0 1 0 0] CT
-13.5 25 moveto 
1 -1 scale
(80) t 
GR
GR
GS
[0.75 0 0 0.75 649.5 129.85001] CT
0.149 GC
/Helvetica 24 F
GS
[1 0 0 1 0 0] CT
-20.5 25 moveto 
1 -1 scale
(100) t 
GR
GR
GS
[0.75 0 0 0.75 0 -0.25] CT
0.149 GC
2 setlinecap
1 LJ
0.667 LW
N
124 166 M
124 23 L
S
GR
GS
[0.75 0 0 0.75 0 -0.25] CT
0.149 GC
2 setlinecap
1 LJ
0.667 LW
N
866 166 M
866 23 L
S
GR
GS
[0.75 0 0 0.75 0 -0.25] CT
0.149 GC
2 setlinecap
1 LJ
0.667 LW
N
124 133 M
131.42 133 L
S
GR
GS
[0.75 0 0 0.75 0 -0.25] CT
0.149 GC
2 setlinecap
1 LJ
0.667 LW
N
124 89 M
131.42 89 L
S
GR
GS
[0.75 0 0 0.75 0 -0.25] CT
0.149 GC
2 setlinecap
1 LJ
0.667 LW
N
124 45 M
131.42 45 L
S
GR
GS
[0.75 0 0 0.75 0 -0.25] CT
0.149 GC
2 setlinecap
1 LJ
0.667 LW
N
866 133 M
858.58 133 L
S
GR
GS
[0.75 0 0 0.75 0 -0.25] CT
0.149 GC
2 setlinecap
1 LJ
0.667 LW
N
866 89 M
858.58 89 L
S
GR
GS
[0.75 0 0 0.75 0 -0.25] CT
0.149 GC
2 setlinecap
1 LJ
0.667 LW
N
866 45 M
858.58 45 L
S
GR
GS
[0.75 0 0 0.75 87.4 99.5] CT
0.149 GC
/Helvetica 24 F
GS
[1 0 0 1 0 0] CT
-35 9.5 moveto 
1 -1 scale
(-20) t 
GR
GR
GS
[0.75 0 0 0.75 87.4 66.5] CT
0.149 GC
/Helvetica 24 F
GS
[1 0 0 1 0 0] CT
-14 9.5 moveto 
1 -1 scale
(0) t 
GR
GR
GS
[0.75 0 0 0.75 87.4 33.5] CT
0.149 GC
/Helvetica 24 F
GS
[1 0 0 1 0 0] CT
-27 9.5 moveto 
1 -1 scale
(20) t 
GR
GR
GS
[0 -0.75 0.75 0 56.30693 82.99995] CT
0.149 GC
N
-42.699 -13.176 M
-42.699 -12.301 -42.387 -11.551 QT
-42.074 -10.801 -41.433 -10.348 QT
-40.793 -9.895 -39.918 -9.895 QT
-39.34 -9.895 -38.676 -10.153 QT
-38.012 -10.41 -37.449 -10.715 QT
-36.887 -11.02 -36.871 -11.02 QT
-36.73 -11.02 -36.652 -10.856 QT
-36.574 -10.692 -36.574 -10.551 QT
-36.574 -10.41 -36.652 -10.363 QT
-38.277 -9.207 -39.949 -9.207 QT
-41.324 -9.207 -42.426 -9.848 QT
-43.527 -10.488 -44.129 -11.637 QT
-44.73 -12.785 -44.73 -14.145 QT
-44.73 -15.488 -44.183 -16.699 QT
-43.637 -17.91 -42.676 -18.809 QT
-41.715 -19.707 -40.496 -20.207 QT
-39.277 -20.707 -37.949 -20.707 QT
-36.465 -20.707 L
-36.074 -20.707 -36.074 -20.317 QT
-36.074 -20.098 -36.222 -19.949 QT
-36.371 -19.801 -36.574 -19.801 QT
-37.996 -19.801 L
-39.027 -19.801 -39.871 -19.34 QT
-40.715 -18.879 -41.293 -18.067 QT
-41.871 -17.254 -42.183 -16.238 QT
-37.59 -16.238 L
-37.402 -16.238 -37.301 -16.129 QT
-37.199 -16.02 -37.199 -15.848 QT
-37.199 -15.629 -37.332 -15.481 QT
-37.465 -15.332 -37.683 -15.332 QT
-42.418 -15.332 L
-42.699 -13.988 -42.699 -13.176 QT
cp
f
GR
GS
[0 -0.75 0.75 0 56.30693 82.99995] CT
0.149 GC
N
-27.124 -3.051 M
-28.577 -4.192 -29.624 -5.676 QT
-30.671 -7.16 -31.335 -8.832 QT
-31.999 -10.504 -32.327 -12.332 QT
-32.655 -14.16 -32.655 -16.004 QT
-32.655 -17.863 -32.327 -19.692 QT
-31.999 -21.52 -31.319 -23.215 QT
-30.639 -24.91 -29.585 -26.379 QT
-28.53 -27.848 -27.124 -28.957 QT
-27.124 -29.004 -26.999 -29.004 QT
-26.749 -29.004 L
-26.686 -29.004 -26.616 -28.934 QT
-26.546 -28.863 -26.546 -28.77 QT
-26.546 -28.66 -26.608 -28.613 QT
-27.874 -27.363 -28.718 -25.942 QT
-29.561 -24.52 -30.077 -22.918 QT
-30.593 -21.317 -30.819 -19.59 QT
-31.046 -17.863 -31.046 -16.004 QT
-31.046 -7.738 -26.624 -3.442 QT
-26.546 -3.379 -26.546 -3.238 QT
-26.546 -3.176 -26.616 -3.09 QT
-26.686 -3.004 -26.749 -3.004 QT
-26.999 -3.004 L
-27.124 -3.004 -27.124 -3.051 QT
cp
f
GR
GS
[0 -0.75 0.75 0 56.30693 82.99995] CT
0.149 GC
N
-22.888 -10.254 M
-22.435 -9.895 -21.591 -9.895 QT
-20.779 -9.895 -20.154 -10.676 QT
-19.529 -11.457 -19.31 -12.379 QT
-18.123 -16.988 L
-17.841 -18.254 -17.841 -18.707 QT
-17.841 -19.363 -18.209 -19.84 QT
-18.576 -20.317 -19.216 -20.317 QT
-20.045 -20.317 -20.771 -19.801 QT
-21.498 -19.285 -21.99 -18.496 QT
-22.482 -17.707 -22.685 -16.895 QT
-22.732 -16.723 -22.888 -16.723 QT
-23.201 -16.723 L
-23.404 -16.723 -23.404 -16.973 QT
-23.404 -17.051 L
-23.154 -18.004 -22.545 -18.926 QT
-21.935 -19.848 -21.052 -20.418 QT
-20.17 -20.988 -19.17 -20.988 QT
-18.216 -20.988 -17.451 -20.481 QT
-16.685 -19.973 -16.357 -19.098 QT
-15.92 -19.895 -15.224 -20.442 QT
-14.529 -20.988 -13.716 -20.988 QT
-13.154 -20.988 -12.568 -20.793 QT
-11.982 -20.598 -11.615 -20.192 QT
-11.248 -19.785 -11.248 -19.176 QT
-11.248 -18.52 -11.67 -18.043 QT
-12.091 -17.567 -12.763 -17.567 QT
-13.17 -17.567 -13.451 -17.832 QT
-13.732 -18.098 -13.732 -18.504 QT
-13.732 -19.051 -13.357 -19.465 QT
-12.982 -19.879 -12.466 -19.957 QT
-12.935 -20.317 -13.763 -20.317 QT
-14.591 -20.317 -15.209 -19.543 QT
-15.826 -18.77 -16.076 -17.817 QT
-17.232 -13.223 L
-17.498 -12.176 -17.498 -11.504 QT
-17.498 -10.848 -17.131 -10.371 QT
-16.763 -9.895 -16.138 -9.895 QT
-14.92 -9.895 -13.959 -10.973 QT
-12.998 -12.051 -12.701 -13.332 QT
-12.638 -13.473 -12.498 -13.473 QT
-12.17 -13.473 L
-12.076 -13.473 -12.013 -13.403 QT
-11.951 -13.332 -11.951 -13.254 QT
-11.951 -13.223 -11.966 -13.176 QT
-12.341 -11.629 -13.521 -10.418 QT
-14.701 -9.207 -16.185 -9.207 QT
-17.138 -9.207 -17.904 -9.723 QT
-18.67 -10.238 -18.998 -11.113 QT
-19.404 -10.348 -20.115 -9.778 QT
-20.826 -9.207 -21.638 -9.207 QT
-22.201 -9.207 -22.795 -9.41 QT
-23.388 -9.613 -23.756 -10.02 QT
-24.123 -10.426 -24.123 -11.035 QT
-24.123 -11.645 -23.693 -12.153 QT
-23.263 -12.66 -22.638 -12.66 QT
-22.201 -12.66 -21.912 -12.395 QT
-21.623 -12.129 -21.623 -11.707 QT
-21.623 -11.16 -21.982 -10.754 QT
-22.341 -10.348 -22.888 -10.254 QT
cp
f
GR
GS
[0 -0.75 0.75 0 56.30693 82.99995] CT
0.149 GC
N
-8.144 -3.004 M
-8.378 -3.004 -8.378 -3.238 QT
-8.378 -3.348 -8.316 -3.395 QT
-3.878 -7.738 -3.878 -16.004 QT
-3.878 -24.27 -8.269 -28.567 QT
-8.378 -28.629 -8.378 -28.77 QT
-8.378 -28.863 -8.308 -28.934 QT
-8.238 -29.004 -8.144 -29.004 QT
-7.894 -29.004 L
-7.831 -29.004 -7.769 -28.957 QT
-5.909 -27.488 -4.667 -25.379 QT
-3.425 -23.27 -2.847 -20.879 QT
-2.269 -18.488 -2.269 -16.004 QT
-2.269 -14.16 -2.581 -12.379 QT
-2.894 -10.598 -3.566 -8.863 QT
-4.238 -7.129 -5.284 -5.66 QT
-6.331 -4.192 -7.769 -3.051 QT
-7.831 -3.004 -7.894 -3.004 QT
-8.144 -3.004 L
cp
f
GR
GS
[0 -0.75 0.75 0 56.30693 82.99995] CT
0.149 GC
N
12.314 -3.004 M
12.314 -29.004 L
15.86 -29.004 L
15.86 -27.957 L
13.345 -27.957 L
13.345 -4.051 L
15.86 -4.051 L
15.86 -3.004 L
12.314 -3.004 L
cp
f
GR
GS
[0 -0.75 0.75 0 56.30693 82.99995] CT
0.149 GC
N
17.35 -9.504 M
17.35 -10.426 L
18.225 -10.426 18.803 -10.559 QT
19.381 -10.692 19.381 -11.238 QT
19.381 -18.348 L
19.381 -19.035 19.17 -19.348 QT
18.959 -19.66 18.561 -19.731 QT
18.163 -19.801 17.35 -19.801 QT
17.35 -20.707 L
21.116 -20.988 L
21.116 -18.457 L
21.631 -19.567 22.655 -20.278 QT
23.678 -20.988 24.881 -20.988 QT
27.881 -20.988 28.397 -18.551 QT
28.928 -19.645 29.928 -20.317 QT
30.928 -20.988 32.116 -20.988 QT
33.303 -20.988 34.108 -20.613 QT
34.913 -20.238 35.319 -19.457 QT
35.725 -18.676 35.725 -17.488 QT
35.725 -11.238 L
35.725 -10.692 36.303 -10.559 QT
36.881 -10.426 37.756 -10.426 QT
37.756 -9.504 L
31.803 -9.504 L
31.803 -10.426 L
32.694 -10.426 33.264 -10.559 QT
33.834 -10.692 33.834 -11.238 QT
33.834 -17.41 L
33.834 -18.723 33.467 -19.52 QT
33.1 -20.317 31.959 -20.317 QT
30.459 -20.317 29.483 -19.113 QT
28.506 -17.91 28.506 -16.379 QT
28.506 -11.238 L
28.506 -10.692 29.077 -10.559 QT
29.647 -10.426 30.538 -10.426 QT
30.538 -9.504 L
24.584 -9.504 L
24.584 -10.426 L
25.475 -10.426 26.045 -10.559 QT
26.616 -10.692 26.616 -11.238 QT
26.616 -17.41 L
26.616 -18.676 26.248 -19.496 QT
25.881 -20.317 24.725 -20.317 QT
23.225 -20.317 22.248 -19.113 QT
21.272 -17.91 21.272 -16.379 QT
21.272 -11.238 L
21.272 -10.692 21.85 -10.559 QT
22.428 -10.426 23.303 -10.426 QT
23.303 -9.504 L
17.35 -9.504 L
cp
f
GR
GS
[0 -0.75 0.75 0 56.30693 82.99995] CT
0.149 GC
N
39.147 -3.004 M
39.147 -4.051 L
41.663 -4.051 L
41.663 -27.957 L
39.147 -27.957 L
39.147 -29.004 L
42.709 -29.004 L
42.709 -3.004 L
39.147 -3.004 L
cp
f
GR
GS
[0.75 0 0 0.75 0 -0.25] CT
1 LJ
1.333 LW
N
131.42 89.381 M
138.84 99.723 L
146.26 105.109 L
153.68 103.779 L
161.1 88.413 L
168.52 88.277 L
175.94 87.163 L
183.36 91.438 L
190.78 96.214 L
198.2 104.855 L
205.62 107.457 L
213.04 92.541 L
220.46 86.392 L
227.88 109.701 L
235.3 133.314 L
242.72 141.112 L
250.14 148.759 L
257.56 87.754 L
264.98 91.011 L
272.4 100.974 L
279.82 125.584 L
287.24 85.72 L
294.66 87.339 L
302.08 87.863 L
309.5 89.761 L
316.92 86.873 L
324.34 87.2 L
331.76 110.221 L
339.18 99.452 L
346.6 105.558 L
354.02 95.865 L
361.44 89.831 L
368.86 91.169 L
376.28 80.848 L
383.7 85.371 L
391.12 106.005 L
398.54 122.37 L
405.96 130.497 L
413.38 156.835 L
420.8 88.365 L
428.22 90.849 L
435.64 89 L
443.06 89 L
450.48 89.975 L
457.9 101.957 L
465.32 90.722 L
472.74 82.315 L
480.16 88.939 L
487.58 90.902 L
495 84.416 L
502.42 91.27 L
509.84 90.253 L
517.26 88.977 L
524.68 88.815 L
532.1 90.099 L
539.52 88.677 L
546.94 86.185 L
554.36 122.197 L
561.78 140.844 L
569.2 85.861 L
576.62 86.554 L
584.04 92.479 L
591.46 86.39 L
598.88 87.299 L
606.3 88.844 L
613.72 101.925 L
621.14 116.911 L
628.56 90.287 L
635.98 93.58 L
643.4 91.024 L
650.82 87.634 L
658.24 92.818 L
665.66 103.451 L
673.08 81.826 L
680.5 71.175 L
687.92 89.721 L
695.34 88.989 L
702.76 104.22 L
710.18 124.159 L
717.6 89.329 L
725.02 88.249 L
732.44 84.2 L
739.86 88.949 L
747.28 87.118 L
754.7 90.533 L
762.12 90.812 L
769.54 92.706 L
776.96 85.519 L
784.38 89.653 L
791.8 107.756 L
799.22 103.817 L
806.64 91.672 L
814.06 88.717 L
821.48 87.607 L
828.9 87.753 L
836.32 68.642 L
843.74 97.311 L
851.16 87.684 L
858.58 91.702 L
866 92.867 L
S
GR
GS
[0.75 0 0 0.75 0 -0.25] CT
[10 6] 0 setdash
2 LJ
0.667 LW
N
124 67 M
866 67 L
S
GR
GS
[0.75 0 0 0.75 0 -0.25] CT
[10 6] 0 setdash
2 LJ
0.667 LW
N
124 111 M
866 111 L
S
GR
GS
[0.75 0 0 0.75 104.13 66.5] CT
0 0.447 0.741 RC
N
2.667 0 M
2.667 -1.473 1.473 -2.667 0 -2.667 C
-1.473 -2.667 -2.667 -1.473 -2.667 0 C
-2.667 1.473 -1.473 2.667 0 2.667 C
1.473 2.667 2.667 1.473 2.667 0 C
cp
f
GR
GS
[0.75 0 0 0.75 104.13 66.5] CT
0 0.447 0.741 RC
10.0 ML
N
2.667 0 M
2.667 -1.473 1.473 -2.667 0 -2.667 C
-1.473 -2.667 -2.667 -1.473 -2.667 0 C
-2.667 1.473 -1.473 2.667 0 2.667 C
1.473 2.667 2.667 1.473 2.667 0 C
cp
S
GR
GS
[0.75 0 0 0.75 109.695 66.5] CT
0 0.447 0.741 RC
N
/f1921431499{2.667 0 M
2.667 -1.473 1.473 -2.667 0 -2.667 C
-1.473 -2.667 -2.667 -1.473 -2.667 0 C
-2.667 1.473 -1.473 2.667 0 2.667 C
1.473 2.667 2.667 1.473 2.667 0 C
cp}def
f1921431499
f
GR
GS
[0.75 0 0 0.75 109.695 66.5] CT
0 0.447 0.741 RC
10.0 ML
N
2.667 0 M
2.667 -1.473 1.473 -2.667 0 -2.667 C
-1.473 -2.667 -2.667 -1.473 -2.667 0 C
-2.667 1.473 -1.473 2.667 0 2.667 C
1.473 2.667 2.667 1.473 2.667 0 C
cp
S
GR
GS
[0.75 0 0 0.75 115.25999 66.5] CT
0 0.447 0.741 RC
N
f1921431499
f
GR
GS
[0.75 0 0 0.75 115.25999 66.5] CT
0 0.447 0.741 RC
10.0 ML
N
2.667 0 M
2.667 -1.473 1.473 -2.667 0 -2.667 C
-1.473 -2.667 -2.667 -1.473 -2.667 0 C
-2.667 1.473 -1.473 2.667 0 2.667 C
1.473 2.667 2.667 1.473 2.667 0 C
cp
S
GR
GS
[0.75 0 0 0.75 120.825 66.5] CT
0 0.447 0.741 RC
N
f1921431499
f
GR
GS
[0.75 0 0 0.75 120.825 66.5] CT
0 0.447 0.741 RC
10.0 ML
N
2.667 0 M
2.667 -1.473 1.473 -2.667 0 -2.667 C
-1.473 -2.667 -2.667 -1.473 -2.667 0 C
-2.667 1.473 -1.473 2.667 0 2.667 C
1.473 2.667 2.667 1.473 2.667 0 C
cp
S
GR
GS
[0.75 0 0 0.75 148.65 66.5] CT
0 0.447 0.741 RC
N
f1921431499
f
GR
GS
[0.75 0 0 0.75 148.65 66.5] CT
0 0.447 0.741 RC
10.0 ML
N
2.667 0 M
2.667 -1.473 1.473 -2.667 0 -2.667 C
-1.473 -2.667 -2.667 -1.473 -2.667 0 C
-2.667 1.473 -1.473 2.667 0 2.667 C
1.473 2.667 2.667 1.473 2.667 0 C
cp
S
GR
GS
[0.75 0 0 0.75 154.215 66.5] CT
0 0.447 0.741 RC
N
f1921431499
f
GR
GS
[0.75 0 0 0.75 154.215 66.5] CT
0 0.447 0.741 RC
10.0 ML
N
2.667 0 M
2.667 -1.473 1.473 -2.667 0 -2.667 C
-1.473 -2.667 -2.667 -1.473 -2.667 0 C
-2.667 1.473 -1.473 2.667 0 2.667 C
1.473 2.667 2.667 1.473 2.667 0 C
cp
S
GR
GS
[0.75 0 0 0.75 170.91 66.5] CT
0 0.447 0.741 RC
N
f1921431499
f
GR
GS
[0.75 0 0 0.75 170.91 66.5] CT
0 0.447 0.741 RC
10.0 ML
N
2.667 0 M
2.667 -1.473 1.473 -2.667 0 -2.667 C
-1.473 -2.667 -2.667 -1.473 -2.667 0 C
-2.667 1.473 -1.473 2.667 0 2.667 C
1.473 2.667 2.667 1.473 2.667 0 C
cp
S
GR
GS
[0.75 0 0 0.75 176.475 66.5] CT
0 0.447 0.741 RC
N
f1921431499
f
GR
GS
[0.75 0 0 0.75 176.475 66.5] CT
0 0.447 0.741 RC
10.0 ML
N
2.667 0 M
2.667 -1.473 1.473 -2.667 0 -2.667 C
-1.473 -2.667 -2.667 -1.473 -2.667 0 C
-2.667 1.473 -1.473 2.667 0 2.667 C
1.473 2.667 2.667 1.473 2.667 0 C
cp
S
GR
GS
[0.75 0 0 0.75 182.04 66.5] CT
0 0.447 0.741 RC
N
f1921431499
f
GR
GS
[0.75 0 0 0.75 182.04 66.5] CT
0 0.447 0.741 RC
10.0 ML
N
2.667 0 M
2.667 -1.473 1.473 -2.667 0 -2.667 C
-1.473 -2.667 -2.667 -1.473 -2.667 0 C
-2.667 1.473 -1.473 2.667 0 2.667 C
1.473 2.667 2.667 1.473 2.667 0 C
cp
S
GR
GS
[0.75 0 0 0.75 187.605 66.5] CT
0 0.447 0.741 RC
N
f1921431499
f
GR
GS
[0.75 0 0 0.75 187.605 66.5] CT
0 0.447 0.741 RC
10.0 ML
N
2.667 0 M
2.667 -1.473 1.473 -2.667 0 -2.667 C
-1.473 -2.667 -2.667 -1.473 -2.667 0 C
-2.667 1.473 -1.473 2.667 0 2.667 C
1.473 2.667 2.667 1.473 2.667 0 C
cp
S
GR
GS
[0.75 0 0 0.75 204.3 66.5] CT
0 0.447 0.741 RC
N
f1921431499
f
GR
GS
[0.75 0 0 0.75 204.3 66.5] CT
0 0.447 0.741 RC
10.0 ML
N
2.667 0 M
2.667 -1.473 1.473 -2.667 0 -2.667 C
-1.473 -2.667 -2.667 -1.473 -2.667 0 C
-2.667 1.473 -1.473 2.667 0 2.667 C
1.473 2.667 2.667 1.473 2.667 0 C
cp
S
GR
GS
[0.75 0 0 0.75 209.86501 66.5] CT
0 0.447 0.741 RC
N
f1921431499
f
GR
GS
[0.75 0 0 0.75 209.86501 66.5] CT
0 0.447 0.741 RC
10.0 ML
N
2.667 0 M
2.667 -1.473 1.473 -2.667 0 -2.667 C
-1.473 -2.667 -2.667 -1.473 -2.667 0 C
-2.667 1.473 -1.473 2.667 0 2.667 C
1.473 2.667 2.667 1.473 2.667 0 C
cp
S
GR
GS
[0.75 0 0 0.75 248.82001 66.5] CT
0 0.447 0.741 RC
N
f1921431499
f
GR
GS
[0.75 0 0 0.75 248.82001 66.5] CT
0 0.447 0.741 RC
10.0 ML
N
2.667 0 M
2.667 -1.473 1.473 -2.667 0 -2.667 C
-1.473 -2.667 -2.667 -1.473 -2.667 0 C
-2.667 1.473 -1.473 2.667 0 2.667 C
1.473 2.667 2.667 1.473 2.667 0 C
cp
S
GR
GS
[0.75 0 0 0.75 254.38499 66.5] CT
0 0.447 0.741 RC
N
f1921431499
f
GR
GS
[0.75 0 0 0.75 254.38499 66.5] CT
0 0.447 0.741 RC
10.0 ML
N
2.667 0 M
2.667 -1.473 1.473 -2.667 0 -2.667 C
-1.473 -2.667 -2.667 -1.473 -2.667 0 C
-2.667 1.473 -1.473 2.667 0 2.667 C
1.473 2.667 2.667 1.473 2.667 0 C
cp
S
GR
GS
[0.75 0 0 0.75 259.95 66.5] CT
0 0.447 0.741 RC
N
f1921431499
f
GR
GS
[0.75 0 0 0.75 259.95 66.5] CT
0 0.447 0.741 RC
10.0 ML
N
2.667 0 M
2.667 -1.473 1.473 -2.667 0 -2.667 C
-1.473 -2.667 -2.667 -1.473 -2.667 0 C
-2.667 1.473 -1.473 2.667 0 2.667 C
1.473 2.667 2.667 1.473 2.667 0 C
cp
S
GR
GS
[0.75 0 0 0.75 265.51499 66.5] CT
0 0.447 0.741 RC
N
f1921431499
f
GR
GS
[0.75 0 0 0.75 265.51499 66.5] CT
0 0.447 0.741 RC
10.0 ML
N
2.667 0 M
2.667 -1.473 1.473 -2.667 0 -2.667 C
-1.473 -2.667 -2.667 -1.473 -2.667 0 C
-2.667 1.473 -1.473 2.667 0 2.667 C
1.473 2.667 2.667 1.473 2.667 0 C
cp
S
GR
GS
[0.75 0 0 0.75 293.34 66.5] CT
0 0.447 0.741 RC
N
f1921431499
f
GR
GS
[0.75 0 0 0.75 293.34 66.5] CT
0 0.447 0.741 RC
10.0 ML
N
2.667 0 M
2.667 -1.473 1.473 -2.667 0 -2.667 C
-1.473 -2.667 -2.667 -1.473 -2.667 0 C
-2.667 1.473 -1.473 2.667 0 2.667 C
1.473 2.667 2.667 1.473 2.667 0 C
cp
S
GR
GS
[0.75 0 0 0.75 298.90501 66.5] CT
0 0.447 0.741 RC
N
f1921431499
f
GR
GS
[0.75 0 0 0.75 298.90501 66.5] CT
0 0.447 0.741 RC
10.0 ML
N
2.667 0 M
2.667 -1.473 1.473 -2.667 0 -2.667 C
-1.473 -2.667 -2.667 -1.473 -2.667 0 C
-2.667 1.473 -1.473 2.667 0 2.667 C
1.473 2.667 2.667 1.473 2.667 0 C
cp
S
GR
GS
[0.75 0 0 0.75 304.46999 66.5] CT
0 0.447 0.741 RC
N
f1921431499
f
GR
GS
[0.75 0 0 0.75 304.46999 66.5] CT
0 0.447 0.741 RC
10.0 ML
N
2.667 0 M
2.667 -1.473 1.473 -2.667 0 -2.667 C
-1.473 -2.667 -2.667 -1.473 -2.667 0 C
-2.667 1.473 -1.473 2.667 0 2.667 C
1.473 2.667 2.667 1.473 2.667 0 C
cp
S
GR
GS
[0.75 0 0 0.75 310.035 66.5] CT
0 0.447 0.741 RC
N
f1921431499
f
GR
GS
[0.75 0 0 0.75 310.035 66.5] CT
0 0.447 0.741 RC
10.0 ML
N
2.667 0 M
2.667 -1.473 1.473 -2.667 0 -2.667 C
-1.473 -2.667 -2.667 -1.473 -2.667 0 C
-2.667 1.473 -1.473 2.667 0 2.667 C
1.473 2.667 2.667 1.473 2.667 0 C
cp
S
GR
GS
[0.75 0 0 0.75 348.99001 66.5] CT
0 0.447 0.741 RC
N
f1921431499
f
GR
GS
[0.75 0 0 0.75 348.99001 66.5] CT
0 0.447 0.741 RC
10.0 ML
N
2.667 0 M
2.667 -1.473 1.473 -2.667 0 -2.667 C
-1.473 -2.667 -2.667 -1.473 -2.667 0 C
-2.667 1.473 -1.473 2.667 0 2.667 C
1.473 2.667 2.667 1.473 2.667 0 C
cp
S
GR
GS
[0.75 0 0 0.75 354.55499 66.5] CT
0 0.447 0.741 RC
N
f1921431499
f
GR
GS
[0.75 0 0 0.75 354.55499 66.5] CT
0 0.447 0.741 RC
10.0 ML
N
2.667 0 M
2.667 -1.473 1.473 -2.667 0 -2.667 C
-1.473 -2.667 -2.667 -1.473 -2.667 0 C
-2.667 1.473 -1.473 2.667 0 2.667 C
1.473 2.667 2.667 1.473 2.667 0 C
cp
S
GR
GS
[0.75 0 0 0.75 415.76999 66.5] CT
0 0.447 0.741 RC
N
f1921431499
f
GR
GS
[0.75 0 0 0.75 415.76999 66.5] CT
0 0.447 0.741 RC
10.0 ML
N
2.667 0 M
2.667 -1.473 1.473 -2.667 0 -2.667 C
-1.473 -2.667 -2.667 -1.473 -2.667 0 C
-2.667 1.473 -1.473 2.667 0 2.667 C
1.473 2.667 2.667 1.473 2.667 0 C
cp
S
GR
GS
[0.75 0 0 0.75 421.33502 66.5] CT
0 0.447 0.741 RC
N
f1921431499
f
GR
GS
[0.75 0 0 0.75 421.33502 66.5] CT
0 0.447 0.741 RC
10.0 ML
N
2.667 0 M
2.667 -1.473 1.473 -2.667 0 -2.667 C
-1.473 -2.667 -2.667 -1.473 -2.667 0 C
-2.667 1.473 -1.473 2.667 0 2.667 C
1.473 2.667 2.667 1.473 2.667 0 C
cp
S
GR
GS
[0.75 0 0 0.75 460.28998 66.5] CT
0 0.447 0.741 RC
N
f1921431499
f
GR
GS
[0.75 0 0 0.75 460.28998 66.5] CT
0 0.447 0.741 RC
10.0 ML
N
2.667 0 M
2.667 -1.473 1.473 -2.667 0 -2.667 C
-1.473 -2.667 -2.667 -1.473 -2.667 0 C
-2.667 1.473 -1.473 2.667 0 2.667 C
1.473 2.667 2.667 1.473 2.667 0 C
cp
S
GR
GS
[0.75 0 0 0.75 465.85501 66.5] CT
0 0.447 0.741 RC
N
f1921431499
f
GR
GS
[0.75 0 0 0.75 465.85501 66.5] CT
0 0.447 0.741 RC
10.0 ML
N
2.667 0 M
2.667 -1.473 1.473 -2.667 0 -2.667 C
-1.473 -2.667 -2.667 -1.473 -2.667 0 C
-2.667 1.473 -1.473 2.667 0 2.667 C
1.473 2.667 2.667 1.473 2.667 0 C
cp
S
GR
GS
[0.75 0 0 0.75 493.67999 66.5] CT
0 0.447 0.741 RC
N
f1921431499
f
GR
GS
[0.75 0 0 0.75 493.67999 66.5] CT
0 0.447 0.741 RC
10.0 ML
N
2.667 0 M
2.667 -1.473 1.473 -2.667 0 -2.667 C
-1.473 -2.667 -2.667 -1.473 -2.667 0 C
-2.667 1.473 -1.473 2.667 0 2.667 C
1.473 2.667 2.667 1.473 2.667 0 C
cp
S
GR
GS
[0.75 0 0 0.75 499.24498 66.5] CT
0 0.447 0.741 RC
N
f1921431499
f
GR
GS
[0.75 0 0 0.75 499.24498 66.5] CT
0 0.447 0.741 RC
10.0 ML
N
2.667 0 M
2.667 -1.473 1.473 -2.667 0 -2.667 C
-1.473 -2.667 -2.667 -1.473 -2.667 0 C
-2.667 1.473 -1.473 2.667 0 2.667 C
1.473 2.667 2.667 1.473 2.667 0 C
cp
S
GR
GS
[0.75 0 0 0.75 504.81001 66.5] CT
0 0.447 0.741 RC
N
f1921431499
f
GR
GS
[0.75 0 0 0.75 504.81001 66.5] CT
0 0.447 0.741 RC
10.0 ML
N
2.667 0 M
2.667 -1.473 1.473 -2.667 0 -2.667 C
-1.473 -2.667 -2.667 -1.473 -2.667 0 C
-2.667 1.473 -1.473 2.667 0 2.667 C
1.473 2.667 2.667 1.473 2.667 0 C
cp
S
GR
GS
[0.75 0 0 0.75 510.375 66.5] CT
0 0.447 0.741 RC
N
f1921431499
f
GR
GS
[0.75 0 0 0.75 510.375 66.5] CT
0 0.447 0.741 RC
10.0 ML
N
2.667 0 M
2.667 -1.473 1.473 -2.667 0 -2.667 C
-1.473 -2.667 -2.667 -1.473 -2.667 0 C
-2.667 1.473 -1.473 2.667 0 2.667 C
1.473 2.667 2.667 1.473 2.667 0 C
cp
S
GR
GS
[0.75 0 0 0.75 527.07001 66.5] CT
0 0.447 0.741 RC
N
f1921431499
f
GR
GS
[0.75 0 0 0.75 527.07001 66.5] CT
0 0.447 0.741 RC
10.0 ML
N
2.667 0 M
2.667 -1.473 1.473 -2.667 0 -2.667 C
-1.473 -2.667 -2.667 -1.473 -2.667 0 C
-2.667 1.473 -1.473 2.667 0 2.667 C
1.473 2.667 2.667 1.473 2.667 0 C
cp
S
GR
GS
[0.75 0 0 0.75 532.63499 66.5] CT
0 0.447 0.741 RC
N
f1921431499
f
GR
GS
[0.75 0 0 0.75 532.63499 66.5] CT
0 0.447 0.741 RC
10.0 ML
N
2.667 0 M
2.667 -1.473 1.473 -2.667 0 -2.667 C
-1.473 -2.667 -2.667 -1.473 -2.667 0 C
-2.667 1.473 -1.473 2.667 0 2.667 C
1.473 2.667 2.667 1.473 2.667 0 C
cp
S
GR
GS
[0.75 0 0 0.75 593.84999 66.5] CT
0 0.447 0.741 RC
N
f1921431499
f
GR
GS
[0.75 0 0 0.75 593.84999 66.5] CT
0 0.447 0.741 RC
10.0 ML
N
2.667 0 M
2.667 -1.473 1.473 -2.667 0 -2.667 C
-1.473 -2.667 -2.667 -1.473 -2.667 0 C
-2.667 1.473 -1.473 2.667 0 2.667 C
1.473 2.667 2.667 1.473 2.667 0 C
cp
S
GR
GS
[0.75 0 0 0.75 599.41498 66.5] CT
0 0.447 0.741 RC
N
f1921431499
f
GR
GS
[0.75 0 0 0.75 599.41498 66.5] CT
0 0.447 0.741 RC
10.0 ML
N
2.667 0 M
2.667 -1.473 1.473 -2.667 0 -2.667 C
-1.473 -2.667 -2.667 -1.473 -2.667 0 C
-2.667 1.473 -1.473 2.667 0 2.667 C
1.473 2.667 2.667 1.473 2.667 0 C
cp
S
GR
GS
[0.75 0 0 0.75 649.5 66.5] CT
0 0.447 0.741 RC
N
f1921431499
f
GR
GS
[0.75 0 0 0.75 649.5 66.5] CT
0 0.447 0.741 RC
10.0 ML
N
2.667 0 M
2.667 -1.473 1.473 -2.667 0 -2.667 C
-1.473 -2.667 -2.667 -1.473 -2.667 0 C
-2.667 1.473 -1.473 2.667 0 2.667 C
1.473 2.667 2.667 1.473 2.667 0 C
cp
S
GR
GS
[0.75 0 0 0.75 0 -0.25] CT
1 GC
N
/f1557898586{124 353 M
866 353 L
866 218 L
124 218 L
cp}def
f1557898586
f
GR
GS
[0.75 0 0 0.75 0 -0.25] CT
0.873 GC
1 LJ
0.667 LW
N
124 353 M
124 218 L
S
GR
GS
[0.75 0 0 0.75 0 -0.25] CT
0.873 GC
1 LJ
0.667 LW
N
272.4 353 M
272.4 218 L
S
GR
GS
[0.75 0 0 0.75 0 -0.25] CT
0.873 GC
1 LJ
0.667 LW
N
420.8 353 M
420.8 218 L
S
GR
GS
[0.75 0 0 0.75 0 -0.25] CT
0.873 GC
1 LJ
0.667 LW
N
569.2 353 M
569.2 218 L
S
GR
GS
[0.75 0 0 0.75 0 -0.25] CT
0.873 GC
1 LJ
0.667 LW
N
717.6 353 M
717.6 218 L
S
GR
GS
[0.75 0 0 0.75 0 -0.25] CT
0.873 GC
1 LJ
0.667 LW
N
866 353 M
866 218 L
S
GR
GS
[0.75 0 0 0.75 0 -0.25] CT
0.873 GC
1 LJ
0.667 LW
N
866 353 M
124 353 L
S
GR
GS
[0.75 0 0 0.75 0 -0.25] CT
0.873 GC
1 LJ
0.667 LW
N
866 299 M
124 299 L
S
GR
GS
[0.75 0 0 0.75 0 -0.25] CT
0.873 GC
1 LJ
0.667 LW
N
866 245 M
124 245 L
S
GR
GS
[0.75 0 0 0.75 0 -0.25] CT
0.149 GC
2 setlinecap
1 LJ
0.667 LW
N
124 353 M
866 353 L
S
GR
GS
[0.75 0 0 0.75 0 -0.25] CT
0.149 GC
2 setlinecap
1 LJ
0.667 LW
N
124 218 M
866 218 L
S
GR
GS
[0.75 0 0 0.75 0 -0.25] CT
0.149 GC
2 setlinecap
1 LJ
0.667 LW
N
124 353 M
124 345.58 L
S
GR
GS
[0.75 0 0 0.75 0 -0.25] CT
0.149 GC
2 setlinecap
1 LJ
0.667 LW
N
272.4 353 M
272.4 345.58 L
S
GR
GS
[0.75 0 0 0.75 0 -0.25] CT
0.149 GC
2 setlinecap
1 LJ
0.667 LW
N
420.8 353 M
420.8 345.58 L
S
GR
GS
[0.75 0 0 0.75 0 -0.25] CT
0.149 GC
2 setlinecap
1 LJ
0.667 LW
N
569.2 353 M
569.2 345.58 L
S
GR
GS
[0.75 0 0 0.75 0 -0.25] CT
0.149 GC
2 setlinecap
1 LJ
0.667 LW
N
717.6 353 M
717.6 345.58 L
S
GR
GS
[0.75 0 0 0.75 0 -0.25] CT
0.149 GC
2 setlinecap
1 LJ
0.667 LW
N
866 353 M
866 345.58 L
S
GR
GS
[0.75 0 0 0.75 0 -0.25] CT
0.149 GC
2 setlinecap
1 LJ
0.667 LW
N
124 218 M
124 225.42 L
S
GR
GS
[0.75 0 0 0.75 0 -0.25] CT
0.149 GC
2 setlinecap
1 LJ
0.667 LW
N
272.4 218 M
272.4 225.42 L
S
GR
GS
[0.75 0 0 0.75 0 -0.25] CT
0.149 GC
2 setlinecap
1 LJ
0.667 LW
N
420.8 218 M
420.8 225.42 L
S
GR
GS
[0.75 0 0 0.75 0 -0.25] CT
0.149 GC
2 setlinecap
1 LJ
0.667 LW
N
569.2 218 M
569.2 225.42 L
S
GR
GS
[0.75 0 0 0.75 0 -0.25] CT
0.149 GC
2 setlinecap
1 LJ
0.667 LW
N
717.6 218 M
717.6 225.42 L
S
GR
GS
[0.75 0 0 0.75 0 -0.25] CT
0.149 GC
2 setlinecap
1 LJ
0.667 LW
N
866 218 M
866 225.42 L
S
GR
GS
[0.75 0 0 0.75 93 270.10001] CT
0.149 GC
/Helvetica 24 F
GS
[1 0 0 1 0 0] CT
-7 25 moveto 
1 -1 scale
(0) t 
GR
GR
GS
[0.75 0 0 0.75 204.3 270.10001] CT
0.149 GC
/Helvetica 24 F
GS
[1 0 0 1 0 0] CT
-13.5 25 moveto 
1 -1 scale
(20) t 
GR
GR
GS
[0.75 0 0 0.75 315.59999 270.10001] CT
0.149 GC
/Helvetica 24 F
GS
[1 0 0 1 0 0] CT
-13.5 25 moveto 
1 -1 scale
(40) t 
GR
GR
GS
[0.75 0 0 0.75 426.90001 270.10001] CT
0.149 GC
/Helvetica 24 F
GS
[1 0 0 1 0 0] CT
-13.5 25 moveto 
1 -1 scale
(60) t 
GR
GR
GS
[0.75 0 0 0.75 538.19998 270.10001] CT
0.149 GC
/Helvetica 24 F
GS
[1 0 0 1 0 0] CT
-13.5 25 moveto 
1 -1 scale
(80) t 
GR
GR
GS
[0.75 0 0 0.75 649.5 270.10001] CT
0.149 GC
/Helvetica 24 F
GS
[1 0 0 1 0 0] CT
-20.5 25 moveto 
1 -1 scale
(100) t 
GR
GR
GS
[0.75 0 0 0.75 0 -0.25] CT
0.149 GC
2 setlinecap
1 LJ
0.667 LW
N
124 353 M
124 218 L
S
GR
GS
[0.75 0 0 0.75 0 -0.25] CT
0.149 GC
2 setlinecap
1 LJ
0.667 LW
N
866 353 M
866 218 L
S
GR
GS
[0.75 0 0 0.75 0 -0.25] CT
0.149 GC
2 setlinecap
1 LJ
0.667 LW
N
124 353 M
131.42 353 L
S
GR
GS
[0.75 0 0 0.75 0 -0.25] CT
0.149 GC
2 setlinecap
1 LJ
0.667 LW
N
124 299 M
131.42 299 L
S
GR
GS
[0.75 0 0 0.75 0 -0.25] CT
0.149 GC
2 setlinecap
1 LJ
0.667 LW
N
124 245 M
131.42 245 L
S
GR
GS
[0.75 0 0 0.75 0 -0.25] CT
0.149 GC
2 setlinecap
1 LJ
0.667 LW
N
866 353 M
858.58 353 L
S
GR
GS
[0.75 0 0 0.75 0 -0.25] CT
0.149 GC
2 setlinecap
1 LJ
0.667 LW
N
866 299 M
858.58 299 L
S
GR
GS
[0.75 0 0 0.75 0 -0.25] CT
0.149 GC
2 setlinecap
1 LJ
0.667 LW
N
866 245 M
858.58 245 L
S
GR
GS
[0.75 0 0 0.75 87.4 264.5] CT
0.149 GC
/Helvetica 24 F
GS
[1 0 0 1 0 0] CT
-35 9.5 moveto 
1 -1 scale
(-20) t 
GR
GR
GS
[0.75 0 0 0.75 87.4 224] CT
0.149 GC
/Helvetica 24 F
GS
[1 0 0 1 0 0] CT
-14 9.5 moveto 
1 -1 scale
(0) t 
GR
GR
GS
[0.75 0 0 0.75 87.4 183.5] CT
0.149 GC
/Helvetica 24 F
GS
[1 0 0 1 0 0] CT
-27 9.5 moveto 
1 -1 scale
(20) t 
GR
GR
GS
[0 -0.75 0.75 0 56.30693 213.87495] CT
0.149 GC
N
-42.1 -13.176 M
-42.1 -12.301 -41.788 -11.551 QT
-41.475 -10.801 -40.835 -10.348 QT
-40.194 -9.895 -39.319 -9.895 QT
-38.741 -9.895 -38.077 -10.153 QT
-37.413 -10.41 -36.85 -10.715 QT
-36.288 -11.02 -36.272 -11.02 QT
-36.131 -11.02 -36.053 -10.856 QT
-35.975 -10.692 -35.975 -10.551 QT
-35.975 -10.41 -36.053 -10.363 QT
-37.678 -9.207 -39.35 -9.207 QT
-40.725 -9.207 -41.827 -9.848 QT
-42.928 -10.488 -43.53 -11.637 QT
-44.131 -12.785 -44.131 -14.145 QT
-44.131 -15.488 -43.585 -16.699 QT
-43.038 -17.91 -42.077 -18.809 QT
-41.116 -19.707 -39.897 -20.207 QT
-38.678 -20.707 -37.35 -20.707 QT
-35.866 -20.707 L
-35.475 -20.707 -35.475 -20.317 QT
-35.475 -20.098 -35.624 -19.949 QT
-35.772 -19.801 -35.975 -19.801 QT
-37.397 -19.801 L
-38.428 -19.801 -39.272 -19.34 QT
-40.116 -18.879 -40.694 -18.067 QT
-41.272 -17.254 -41.585 -16.238 QT
-36.991 -16.238 L
-36.803 -16.238 -36.702 -16.129 QT
-36.6 -16.02 -36.6 -15.848 QT
-36.6 -15.629 -36.733 -15.481 QT
-36.866 -15.332 -37.085 -15.332 QT
-41.819 -15.332 L
-42.1 -13.988 -42.1 -13.176 QT
cp
f
GR
GS
[0 -0.75 0.75 0 56.30693 213.87495] CT
0.149 GC
N
-26.525 -3.051 M
-27.978 -4.192 -29.025 -5.676 QT
-30.072 -7.16 -30.736 -8.832 QT
-31.4 -10.504 -31.728 -12.332 QT
-32.056 -14.16 -32.056 -16.004 QT
-32.056 -17.863 -31.728 -19.692 QT
-31.4 -21.52 -30.72 -23.215 QT
-30.041 -24.91 -28.986 -26.379 QT
-27.931 -27.848 -26.525 -28.957 QT
-26.525 -29.004 -26.4 -29.004 QT
-26.15 -29.004 L
-26.087 -29.004 -26.017 -28.934 QT
-25.947 -28.863 -25.947 -28.77 QT
-25.947 -28.66 -26.009 -28.613 QT
-27.275 -27.363 -28.119 -25.942 QT
-28.962 -24.52 -29.478 -22.918 QT
-29.994 -21.317 -30.22 -19.59 QT
-30.447 -17.863 -30.447 -16.004 QT
-30.447 -7.738 -26.025 -3.442 QT
-25.947 -3.379 -25.947 -3.238 QT
-25.947 -3.176 -26.017 -3.09 QT
-26.087 -3.004 -26.15 -3.004 QT
-26.4 -3.004 L
-26.525 -3.004 -26.525 -3.051 QT
cp
f
GR
GS
[0 -0.75 0.75 0 56.30693 213.87495] CT
0.149 GC
N
-22.133 -5.785 M
-21.586 -4.848 -20.227 -4.848 QT
-19.008 -4.848 -18.102 -5.707 QT
-17.196 -6.567 -16.641 -7.793 QT
-16.086 -9.02 -15.789 -10.301 QT
-16.946 -9.207 -18.289 -9.207 QT
-19.321 -9.207 -20.039 -9.567 QT
-20.758 -9.926 -21.164 -10.629 QT
-21.571 -11.332 -21.571 -12.332 QT
-21.571 -13.192 -21.336 -14.082 QT
-21.102 -14.973 -20.696 -16.074 QT
-20.289 -17.176 -19.977 -17.988 QT
-19.633 -18.942 -19.633 -19.551 QT
-19.633 -20.317 -20.211 -20.317 QT
-21.243 -20.317 -21.907 -19.262 QT
-22.571 -18.207 -22.883 -16.895 QT
-22.93 -16.723 -23.102 -16.723 QT
-23.399 -16.723 L
-23.618 -16.723 -23.618 -16.973 QT
-23.618 -17.051 L
-23.196 -18.598 -22.336 -19.793 QT
-21.477 -20.988 -20.149 -20.988 QT
-19.227 -20.988 -18.586 -20.379 QT
-17.946 -19.77 -17.946 -18.832 QT
-17.946 -18.348 -18.164 -17.817 QT
-18.274 -17.504 -18.68 -16.434 QT
-19.086 -15.363 -19.305 -14.668 QT
-19.524 -13.973 -19.664 -13.301 QT
-19.805 -12.629 -19.805 -11.957 QT
-19.805 -11.098 -19.438 -10.496 QT
-19.071 -9.895 -18.258 -9.895 QT
-16.649 -9.895 -15.368 -11.863 QT
-13.399 -19.879 L
-13.321 -20.223 -13 -20.465 QT
-12.68 -20.707 -12.305 -20.707 QT
-11.993 -20.707 -11.758 -20.504 QT
-11.524 -20.301 -11.524 -19.973 QT
-11.524 -19.832 -11.555 -19.77 QT
-14.133 -9.426 L
-14.461 -8.098 -15.375 -6.879 QT
-16.289 -5.66 -17.579 -4.918 QT
-18.868 -4.176 -20.274 -4.176 QT
-20.946 -4.176 -21.602 -4.434 QT
-22.258 -4.692 -22.664 -5.215 QT
-23.071 -5.738 -23.071 -6.426 QT
-23.071 -7.145 -22.657 -7.66 QT
-22.243 -8.176 -21.539 -8.176 QT
-21.118 -8.176 -20.836 -7.918 QT
-20.555 -7.66 -20.555 -7.238 QT
-20.555 -6.645 -21 -6.199 QT
-21.446 -5.754 -22.039 -5.754 QT
-22.055 -5.77 -22.086 -5.778 QT
-22.118 -5.785 -22.133 -5.785 QT
cp
f
GR
GS
[0 -0.75 0.75 0 56.30693 213.87495] CT
0.149 GC
N
-8.743 -3.004 M
-8.977 -3.004 -8.977 -3.238 QT
-8.977 -3.348 -8.915 -3.395 QT
-4.477 -7.738 -4.477 -16.004 QT
-4.477 -24.27 -8.868 -28.567 QT
-8.977 -28.629 -8.977 -28.77 QT
-8.977 -28.863 -8.907 -28.934 QT
-8.836 -29.004 -8.743 -29.004 QT
-8.493 -29.004 L
-8.43 -29.004 -8.368 -28.957 QT
-6.508 -27.488 -5.266 -25.379 QT
-4.024 -23.27 -3.446 -20.879 QT
-2.868 -18.488 -2.868 -16.004 QT
-2.868 -14.16 -3.18 -12.379 QT
-3.493 -10.598 -4.165 -8.863 QT
-4.836 -7.129 -5.883 -5.66 QT
-6.93 -4.192 -8.368 -3.051 QT
-8.43 -3.004 -8.493 -3.004 QT
-8.743 -3.004 L
cp
f
GR
GS
[0 -0.75 0.75 0 56.30693 213.87495] CT
0.149 GC
N
11.715 -3.004 M
11.715 -29.004 L
15.262 -29.004 L
15.262 -27.957 L
12.746 -27.957 L
12.746 -4.051 L
15.262 -4.051 L
15.262 -3.004 L
11.715 -3.004 L
cp
f
GR
GS
[0 -0.75 0.75 0 56.30693 213.87495] CT
0.149 GC
N
16.751 -9.504 M
16.751 -10.426 L
17.626 -10.426 18.204 -10.559 QT
18.782 -10.692 18.782 -11.238 QT
18.782 -18.348 L
18.782 -19.035 18.571 -19.348 QT
18.361 -19.66 17.962 -19.731 QT
17.564 -19.801 16.751 -19.801 QT
16.751 -20.707 L
20.517 -20.988 L
20.517 -18.457 L
21.032 -19.567 22.056 -20.278 QT
23.079 -20.988 24.282 -20.988 QT
27.282 -20.988 27.798 -18.551 QT
28.329 -19.645 29.329 -20.317 QT
30.329 -20.988 31.517 -20.988 QT
32.704 -20.988 33.509 -20.613 QT
34.314 -20.238 34.72 -19.457 QT
35.126 -18.676 35.126 -17.488 QT
35.126 -11.238 L
35.126 -10.692 35.704 -10.559 QT
36.282 -10.426 37.157 -10.426 QT
37.157 -9.504 L
31.204 -9.504 L
31.204 -10.426 L
32.095 -10.426 32.665 -10.559 QT
33.236 -10.692 33.236 -11.238 QT
33.236 -17.41 L
33.236 -18.723 32.868 -19.52 QT
32.501 -20.317 31.361 -20.317 QT
29.861 -20.317 28.884 -19.113 QT
27.907 -17.91 27.907 -16.379 QT
27.907 -11.238 L
27.907 -10.692 28.478 -10.559 QT
29.048 -10.426 29.939 -10.426 QT
29.939 -9.504 L
23.986 -9.504 L
23.986 -10.426 L
24.876 -10.426 25.446 -10.559 QT
26.017 -10.692 26.017 -11.238 QT
26.017 -17.41 L
26.017 -18.676 25.65 -19.496 QT
25.282 -20.317 24.126 -20.317 QT
22.626 -20.317 21.65 -19.113 QT
20.673 -17.91 20.673 -16.379 QT
20.673 -11.238 L
20.673 -10.692 21.251 -10.559 QT
21.829 -10.426 22.704 -10.426 QT
22.704 -9.504 L
16.751 -9.504 L
cp
f
GR
GS
[0 -0.75 0.75 0 56.30693 213.87495] CT
0.149 GC
N
38.548 -3.004 M
38.548 -4.051 L
41.064 -4.051 L
41.064 -27.957 L
38.548 -27.957 L
38.548 -29.004 L
42.111 -29.004 L
42.111 -3.004 L
38.548 -3.004 L
cp
f
GR
GS
[0.75 0 0 0.75 0 -0.25] CT
1 LJ
1.333 LW
N
131.42 297.297 M
138.84 301.061 L
146.26 312.029 L
153.68 306.135 L
161.1 301.624 L
168.52 298.415 L
175.94 302.469 L
183.36 303.696 L
190.78 307.545 L
198.2 291.757 L
205.62 282.785 L
213.04 294.697 L
220.46 296.501 L
227.88 286.262 L
235.3 281.862 L
242.72 308.819 L
250.14 322.487 L
257.56 300.591 L
264.98 297.902 L
272.4 280.87 L
279.82 273.659 L
287.24 298.812 L
294.66 295.463 L
302.08 301.052 L
309.5 295.915 L
316.92 296.665 L
324.34 296.574 L
331.76 283.852 L
339.18 301.685 L
346.6 293.729 L
354.02 293.553 L
361.44 297.726 L
368.86 302.01 L
376.28 297.15 L
383.7 301.096 L
391.12 284.991 L
398.54 282.231 L
405.96 236.373 L
413.38 221.935 L
420.8 296.721 L
428.22 299.074 L
435.64 299 L
443.06 299 L
450.48 294.101 L
457.9 304.871 L
465.32 289.093 L
472.74 281.925 L
480.16 302.503 L
487.58 297.67 L
495 292.427 L
502.42 304.718 L
509.84 296.655 L
517.26 300.194 L
524.68 299.807 L
532.1 299.47 L
539.52 298.301 L
546.94 300.465 L
554.36 300.849 L
561.78 291.804 L
569.2 304.465 L
576.62 287.695 L
584.04 301.699 L
591.46 295.36 L
598.88 300.5 L
606.3 299.223 L
613.72 283.545 L
621.14 280.395 L
628.56 305.085 L
635.98 301.398 L
643.4 298.388 L
650.82 296.486 L
658.24 273.428 L
665.66 269.489 L
673.08 283.293 L
680.5 276.672 L
687.92 300.079 L
695.34 299.716 L
702.76 276.951 L
710.18 259.984 L
717.6 299.301 L
725.02 299.238 L
732.44 300.312 L
739.86 302.035 L
747.28 283.901 L
754.7 300.465 L
762.12 300.642 L
769.54 296.384 L
776.96 299.782 L
784.38 297.327 L
791.8 296.256 L
799.22 296.201 L
806.64 298.526 L
814.06 295.162 L
821.48 298.428 L
828.9 299.233 L
836.32 237.629 L
843.74 318.661 L
851.16 298.431 L
858.58 299.526 L
866 287.802 L
S
GR
GS
[0.75 0 0 0.75 0 -0.25] CT
[10 6] 0 setdash
2 LJ
0.667 LW
N
124 272 M
866 272 L
S
GR
GS
[0.75 0 0 0.75 0 -0.25] CT
[10 6] 0 setdash
2 LJ
0.667 LW
N
124 326 M
866 326 L
S
GR
GS
[0.75 0 0 0.75 104.13 224] CT
0 0.447 0.741 RC
N
f1921431499
f
GR
GS
[0.75 0 0 0.75 104.13 224] CT
0 0.447 0.741 RC
10.0 ML
N
2.667 0 M
2.667 -1.473 1.473 -2.667 0 -2.667 C
-1.473 -2.667 -2.667 -1.473 -2.667 0 C
-2.667 1.473 -1.473 2.667 0 2.667 C
1.473 2.667 2.667 1.473 2.667 0 C
cp
S
GR
GS
[0.75 0 0 0.75 109.695 224] CT
0 0.447 0.741 RC
N
f1921431499
f
GR
GS
[0.75 0 0 0.75 109.695 224] CT
0 0.447 0.741 RC
10.0 ML
N
2.667 0 M
2.667 -1.473 1.473 -2.667 0 -2.667 C
-1.473 -2.667 -2.667 -1.473 -2.667 0 C
-2.667 1.473 -1.473 2.667 0 2.667 C
1.473 2.667 2.667 1.473 2.667 0 C
cp
S
GR
GS
[0.75 0 0 0.75 115.25999 224] CT
0 0.447 0.741 RC
N
f1921431499
f
GR
GS
[0.75 0 0 0.75 115.25999 224] CT
0 0.447 0.741 RC
10.0 ML
N
2.667 0 M
2.667 -1.473 1.473 -2.667 0 -2.667 C
-1.473 -2.667 -2.667 -1.473 -2.667 0 C
-2.667 1.473 -1.473 2.667 0 2.667 C
1.473 2.667 2.667 1.473 2.667 0 C
cp
S
GR
GS
[0.75 0 0 0.75 120.825 224] CT
0 0.447 0.741 RC
N
f1921431499
f
GR
GS
[0.75 0 0 0.75 120.825 224] CT
0 0.447 0.741 RC
10.0 ML
N
2.667 0 M
2.667 -1.473 1.473 -2.667 0 -2.667 C
-1.473 -2.667 -2.667 -1.473 -2.667 0 C
-2.667 1.473 -1.473 2.667 0 2.667 C
1.473 2.667 2.667 1.473 2.667 0 C
cp
S
GR
GS
[0.75 0 0 0.75 148.65 224] CT
0 0.447 0.741 RC
N
f1921431499
f
GR
GS
[0.75 0 0 0.75 148.65 224] CT
0 0.447 0.741 RC
10.0 ML
N
2.667 0 M
2.667 -1.473 1.473 -2.667 0 -2.667 C
-1.473 -2.667 -2.667 -1.473 -2.667 0 C
-2.667 1.473 -1.473 2.667 0 2.667 C
1.473 2.667 2.667 1.473 2.667 0 C
cp
S
GR
GS
[0.75 0 0 0.75 154.215 224] CT
0 0.447 0.741 RC
N
f1921431499
f
GR
GS
[0.75 0 0 0.75 154.215 224] CT
0 0.447 0.741 RC
10.0 ML
N
2.667 0 M
2.667 -1.473 1.473 -2.667 0 -2.667 C
-1.473 -2.667 -2.667 -1.473 -2.667 0 C
-2.667 1.473 -1.473 2.667 0 2.667 C
1.473 2.667 2.667 1.473 2.667 0 C
cp
S
GR
GS
[0.75 0 0 0.75 170.91 224] CT
0 0.447 0.741 RC
N
f1921431499
f
GR
GS
[0.75 0 0 0.75 170.91 224] CT
0 0.447 0.741 RC
10.0 ML
N
2.667 0 M
2.667 -1.473 1.473 -2.667 0 -2.667 C
-1.473 -2.667 -2.667 -1.473 -2.667 0 C
-2.667 1.473 -1.473 2.667 0 2.667 C
1.473 2.667 2.667 1.473 2.667 0 C
cp
S
GR
GS
[0.75 0 0 0.75 176.475 224] CT
0 0.447 0.741 RC
N
f1921431499
f
GR
GS
[0.75 0 0 0.75 176.475 224] CT
0 0.447 0.741 RC
10.0 ML
N
2.667 0 M
2.667 -1.473 1.473 -2.667 0 -2.667 C
-1.473 -2.667 -2.667 -1.473 -2.667 0 C
-2.667 1.473 -1.473 2.667 0 2.667 C
1.473 2.667 2.667 1.473 2.667 0 C
cp
S
GR
GS
[0.75 0 0 0.75 182.04 224] CT
0 0.447 0.741 RC
N
f1921431499
f
GR
GS
[0.75 0 0 0.75 182.04 224] CT
0 0.447 0.741 RC
10.0 ML
N
2.667 0 M
2.667 -1.473 1.473 -2.667 0 -2.667 C
-1.473 -2.667 -2.667 -1.473 -2.667 0 C
-2.667 1.473 -1.473 2.667 0 2.667 C
1.473 2.667 2.667 1.473 2.667 0 C
cp
S
GR
GS
[0.75 0 0 0.75 187.605 224] CT
0 0.447 0.741 RC
N
f1921431499
f
GR
GS
[0.75 0 0 0.75 187.605 224] CT
0 0.447 0.741 RC
10.0 ML
N
2.667 0 M
2.667 -1.473 1.473 -2.667 0 -2.667 C
-1.473 -2.667 -2.667 -1.473 -2.667 0 C
-2.667 1.473 -1.473 2.667 0 2.667 C
1.473 2.667 2.667 1.473 2.667 0 C
cp
S
GR
GS
[0.75 0 0 0.75 204.3 224] CT
0 0.447 0.741 RC
N
f1921431499
f
GR
GS
[0.75 0 0 0.75 204.3 224] CT
0 0.447 0.741 RC
10.0 ML
N
2.667 0 M
2.667 -1.473 1.473 -2.667 0 -2.667 C
-1.473 -2.667 -2.667 -1.473 -2.667 0 C
-2.667 1.473 -1.473 2.667 0 2.667 C
1.473 2.667 2.667 1.473 2.667 0 C
cp
S
GR
GS
[0.75 0 0 0.75 209.86501 224] CT
0 0.447 0.741 RC
N
f1921431499
f
GR
GS
[0.75 0 0 0.75 209.86501 224] CT
0 0.447 0.741 RC
10.0 ML
N
2.667 0 M
2.667 -1.473 1.473 -2.667 0 -2.667 C
-1.473 -2.667 -2.667 -1.473 -2.667 0 C
-2.667 1.473 -1.473 2.667 0 2.667 C
1.473 2.667 2.667 1.473 2.667 0 C
cp
S
GR
GS
[0.75 0 0 0.75 248.82001 224] CT
0 0.447 0.741 RC
N
f1921431499
f
GR
GS
[0.75 0 0 0.75 248.82001 224] CT
0 0.447 0.741 RC
10.0 ML
N
2.667 0 M
2.667 -1.473 1.473 -2.667 0 -2.667 C
-1.473 -2.667 -2.667 -1.473 -2.667 0 C
-2.667 1.473 -1.473 2.667 0 2.667 C
1.473 2.667 2.667 1.473 2.667 0 C
cp
S
GR
GS
[0.75 0 0 0.75 254.38499 224] CT
0 0.447 0.741 RC
N
f1921431499
f
GR
GS
[0.75 0 0 0.75 254.38499 224] CT
0 0.447 0.741 RC
10.0 ML
N
2.667 0 M
2.667 -1.473 1.473 -2.667 0 -2.667 C
-1.473 -2.667 -2.667 -1.473 -2.667 0 C
-2.667 1.473 -1.473 2.667 0 2.667 C
1.473 2.667 2.667 1.473 2.667 0 C
cp
S
GR
GS
[0.75 0 0 0.75 259.95 224] CT
0 0.447 0.741 RC
N
f1921431499
f
GR
GS
[0.75 0 0 0.75 259.95 224] CT
0 0.447 0.741 RC
10.0 ML
N
2.667 0 M
2.667 -1.473 1.473 -2.667 0 -2.667 C
-1.473 -2.667 -2.667 -1.473 -2.667 0 C
-2.667 1.473 -1.473 2.667 0 2.667 C
1.473 2.667 2.667 1.473 2.667 0 C
cp
S
GR
GS
[0.75 0 0 0.75 265.51499 224] CT
0 0.447 0.741 RC
N
f1921431499
f
GR
GS
[0.75 0 0 0.75 265.51499 224] CT
0 0.447 0.741 RC
10.0 ML
N
2.667 0 M
2.667 -1.473 1.473 -2.667 0 -2.667 C
-1.473 -2.667 -2.667 -1.473 -2.667 0 C
-2.667 1.473 -1.473 2.667 0 2.667 C
1.473 2.667 2.667 1.473 2.667 0 C
cp
S
GR
GS
[0.75 0 0 0.75 293.34 224] CT
0 0.447 0.741 RC
N
f1921431499
f
GR
GS
[0.75 0 0 0.75 293.34 224] CT
0 0.447 0.741 RC
10.0 ML
N
2.667 0 M
2.667 -1.473 1.473 -2.667 0 -2.667 C
-1.473 -2.667 -2.667 -1.473 -2.667 0 C
-2.667 1.473 -1.473 2.667 0 2.667 C
1.473 2.667 2.667 1.473 2.667 0 C
cp
S
GR
GS
[0.75 0 0 0.75 298.90501 224] CT
0 0.447 0.741 RC
N
f1921431499
f
GR
GS
[0.75 0 0 0.75 298.90501 224] CT
0 0.447 0.741 RC
10.0 ML
N
2.667 0 M
2.667 -1.473 1.473 -2.667 0 -2.667 C
-1.473 -2.667 -2.667 -1.473 -2.667 0 C
-2.667 1.473 -1.473 2.667 0 2.667 C
1.473 2.667 2.667 1.473 2.667 0 C
cp
S
GR
GS
[0.75 0 0 0.75 304.46999 224] CT
0 0.447 0.741 RC
N
f1921431499
f
GR
GS
[0.75 0 0 0.75 304.46999 224] CT
0 0.447 0.741 RC
10.0 ML
N
2.667 0 M
2.667 -1.473 1.473 -2.667 0 -2.667 C
-1.473 -2.667 -2.667 -1.473 -2.667 0 C
-2.667 1.473 -1.473 2.667 0 2.667 C
1.473 2.667 2.667 1.473 2.667 0 C
cp
S
GR
GS
[0.75 0 0 0.75 310.035 224] CT
0 0.447 0.741 RC
N
f1921431499
f
GR
GS
[0.75 0 0 0.75 310.035 224] CT
0 0.447 0.741 RC
10.0 ML
N
2.667 0 M
2.667 -1.473 1.473 -2.667 0 -2.667 C
-1.473 -2.667 -2.667 -1.473 -2.667 0 C
-2.667 1.473 -1.473 2.667 0 2.667 C
1.473 2.667 2.667 1.473 2.667 0 C
cp
S
GR
GS
[0.75 0 0 0.75 348.99001 224] CT
0 0.447 0.741 RC
N
f1921431499
f
GR
GS
[0.75 0 0 0.75 348.99001 224] CT
0 0.447 0.741 RC
10.0 ML
N
2.667 0 M
2.667 -1.473 1.473 -2.667 0 -2.667 C
-1.473 -2.667 -2.667 -1.473 -2.667 0 C
-2.667 1.473 -1.473 2.667 0 2.667 C
1.473 2.667 2.667 1.473 2.667 0 C
cp
S
GR
GS
[0.75 0 0 0.75 354.55499 224] CT
0 0.447 0.741 RC
N
f1921431499
f
GR
GS
[0.75 0 0 0.75 354.55499 224] CT
0 0.447 0.741 RC
10.0 ML
N
2.667 0 M
2.667 -1.473 1.473 -2.667 0 -2.667 C
-1.473 -2.667 -2.667 -1.473 -2.667 0 C
-2.667 1.473 -1.473 2.667 0 2.667 C
1.473 2.667 2.667 1.473 2.667 0 C
cp
S
GR
GS
[0.75 0 0 0.75 415.76999 224] CT
0 0.447 0.741 RC
N
f1921431499
f
GR
GS
[0.75 0 0 0.75 415.76999 224] CT
0 0.447 0.741 RC
10.0 ML
N
2.667 0 M
2.667 -1.473 1.473 -2.667 0 -2.667 C
-1.473 -2.667 -2.667 -1.473 -2.667 0 C
-2.667 1.473 -1.473 2.667 0 2.667 C
1.473 2.667 2.667 1.473 2.667 0 C
cp
S
GR
GS
[0.75 0 0 0.75 421.33502 224] CT
0 0.447 0.741 RC
N
f1921431499
f
GR
GS
[0.75 0 0 0.75 421.33502 224] CT
0 0.447 0.741 RC
10.0 ML
N
2.667 0 M
2.667 -1.473 1.473 -2.667 0 -2.667 C
-1.473 -2.667 -2.667 -1.473 -2.667 0 C
-2.667 1.473 -1.473 2.667 0 2.667 C
1.473 2.667 2.667 1.473 2.667 0 C
cp
S
GR
GS
[0.75 0 0 0.75 460.28998 224] CT
0 0.447 0.741 RC
N
f1921431499
f
GR
GS
[0.75 0 0 0.75 460.28998 224] CT
0 0.447 0.741 RC
10.0 ML
N
2.667 0 M
2.667 -1.473 1.473 -2.667 0 -2.667 C
-1.473 -2.667 -2.667 -1.473 -2.667 0 C
-2.667 1.473 -1.473 2.667 0 2.667 C
1.473 2.667 2.667 1.473 2.667 0 C
cp
S
GR
GS
[0.75 0 0 0.75 465.85501 224] CT
0 0.447 0.741 RC
N
f1921431499
f
GR
GS
[0.75 0 0 0.75 465.85501 224] CT
0 0.447 0.741 RC
10.0 ML
N
2.667 0 M
2.667 -1.473 1.473 -2.667 0 -2.667 C
-1.473 -2.667 -2.667 -1.473 -2.667 0 C
-2.667 1.473 -1.473 2.667 0 2.667 C
1.473 2.667 2.667 1.473 2.667 0 C
cp
S
GR
GS
[0.75 0 0 0.75 493.67999 224] CT
0 0.447 0.741 RC
N
f1921431499
f
GR
GS
[0.75 0 0 0.75 493.67999 224] CT
0 0.447 0.741 RC
10.0 ML
N
2.667 0 M
2.667 -1.473 1.473 -2.667 0 -2.667 C
-1.473 -2.667 -2.667 -1.473 -2.667 0 C
-2.667 1.473 -1.473 2.667 0 2.667 C
1.473 2.667 2.667 1.473 2.667 0 C
cp
S
GR
GS
[0.75 0 0 0.75 499.24498 224] CT
0 0.447 0.741 RC
N
f1921431499
f
GR
GS
[0.75 0 0 0.75 499.24498 224] CT
0 0.447 0.741 RC
10.0 ML
N
2.667 0 M
2.667 -1.473 1.473 -2.667 0 -2.667 C
-1.473 -2.667 -2.667 -1.473 -2.667 0 C
-2.667 1.473 -1.473 2.667 0 2.667 C
1.473 2.667 2.667 1.473 2.667 0 C
cp
S
GR
GS
[0.75 0 0 0.75 504.81001 224] CT
0 0.447 0.741 RC
N
f1921431499
f
GR
GS
[0.75 0 0 0.75 504.81001 224] CT
0 0.447 0.741 RC
10.0 ML
N
2.667 0 M
2.667 -1.473 1.473 -2.667 0 -2.667 C
-1.473 -2.667 -2.667 -1.473 -2.667 0 C
-2.667 1.473 -1.473 2.667 0 2.667 C
1.473 2.667 2.667 1.473 2.667 0 C
cp
S
GR
GS
[0.75 0 0 0.75 510.375 224] CT
0 0.447 0.741 RC
N
f1921431499
f
GR
GS
[0.75 0 0 0.75 510.375 224] CT
0 0.447 0.741 RC
10.0 ML
N
2.667 0 M
2.667 -1.473 1.473 -2.667 0 -2.667 C
-1.473 -2.667 -2.667 -1.473 -2.667 0 C
-2.667 1.473 -1.473 2.667 0 2.667 C
1.473 2.667 2.667 1.473 2.667 0 C
cp
S
GR
GS
[0.75 0 0 0.75 527.07001 224] CT
0 0.447 0.741 RC
N
f1921431499
f
GR
GS
[0.75 0 0 0.75 527.07001 224] CT
0 0.447 0.741 RC
10.0 ML
N
2.667 0 M
2.667 -1.473 1.473 -2.667 0 -2.667 C
-1.473 -2.667 -2.667 -1.473 -2.667 0 C
-2.667 1.473 -1.473 2.667 0 2.667 C
1.473 2.667 2.667 1.473 2.667 0 C
cp
S
GR
GS
[0.75 0 0 0.75 532.63499 224] CT
0 0.447 0.741 RC
N
f1921431499
f
GR
GS
[0.75 0 0 0.75 532.63499 224] CT
0 0.447 0.741 RC
10.0 ML
N
2.667 0 M
2.667 -1.473 1.473 -2.667 0 -2.667 C
-1.473 -2.667 -2.667 -1.473 -2.667 0 C
-2.667 1.473 -1.473 2.667 0 2.667 C
1.473 2.667 2.667 1.473 2.667 0 C
cp
S
GR
GS
[0.75 0 0 0.75 593.84999 224] CT
0 0.447 0.741 RC
N
f1921431499
f
GR
GS
[0.75 0 0 0.75 593.84999 224] CT
0 0.447 0.741 RC
10.0 ML
N
2.667 0 M
2.667 -1.473 1.473 -2.667 0 -2.667 C
-1.473 -2.667 -2.667 -1.473 -2.667 0 C
-2.667 1.473 -1.473 2.667 0 2.667 C
1.473 2.667 2.667 1.473 2.667 0 C
cp
S
GR
GS
[0.75 0 0 0.75 599.41498 224] CT
0 0.447 0.741 RC
N
f1921431499
f
GR
GS
[0.75 0 0 0.75 599.41498 224] CT
0 0.447 0.741 RC
10.0 ML
N
2.667 0 M
2.667 -1.473 1.473 -2.667 0 -2.667 C
-1.473 -2.667 -2.667 -1.473 -2.667 0 C
-2.667 1.473 -1.473 2.667 0 2.667 C
1.473 2.667 2.667 1.473 2.667 0 C
cp
S
GR
GS
[0.75 0 0 0.75 649.5 224] CT
0 0.447 0.741 RC
N
f1921431499
f
GR
GS
[0.75 0 0 0.75 649.5 224] CT
0 0.447 0.741 RC
10.0 ML
N
2.667 0 M
2.667 -1.473 1.473 -2.667 0 -2.667 C
-1.473 -2.667 -2.667 -1.473 -2.667 0 C
-2.667 1.473 -1.473 2.667 0 2.667 C
1.473 2.667 2.667 1.473 2.667 0 C
cp
S
GR
GS
[0.75 0 0 0.75 0 -0.25] CT
1 GC
N
/f1430670086{124 539 M
866 539 L
866 405 L
124 405 L
cp}def
f1430670086
f
GR
GS
[0.75 0 0 0.75 0 -0.25] CT
0.873 GC
1 LJ
0.667 LW
N
124 539 M
124 405 L
S
GR
GS
[0.75 0 0 0.75 0 -0.25] CT
0.873 GC
1 LJ
0.667 LW
N
272.4 539 M
272.4 405 L
S
GR
GS
[0.75 0 0 0.75 0 -0.25] CT
0.873 GC
1 LJ
0.667 LW
N
420.8 539 M
420.8 405 L
S
GR
GS
[0.75 0 0 0.75 0 -0.25] CT
0.873 GC
1 LJ
0.667 LW
N
569.2 539 M
569.2 405 L
S
GR
GS
[0.75 0 0 0.75 0 -0.25] CT
0.873 GC
1 LJ
0.667 LW
N
717.6 539 M
717.6 405 L
S
GR
GS
[0.75 0 0 0.75 0 -0.25] CT
0.873 GC
1 LJ
0.667 LW
N
866 539 M
866 405 L
S
GR
GS
[0.75 0 0 0.75 0 -0.25] CT
0.873 GC
1 LJ
0.667 LW
N
866 497.963 M
124 497.963 L
S
GR
GS
[0.75 0 0 0.75 0 -0.25] CT
0.873 GC
1 LJ
0.667 LW
N
866 451.481 M
124 451.481 L
S
GR
GS
[0.75 0 0 0.75 0 -0.25] CT
0.873 GC
1 LJ
0.667 LW
N
866 405 M
124 405 L
S
GR
GS
[0.75 0 0 0.75 0 -0.25] CT
0.149 GC
2 setlinecap
1 LJ
0.667 LW
N
124 539 M
866 539 L
S
GR
GS
[0.75 0 0 0.75 0 -0.25] CT
0.149 GC
2 setlinecap
1 LJ
0.667 LW
N
124 405 M
866 405 L
S
GR
GS
[0.75 0 0 0.75 0 -0.25] CT
0.149 GC
2 setlinecap
1 LJ
0.667 LW
N
124 539 M
124 531.58 L
S
GR
GS
[0.75 0 0 0.75 0 -0.25] CT
0.149 GC
2 setlinecap
1 LJ
0.667 LW
N
272.4 539 M
272.4 531.58 L
S
GR
GS
[0.75 0 0 0.75 0 -0.25] CT
0.149 GC
2 setlinecap
1 LJ
0.667 LW
N
420.8 539 M
420.8 531.58 L
S
GR
GS
[0.75 0 0 0.75 0 -0.25] CT
0.149 GC
2 setlinecap
1 LJ
0.667 LW
N
569.2 539 M
569.2 531.58 L
S
GR
GS
[0.75 0 0 0.75 0 -0.25] CT
0.149 GC
2 setlinecap
1 LJ
0.667 LW
N
717.6 539 M
717.6 531.58 L
S
GR
GS
[0.75 0 0 0.75 0 -0.25] CT
0.149 GC
2 setlinecap
1 LJ
0.667 LW
N
866 539 M
866 531.58 L
S
GR
GS
[0.75 0 0 0.75 0 -0.25] CT
0.149 GC
2 setlinecap
1 LJ
0.667 LW
N
124 405 M
124 412.42 L
S
GR
GS
[0.75 0 0 0.75 0 -0.25] CT
0.149 GC
2 setlinecap
1 LJ
0.667 LW
N
272.4 405 M
272.4 412.42 L
S
GR
GS
[0.75 0 0 0.75 0 -0.25] CT
0.149 GC
2 setlinecap
1 LJ
0.667 LW
N
420.8 405 M
420.8 412.42 L
S
GR
GS
[0.75 0 0 0.75 0 -0.25] CT
0.149 GC
2 setlinecap
1 LJ
0.667 LW
N
569.2 405 M
569.2 412.42 L
S
GR
GS
[0.75 0 0 0.75 0 -0.25] CT
0.149 GC
2 setlinecap
1 LJ
0.667 LW
N
717.6 405 M
717.6 412.42 L
S
GR
GS
[0.75 0 0 0.75 0 -0.25] CT
0.149 GC
2 setlinecap
1 LJ
0.667 LW
N
866 405 M
866 412.42 L
S
GR
GS
[0.75 0 0 0.75 93 409.60001] CT
0.149 GC
/Helvetica 24 F
GS
[1 0 0 1 0 0] CT
-7 25 moveto 
1 -1 scale
(0) t 
GR
GR
GS
[0.75 0 0 0.75 204.3 409.60001] CT
0.149 GC
/Helvetica 24 F
GS
[1 0 0 1 0 0] CT
-13.5 25 moveto 
1 -1 scale
(20) t 
GR
GR
GS
[0.75 0 0 0.75 315.59999 409.60001] CT
0.149 GC
/Helvetica 24 F
GS
[1 0 0 1 0 0] CT
-13.5 25 moveto 
1 -1 scale
(40) t 
GR
GR
GS
[0.75 0 0 0.75 426.90001 409.60001] CT
0.149 GC
/Helvetica 24 F
GS
[1 0 0 1 0 0] CT
-13.5 25 moveto 
1 -1 scale
(60) t 
GR
GR
GS
[0.75 0 0 0.75 538.19998 409.60001] CT
0.149 GC
/Helvetica 24 F
GS
[1 0 0 1 0 0] CT
-13.5 25 moveto 
1 -1 scale
(80) t 
GR
GR
GS
[0.75 0 0 0.75 649.5 409.60001] CT
0.149 GC
/Helvetica 24 F
GS
[1 0 0 1 0 0] CT
-20.5 25 moveto 
1 -1 scale
(100) t 
GR
GR
GS
[0.75 0 0 0.75 373.35226 435.51268] CT
0.149 GC
/Helvetica 26.4 F
GS
[1 0 0 1 0 0] CT
-48.5 27 moveto 
1 -1 scale
(Time \(s\)) t 
GR
GR
GS
[0.75 0 0 0.75 0 -0.25] CT
0.149 GC
2 setlinecap
1 LJ
0.667 LW
N
124 539 M
124 405 L
S
GR
GS
[0.75 0 0 0.75 0 -0.25] CT
0.149 GC
2 setlinecap
1 LJ
0.667 LW
N
866 539 M
866 405 L
S
GR
GS
[0.75 0 0 0.75 0 -0.25] CT
0.149 GC
2 setlinecap
1 LJ
0.667 LW
N
124 497.963 M
131.42 497.963 L
S
GR
GS
[0.75 0 0 0.75 0 -0.25] CT
0.149 GC
2 setlinecap
1 LJ
0.667 LW
N
124 451.481 M
131.42 451.481 L
S
GR
GS
[0.75 0 0 0.75 0 -0.25] CT
0.149 GC
2 setlinecap
1 LJ
0.667 LW
N
124 405 M
131.42 405 L
S
GR
GS
[0.75 0 0 0.75 0 -0.25] CT
0.149 GC
2 setlinecap
1 LJ
0.667 LW
N
866 497.963 M
858.58 497.963 L
S
GR
GS
[0.75 0 0 0.75 0 -0.25] CT
0.149 GC
2 setlinecap
1 LJ
0.667 LW
N
866 451.481 M
858.58 451.481 L
S
GR
GS
[0.75 0 0 0.75 0 -0.25] CT
0.149 GC
2 setlinecap
1 LJ
0.667 LW
N
866 405 M
858.58 405 L
S
GR
GS
[0.75 0 0 0.75 87.4 373.2221] CT
0.149 GC
/Helvetica 24 F
GS
[1 0 0 1 0 0] CT
-35 9.5 moveto 
1 -1 scale
(-20) t 
GR
GR
GS
[0.75 0 0 0.75 87.4 338.36104] CT
0.149 GC
/Helvetica 24 F
GS
[1 0 0 1 0 0] CT
-14 9.5 moveto 
1 -1 scale
(0) t 
GR
GR
GS
[0.75 0 0 0.75 87.4 303.5] CT
0.149 GC
/Helvetica 24 F
GS
[1 0 0 1 0 0] CT
-27 9.5 moveto 
1 -1 scale
(20) t 
GR
GR
GS
[0 -0.75 0.75 0 56.30693 355.79151] CT
0.149 GC
N
-41.874 -13.176 M
-41.874 -12.301 -41.562 -11.551 QT
-41.249 -10.801 -40.608 -10.348 QT
-39.968 -9.895 -39.093 -9.895 QT
-38.515 -9.895 -37.851 -10.153 QT
-37.187 -10.41 -36.624 -10.715 QT
-36.062 -11.02 -36.046 -11.02 QT
-35.905 -11.02 -35.827 -10.856 QT
-35.749 -10.692 -35.749 -10.551 QT
-35.749 -10.41 -35.827 -10.363 QT
-37.452 -9.207 -39.124 -9.207 QT
-40.499 -9.207 -41.601 -9.848 QT
-42.702 -10.488 -43.304 -11.637 QT
-43.905 -12.785 -43.905 -14.145 QT
-43.905 -15.488 -43.358 -16.699 QT
-42.812 -17.91 -41.851 -18.809 QT
-40.89 -19.707 -39.671 -20.207 QT
-38.452 -20.707 -37.124 -20.707 QT
-35.64 -20.707 L
-35.249 -20.707 -35.249 -20.317 QT
-35.249 -20.098 -35.397 -19.949 QT
-35.546 -19.801 -35.749 -19.801 QT
-37.171 -19.801 L
-38.202 -19.801 -39.046 -19.34 QT
-39.89 -18.879 -40.468 -18.067 QT
-41.046 -17.254 -41.358 -16.238 QT
-36.765 -16.238 L
-36.577 -16.238 -36.476 -16.129 QT
-36.374 -16.02 -36.374 -15.848 QT
-36.374 -15.629 -36.507 -15.481 QT
-36.64 -15.332 -36.858 -15.332 QT
-41.593 -15.332 L
-41.874 -13.988 -41.874 -13.176 QT
cp
f
GR
GS
[0 -0.75 0.75 0 56.30693 355.79151] CT
0.149 GC
N
-26.299 -3.051 M
-27.752 -4.192 -28.799 -5.676 QT
-29.846 -7.16 -30.51 -8.832 QT
-31.174 -10.504 -31.502 -12.332 QT
-31.83 -14.16 -31.83 -16.004 QT
-31.83 -17.863 -31.502 -19.692 QT
-31.174 -21.52 -30.494 -23.215 QT
-29.814 -24.91 -28.76 -26.379 QT
-27.705 -27.848 -26.299 -28.957 QT
-26.299 -29.004 -26.174 -29.004 QT
-25.924 -29.004 L
-25.861 -29.004 -25.791 -28.934 QT
-25.721 -28.863 -25.721 -28.77 QT
-25.721 -28.66 -25.783 -28.613 QT
-27.049 -27.363 -27.893 -25.942 QT
-28.736 -24.52 -29.252 -22.918 QT
-29.768 -21.317 -29.994 -19.59 QT
-30.221 -17.863 -30.221 -16.004 QT
-30.221 -7.738 -25.799 -3.442 QT
-25.721 -3.379 -25.721 -3.238 QT
-25.721 -3.176 -25.791 -3.09 QT
-25.861 -3.004 -25.924 -3.004 QT
-26.174 -3.004 L
-26.299 -3.004 -26.299 -3.051 QT
cp
f
GR
GS
[0 -0.75 0.75 0 56.30693 355.79151] CT
0.149 GC
N
-22.829 -9.207 M
-23.032 -9.207 -23.032 -9.457 QT
-23.032 -9.582 -22.97 -9.629 QT
-22.282 -10.832 -21.298 -11.934 QT
-20.313 -13.035 -19.063 -14.16 QT
-17.813 -15.285 -16.548 -16.41 QT
-15.282 -17.535 -14.501 -18.41 QT
-14.595 -18.41 L
-15.173 -18.41 -16.274 -18.785 QT
-17.376 -19.16 -18.017 -19.16 QT
-18.704 -19.16 -19.352 -18.856 QT
-20.001 -18.551 -20.173 -17.942 QT
-20.204 -17.738 -20.376 -17.738 QT
-20.688 -17.738 L
-20.892 -17.738 -20.892 -18.004 QT
-20.892 -18.082 L
-20.688 -18.848 -20.227 -19.512 QT
-19.767 -20.176 -19.087 -20.582 QT
-18.407 -20.988 -17.673 -20.988 QT
-17.157 -20.988 -16.813 -20.754 QT
-16.47 -20.52 -16.009 -20.028 QT
-15.548 -19.535 -15.267 -19.317 QT
-14.985 -19.098 -14.548 -19.098 QT
-13.97 -19.098 -13.524 -19.621 QT
-13.079 -20.145 -12.626 -20.91 QT
-12.548 -20.988 -12.438 -20.988 QT
-12.142 -20.988 L
-12.048 -20.988 -11.993 -20.926 QT
-11.938 -20.863 -11.938 -20.77 QT
-11.938 -20.676 -11.985 -20.598 QT
-12.688 -19.395 -13.618 -18.348 QT
-14.548 -17.301 -16.056 -15.949 QT
-17.563 -14.598 -18.595 -13.66 QT
-19.626 -12.723 -20.532 -11.738 QT
-20.329 -11.785 -19.985 -11.785 QT
-19.345 -11.785 -18.251 -11.426 QT
-17.157 -11.067 -16.548 -11.067 QT
-15.907 -11.067 -15.243 -11.348 QT
-14.579 -11.629 -14.102 -12.137 QT
-13.626 -12.645 -13.454 -13.301 QT
-13.392 -13.473 -13.251 -13.473 QT
-12.938 -13.473 L
-12.829 -13.473 -12.767 -13.395 QT
-12.704 -13.317 -12.704 -13.223 QT
-12.704 -13.192 -12.735 -13.145 QT
-12.97 -12.16 -13.571 -11.262 QT
-14.173 -10.363 -15.04 -9.785 QT
-15.907 -9.207 -16.892 -9.207 QT
-17.392 -9.207 -17.735 -9.442 QT
-18.079 -9.676 -18.54 -10.176 QT
-19.001 -10.676 -19.298 -10.895 QT
-19.595 -11.113 -20.001 -11.113 QT
-21.298 -11.113 -22.329 -9.301 QT
-22.423 -9.207 -22.501 -9.207 QT
-22.829 -9.207 L
cp
f
GR
GS
[0 -0.75 0.75 0 56.30693 355.79151] CT
0.149 GC
N
-8.969 -3.004 M
-9.203 -3.004 -9.203 -3.238 QT
-9.203 -3.348 -9.141 -3.395 QT
-4.703 -7.738 -4.703 -16.004 QT
-4.703 -24.27 -9.094 -28.567 QT
-9.203 -28.629 -9.203 -28.77 QT
-9.203 -28.863 -9.133 -28.934 QT
-9.062 -29.004 -8.969 -29.004 QT
-8.719 -29.004 L
-8.656 -29.004 -8.594 -28.957 QT
-6.734 -27.488 -5.492 -25.379 QT
-4.25 -23.27 -3.672 -20.879 QT
-3.094 -18.488 -3.094 -16.004 QT
-3.094 -14.16 -3.406 -12.379 QT
-3.719 -10.598 -4.391 -8.863 QT
-5.062 -7.129 -6.109 -5.66 QT
-7.156 -4.192 -8.594 -3.051 QT
-8.656 -3.004 -8.719 -3.004 QT
-8.969 -3.004 L
cp
f
GR
GS
[0 -0.75 0.75 0 56.30693 355.79151] CT
0.149 GC
N
11.489 -3.004 M
11.489 -29.004 L
15.035 -29.004 L
15.035 -27.957 L
12.52 -27.957 L
12.52 -4.051 L
15.035 -4.051 L
15.035 -3.004 L
11.489 -3.004 L
cp
f
GR
GS
[0 -0.75 0.75 0 56.30693 355.79151] CT
0.149 GC
N
16.525 -9.504 M
16.525 -10.426 L
17.4 -10.426 17.978 -10.559 QT
18.556 -10.692 18.556 -11.238 QT
18.556 -18.348 L
18.556 -19.035 18.345 -19.348 QT
18.134 -19.66 17.736 -19.731 QT
17.338 -19.801 16.525 -19.801 QT
16.525 -20.707 L
20.291 -20.988 L
20.291 -18.457 L
20.806 -19.567 21.83 -20.278 QT
22.853 -20.988 24.056 -20.988 QT
27.056 -20.988 27.572 -18.551 QT
28.103 -19.645 29.103 -20.317 QT
30.103 -20.988 31.291 -20.988 QT
32.478 -20.988 33.283 -20.613 QT
34.088 -20.238 34.494 -19.457 QT
34.9 -18.676 34.9 -17.488 QT
34.9 -11.238 L
34.9 -10.692 35.478 -10.559 QT
36.056 -10.426 36.931 -10.426 QT
36.931 -9.504 L
30.978 -9.504 L
30.978 -10.426 L
31.869 -10.426 32.439 -10.559 QT
33.009 -10.692 33.009 -11.238 QT
33.009 -17.41 L
33.009 -18.723 32.642 -19.52 QT
32.275 -20.317 31.134 -20.317 QT
29.634 -20.317 28.658 -19.113 QT
27.681 -17.91 27.681 -16.379 QT
27.681 -11.238 L
27.681 -10.692 28.252 -10.559 QT
28.822 -10.426 29.713 -10.426 QT
29.713 -9.504 L
23.759 -9.504 L
23.759 -10.426 L
24.65 -10.426 25.22 -10.559 QT
25.791 -10.692 25.791 -11.238 QT
25.791 -17.41 L
25.791 -18.676 25.423 -19.496 QT
25.056 -20.317 23.9 -20.317 QT
22.4 -20.317 21.423 -19.113 QT
20.447 -17.91 20.447 -16.379 QT
20.447 -11.238 L
20.447 -10.692 21.025 -10.559 QT
21.603 -10.426 22.478 -10.426 QT
22.478 -9.504 L
16.525 -9.504 L
cp
f
GR
GS
[0 -0.75 0.75 0 56.30693 355.79151] CT
0.149 GC
N
38.322 -3.004 M
38.322 -4.051 L
40.838 -4.051 L
40.838 -27.957 L
38.322 -27.957 L
38.322 -29.004 L
41.884 -29.004 L
41.884 -3.004 L
38.322 -3.004 L
cp
f
GR
GS
[0.75 0 0 0.75 0 -0.25] CT
1 LJ
1.333 LW
N
131.42 497.251 M
138.84 492.816 L
146.26 490.507 L
153.68 479.121 L
161.1 467.916 L
168.52 498.568 L
175.94 497.642 L
183.36 504.426 L
190.78 504.421 L
198.2 505.679 L
205.62 503.839 L
213.04 497.631 L
220.46 497.42 L
227.88 493.049 L
235.3 487.792 L
242.72 513.255 L
250.14 524.352 L
257.56 498.488 L
264.98 492.84 L
272.4 494.568 L
279.82 487.436 L
287.24 498.255 L
294.66 498.969 L
302.08 500.793 L
309.5 491.104 L
316.92 502.278 L
324.34 498.055 L
331.76 484.084 L
339.18 472.198 L
346.6 466.436 L
354.02 453.733 L
361.44 501.542 L
368.86 497.361 L
376.28 505.521 L
383.7 501.034 L
391.12 462.928 L
398.54 437.91 L
405.96 428.476 L
413.38 408.446 L
420.8 490.986 L
428.22 497.983 L
435.64 497.963 L
443.06 497.963 L
450.48 492.781 L
457.9 501.66 L
465.32 480.534 L
472.74 467.381 L
480.16 498.013 L
487.58 497.105 L
495 500.459 L
502.42 493.255 L
509.84 498.281 L
517.26 494.105 L
524.68 498.689 L
532.1 498.551 L
539.52 498.503 L
546.94 495.426 L
554.36 492.363 L
561.78 496.946 L
569.2 494.816 L
576.62 508.562 L
584.04 497.65 L
591.46 496.958 L
598.88 501.788 L
606.3 496.408 L
613.72 494.927 L
621.14 479.802 L
628.56 495.756 L
635.98 497.064 L
643.4 499.28 L
650.82 497.124 L
658.24 480.506 L
665.66 460.539 L
673.08 453.363 L
680.5 454.734 L
687.92 498.299 L
695.34 496.503 L
702.76 494.041 L
710.18 486.626 L
717.6 496.683 L
725.02 498.467 L
732.44 500.895 L
739.86 500.627 L
747.28 519.129 L
754.7 498.194 L
762.12 496.906 L
769.54 499.431 L
776.96 495.712 L
784.38 496.838 L
791.8 478.315 L
799.22 483.509 L
806.64 495.617 L
814.06 499.949 L
821.48 495.918 L
828.9 496.473 L
836.32 539 L
843.74 482.989 L
851.16 498.993 L
858.58 500.43 L
866 506.822 L
S
GR
GS
[0.75 0 0 0.75 0 -0.25] CT
[10 6] 0 setdash
2 LJ
0.667 LW
N
124 474.722 M
866 474.722 L
S
GR
GS
[0.75 0 0 0.75 0 -0.25] CT
[10 6] 0 setdash
2 LJ
0.667 LW
N
124 521.203 M
866 521.203 L
S
GR
GS
[0.75 0 0 0.75 104.13 373.2221] CT
0 0.447 0.741 RC
N
f1921431499
f
GR
GS
[0.75 0 0 0.75 104.13 373.2221] CT
0 0.447 0.741 RC
10.0 ML
N
2.667 0 M
2.667 -1.473 1.473 -2.667 0 -2.667 C
-1.473 -2.667 -2.667 -1.473 -2.667 0 C
-2.667 1.473 -1.473 2.667 0 2.667 C
1.473 2.667 2.667 1.473 2.667 0 C
cp
S
GR
GS
[0.75 0 0 0.75 109.695 373.2221] CT
0 0.447 0.741 RC
N
f1921431499
f
GR
GS
[0.75 0 0 0.75 109.695 373.2221] CT
0 0.447 0.741 RC
10.0 ML
N
2.667 0 M
2.667 -1.473 1.473 -2.667 0 -2.667 C
-1.473 -2.667 -2.667 -1.473 -2.667 0 C
-2.667 1.473 -1.473 2.667 0 2.667 C
1.473 2.667 2.667 1.473 2.667 0 C
cp
S
GR
GS
[0.75 0 0 0.75 115.25999 373.2221] CT
0 0.447 0.741 RC
N
f1921431499
f
GR
GS
[0.75 0 0 0.75 115.25999 373.2221] CT
0 0.447 0.741 RC
10.0 ML
N
2.667 0 M
2.667 -1.473 1.473 -2.667 0 -2.667 C
-1.473 -2.667 -2.667 -1.473 -2.667 0 C
-2.667 1.473 -1.473 2.667 0 2.667 C
1.473 2.667 2.667 1.473 2.667 0 C
cp
S
GR
GS
[0.75 0 0 0.75 120.825 373.2221] CT
0 0.447 0.741 RC
N
f1921431499
f
GR
GS
[0.75 0 0 0.75 120.825 373.2221] CT
0 0.447 0.741 RC
10.0 ML
N
2.667 0 M
2.667 -1.473 1.473 -2.667 0 -2.667 C
-1.473 -2.667 -2.667 -1.473 -2.667 0 C
-2.667 1.473 -1.473 2.667 0 2.667 C
1.473 2.667 2.667 1.473 2.667 0 C
cp
S
GR
GS
[0.75 0 0 0.75 148.65 373.2221] CT
0 0.447 0.741 RC
N
f1921431499
f
GR
GS
[0.75 0 0 0.75 148.65 373.2221] CT
0 0.447 0.741 RC
10.0 ML
N
2.667 0 M
2.667 -1.473 1.473 -2.667 0 -2.667 C
-1.473 -2.667 -2.667 -1.473 -2.667 0 C
-2.667 1.473 -1.473 2.667 0 2.667 C
1.473 2.667 2.667 1.473 2.667 0 C
cp
S
GR
GS
[0.75 0 0 0.75 154.215 373.2221] CT
0 0.447 0.741 RC
N
f1921431499
f
GR
GS
[0.75 0 0 0.75 154.215 373.2221] CT
0 0.447 0.741 RC
10.0 ML
N
2.667 0 M
2.667 -1.473 1.473 -2.667 0 -2.667 C
-1.473 -2.667 -2.667 -1.473 -2.667 0 C
-2.667 1.473 -1.473 2.667 0 2.667 C
1.473 2.667 2.667 1.473 2.667 0 C
cp
S
GR
GS
[0.75 0 0 0.75 170.91 373.2221] CT
0 0.447 0.741 RC
N
f1921431499
f
GR
GS
[0.75 0 0 0.75 170.91 373.2221] CT
0 0.447 0.741 RC
10.0 ML
N
2.667 0 M
2.667 -1.473 1.473 -2.667 0 -2.667 C
-1.473 -2.667 -2.667 -1.473 -2.667 0 C
-2.667 1.473 -1.473 2.667 0 2.667 C
1.473 2.667 2.667 1.473 2.667 0 C
cp
S
GR
GS
[0.75 0 0 0.75 176.475 373.2221] CT
0 0.447 0.741 RC
N
f1921431499
f
GR
GS
[0.75 0 0 0.75 176.475 373.2221] CT
0 0.447 0.741 RC
10.0 ML
N
2.667 0 M
2.667 -1.473 1.473 -2.667 0 -2.667 C
-1.473 -2.667 -2.667 -1.473 -2.667 0 C
-2.667 1.473 -1.473 2.667 0 2.667 C
1.473 2.667 2.667 1.473 2.667 0 C
cp
S
GR
GS
[0.75 0 0 0.75 182.04 373.2221] CT
0 0.447 0.741 RC
N
f1921431499
f
GR
GS
[0.75 0 0 0.75 182.04 373.2221] CT
0 0.447 0.741 RC
10.0 ML
N
2.667 0 M
2.667 -1.473 1.473 -2.667 0 -2.667 C
-1.473 -2.667 -2.667 -1.473 -2.667 0 C
-2.667 1.473 -1.473 2.667 0 2.667 C
1.473 2.667 2.667 1.473 2.667 0 C
cp
S
GR
GS
[0.75 0 0 0.75 187.605 373.2221] CT
0 0.447 0.741 RC
N
f1921431499
f
GR
GS
[0.75 0 0 0.75 187.605 373.2221] CT
0 0.447 0.741 RC
10.0 ML
N
2.667 0 M
2.667 -1.473 1.473 -2.667 0 -2.667 C
-1.473 -2.667 -2.667 -1.473 -2.667 0 C
-2.667 1.473 -1.473 2.667 0 2.667 C
1.473 2.667 2.667 1.473 2.667 0 C
cp
S
GR
GS
[0.75 0 0 0.75 204.3 373.2221] CT
0 0.447 0.741 RC
N
f1921431499
f
GR
GS
[0.75 0 0 0.75 204.3 373.2221] CT
0 0.447 0.741 RC
10.0 ML
N
2.667 0 M
2.667 -1.473 1.473 -2.667 0 -2.667 C
-1.473 -2.667 -2.667 -1.473 -2.667 0 C
-2.667 1.473 -1.473 2.667 0 2.667 C
1.473 2.667 2.667 1.473 2.667 0 C
cp
S
GR
GS
[0.75 0 0 0.75 209.86501 373.2221] CT
0 0.447 0.741 RC
N
f1921431499
f
GR
GS
[0.75 0 0 0.75 209.86501 373.2221] CT
0 0.447 0.741 RC
10.0 ML
N
2.667 0 M
2.667 -1.473 1.473 -2.667 0 -2.667 C
-1.473 -2.667 -2.667 -1.473 -2.667 0 C
-2.667 1.473 -1.473 2.667 0 2.667 C
1.473 2.667 2.667 1.473 2.667 0 C
cp
S
GR
GS
[0.75 0 0 0.75 248.82001 373.2221] CT
0 0.447 0.741 RC
N
f1921431499
f
GR
GS
[0.75 0 0 0.75 248.82001 373.2221] CT
0 0.447 0.741 RC
10.0 ML
N
2.667 0 M
2.667 -1.473 1.473 -2.667 0 -2.667 C
-1.473 -2.667 -2.667 -1.473 -2.667 0 C
-2.667 1.473 -1.473 2.667 0 2.667 C
1.473 2.667 2.667 1.473 2.667 0 C
cp
S
GR
GS
[0.75 0 0 0.75 254.38499 373.2221] CT
0 0.447 0.741 RC
N
f1921431499
f
GR
GS
[0.75 0 0 0.75 254.38499 373.2221] CT
0 0.447 0.741 RC
10.0 ML
N
2.667 0 M
2.667 -1.473 1.473 -2.667 0 -2.667 C
-1.473 -2.667 -2.667 -1.473 -2.667 0 C
-2.667 1.473 -1.473 2.667 0 2.667 C
1.473 2.667 2.667 1.473 2.667 0 C
cp
S
GR
GS
[0.75 0 0 0.75 259.95 373.2221] CT
0 0.447 0.741 RC
N
f1921431499
f
GR
GS
[0.75 0 0 0.75 259.95 373.2221] CT
0 0.447 0.741 RC
10.0 ML
N
2.667 0 M
2.667 -1.473 1.473 -2.667 0 -2.667 C
-1.473 -2.667 -2.667 -1.473 -2.667 0 C
-2.667 1.473 -1.473 2.667 0 2.667 C
1.473 2.667 2.667 1.473 2.667 0 C
cp
S
GR
GS
[0.75 0 0 0.75 265.51499 373.2221] CT
0 0.447 0.741 RC
N
f1921431499
f
GR
GS
[0.75 0 0 0.75 265.51499 373.2221] CT
0 0.447 0.741 RC
10.0 ML
N
2.667 0 M
2.667 -1.473 1.473 -2.667 0 -2.667 C
-1.473 -2.667 -2.667 -1.473 -2.667 0 C
-2.667 1.473 -1.473 2.667 0 2.667 C
1.473 2.667 2.667 1.473 2.667 0 C
cp
S
GR
GS
[0.75 0 0 0.75 293.34 373.2221] CT
0 0.447 0.741 RC
N
f1921431499
f
GR
GS
[0.75 0 0 0.75 293.34 373.2221] CT
0 0.447 0.741 RC
10.0 ML
N
2.667 0 M
2.667 -1.473 1.473 -2.667 0 -2.667 C
-1.473 -2.667 -2.667 -1.473 -2.667 0 C
-2.667 1.473 -1.473 2.667 0 2.667 C
1.473 2.667 2.667 1.473 2.667 0 C
cp
S
GR
GS
[0.75 0 0 0.75 298.90501 373.2221] CT
0 0.447 0.741 RC
N
f1921431499
f
GR
GS
[0.75 0 0 0.75 298.90501 373.2221] CT
0 0.447 0.741 RC
10.0 ML
N
2.667 0 M
2.667 -1.473 1.473 -2.667 0 -2.667 C
-1.473 -2.667 -2.667 -1.473 -2.667 0 C
-2.667 1.473 -1.473 2.667 0 2.667 C
1.473 2.667 2.667 1.473 2.667 0 C
cp
S
GR
GS
[0.75 0 0 0.75 304.46999 373.2221] CT
0 0.447 0.741 RC
N
f1921431499
f
GR
GS
[0.75 0 0 0.75 304.46999 373.2221] CT
0 0.447 0.741 RC
10.0 ML
N
2.667 0 M
2.667 -1.473 1.473 -2.667 0 -2.667 C
-1.473 -2.667 -2.667 -1.473 -2.667 0 C
-2.667 1.473 -1.473 2.667 0 2.667 C
1.473 2.667 2.667 1.473 2.667 0 C
cp
S
GR
GS
[0.75 0 0 0.75 310.035 373.2221] CT
0 0.447 0.741 RC
N
f1921431499
f
GR
GS
[0.75 0 0 0.75 310.035 373.2221] CT
0 0.447 0.741 RC
10.0 ML
N
2.667 0 M
2.667 -1.473 1.473 -2.667 0 -2.667 C
-1.473 -2.667 -2.667 -1.473 -2.667 0 C
-2.667 1.473 -1.473 2.667 0 2.667 C
1.473 2.667 2.667 1.473 2.667 0 C
cp
S
GR
GS
[0.75 0 0 0.75 348.99001 373.2221] CT
0 0.447 0.741 RC
N
f1921431499
f
GR
GS
[0.75 0 0 0.75 348.99001 373.2221] CT
0 0.447 0.741 RC
10.0 ML
N
2.667 0 M
2.667 -1.473 1.473 -2.667 0 -2.667 C
-1.473 -2.667 -2.667 -1.473 -2.667 0 C
-2.667 1.473 -1.473 2.667 0 2.667 C
1.473 2.667 2.667 1.473 2.667 0 C
cp
S
GR
GS
[0.75 0 0 0.75 354.55499 373.2221] CT
0 0.447 0.741 RC
N
f1921431499
f
GR
GS
[0.75 0 0 0.75 354.55499 373.2221] CT
0 0.447 0.741 RC
10.0 ML
N
2.667 0 M
2.667 -1.473 1.473 -2.667 0 -2.667 C
-1.473 -2.667 -2.667 -1.473 -2.667 0 C
-2.667 1.473 -1.473 2.667 0 2.667 C
1.473 2.667 2.667 1.473 2.667 0 C
cp
S
GR
GS
[0.75 0 0 0.75 415.76999 373.2221] CT
0 0.447 0.741 RC
N
f1921431499
f
GR
GS
[0.75 0 0 0.75 415.76999 373.2221] CT
0 0.447 0.741 RC
10.0 ML
N
2.667 0 M
2.667 -1.473 1.473 -2.667 0 -2.667 C
-1.473 -2.667 -2.667 -1.473 -2.667 0 C
-2.667 1.473 -1.473 2.667 0 2.667 C
1.473 2.667 2.667 1.473 2.667 0 C
cp
S
GR
GS
[0.75 0 0 0.75 421.33502 373.2221] CT
0 0.447 0.741 RC
N
f1921431499
f
GR
GS
[0.75 0 0 0.75 421.33502 373.2221] CT
0 0.447 0.741 RC
10.0 ML
N
2.667 0 M
2.667 -1.473 1.473 -2.667 0 -2.667 C
-1.473 -2.667 -2.667 -1.473 -2.667 0 C
-2.667 1.473 -1.473 2.667 0 2.667 C
1.473 2.667 2.667 1.473 2.667 0 C
cp
S
GR
GS
[0.75 0 0 0.75 460.28998 373.2221] CT
0 0.447 0.741 RC
N
f1921431499
f
GR
GS
[0.75 0 0 0.75 460.28998 373.2221] CT
0 0.447 0.741 RC
10.0 ML
N
2.667 0 M
2.667 -1.473 1.473 -2.667 0 -2.667 C
-1.473 -2.667 -2.667 -1.473 -2.667 0 C
-2.667 1.473 -1.473 2.667 0 2.667 C
1.473 2.667 2.667 1.473 2.667 0 C
cp
S
GR
GS
[0.75 0 0 0.75 465.85501 373.2221] CT
0 0.447 0.741 RC
N
f1921431499
f
GR
GS
[0.75 0 0 0.75 465.85501 373.2221] CT
0 0.447 0.741 RC
10.0 ML
N
2.667 0 M
2.667 -1.473 1.473 -2.667 0 -2.667 C
-1.473 -2.667 -2.667 -1.473 -2.667 0 C
-2.667 1.473 -1.473 2.667 0 2.667 C
1.473 2.667 2.667 1.473 2.667 0 C
cp
S
GR
GS
[0.75 0 0 0.75 493.67999 373.2221] CT
0 0.447 0.741 RC
N
f1921431499
f
GR
GS
[0.75 0 0 0.75 493.67999 373.2221] CT
0 0.447 0.741 RC
10.0 ML
N
2.667 0 M
2.667 -1.473 1.473 -2.667 0 -2.667 C
-1.473 -2.667 -2.667 -1.473 -2.667 0 C
-2.667 1.473 -1.473 2.667 0 2.667 C
1.473 2.667 2.667 1.473 2.667 0 C
cp
S
GR
GS
[0.75 0 0 0.75 499.24498 373.2221] CT
0 0.447 0.741 RC
N
f1921431499
f
GR
GS
[0.75 0 0 0.75 499.24498 373.2221] CT
0 0.447 0.741 RC
10.0 ML
N
2.667 0 M
2.667 -1.473 1.473 -2.667 0 -2.667 C
-1.473 -2.667 -2.667 -1.473 -2.667 0 C
-2.667 1.473 -1.473 2.667 0 2.667 C
1.473 2.667 2.667 1.473 2.667 0 C
cp
S
GR
GS
[0.75 0 0 0.75 504.81001 373.2221] CT
0 0.447 0.741 RC
N
f1921431499
f
GR
GS
[0.75 0 0 0.75 504.81001 373.2221] CT
0 0.447 0.741 RC
10.0 ML
N
2.667 0 M
2.667 -1.473 1.473 -2.667 0 -2.667 C
-1.473 -2.667 -2.667 -1.473 -2.667 0 C
-2.667 1.473 -1.473 2.667 0 2.667 C
1.473 2.667 2.667 1.473 2.667 0 C
cp
S
GR
GS
[0.75 0 0 0.75 510.375 373.2221] CT
0 0.447 0.741 RC
N
f1921431499
f
GR
GS
[0.75 0 0 0.75 510.375 373.2221] CT
0 0.447 0.741 RC
10.0 ML
N
2.667 0 M
2.667 -1.473 1.473 -2.667 0 -2.667 C
-1.473 -2.667 -2.667 -1.473 -2.667 0 C
-2.667 1.473 -1.473 2.667 0 2.667 C
1.473 2.667 2.667 1.473 2.667 0 C
cp
S
GR
GS
[0.75 0 0 0.75 527.07001 373.2221] CT
0 0.447 0.741 RC
N
f1921431499
f
GR
GS
[0.75 0 0 0.75 527.07001 373.2221] CT
0 0.447 0.741 RC
10.0 ML
N
2.667 0 M
2.667 -1.473 1.473 -2.667 0 -2.667 C
-1.473 -2.667 -2.667 -1.473 -2.667 0 C
-2.667 1.473 -1.473 2.667 0 2.667 C
1.473 2.667 2.667 1.473 2.667 0 C
cp
S
GR
GS
[0.75 0 0 0.75 532.63499 373.2221] CT
0 0.447 0.741 RC
N
f1921431499
f
GR
GS
[0.75 0 0 0.75 532.63499 373.2221] CT
0 0.447 0.741 RC
10.0 ML
N
2.667 0 M
2.667 -1.473 1.473 -2.667 0 -2.667 C
-1.473 -2.667 -2.667 -1.473 -2.667 0 C
-2.667 1.473 -1.473 2.667 0 2.667 C
1.473 2.667 2.667 1.473 2.667 0 C
cp
S
GR
GS
[0.75 0 0 0.75 593.84999 373.2221] CT
0 0.447 0.741 RC
N
f1921431499
f
GR
GS
[0.75 0 0 0.75 593.84999 373.2221] CT
0 0.447 0.741 RC
10.0 ML
N
2.667 0 M
2.667 -1.473 1.473 -2.667 0 -2.667 C
-1.473 -2.667 -2.667 -1.473 -2.667 0 C
-2.667 1.473 -1.473 2.667 0 2.667 C
1.473 2.667 2.667 1.473 2.667 0 C
cp
S
GR
GS
[0.75 0 0 0.75 599.41498 373.2221] CT
0 0.447 0.741 RC
N
f1921431499
f
GR
GS
[0.75 0 0 0.75 599.41498 373.2221] CT
0 0.447 0.741 RC
10.0 ML
N
2.667 0 M
2.667 -1.473 1.473 -2.667 0 -2.667 C
-1.473 -2.667 -2.667 -1.473 -2.667 0 C
-2.667 1.473 -1.473 2.667 0 2.667 C
1.473 2.667 2.667 1.473 2.667 0 C
cp
S
GR
GS
[0.75 0 0 0.75 649.5 373.2221] CT
0 0.447 0.741 RC
N
f1921431499
f
GR
GS
[0.75 0 0 0.75 649.5 373.2221] CT
0 0.447 0.741 RC
10.0 ML
N
2.667 0 M
2.667 -1.473 1.473 -2.667 0 -2.667 C
-1.473 -2.667 -2.667 -1.473 -2.667 0 C
-2.667 1.473 -1.473 2.667 0 2.667 C
1.473 2.667 2.667 1.473 2.667 0 C
cp
S
GR
%%Trailer
%%Pages: 1
%%EOF
