\relax 
\providecommand\hyper@newdestlabel[2]{}
\@writefile{toc}{\contentsline {chapter}{\numberline {6}Hybridized Navigation Filters and theoretical limits on positioning with correlated measurements}{83}{chapter.6}\protected@file@percent }
\@writefile{lof}{\addvspace {10\p@ }}
\@writefile{lot}{\addvspace {10\p@ }}
\newlabel{ch:navFilters}{{6}{83}{Hybridized Navigation Filters and theoretical limits on positioning with correlated measurements}{chapter.6}{}}
\acronymused{GNSS}
\acronymused{RF}
\acronymused{GNSS}
\acronymused{PNT}
\acronymused{RF}
\acronymused{GNSS}
\acronymused{GNSS}
\acronymused{EKF}
\AC@undonewlabel{acro:UKF}
\newlabel{acro:UKF}{{6}{83}{Hybridized Navigation Filters and theoretical limits on positioning with correlated measurements}{chapter.6}{}}
\acronymused{UKF}
\acronymused{HMM}
\AC@undonewlabel{acro:MMSE}
\newlabel{acro:MMSE}{{6}{83}{Hybridized Navigation Filters and theoretical limits on positioning with correlated measurements}{chapter.6}{}}
\acronymused{MMSE}
\AC@undonewlabel{acro:H-WLMS}
\newlabel{acro:H-WLMS}{{6}{83}{Hybridized Navigation Filters and theoretical limits on positioning with correlated measurements}{chapter.6}{}}
\acronymused{H-WLMS}
\AC@undonewlabel{acro:H-EKF}
\newlabel{acro:H-EKF}{{6}{83}{Hybridized Navigation Filters and theoretical limits on positioning with correlated measurements}{chapter.6}{}}
\acronymused{H-EKF}
\AC@undonewlabel{acro:H-PF}
\newlabel{acro:H-PF}{{6}{83}{Hybridized Navigation Filters and theoretical limits on positioning with correlated measurements}{chapter.6}{}}
\acronymused{H-PF}
\acronymused{IAR}
\acronymused{HMM}
\@writefile{toc}{\contentsline {section}{\numberline {6.1}Modified \ac {HMM} for correlated measurements}{84}{section.6.1}\protected@file@percent }
\newlabel{sec:hmm}{{6.1}{84}{Modified \ac {HMM} for correlated measurements}{section.6.1}{}}
\acronymused{GNSS}
\newlabel{sec:problem}{{6.1}{84}{Modified \ac {HMM} for correlated measurements}{section.6.1}{}}
\@writefile{lof}{\contentsline {figure}{\numberline {6.1}{\ignorespaces {\relax \fontsize  {10}{12}\selectfont  \abovedisplayskip 10\p@ plus2\p@ minus5\p@ \abovedisplayshortskip \z@ plus3\p@ \belowdisplayshortskip 6\p@ plus3\p@ minus3\p@ \def \leftmargin \leftmargini \parsep 4.5\p@ plus2\p@ minus\p@ \topsep 9\p@ plus3\p@ minus5\p@ \itemsep 4.5\p@ plus2\p@ minus\p@ {\leftmargin \leftmargini \topsep 6\p@ plus2\p@ minus2\p@ \parsep 3\p@ plus2\p@ minus\p@ \itemsep \parsep }\belowdisplayskip \abovedisplayskip Hidden Markov Model (HMM) for a single agent retrieving direct observable measurements}.\relax }}{84}{figure.caption.65}\protected@file@percent }
\newlabel{fig:HHM_figure}{{6.1}{84}{{\small Hidden Markov Model (HMM) for a single agent retrieving direct observable measurements}.\relax }{figure.caption.65}{}}
\acronymused{HMM}
\@writefile{toc}{\contentsline {subsection}{\numberline {6.1.1}A model of the positioning problem: the \ac {HMM}}{84}{subsection.6.1.1}\protected@file@percent }
\newlabel{sub:hmm_model}{{6.1.1}{84}{A model of the positioning problem: the \ac {HMM}}{subsection.6.1.1}{}}
\acronymused{HMM}
\newlabel{eq:stateEKF}{{6.1}{84}{A model of the positioning problem: the \ac {HMM}}{equation.6.1.1}{}}
\newlabel{eq:observables}{{6.2}{84}{A model of the positioning problem: the \ac {HMM}}{equation.6.1.2}{}}
\acronymused{GNSS}
\acronymused{HMM}
\newlabel{eq:stateTransition}{{6.5}{85}{A model of the positioning problem: the \ac {HMM}}{equation.6.1.5}{}}
\acronymused{GNSS}
\newlabel{eq:measurementEquation}{{6.6}{85}{A model of the positioning problem: the \ac {HMM}}{equation.6.1.6}{}}
\newlabel{eq:bayes}{{6.7}{85}{A model of the positioning problem: the \ac {HMM}}{equation.6.1.7}{}}
\newlabel{eq:meas}{{6.8}{85}{A model of the positioning problem: the \ac {HMM}}{equation.6.1.8}{}}
\acronymused{HMM}
\@writefile{toc}{\contentsline {subsection}{\numberline {6.1.2}Combined Observable Measurements and Implicit Belief Propagation}{86}{subsection.6.1.2}\protected@file@percent }
\@writefile{lof}{\contentsline {figure}{\numberline {6.2}{\ignorespaces {\relax \fontsize  {10}{12}\selectfont  \abovedisplayskip 10\p@ plus2\p@ minus5\p@ \abovedisplayshortskip \z@ plus3\p@ \belowdisplayshortskip 6\p@ plus3\p@ minus3\p@ \def \leftmargin \leftmargini \parsep 4.5\p@ plus2\p@ minus\p@ \topsep 9\p@ plus3\p@ minus5\p@ \itemsep 4.5\p@ plus2\p@ minus\p@ {\leftmargin \leftmargini \topsep 6\p@ plus2\p@ minus2\p@ \parsep 3\p@ plus2\p@ minus\p@ \itemsep \parsep }\belowdisplayskip \abovedisplayskip Modified HMM for dual agent state-space estimation with combined, correlated measurement generation. MM referred to the functional scheme of networked \ac {GNSS} receiver.}\relax }}{86}{figure.caption.66}\protected@file@percent }
\acronymused{GNSS}
\newlabel{fig:HHM_figure2}{{6.2}{86}{{\small Modified HMM for dual agent state-space estimation with combined, correlated measurement generation. MM referred to the functional scheme of networked \ac {GNSS} receiver.}\relax }{figure.caption.66}{}}
\newlabel{eq:measVec}{{6.11}{86}{Combined Observable Measurements and Implicit Belief Propagation}{equation.6.1.11}{}}
\newlabel{eq:generalIvd}{{6.12}{86}{Combined Observable Measurements and Implicit Belief Propagation}{equation.6.1.12}{}}
\acronymused{HMM}
\newlabel{eq:bayesExtended}{{6.13}{87}{Combined Observable Measurements and Implicit Belief Propagation}{equation.6.1.13}{}}
\newlabel{eq:dependency}{{6.14}{87}{Combined Observable Measurements and Implicit Belief Propagation}{equation.6.1.14}{}}
\acronymused{CRLB}
\acronymused{GNSS}
\@writefile{toc}{\contentsline {subsection}{\numberline {6.1.3}Hybrid Measurements Modelling in \ac {GNSS}}{87}{subsection.6.1.3}\protected@file@percent }
\acronymused{GNSS}
\acronymused{GNSS}
\newlabel{eq:measVecGNSS}{{6.15}{87}{Hybrid Measurements Modelling in \ac {GNSS}}{equation.6.1.15}{}}
\acronymused{HMM}
\@writefile{lof}{\contentsline {figure}{\numberline {6.3}{\ignorespaces {\relax \fontsize  {10}{12}\selectfont  \abovedisplayskip 10\p@ plus2\p@ minus5\p@ \abovedisplayshortskip \z@ plus3\p@ \belowdisplayshortskip 6\p@ plus3\p@ minus3\p@ \def \leftmargin \leftmargini \parsep 4.5\p@ plus2\p@ minus\p@ \topsep 9\p@ plus3\p@ minus5\p@ \itemsep 4.5\p@ plus2\p@ minus\p@ {\leftmargin \leftmargini \topsep 6\p@ plus2\p@ minus2\p@ \parsep 3\p@ plus2\p@ minus\p@ \itemsep \parsep }\belowdisplayskip \abovedisplayskip HMM in \ac {GNSS} aided system state estimation.}\relax }}{87}{figure.caption.67}\protected@file@percent }
\acronymused{GNSS}
\newlabel{fig:HHM_figure3}{{6.3}{87}{{\small HMM in \ac {GNSS} aided system state estimation.}\relax }{figure.caption.67}{}}
\newlabel{eq:measCovMatrix}{{6.16}{88}{Hybrid Measurements Modelling in \ac {GNSS}}{equation.6.1.16}{}}
\acronymused{LMS}
\acronymused{WLS}
\@writefile{toc}{\contentsline {section}{\numberline {6.2}Hybrid \ac {WLS}}{88}{section.6.2}\protected@file@percent }
\acronymused{HMM}
\acronymused{WLS}
\acronymused{LMS}
\acronymused{KF}
\acronymused{PF}
\newlabel{eq:LMS_ioise}{{6.17}{88}{Hybrid \ac {WLS}}{equation.6.2.17}{}}
\AC@undonewlabel{acro:DCM}
\newlabel{acro:DCM}{{6.2}{88}{Hybrid \ac {WLS}}{equation.6.2.17}{}}
\acronymused{DCM}
\acronymused{WLS}
\acronymused{GNSS}
\acronymused{DCM}
\newlabel{eq:DCM}{{6.2}{89}{Hybrid \ac {WLS}}{equation.6.2.17}{}}
\acronymused{ML}
\newlabel{eq:WLMS_likelihood}{{6.21}{89}{Hybrid \ac {WLS}}{equation.6.2.21}{}}
\newlabel{eq:WLMS}{{6.23}{89}{Hybrid \ac {WLS}}{equation.6.2.23}{}}
\newlabel{eq:wlsCov}{{6.24}{89}{Hybrid \ac {WLS}}{equation.6.2.24}{}}
\acronymused{WLS}
\acronymused{SAIA}
\acronymused{WLS}
\@writefile{toc}{\contentsline {subsection}{\numberline {6.2.1}Weighted \ac {SAIA} for robust measurement integration in \ac {WLS}}{89}{subsection.6.2.1}\protected@file@percent }
\newlabel{sub:SAIA}{{6.2.1}{89}{Weighted \ac {SAIA} for robust measurement integration in \ac {WLS}}{subsection.6.2.1}{}}
\acronymused{H-WLMS}
\acronymused{PVT}
\acronymused{WLS}
\acronymused{SAIA}
\acronymused{SAIA}
\acronymused{WLS}
\acronymused{IAR}
\AC@undonewlabel{acro:W-SAIA}
\newlabel{acro:W-SAIA}{{6.2.1}{90}{Weighted \ac {SAIA} for robust measurement integration in \ac {WLS}}{subsection.6.2.1}{}}
\acronymused{W-SAIA}
\acronymused{WLS}
\acronymused{W-SAIA}
\acronymused{WLS}
\acronymused{PVT}
\@writefile{toc}{\contentsline {section}{\numberline {6.3}Approximated Bayesian Estimation}{90}{section.6.3}\protected@file@percent }
\acronymused{EKF}
\acronymused{PF}
\@writefile{toc}{\contentsline {subsection}{\numberline {6.3.1}Hybrid Extended Kalman Filter}{91}{subsection.6.3.1}\protected@file@percent }
\acronymused{KF}
\acronymused{MMSE}
\acronymused{GNSS}
\acronymused{LoS}
\acronymused{EKF}
\acronymused{UKF}
\@writefile{toc}{\contentsline {subsubsection}{Models equations}{91}{subsection.6.3.1}\protected@file@percent }
\acronymused{EKF}
\@writefile{loc}{\ChangesListline {added}{Added~(1)}{a}{91}}
\newlabel{eq:sys_model}{{6.30}{91}{Models equations}{equation.6.3.30}{}}
\newlabel{eq:sys_model_compact}{{6.31}{91}{Models equations}{equation.6.3.31}{}}
\newlabel{eq:systemnoise}{{6.32}{91}{Models equations}{equation.6.3.32}{}}
\acronymused{GNSS}
\acronymused{GNSS}
\newlabel{eq:meas_model}{{6.33}{92}{Models equations}{equation.6.3.33}{}}
\acronymused{EKF}
\newlabel{eq:linearized_meas}{{6.35}{92}{Models equations}{equation.6.3.35}{}}
\acronymused{GNSS}
\@writefile{loc}{\ChangesListline {added}{Added~(1)}{linearized}{92}}
\@writefile{loc}{\ChangesListline {added}{Added~(1)}{incremental}{92}}
\newlabel{eq:vectorExtended}{{6.36}{92}{Models equations}{equation.6.3.36}{}}
\acronymused{DCM}
\@writefile{toc}{\contentsline {subsubsection}{EKF routine}{92}{equation.6.3.36}\protected@file@percent }
\acronymused{EKF}
\acronymused{EKF}
\acronymused{EKF}
\acronymused{EKF}
\acronymused{EKF}
\acronymused{EKF}
\newlabel{eq:cov_pred}{{6.38}{93}{EKF routine}{equation.6.3.38}{}}
\newlabel{eq:Kgain}{{6.39}{93}{EKF routine}{equation.6.3.39}{}}
\newlabel{eq:inc_state_est}{{6.40}{93}{EKF routine}{equation.6.3.40}{}}
\newlabel{eq:cov_upd}{{6.43}{93}{EKF routine}{equation.6.3.43}{}}
\acronymused{EKF}
\acronymused{EKF}
\acronymused{EKF}
\@writefile{toc}{\contentsline {subsubsection}{Error-state EKF indirect routine}{93}{equation.6.3.43}\protected@file@percent }
\@writefile{lof}{\contentsline {figure}{\numberline {6.4}{\ignorespaces {\relax \fontsize  {10}{12}\selectfont  \abovedisplayskip 10\p@ plus2\p@ minus5\p@ \abovedisplayshortskip \z@ plus3\p@ \belowdisplayshortskip 6\p@ plus3\p@ minus3\p@ \def \leftmargin \leftmargini \parsep 4.5\p@ plus2\p@ minus\p@ \topsep 9\p@ plus3\p@ minus5\p@ \itemsep 4.5\p@ plus2\p@ minus\p@ {\leftmargin \leftmargini \topsep 6\p@ plus2\p@ minus2\p@ \parsep 3\p@ plus2\p@ minus\p@ \itemsep \parsep }\belowdisplayskip \abovedisplayskip Indirect \ac {KF} scheme. }\relax }}{93}{figure.caption.68}\protected@file@percent }
\acronymused{KF}
\newlabel{fig:indEKF}{{6.4}{93}{{\small Indirect \ac {KF} scheme. }\relax }{figure.caption.68}{}}
\acronymused{KF}
\acronymused{KF}
\acronymused{INS}
\acronymused{INS}
\acronymused{GNSS}
\@writefile{loc}{\ChangesListline {added}{Added~(1)}{, overconfidence or uncontrolled growth of $\mathbf  {P}_k$}{94}}
\acronymused{WLS}
\acronymused{PVT}
\@writefile{loc}{\ChangesListline {added}{Added~(1)}{The same result can be achieved by setting the process covariance matrix $\mathbf  {Q}_k$ to infinite.}{94}}
\@writefile{toc}{\contentsline {subsection}{\numberline {6.3.2}Hybrid Particle Filter}{94}{subsection.6.3.2}\protected@file@percent }
\acronymused{PF}
\acronymused{SIS}
\acronymused{PF}
\acronymused{PNT}
\acronymused{GNSS}
\acronymused{CP}
\acronymused{EKF}
\@writefile{toc}{\contentsline {subsubsection}{Model Equations}{95}{subsection.6.3.2}\protected@file@percent }
\acronymused{PF}
\newlabel{eq:particle}{{6.51}{95}{Model Equations}{equation.6.3.51}{}}
\newlabel{eq:aPostProb}{{6.52}{95}{Model Equations}{equation.6.3.52}{}}
\newlabel{eq:measLikelihood}{{6.53}{95}{Model Equations}{equation.6.3.53}{}}
\acronymused{PF}
\AC@undonewlabel{acro:SIR}
\newlabel{acro:SIR}{{4}{95}{Model Equations}{Item.4}{}}
\acronymused{SIR}
\newlabel{eq:thresholdParticle}{{6.54}{96}{Model Equations}{equation.6.3.54}{}}
\acronymused{EKF}
\acronymused{PF}
\acronymused{PF}
\acronymused{PF}
\acronymused{H-PF}
\acronymused{CRLB}
\@writefile{toc}{\contentsline {section}{\numberline {6.4}On the approximation of a \ac {CRLB} for hybrid navigation filters}{96}{section.6.4}\protected@file@percent }
\acronymused{GNSS}
\acronymused{CRLB}
\acronymused{H-WLMS}
\acronymused{H-EKF}
\acronymused{GDOP}
\acronymused{GDOP}
\acronymused{GDOP}
\acronymused{CRLB}
\AC@undonewlabel{acro:CDOP}
\newlabel{acro:CDOP}{{6.4}{96}{On the approximation of a \ac {CRLB} for hybrid navigation filters}{section.6.4}{}}
\acronymused{CDOP}
\newlabel{eq:cooperativeGDOP}{{6.55}{96}{On the approximation of a \ac {CRLB} for hybrid navigation filters}{equation.6.4.55}{}}
\acronymused{DCM}
\@writefile{loc}{\ChangesListline {added}{Added~(1)}{where $Tr(\cdot )$ indicates the trace operation and $\bar {\mathbf  {H}}$ is the hybrid \ac {DCM} drawn accordingly to satellites and terrestrial anchors positions.}{96}}
\acronymused{CRLB}
\acronymused{CRLB}
\acronymused{GNSS}
\acronymused{FIM}
\acronymused{CRLB}
\@writefile{toc}{\contentsline {subsection}{\numberline {6.4.1}\ac {FIM} and \ac {CRLB}: definitions}{97}{subsection.6.4.1}\protected@file@percent }
\acronymused{CRLB}
\acronymused{CRLB}
\newlabel{eq:crlb}{{6.56}{97}{\ac {FIM} and \ac {CRLB}: definitions}{equation.6.4.56}{}}
\acronymused{PDF}
\acronymused{FIM}
\acronymused{CRLB}
\newlabel{eq:traceInequality}{{6.57}{97}{\ac {FIM} and \ac {CRLB}: definitions}{equation.6.4.57}{}}
\acronymused{CRLB}
\acronymused{CRLB}
\acronymused{CRLB}
\@writefile{toc}{\contentsline {subsection}{\numberline {6.4.2}Range Contributions Modelling}{97}{subsection.6.4.2}\protected@file@percent }
\newlabel{eq:satRange}{{6.58}{97}{Range Contributions Modelling}{equation.6.4.58}{}}
\newlabel{eq:fullMeasVector}{{6.60}{98}{Range Contributions Modelling}{equation.6.4.60}{}}
\newlabel{eq:measErrCovMatrix}{{6.61}{98}{Range Contributions Modelling}{equation.6.4.61}{}}
\@writefile{toc}{\contentsline {section}{\numberline {6.5}Fisher Information Matrix in Positioning Estimation}{98}{section.6.5}\protected@file@percent }
\newlabel{sec:fisher}{{6.5}{98}{Fisher Information Matrix in Positioning Estimation}{section.6.5}{}}
\@writefile{toc}{\contentsline {subsection}{\numberline {6.5.1}Fisher Information Matrix for Satellite-only Contributions}{98}{subsection.6.5.1}\protected@file@percent }
\newlabel{eq:theoreticaLikelihood}{{6.63}{99}{Fisher Information Matrix for Satellite-only Contributions}{equation.6.5.63}{}}
\acronymused{FIM}
\newlabel{eq:fimDef}{{6.65}{99}{Fisher Information Matrix for Satellite-only Contributions}{equation.6.5.65}{}}
\acronymused{FIM}
\newlabel{eq:FIM}{{6.66}{99}{Fisher Information Matrix for Satellite-only Contributions}{equation.6.5.66}{}}
\newlabel{eq:FIM_1}{{6.67}{99}{Fisher Information Matrix for Satellite-only Contributions}{equation.6.5.67}{}}
\newlabel{eq:FIM_2}{{6.68}{99}{Fisher Information Matrix for Satellite-only Contributions}{equation.6.5.68}{}}
\newlabel{eq:FIM_3}{{6.69}{99}{Fisher Information Matrix for Satellite-only Contributions}{equation.6.5.69}{}}
\acronymused{PVT}
\@writefile{toc}{\contentsline {subsection}{\numberline {6.5.2}Fisher Information Matrix for Cooperative Contributions}{99}{subsection.6.5.2}\protected@file@percent }
\acronymused{IAR}
\newlabel{eq:wAverageRealIAR}{{6.70}{99}{Fisher Information Matrix for Cooperative Contributions}{equation.6.5.70}{}}
\acronymused{IAR}
\acronymused{GNSS}
\newlabel{eq:terrLikelihood}{{6.71}{100}{Fisher Information Matrix for Cooperative Contributions}{equation.6.5.71}{}}
\acronymused{FIM}
\@writefile{toc}{\contentsline {subsection}{\numberline {6.5.3}\ac {FIM} computation in non-linear system estimation}{100}{subsection.6.5.3}\protected@file@percent }
\acronymused{EKF}
\acronymused{EKF}
\acronymused{LMS}
\acronymused{EKF}
\acronymused{KF}
\acronymused{LMS}
\acronymused{CRLB}
\acronymused{FIM}
\acronymused{EKF}
\acronymused{FIM}
\newlabel{eq:ekfFIM}{{6.72}{100}{\ac {FIM} computation in non-linear system estimation}{equation.6.5.72}{}}
\acronymused{FIM}
\@writefile{toc}{\contentsline {subsection}{\numberline {6.5.4}On the Approximation of the \ac {FIM} for Hybrid Navigation Filters}{100}{subsection.6.5.4}\protected@file@percent }
\acronymused{CRLB}
\acronymused{FIM}
\acronymused{FIM}
\acronymused{FIM}
\acronymused{FIM}
\acronymused{CRLB}
\acronymused{GNSS}
\@writefile{lof}{\contentsline {figure}{\numberline {6.5}{\ignorespaces {\relax \fontsize  {10}{12}\selectfont  \abovedisplayskip 10\p@ plus2\p@ minus5\p@ \abovedisplayshortskip \z@ plus3\p@ \belowdisplayshortskip 6\p@ plus3\p@ minus3\p@ \def \leftmargin \leftmargini \parsep 4.5\p@ plus2\p@ minus\p@ \topsep 9\p@ plus3\p@ minus5\p@ \itemsep 4.5\p@ plus2\p@ minus\p@ {\leftmargin \leftmargini \topsep 6\p@ plus2\p@ minus2\p@ \parsep 3\p@ plus2\p@ minus\p@ \itemsep \parsep }\belowdisplayskip \abovedisplayskip Example of theoretical computation of satellite-based positioning CRLB vs. hybrid positioning CRLB for a dynamic trajectory. }\relax }}{101}{figure.caption.69}\protected@file@percent }
\newlabel{fig:thCRLB}{{6.5}{101}{{\small Example of theoretical computation of satellite-based positioning CRLB vs. hybrid positioning CRLB for a dynamic trajectory. }\relax }{figure.caption.69}{}}
\acronymused{FIM}
\@setckpt{Chapter5/chapter5}{
\setcounter{page}{102}
\setcounter{equation}{72}
\setcounter{enumi}{5}
\setcounter{enumii}{0}
\setcounter{enumiii}{0}
\setcounter{enumiv}{0}
\setcounter{footnote}{0}
\setcounter{mpfootnote}{0}
\setcounter{part}{0}
\setcounter{chapter}{6}
\setcounter{section}{5}
\setcounter{subsection}{4}
\setcounter{subsubsection}{0}
\setcounter{paragraph}{0}
\setcounter{subparagraph}{0}
\setcounter{figure}{5}
\setcounter{table}{0}
\setcounter{SDpage}{0}
\setcounter{NumberSD}{0}
\setcounter{tomo}{0}
\setcounter{parentequation}{0}
\setcounter{caption@flags}{0}
\setcounter{ContinuedFloat}{0}
\setcounter{subfigure}{0}
\setcounter{subtable}{0}
\setcounter{float@type}{16}
\setcounter{tabx@nest}{0}
\setcounter{listtotal}{0}
\setcounter{listcount}{0}
\setcounter{liststart}{0}
\setcounter{liststop}{0}
\setcounter{citecount}{0}
\setcounter{citetotal}{0}
\setcounter{multicitecount}{0}
\setcounter{multicitetotal}{0}
\setcounter{instcount}{332}
\setcounter{maxnames}{3}
\setcounter{minnames}{1}
\setcounter{maxitems}{3}
\setcounter{minitems}{1}
\setcounter{citecounter}{0}
\setcounter{maxcitecounter}{0}
\setcounter{savedcitecounter}{0}
\setcounter{uniquelist}{0}
\setcounter{uniquename}{0}
\setcounter{refsection}{0}
\setcounter{refsegment}{0}
\setcounter{maxextratitle}{0}
\setcounter{maxextratitleyear}{0}
\setcounter{maxextraname}{5}
\setcounter{maxextradate}{0}
\setcounter{maxextraalpha}{0}
\setcounter{abbrvpenalty}{50}
\setcounter{highnamepenalty}{50}
\setcounter{lownamepenalty}{25}
\setcounter{maxparens}{3}
\setcounter{parenlevel}{0}
\setcounter{mincomprange}{10}
\setcounter{maxcomprange}{100000}
\setcounter{mincompwidth}{1}
\setcounter{afterword}{0}
\setcounter{savedafterword}{0}
\setcounter{annotator}{0}
\setcounter{savedannotator}{0}
\setcounter{author}{0}
\setcounter{savedauthor}{0}
\setcounter{bookauthor}{0}
\setcounter{savedbookauthor}{0}
\setcounter{commentator}{0}
\setcounter{savedcommentator}{0}
\setcounter{editor}{0}
\setcounter{savededitor}{0}
\setcounter{editora}{0}
\setcounter{savededitora}{0}
\setcounter{editorb}{0}
\setcounter{savededitorb}{0}
\setcounter{editorc}{0}
\setcounter{savededitorc}{0}
\setcounter{foreword}{0}
\setcounter{savedforeword}{0}
\setcounter{holder}{0}
\setcounter{savedholder}{0}
\setcounter{introduction}{0}
\setcounter{savedintroduction}{0}
\setcounter{namea}{0}
\setcounter{savednamea}{0}
\setcounter{nameb}{0}
\setcounter{savednameb}{0}
\setcounter{namec}{0}
\setcounter{savednamec}{0}
\setcounter{translator}{0}
\setcounter{savedtranslator}{0}
\setcounter{shortauthor}{0}
\setcounter{savedshortauthor}{0}
\setcounter{shorteditor}{0}
\setcounter{savedshorteditor}{0}
\setcounter{labelname}{0}
\setcounter{savedlabelname}{0}
\setcounter{institution}{0}
\setcounter{savedinstitution}{0}
\setcounter{lista}{0}
\setcounter{savedlista}{0}
\setcounter{listb}{0}
\setcounter{savedlistb}{0}
\setcounter{listc}{0}
\setcounter{savedlistc}{0}
\setcounter{listd}{0}
\setcounter{savedlistd}{0}
\setcounter{liste}{0}
\setcounter{savedliste}{0}
\setcounter{listf}{0}
\setcounter{savedlistf}{0}
\setcounter{location}{0}
\setcounter{savedlocation}{0}
\setcounter{organization}{0}
\setcounter{savedorganization}{0}
\setcounter{origlocation}{0}
\setcounter{savedoriglocation}{0}
\setcounter{origpublisher}{0}
\setcounter{savedorigpublisher}{0}
\setcounter{publisher}{0}
\setcounter{savedpublisher}{0}
\setcounter{language}{0}
\setcounter{savedlanguage}{0}
\setcounter{origlanguage}{0}
\setcounter{savedoriglanguage}{0}
\setcounter{pageref}{0}
\setcounter{savedpageref}{0}
\setcounter{textcitecount}{0}
\setcounter{textcitetotal}{0}
\setcounter{textcitemaxnames}{0}
\setcounter{biburlnumpenalty}{0}
\setcounter{biburlucpenalty}{0}
\setcounter{biburllcpenalty}{0}
\setcounter{smartand}{1}
\setcounter{bbx:relatedcount}{0}
\setcounter{bbx:relatedtotal}{0}
\setcounter{Item}{5}
\setcounter{Hfootnote}{0}
\setcounter{bookmark@seq@number}{76}
\setcounter{nlinenum}{0}
\setcounter{algorithm}{0}
\setcounter{ALC@unique}{0}
\setcounter{ALC@line}{0}
\setcounter{ALC@rem}{0}
\setcounter{ALC@depth}{0}
\setcounter{@todonotes@numberoftodonotes}{0}
\setcounter{Changes@AuthorCount}{2}
\setcounter{Changes@Author}{2}
\setcounter{Changes@addedCount}{1}
\setcounter{Changes@deletedCount}{0}
\setcounter{Changes@replacedCount}{1}
\setcounter{Changes@highlightCount}{0}
\setcounter{Changes@commentCount}{0}
\setcounter{authorcommentcount}{0}
\setcounter{Changes@addedCount1}{30}
\setcounter{Changes@deletedCount1}{2}
\setcounter{Changes@replacedCount1}{7}
\setcounter{Changes@highlightCount1}{0}
\setcounter{Changes@commentCount1}{0}
\setcounter{lstnumber}{1}
\setcounter{FancyVerbLine}{0}
\setcounter{section@level}{0}
\setcounter{lstlisting}{0}
}
