\relax 
\providecommand\hyper@newdestlabel[2]{}
\@writefile{toc}{\contentsline {chapter}{\numberline {A}Fundamentals on Reference Systems and Frames}{169}{appendix.A}\protected@file@percent }
\@writefile{lof}{\addvspace {10\p@ }}
\@writefile{lot}{\addvspace {10\p@ }}
\newlabel{appendix:referenceFrame}{{A}{169}{Fundamentals on Reference Systems and Frames}{appendix.A}{}}
\acronymused{GNSS}
\acronymused{GNSS}
\@writefile{toc}{\contentsline {section}{\numberline {A.1}Conventional Celestial Reference System CRS}{169}{section.A.1}\protected@file@percent }
\@writefile{toc}{\contentsline {section}{\numberline {A.2}Conventional Terrestrial Reference System (TRS)}{169}{section.A.2}\protected@file@percent }
\newlabel{fig:ECI_onLLH}{{A.1a}{170}{{\small CRS Earth Centered Inertial (ECI)s.}\relax }{figure.caption.140}{}}
\newlabel{sub@fig:ECI_onLLH}{{a}{170}{{\small CRS Earth Centered Inertial (ECI)s.}\relax }{figure.caption.140}{}}
\newlabel{fig:ECEF}{{A.1b}{170}{Earth Centered Earth Fixed reference frame.\relax }{figure.caption.140}{}}
\newlabel{sub@fig:ECEF}{{b}{170}{Earth Centered Earth Fixed reference frame.\relax }{figure.caption.140}{}}
\@writefile{lof}{\contentsline {figure}{\numberline {A.1}{\ignorespaces {\relax \fontsize  {10}{12}\selectfont  \abovedisplayskip 10\p@ plus2\p@ minus5\p@ \abovedisplayshortskip \z@ plus3\p@ \belowdisplayshortskip 6\p@ plus3\p@ minus3\p@ \def \leftmargin \leftmargini \parsep 4.5\p@ plus2\p@ minus\p@ \topsep 9\p@ plus3\p@ minus5\p@ \itemsep 4.5\p@ plus2\p@ minus\p@ {\leftmargin \leftmargini \topsep 6\p@ plus2\p@ minus2\p@ \parsep 3\p@ plus2\p@ minus\p@ \itemsep \parsep }\belowdisplayskip \abovedisplayskip Coordinates Reference Systems.}\relax }}{170}{figure.caption.140}\protected@file@percent }
\newlabel{fig:refs}{{A.1}{170}{{\small Coordinates Reference Systems.}\relax }{figure.caption.140}{}}
\acronymused{GNSS}
\acronymused{DoD}
\@writefile{toc}{\contentsline {section}{\numberline {A.3}Conversion between reference systems}{171}{section.A.3}\protected@file@percent }
\newlabel{sec:conversion}{{A.3}{171}{Conversion between reference systems}{section.A.3}{}}
\acronymused{ECEF}
\acronymused{GPS}
\acronymused{LLA}
\@writefile{toc}{\contentsline {paragraph}{Ellipsoidal Coordinates ($\phi $, $\lambda $, $h$) }{171}{section.A.3}\protected@file@percent }
\acronymused{ECEF}
\@writefile{lof}{\contentsline {figure}{\numberline {A.2}{\ignorespaces \relax \fontsize  {10}{12}\selectfont  \abovedisplayskip 10\p@ plus2\p@ minus5\p@ \abovedisplayshortskip \z@ plus3\p@ \belowdisplayshortskip 6\p@ plus3\p@ minus3\p@ \def \leftmargin \leftmargini \parsep 4.5\p@ plus2\p@ minus\p@ \topsep 9\p@ plus3\p@ minus5\p@ \itemsep 4.5\p@ plus2\p@ minus\p@ {\leftmargin \leftmargini \topsep 6\p@ plus2\p@ minus2\p@ \parsep 3\p@ plus2\p@ minus\p@ \itemsep \parsep }\belowdisplayskip \abovedisplayskip {Ellipsoidal Coordinates \ac {LLA}/LLH.}\relax }}{171}{figure.caption.141}\protected@file@percent }
\acronymused{LLA}
\newlabel{fig:LLH}{{A.2}{171}{\small {Ellipsoidal Coordinates \ac {LLA}/LLH.}\relax }{figure.caption.141}{}}
\newlabel{eq:LLH2ECEF}{{A.1}{171}{Ellipsoidal Coordinates ($\phi $, $\lambda $, $h$) }{equation.A.3.1}{}}
\acronymused{ECEF}
\@writefile{toc}{\contentsline {paragraph}{Conversion between ECEF to Local Tangent Plane (LTP) Coordinates }{172}{equation.A.3.3}\protected@file@percent }
\acronymused{ENU}
\acronymused{ECEF}
\newlabel{eq:conversion}{{A.5}{172}{Conversion between ECEF to Local Tangent Plane (LTP) Coordinates }{equation.A.3.5}{}}
\newlabel{eq:transformation}{{A.6}{172}{Conversion between ECEF to Local Tangent Plane (LTP) Coordinates }{equation.A.3.6}{}}
\newlabel{eq:axisENU}{{A.7}{172}{Conversion between ECEF to Local Tangent Plane (LTP) Coordinates }{equation.A.3.7}{}}
\@writefile{toc}{\contentsline {subsection}{\numberline {A.3.1}Range, Elevation and Azimuth computation from ENU frame}{172}{subsection.A.3.1}\protected@file@percent }
\acronymused{ENU}
\acronymused{LTP}
\newlabel{eq:axisENU}{{A.9}{173}{Range, Elevation and Azimuth computation from ENU frame}{equation.A.3.9}{}}
\newlabel{eq:axisENU}{{A.10}{173}{Range, Elevation and Azimuth computation from ENU frame}{equation.A.3.10}{}}
\acronymused{LTP}
\acronymused{LTP}
\acronymused{LLA}
\newlabel{fig:LTP_onLLH}{{A.3a}{173}{{\small \ac {LTP} shown in \ac {LLA} system.}\relax }{figure.caption.142}{}}
\newlabel{sub@fig:LTP_onLLH}{{a}{173}{{\small \ac {LTP} shown in \ac {LLA} system.}\relax }{figure.caption.142}{}}
\newlabel{fig:TRS}{{A.3b}{173}{LTP Coordinates Reference\relax }{figure.caption.142}{}}
\newlabel{sub@fig:TRS}{{b}{173}{LTP Coordinates Reference\relax }{figure.caption.142}{}}
\@writefile{lof}{\contentsline {figure}{\numberline {A.3}{\ignorespaces {\relax \fontsize  {10}{12}\selectfont  \abovedisplayskip 10\p@ plus2\p@ minus5\p@ \abovedisplayshortskip \z@ plus3\p@ \belowdisplayshortskip 6\p@ plus3\p@ minus3\p@ \def \leftmargin \leftmargini \parsep 4.5\p@ plus2\p@ minus\p@ \topsep 9\p@ plus3\p@ minus5\p@ \itemsep 4.5\p@ plus2\p@ minus\p@ {\leftmargin \leftmargini \topsep 6\p@ plus2\p@ minus2\p@ \parsep 3\p@ plus2\p@ minus\p@ \itemsep \parsep }\belowdisplayskip \abovedisplayskip \ac {LTP} shown w.r.t. a \ac {LLA} frame and as reference frame}.\relax }}{173}{figure.caption.142}\protected@file@percent }
\acronymused{LTP}
\acronymused{LLA}
\newlabel{fig:LTP}{{A.3}{173}{{\small \ac {LTP} shown w.r.t. a \ac {LLA} frame and as reference frame}.\relax }{figure.caption.142}{}}
\@setckpt{Appendix2/appendix2}{
\setcounter{page}{174}
\setcounter{equation}{10}
\setcounter{enumi}{2}
\setcounter{enumii}{0}
\setcounter{enumiii}{0}
\setcounter{enumiv}{0}
\setcounter{footnote}{1}
\setcounter{mpfootnote}{0}
\setcounter{part}{0}
\setcounter{chapter}{1}
\setcounter{section}{3}
\setcounter{subsection}{1}
\setcounter{subsubsection}{0}
\setcounter{paragraph}{0}
\setcounter{subparagraph}{0}
\setcounter{figure}{3}
\setcounter{table}{0}
\setcounter{SDpage}{0}
\setcounter{NumberSD}{0}
\setcounter{tomo}{0}
\setcounter{parentequation}{0}
\setcounter{caption@flags}{0}
\setcounter{ContinuedFloat}{0}
\setcounter{subfigure}{2}
\setcounter{subtable}{0}
\setcounter{float@type}{16}
\setcounter{tabx@nest}{0}
\setcounter{listtotal}{0}
\setcounter{listcount}{0}
\setcounter{liststart}{0}
\setcounter{liststop}{0}
\setcounter{citecount}{0}
\setcounter{citetotal}{0}
\setcounter{multicitecount}{0}
\setcounter{multicitetotal}{0}
\setcounter{instcount}{399}
\setcounter{maxnames}{3}
\setcounter{minnames}{1}
\setcounter{maxitems}{3}
\setcounter{minitems}{1}
\setcounter{citecounter}{0}
\setcounter{maxcitecounter}{0}
\setcounter{savedcitecounter}{0}
\setcounter{uniquelist}{0}
\setcounter{uniquename}{0}
\setcounter{refsection}{0}
\setcounter{refsegment}{0}
\setcounter{maxextratitle}{0}
\setcounter{maxextratitleyear}{0}
\setcounter{maxextraname}{5}
\setcounter{maxextradate}{0}
\setcounter{maxextraalpha}{0}
\setcounter{abbrvpenalty}{50}
\setcounter{highnamepenalty}{50}
\setcounter{lownamepenalty}{25}
\setcounter{maxparens}{3}
\setcounter{parenlevel}{0}
\setcounter{mincomprange}{10}
\setcounter{maxcomprange}{100000}
\setcounter{mincompwidth}{1}
\setcounter{afterword}{0}
\setcounter{savedafterword}{0}
\setcounter{annotator}{0}
\setcounter{savedannotator}{0}
\setcounter{author}{0}
\setcounter{savedauthor}{0}
\setcounter{bookauthor}{0}
\setcounter{savedbookauthor}{0}
\setcounter{commentator}{0}
\setcounter{savedcommentator}{0}
\setcounter{editor}{0}
\setcounter{savededitor}{0}
\setcounter{editora}{0}
\setcounter{savededitora}{0}
\setcounter{editorb}{0}
\setcounter{savededitorb}{0}
\setcounter{editorc}{0}
\setcounter{savededitorc}{0}
\setcounter{foreword}{0}
\setcounter{savedforeword}{0}
\setcounter{holder}{0}
\setcounter{savedholder}{0}
\setcounter{introduction}{0}
\setcounter{savedintroduction}{0}
\setcounter{namea}{0}
\setcounter{savednamea}{0}
\setcounter{nameb}{0}
\setcounter{savednameb}{0}
\setcounter{namec}{0}
\setcounter{savednamec}{0}
\setcounter{translator}{0}
\setcounter{savedtranslator}{0}
\setcounter{shortauthor}{0}
\setcounter{savedshortauthor}{0}
\setcounter{shorteditor}{0}
\setcounter{savedshorteditor}{0}
\setcounter{labelname}{0}
\setcounter{savedlabelname}{0}
\setcounter{institution}{0}
\setcounter{savedinstitution}{0}
\setcounter{lista}{0}
\setcounter{savedlista}{0}
\setcounter{listb}{0}
\setcounter{savedlistb}{0}
\setcounter{listc}{0}
\setcounter{savedlistc}{0}
\setcounter{listd}{0}
\setcounter{savedlistd}{0}
\setcounter{liste}{0}
\setcounter{savedliste}{0}
\setcounter{listf}{0}
\setcounter{savedlistf}{0}
\setcounter{location}{0}
\setcounter{savedlocation}{0}
\setcounter{organization}{0}
\setcounter{savedorganization}{0}
\setcounter{origlocation}{0}
\setcounter{savedoriglocation}{0}
\setcounter{origpublisher}{0}
\setcounter{savedorigpublisher}{0}
\setcounter{publisher}{0}
\setcounter{savedpublisher}{0}
\setcounter{language}{0}
\setcounter{savedlanguage}{0}
\setcounter{origlanguage}{0}
\setcounter{savedoriglanguage}{0}
\setcounter{pageref}{0}
\setcounter{savedpageref}{0}
\setcounter{textcitecount}{0}
\setcounter{textcitetotal}{0}
\setcounter{textcitemaxnames}{0}
\setcounter{biburlnumpenalty}{0}
\setcounter{biburlucpenalty}{0}
\setcounter{biburllcpenalty}{0}
\setcounter{smartand}{1}
\setcounter{bbx:relatedcount}{0}
\setcounter{bbx:relatedtotal}{0}
\setcounter{Item}{11}
\setcounter{Hfootnote}{4}
\setcounter{bookmark@seq@number}{123}
\setcounter{nlinenum}{0}
\setcounter{algorithm}{1}
\setcounter{ALC@unique}{6}
\setcounter{ALC@line}{6}
\setcounter{ALC@rem}{0}
\setcounter{ALC@depth}{0}
\setcounter{@todonotes@numberoftodonotes}{0}
\setcounter{Changes@AuthorCount}{2}
\setcounter{Changes@Author}{2}
\setcounter{Changes@addedCount}{1}
\setcounter{Changes@deletedCount}{0}
\setcounter{Changes@replacedCount}{2}
\setcounter{Changes@highlightCount}{0}
\setcounter{Changes@commentCount}{0}
\setcounter{authorcommentcount}{0}
\setcounter{Changes@addedCount1}{41}
\setcounter{Changes@deletedCount1}{3}
\setcounter{Changes@replacedCount1}{9}
\setcounter{Changes@highlightCount1}{0}
\setcounter{Changes@commentCount1}{0}
\setcounter{lstnumber}{1}
\setcounter{FancyVerbLine}{0}
\setcounter{section@level}{0}
\setcounter{lstlisting}{0}
}
