\relax 
\providecommand\hyper@newdestlabel[2]{}
\@writefile{toc}{\contentsline {chapter}{\numberline {8}Implementation of a Proof Of Concept}{131}{chapter.8}\protected@file@percent }
\@writefile{lof}{\addvspace {10\p@ }}
\@writefile{lot}{\addvspace {10\p@ }}
\newlabel{ch:proofOfConcept}{{8}{131}{Implementation of a Proof Of Concept}{chapter.8}{}}
\acronymused{PoC}
\acronymused{CP}
\acronymused{CAPS.loc}
\acronymused{CP}
\acronymused{GNSS}
\acronymused{ESA}
\acronymused{GNSS}
\acronymused{CP}
\acronymused{GNSS}
\acronymused{PoC}
\acronymused{CP}
\acronymused{GNSS}
\acronymused{GNSS}
\acronymused{CAPS.loc}
\acronymused{GNSS}
\acronymused{GNSS}
\acronymused{CP}
\acronymused{GNSS}
\@writefile{toc}{\contentsline {section}{\numberline {8.1}The role of \ac {GNSS} in smart connected environments}{131}{section.8.1}\protected@file@percent }
\newlabel{sec:overview}{{8.1}{131}{The role of \ac {GNSS} in smart connected environments}{section.8.1}{}}
\acronymused{GNSS}
\acronymused{CP}
\acronymused{CP}
\acronymused{GNSS}
\acronymused{CAPS.loc}
\acronymused{CAPS.loc}
\acronymused{GNSS}
\acronymused{GNSS}
\acronymused{GNSS}
\AC@undonewlabel{acro:NLOS}
\newlabel{acro:NLOS}{{8.1}{132}{The role of \ac {GNSS} in smart connected environments}{section.8.1}{}}
\acronymused{NLOS}
\AC@undonewlabel{acro:IoT}
\newlabel{acro:IoT}{{8.1}{132}{The role of \ac {GNSS} in smart connected environments}{section.8.1}{}}
\acronymused{IoT}
\acronymused{GNSS}
\acronymused{GNSS}
\acronymused{PVT}
\acronymused{GNSS}
\acronymused{GNSS}
\@writefile{toc}{\contentsline {subsection}{\numberline {8.1.1}\ac {GNSS} advances in mass-market smart devices}{132}{subsection.8.1.1}\protected@file@percent }
\acronymused{GNSS}
\acronymused{RTK}
\acronymused{UHF}
\AC@undonewlabel{acro:VHF}
\newlabel{acro:VHF}{{8.1.1}{132}{\ac {GNSS} advances in mass-market smart devices}{subsection.8.1.1}{}}
\acronymused{VHF}
\acronymused{GNSS}
\acronymused{LBS}
\acronymused{GNSS}
\acronymused{GNSS}
\acronymused{GNSS}
\AC@undonewlabel{acro:API}
\newlabel{acro:API}{{8.1.1}{132}{\ac {GNSS} advances in mass-market smart devices}{subsection.8.1.1}{}}
\acronymused{API}
\acronymused{GNSS}
\acronymused{GNSS}
\acronymused{GNSS}
\acronymused{CP}
\acronymused{GNSS}
\acronymused{DGNSS}
\acronymused{RTK}
\acronymused{PPP}
\acronymused{GNSS}
\acronymused{PVT}
\acronymused{CAPS.loc}
\acronymused{GNSS}
\@writefile{toc}{\contentsline {subsection}{\numberline {8.1.2}The HANSEL project}{133}{subsection.8.1.2}\protected@file@percent }
\acronymused{GNSS}
\acronymused{GNSS}
\@writefile{lof}{\contentsline {figure}{\numberline {8.1}{\ignorespaces {\relax \fontsize  {10}{12}\selectfont  \abovedisplayskip 10\p@ plus2\p@ minus5\p@ \abovedisplayshortskip \z@ plus3\p@ \belowdisplayshortskip 6\p@ plus3\p@ minus3\p@ \def \leftmargin \leftmargini \parsep 4.5\p@ plus2\p@ minus\p@ \topsep 9\p@ plus3\p@ minus5\p@ \itemsep 4.5\p@ plus2\p@ minus\p@ {\leftmargin \leftmargini \topsep 6\p@ plus2\p@ minus2\p@ \parsep 3\p@ plus2\p@ minus\p@ \itemsep \parsep }\belowdisplayskip \abovedisplayskip HANSEL testbed high-level block scheme.}\relax }}{133}{figure.caption.104}\protected@file@percent }
\newlabel{fig:hanselOverall}{{8.1}{133}{{\small HANSEL testbed high-level block scheme.}\relax }{figure.caption.104}{}}
\acronymused{GNSS}
\acronymused{GNSS}
\acronymused{GNSS}
\acronymused{CP}
\acronymused{GNSS}
\@writefile{lot}{\contentsline {table}{\numberline {8.1}{\ignorespaces GNSS-based back-end services running on the HANSEL testbed\relax }}{134}{table.caption.105}\protected@file@percent }
\newlabel{tab:hanselSERVICE}{{8.1}{134}{GNSS-based back-end services running on the HANSEL testbed\relax }{table.caption.105}{}}
\acronymused{GNSS}
\acronymused{GNSS}
\@writefile{lot}{\contentsline {table}{\numberline {8.2}{\ignorespaces GNSS-based front-end services running on the HANSEL testbed\relax }}{134}{table.caption.106}\protected@file@percent }
\newlabel{tab:hanselAPP}{{8.2}{134}{GNSS-based front-end services running on the HANSEL testbed\relax }{table.caption.106}{}}
\acronymused{CAPS.loc}
\acronymused{GNSS}
\acronymused{CP}
\acronymused{CPS}
\acronymused{CPA}
\acronymused{GNSS}
\@writefile{toc}{\contentsline {section}{\numberline {8.2}From smartphones to networked \ac {GNSS} receivers}{134}{section.8.2}\protected@file@percent }
\acronymused{GNSS}
\acronymused{GNSS}
\acronymused{CP}
\acronymused{GNSS}
\acronymused{API}
\acronymused{GNSS}
\acronymused{GNSS}
\acronymused{GNSS}
\newlabel{fig:archi1}{{8.2a}{135}{\relax }{figure.caption.107}{}}
\newlabel{sub@fig:archi1}{{a}{135}{\relax }{figure.caption.107}{}}
\newlabel{fig:archi2}{{8.2b}{135}{\relax }{figure.caption.107}{}}
\newlabel{sub@fig:archi2}{{b}{135}{\relax }{figure.caption.107}{}}
\@writefile{lof}{\contentsline {figure}{\numberline {8.2}{\ignorespaces \relax \fontsize  {10}{12}\selectfont  \abovedisplayskip 10\p@ plus2\p@ minus5\p@ \abovedisplayshortskip \z@ plus3\p@ \belowdisplayshortskip 6\p@ plus3\p@ minus3\p@ \def \leftmargin \leftmargini \parsep 4.5\p@ plus2\p@ minus\p@ \topsep 9\p@ plus3\p@ minus5\p@ \itemsep 4.5\p@ plus2\p@ minus\p@ {\leftmargin \leftmargini \topsep 6\p@ plus2\p@ minus2\p@ \parsep 3\p@ plus2\p@ minus\p@ \itemsep \parsep }\belowdisplayskip \abovedisplayskip Network topologies for the \ac {CP} paradigm among networked receivers.\relax }}{135}{figure.caption.107}\protected@file@percent }
\acronymused{CP}
\newlabel{fig:archi}{{8.2}{135}{\small Network topologies for the \ac {CP} paradigm among networked receivers.\relax }{figure.caption.107}{}}
\acronymused{CRU}
\acronymused{GNSS}
\acronymused{PVT}
\acronymused{PVT}
\acronymused{GNSS}
\AC@undonewlabel{acro:DSRC}
\newlabel{acro:DSRC}{{8.2}{136}{From smartphones to networked \ac {GNSS} receivers}{figure.caption.107}{}}
\acronymused{DSRC}
\acronymused{API}
\@writefile{toc}{\contentsline {subsection}{\numberline {8.2.1}Hardware selection: Xiaomi Mi 8 Pro and Braoadcom BCM47755}{136}{subsection.8.2.1}\protected@file@percent }
\acronymused{CAPS.loc}
\acronymused{GNSS}
\acronymused{CAPS.loc}
\acronymused{GNSS}
\acronymused{GPS}
\acronymused{GLONASS}
\@writefile{lof}{\contentsline {figure}{\numberline {8.3}{\ignorespaces {\relax \fontsize  {10}{12}\selectfont  \abovedisplayskip 10\p@ plus2\p@ minus5\p@ \abovedisplayshortskip \z@ plus3\p@ \belowdisplayshortskip 6\p@ plus3\p@ minus3\p@ \def \leftmargin \leftmargini \parsep 4.5\p@ plus2\p@ minus\p@ \topsep 9\p@ plus3\p@ minus5\p@ \itemsep 4.5\p@ plus2\p@ minus\p@ {\leftmargin \leftmargini \topsep 6\p@ plus2\p@ minus2\p@ \parsep 3\p@ plus2\p@ minus\p@ \itemsep \parsep }\belowdisplayskip \abovedisplayskip Xiaomi\textsuperscript  {\texttrademark } Mi 8 Pro and Broadcom\textsuperscript  {\texttrademark } BCM47755 Dual-frequency \ac {GNSS} chip.}\relax }}{136}{figure.caption.108}\protected@file@percent }
\acronymused{GNSS}
\newlabel{fig:xiaomi}{{8.3}{136}{{\small Xiaomi\textsuperscript {\texttrademark } Mi 8 Pro and Broadcom\textsuperscript {\texttrademark } BCM47755 Dual-frequency \ac {GNSS} chip.}\relax }{figure.caption.108}{}}
\acronymused{RF}
\AC@undonewlabel{acro:CPU}
\newlabel{acro:CPU}{{8.2.1}{137}{Hardware selection: Xiaomi Mi 8 Pro and Braoadcom BCM47755}{figure.caption.108}{}}
\acronymused{CPU}
\acronymused{GNSS}
\acronymused{GNSS}
\acronymused{ADC}
\AC@undonewlabel{acro:RTC}
\newlabel{acro:RTC}{{8.2.1}{137}{Hardware selection: Xiaomi Mi 8 Pro and Braoadcom BCM47755}{figure.caption.108}{}}
\acronymused{RTC}
\acronymused{RTC}
\acronymused{API}
\@writefile{toc}{\contentsline {section}{\numberline {8.3}CAPS.loc: Framework overview}{137}{section.8.3}\protected@file@percent }
\newlabel{sec:capsloc}{{8.3}{137}{CAPS.loc: Framework overview}{section.8.3}{}}
\acronymused{CAPS.loc}
\acronymused{CPS}
\acronymused{CPS}
\acronymused{GNSS}
\acronymused{CPA}
\acronymused{API}
\acronymused{PVT}
\acronymused{CAPS.loc}
\acronymused{CPA}
\AC@undonewlabel{acro:UDP}
\newlabel{acro:UDP}{{8.3}{137}{CAPS.loc: Framework overview}{section.8.3}{}}
\acronymused{UDP}
\acronymused{PVT}
\@writefile{toc}{\contentsline {subsection}{\numberline {8.3.1}Collaborative Positioning Service}{137}{subsection.8.3.1}\protected@file@percent }
\acronymused{CPS}
\acronymused{CPS}
\@writefile{lof}{\contentsline {figure}{\numberline {8.4}{\ignorespaces {\relax \fontsize  {10}{12}\selectfont  \abovedisplayskip 10\p@ plus2\p@ minus5\p@ \abovedisplayshortskip \z@ plus3\p@ \belowdisplayshortskip 6\p@ plus3\p@ minus3\p@ \def \leftmargin \leftmargini \parsep 4.5\p@ plus2\p@ minus\p@ \topsep 9\p@ plus3\p@ minus5\p@ \itemsep 4.5\p@ plus2\p@ minus\p@ {\leftmargin \leftmargini \topsep 6\p@ plus2\p@ minus2\p@ \parsep 3\p@ plus2\p@ minus\p@ \itemsep \parsep }\belowdisplayskip \abovedisplayskip High-level configuration of the scalable \ac {CAPS.loc} client-server topology (exploited in the real implementation.}\relax }}{138}{figure.caption.109}\protected@file@percent }
\acronymused{CAPS.loc}
\newlabel{fig:highlevelscheme}{{8.4}{138}{{\small High-level configuration of the scalable \ac {CAPS.loc} client-server topology (exploited in the real implementation.}\relax }{figure.caption.109}{}}
\acronymused{API}
\acronymused{CPA}
\@writefile{toc}{\contentsline {subsubsection}{Raw Measurements Database (db)}{138}{subsection.8.3.1}\protected@file@percent }
\acronymused{CPS}
\acronymused{CPS}
\acronymused{CPS}
\acronymused{API}
\acronymused{CPS}
\acronymused{CPA}
\acronymused{DB}
\acronymused{CPS}
\acronymused{API}
\AC@undonewlabel{acro:GUI}
\newlabel{acro:GUI}{{8.3.1}{138}{Raw Measurements Database (db)}{subsection.8.3.1}{}}
\acronymused{GUI}
\acronymused{DB}
\@writefile{toc}{\contentsline {subsubsection}{Cooperative Positioning System API}{139}{subsection.8.3.1}\protected@file@percent }
\acronymused{CPS}
\acronymused{API}
\acronymused{CAPS.loc}
\acronymused{CPS}
\acronymused{CPA}
\acronymused{DB}
\acronymused{DB}
\@writefile{lot}{\contentsline {table}{\numberline {8.3}{\ignorespaces \relax \fontsize  {10}{12}\selectfont  \abovedisplayskip 10\p@ plus2\p@ minus5\p@ \abovedisplayshortskip \z@ plus3\p@ \belowdisplayshortskip 6\p@ plus3\p@ minus3\p@ \def \leftmargin \leftmargini \parsep 4.5\p@ plus2\p@ minus\p@ \topsep 9\p@ plus3\p@ minus5\p@ \itemsep 4.5\p@ plus2\p@ minus\p@ {\leftmargin \leftmargini \topsep 6\p@ plus2\p@ minus2\p@ \parsep 3\p@ plus2\p@ minus\p@ \itemsep \parsep }\belowdisplayskip \abovedisplayskip Agent registration API methods.\relax }}{139}{table.caption.110}\protected@file@percent }
\newlabel{tab:registrationAPIs}{{8.3}{139}{\small Agent registration API methods.\relax }{table.caption.110}{}}
\acronymused{CPS}
\AC@undonewlabel{acro:CRM}
\newlabel{acro:CRM}{{8.3.1}{139}{Cooperative Positioning System API}{table.caption.110}{}}
\acronymused{CRM}
\acronymused{CPS}
\acronymused{CP}
\acronymused{GNSS}
\acronymused{GNSS}
\@writefile{lot}{\contentsline {table}{\numberline {8.4}{\ignorespaces \relax \fontsize  {10}{12}\selectfont  \abovedisplayskip 10\p@ plus2\p@ minus5\p@ \abovedisplayshortskip \z@ plus3\p@ \belowdisplayshortskip 6\p@ plus3\p@ minus3\p@ \def \leftmargin \leftmargini \parsep 4.5\p@ plus2\p@ minus\p@ \topsep 9\p@ plus3\p@ minus5\p@ \itemsep 4.5\p@ plus2\p@ minus\p@ {\leftmargin \leftmargini \topsep 6\p@ plus2\p@ minus2\p@ \parsep 3\p@ plus2\p@ minus\p@ \itemsep \parsep }\belowdisplayskip \abovedisplayskip Raw measurement API methods.\relax }}{139}{table.caption.111}\protected@file@percent }
\newlabel{tab:measurementsAPIs}{{8.4}{139}{\small Raw measurement API methods.\relax }{table.caption.111}{}}
\acronymused{CPS}
\acronymused{DB}
\acronymused{CPS}
\@writefile{lot}{\contentsline {table}{\numberline {8.5}{\ignorespaces \relax \fontsize  {10}{12}\selectfont  \abovedisplayskip 10\p@ plus2\p@ minus5\p@ \abovedisplayshortskip \z@ plus3\p@ \belowdisplayshortskip 6\p@ plus3\p@ minus3\p@ \def \leftmargin \leftmargini \parsep 4.5\p@ plus2\p@ minus\p@ \topsep 9\p@ plus3\p@ minus5\p@ \itemsep 4.5\p@ plus2\p@ minus\p@ {\leftmargin \leftmargini \topsep 6\p@ plus2\p@ minus2\p@ \parsep 3\p@ plus2\p@ minus\p@ \itemsep \parsep }\belowdisplayskip \abovedisplayskip \ac {DB} housekeeping API methods.\relax }}{140}{table.caption.112}\protected@file@percent }
\acronymused{DB}
\newlabel{tab:housekeepingAPIs}{{8.5}{140}{\small \ac {DB} housekeeping API methods.\relax }{table.caption.112}{}}
\acronymused{PVT}
\acronymused{HPVT}
\@writefile{lot}{\contentsline {table}{\numberline {8.6}{\ignorespaces \relax \fontsize  {10}{12}\selectfont  \abovedisplayskip 10\p@ plus2\p@ minus5\p@ \abovedisplayshortskip \z@ plus3\p@ \belowdisplayshortskip 6\p@ plus3\p@ minus3\p@ \def \leftmargin \leftmargini \parsep 4.5\p@ plus2\p@ minus\p@ \topsep 9\p@ plus3\p@ minus5\p@ \itemsep 4.5\p@ plus2\p@ minus\p@ {\leftmargin \leftmargini \topsep 6\p@ plus2\p@ minus2\p@ \parsep 3\p@ plus2\p@ minus\p@ \itemsep \parsep }\belowdisplayskip \abovedisplayskip Agent configuration API methods.\relax }}{140}{table.caption.113}\protected@file@percent }
\newlabel{tab:remoteConfigAPIs}{{8.6}{140}{\small Agent configuration API methods.\relax }{table.caption.113}{}}
\acronymused{API}
\acronymused{GUI}
\acronymused{CPS}
\acronymused{API}
\@writefile{toc}{\contentsline {subsection}{\numberline {8.3.2}Collaborative Positioning Application - CPA}{140}{subsection.8.3.2}\protected@file@percent }
\acronymused{CPA}
\acronymused{EKF}
\acronymused{CPS}
\acronymused{CPA}
\acronymused{API}
\acronymused{CAPS.loc}
\acronymused{CPA}
\acronymused{CPA}
\acronymused{CPS}
\acronymused{CPA}
\acronymused{GUI}
\acronymused{CPA}
\@writefile{toc}{\contentsline {subsubsection}{Main activity}{140}{figure.caption.114}\protected@file@percent }
\acronymused{CPA}
\acronymused{GUI}
\@writefile{toc}{\contentsline {subsubsection}{Agent Subscriber}{140}{figure.caption.114}\protected@file@percent }
\acronymused{CPS}
\@writefile{lof}{\contentsline {figure}{\numberline {8.5}{\ignorespaces {\relax \fontsize  {10}{12}\selectfont  \abovedisplayskip 10\p@ plus2\p@ minus5\p@ \abovedisplayshortskip \z@ plus3\p@ \belowdisplayshortskip 6\p@ plus3\p@ minus3\p@ \def \leftmargin \leftmargini \parsep 4.5\p@ plus2\p@ minus\p@ \topsep 9\p@ plus3\p@ minus5\p@ \itemsep 4.5\p@ plus2\p@ minus\p@ {\leftmargin \leftmargini \topsep 6\p@ plus2\p@ minus2\p@ \parsep 3\p@ plus2\p@ minus\p@ \itemsep \parsep }\belowdisplayskip \abovedisplayskip Full \ac {CPA} functional scheme showing all the threads and the communication processes among them.}\relax }}{141}{figure.caption.114}\protected@file@percent }
\acronymused{CPA}
\newlabel{fig:CPA_scheme}{{8.5}{141}{{\small Full \ac {CPA} functional scheme showing all the threads and the communication processes among them.}\relax }{figure.caption.114}{}}
\acronymused{CPA}
\acronymused{CPS}
\acronymused{CPA}
\acronymused{CPA}
\acronymused{CRM}
\@writefile{toc}{\contentsline {subsubsection}{GNSS Container}{141}{figure.caption.115}\protected@file@percent }
\acronymused{GNSS}
\acronymused{GNSS}
\acronymused{API}
\@writefile{lof}{\contentsline {figure}{\numberline {8.6}{\ignorespaces {\relax \fontsize  {10}{12}\selectfont  \abovedisplayskip 10\p@ plus2\p@ minus5\p@ \abovedisplayshortskip \z@ plus3\p@ \belowdisplayshortskip 6\p@ plus3\p@ minus3\p@ \def \leftmargin \leftmargini \parsep 4.5\p@ plus2\p@ minus\p@ \topsep 9\p@ plus3\p@ minus5\p@ \itemsep 4.5\p@ plus2\p@ minus\p@ {\leftmargin \leftmargini \topsep 6\p@ plus2\p@ minus2\p@ \parsep 3\p@ plus2\p@ minus\p@ \itemsep \parsep }\belowdisplayskip \abovedisplayskip Agent registration process as it is forseen for the \ac {CPA}/\ac {CPS} interaction}.\relax }}{142}{figure.caption.115}\protected@file@percent }
\acronymused{CPA}
\acronymused{CPS}
\newlabel{fig:registrationFlowChart}{{8.6}{142}{{\small Agent registration process as it is forseen for the \ac {CPA}/\ac {CPS} interaction}.\relax }{figure.caption.115}{}}
\@writefile{loc}{\ChangesListline {replaced}{Replaced~(1)}{(i.e. IGS standard)}{142}}
\acronymused{GNSS}
\acronymused{PVT}
\@writefile{toc}{\contentsline {subsubsection}{Agent Handler}{142}{figure.caption.115}\protected@file@percent }
\acronymused{CPA}
\acronymused{CPS}
\acronymused{API}
\acronymused{PVT}
\acronymused{CPA}
\acronymused{GUI}
\acronymused{CPS}
\acronymused{CAPS.loc}
\acronymused{API}
\@writefile{toc}{\contentsline {subsubsection}{CRMcollector}{143}{figure.caption.115}\protected@file@percent }
\acronymused{CPA}
\acronymused{GNSS}
\acronymused{CPA}
\acronymused{CPA}
\@writefile{toc}{\contentsline {subsubsection}{GNSSMeasScript}{143}{figure.caption.115}\protected@file@percent }
\acronymused{GNSS}
\acronymused{GNSS}
\acronymused{CPA}
\acronymused{API}
\acronymused{GNSS}
\acronymused{CRM}
\acronymused{API}
\acronymused{DD}
\acronymused{GNSS}
\@writefile{lof}{\contentsline {figure}{\numberline {8.7}{\ignorespaces {\relax \fontsize  {10}{12}\selectfont  \abovedisplayskip 10\p@ plus2\p@ minus5\p@ \abovedisplayshortskip \z@ plus3\p@ \belowdisplayshortskip 6\p@ plus3\p@ minus3\p@ \def \leftmargin \leftmargini \parsep 4.5\p@ plus2\p@ minus\p@ \topsep 9\p@ plus3\p@ minus5\p@ \itemsep 4.5\p@ plus2\p@ minus\p@ {\leftmargin \leftmargini \topsep 6\p@ plus2\p@ minus2\p@ \parsep 3\p@ plus2\p@ minus\p@ \itemsep \parsep }\belowdisplayskip \abovedisplayskip Hybrid positioning flow chart.}\relax }}{144}{figure.caption.116}\protected@file@percent }
\newlabel{fig:hybridFlow}{{8.7}{144}{{\small Hybrid positioning flow chart.}\relax }{figure.caption.116}{}}
\acronymused{H-WLMS}
\acronymused{H-EKF}
\acronymused{GNSS}
\acronymused{H-WLMS}
\acronymused{WLS}
\acronymused{H-EKF}
\acronymused{EKF}
\acronymused{PVT}
\@writefile{toc}{\contentsline {subsubsection}{Graphic User Interface and Settings}{144}{Item.9}\protected@file@percent }
\acronymused{CPA}
\acronymused{GUI}
\acronymused{GUI}
\acronymused{GUI}
\acronymused{GNSS}
\acronymused{GNSS}
\acronymused{GUI}
\acronymused{EKF}
\@writefile{lof}{\contentsline {figure}{\numberline {8.8}{\ignorespaces {\relax \fontsize  {10}{12}\selectfont  \abovedisplayskip 10\p@ plus2\p@ minus5\p@ \abovedisplayshortskip \z@ plus3\p@ \belowdisplayshortskip 6\p@ plus3\p@ minus3\p@ \def \leftmargin \leftmargini \parsep 4.5\p@ plus2\p@ minus\p@ \topsep 9\p@ plus3\p@ minus5\p@ \itemsep 4.5\p@ plus2\p@ minus\p@ {\leftmargin \leftmargini \topsep 6\p@ plus2\p@ minus2\p@ \parsep 3\p@ plus2\p@ minus\p@ \itemsep \parsep }\belowdisplayskip \abovedisplayskip Screenshots of the CPA developed within the HANSEL project.}\relax }}{145}{figure.caption.117}\protected@file@percent }
\newlabel{fig:screenshotExample}{{8.8}{145}{{\small Screenshots of the CPA developed within the HANSEL project.}\relax }{figure.caption.117}{}}
\acronymused{CP}
\acronymused{GNSS}
\acronymused{CPS}
\acronymused{API}
\acronymused{PVT}
\acronymused{GPS}
\acronymused{GPS}
\acronymused{PVT}
\acronymused{EKF}
\acronymused{H-EKF}
\acronymused{PVT}
\acronymused{CPA}
\@writefile{lof}{\contentsline {figure}{\numberline {8.9}{\ignorespaces {\relax \fontsize  {10}{12}\selectfont  \abovedisplayskip 10\p@ plus2\p@ minus5\p@ \abovedisplayshortskip \z@ plus3\p@ \belowdisplayshortskip 6\p@ plus3\p@ minus3\p@ \def \leftmargin \leftmargini \parsep 4.5\p@ plus2\p@ minus\p@ \topsep 9\p@ plus3\p@ minus5\p@ \itemsep 4.5\p@ plus2\p@ minus\p@ {\leftmargin \leftmargini \topsep 6\p@ plus2\p@ minus2\p@ \parsep 3\p@ plus2\p@ minus\p@ \itemsep \parsep }\belowdisplayskip \abovedisplayskip Screenshots of the CPA configuration panel.}\relax }}{146}{figure.caption.118}\protected@file@percent }
\newlabel{fig:confPanel}{{8.9}{146}{{\small Screenshots of the CPA configuration panel.}\relax }{figure.caption.118}{}}
\acronymused{CAPS.loc}
\acronymused{CAPS.loc}
\acronymused{CAPS.loc}
\acronymused{CP}
\acronymused{CAPS.loc}
\@writefile{toc}{\contentsline {section}{\numberline {8.4}Offline asynchronous measurements combination}{147}{section.8.4}\protected@file@percent }
\newlabel{sec:offline}{{8.4}{147}{Offline asynchronous measurements combination}{section.8.4}{}}
\acronymused{DD}
\acronymused{CAPS.loc}
\AC@undonewlabel{acro:ROS}
\newlabel{acro:ROS}{{8.4}{147}{Offline asynchronous measurements combination}{section.8.4}{}}
\acronymused{ROS}
\acronymused{CAPS.loc}
\@writefile{toc}{\contentsline {subsection}{\numberline {8.4.1}Baseline length estimation through Android GNSS raw measurements}{147}{subsection.8.4.1}\protected@file@percent }
\@writefile{loc}{\ChangesListline {replaced}{Replaced~(1)}{y}{147}}
\acronymused{DD}
\acronymused{GNSS}
\acronymused{PoC}
\@writefile{toc}{\contentsline {subsubsection}{Static non-zero-baseline test}{147}{subsection.8.4.1}\protected@file@percent }
\acronymused{GPS}
\acronymused{GPS}
\@writefile{lof}{\contentsline {figure}{\numberline {8.10}{\ignorespaces {\relax \fontsize  {10}{12}\selectfont  \abovedisplayskip 10\p@ plus2\p@ minus5\p@ \abovedisplayshortskip \z@ plus3\p@ \belowdisplayshortskip 6\p@ plus3\p@ minus3\p@ \def \leftmargin \leftmargini \parsep 4.5\p@ plus2\p@ minus\p@ \topsep 9\p@ plus3\p@ minus5\p@ \itemsep 4.5\p@ plus2\p@ minus\p@ {\leftmargin \leftmargini \topsep 6\p@ plus2\p@ minus2\p@ \parsep 3\p@ plus2\p@ minus\p@ \itemsep \parsep }\belowdisplayskip \abovedisplayskip \SI {20}{\meter } baseline test with \ac {DDR} and \ac {PVT-R} comparison. \ac {GDOP}$=2.0$ }.\relax }}{148}{figure.caption.119}\protected@file@percent }
\acronymused{DDR}
\acronymused{PVT-R}
\acronymused{GDOP}
\newlabel{fig:unfiltered}{{8.10}{148}{{\small \SI {20}{\meter } baseline test with \ac {DDR} and \ac {PVT-R} comparison. \ac {GDOP}$=2.0$ }.\relax }{figure.caption.119}{}}
\@writefile{lof}{\contentsline {figure}{\numberline {8.11}{\ignorespaces {\relax \fontsize  {10}{12}\selectfont  \abovedisplayskip 10\p@ plus2\p@ minus5\p@ \abovedisplayshortskip \z@ plus3\p@ \belowdisplayshortskip 6\p@ plus3\p@ minus3\p@ \def \leftmargin \leftmargini \parsep 4.5\p@ plus2\p@ minus\p@ \topsep 9\p@ plus3\p@ minus5\p@ \itemsep 4.5\p@ plus2\p@ minus\p@ {\leftmargin \leftmargini \topsep 6\p@ plus2\p@ minus2\p@ \parsep 3\p@ plus2\p@ minus\p@ \itemsep \parsep }\belowdisplayskip \abovedisplayskip \SI {20}{\meter } baseline test with DDR, W-DDR and \ac {APD} comparison. \ac {GDOP}$=2.5$, increased by filtering bad measurements}.\relax }}{148}{figure.caption.120}\protected@file@percent }
\acronymused{APD}
\acronymused{GDOP}
\newlabel{fig:filtered}{{8.11}{148}{{\small \SI {20}{\meter } baseline test with DDR, W-DDR and \ac {APD} comparison. \ac {GDOP}$=2.5$, increased by filtering bad measurements}.\relax }{figure.caption.120}{}}
\acronymused{DDR}
\AC@undonewlabel{acro:W-DDR}
\newlabel{acro:W-DDR}{{8.4.1}{148}{Static non-zero-baseline test}{figure.caption.120}{}}
\acronymused{W-DDR}
\acronymused{PVT}
\acronymused{W-DDR}
\acronymused{GDOP}
\@writefile{lot}{\contentsline {table}{\numberline {8.7}{\ignorespaces Test with two Comparison of the quality of time-compensated GNSS-based ranges with different optimizations.\relax }}{149}{table.caption.121}\protected@file@percent }
\newlabel{tab:offline}{{8.7}{149}{Test with two Comparison of the quality of time-compensated GNSS-based ranges with different optimizations.\relax }{table.caption.121}{}}
\@writefile{toc}{\contentsline {section}{\numberline {8.5}Real-time CAPS.loc experiments}{149}{section.8.5}\protected@file@percent }
\newlabel{sec:capsResults}{{8.5}{149}{Real-time CAPS.loc experiments}{section.8.5}{}}
\acronymused{CAPS.loc}
\@writefile{lof}{\contentsline {figure}{\numberline {8.12}{\ignorespaces {\relax \fontsize  {10}{12}\selectfont  \abovedisplayskip 10\p@ plus2\p@ minus5\p@ \abovedisplayshortskip \z@ plus3\p@ \belowdisplayshortskip 6\p@ plus3\p@ minus3\p@ \def \leftmargin \leftmargini \parsep 4.5\p@ plus2\p@ minus\p@ \topsep 9\p@ plus3\p@ minus5\p@ \itemsep 4.5\p@ plus2\p@ minus\p@ {\leftmargin \leftmargini \topsep 6\p@ plus2\p@ minus2\p@ \parsep 3\p@ plus2\p@ minus\p@ \itemsep \parsep }\belowdisplayskip \abovedisplayskip Experiment setup exploiting 4G connectivity and \ac {CPS} on a remote server (Amazon Web Service located in Ireland).}\relax }}{149}{figure.caption.122}\protected@file@percent }
\acronymused{CPS}
\newlabel{fig:smarpthoneExpScheme}{{8.12}{149}{{\small Experiment setup exploiting 4G connectivity and \ac {CPS} on a remote server (Amazon Web Service located in Ireland).}\relax }{figure.caption.122}{}}
\@writefile{toc}{\contentsline {subsection}{\numberline {8.5.1}Setup}{150}{subsection.8.5.1}\protected@file@percent }
\newlabel{sub:setup}{{8.5.1}{150}{Setup}{subsection.8.5.1}{}}
\acronymused{CP}
\acronymused{CPA}
\acronymused{GNSS}
\acronymused{GPS}
\acronymused{EKF}
\acronymused{GNSS}
\acronymused{GNSS}
\acronymused{GNSS}
\acronymused{CPS}
\acronymused{CP}
\acronymused{CP}
\acronymused{CPS}
\acronymused{ECEF}
\acronymused{LLA}
\@writefile{toc}{\contentsline {subsection}{\numberline {8.5.2}Performance metrics}{150}{subsection.8.5.2}\protected@file@percent }
\newlabel{subsec:metrics}{{8.5.2}{150}{Performance metrics}{subsection.8.5.2}{}}
\acronymused{GNSS}
\acronymused{CP}
\acronymused{CAPS.loc}
\acronymused{CP}
\acronymused{GNSS}
\newlabel{eq:cpAvail}{{8.1}{150}{Performance metrics}{equation.8.5.1}{}}
\@writefile{lof}{\contentsline {figure}{\numberline {8.13}{\ignorespaces {\relax \fontsize  {10}{12}\selectfont  \abovedisplayskip 10\p@ plus2\p@ minus5\p@ \abovedisplayshortskip \z@ plus3\p@ \belowdisplayshortskip 6\p@ plus3\p@ minus3\p@ \def \leftmargin \leftmargini \parsep 4.5\p@ plus2\p@ minus\p@ \topsep 9\p@ plus3\p@ minus5\p@ \itemsep 4.5\p@ plus2\p@ minus\p@ {\leftmargin \leftmargini \topsep 6\p@ plus2\p@ minus2\p@ \parsep 3\p@ plus2\p@ minus\p@ \itemsep \parsep }\belowdisplayskip \abovedisplayskip Example of pedestrian urban paths with different profitability of the paradigm (greed dots indicate profitable integration). The cross marker indicates the origin of the local EN frame \added [id=1]{(Up direction is omitted for readability)}.}\relax }}{151}{figure.caption.123}\protected@file@percent }
\@writefile{loc}{\ChangesListline {added}{Added~(1)}{(Up direction is omitted for readability)}{151}}
\newlabel{fig:exampleCAPS-loc}{{8.13}{151}{{\small Example of pedestrian urban paths with different profitability of the paradigm (greed dots indicate profitable integration). The cross marker indicates the origin of the local EN frame \added [id=1]{(Up direction is omitted for readability)}.}\relax }{figure.caption.123}{}}
\acronymused{GNSS}
\acronymused{CP}
\acronymused{RMS}
\newlabel{eq:3DpositionError}{{8.2}{151}{Performance metrics}{equation.8.5.2}{}}
\newlabel{eq:2DpositionError}{{8.3}{151}{Performance metrics}{equation.8.5.3}{}}
\AC@undonewlabel{acro:ENU}
\newlabel{acro:ENU}{{8.5.2}{151}{Performance metrics}{equation.8.5.3}{}}
\acronymused{ENU}
\acronymused{ENU}
\acronymused{ECEF}
\acronymused{ECEF}
\acronymused{CP}
\acronymused{CP}
\acronymused{CP}
\acronymused{CP}
\acronymused{GPS}
\newlabel{eq:Profit}{{8.4}{152}{Performance metrics}{equation.8.5.4}{}}
\@writefile{lof}{\contentsline {figure}{\numberline {8.14}{\ignorespaces {\relax \fontsize  {10}{12}\selectfont  \abovedisplayskip 10\p@ plus2\p@ minus5\p@ \abovedisplayshortskip \z@ plus3\p@ \belowdisplayshortskip 6\p@ plus3\p@ minus3\p@ \def \leftmargin \leftmargini \parsep 4.5\p@ plus2\p@ minus\p@ \topsep 9\p@ plus3\p@ minus5\p@ \itemsep 4.5\p@ plus2\p@ minus\p@ {\leftmargin \leftmargini \topsep 6\p@ plus2\p@ minus2\p@ \parsep 3\p@ plus2\p@ minus\p@ \itemsep \parsep }\belowdisplayskip \abovedisplayskip Classification of profitability according to the hysteresis threshold $T_{H}$}.\relax }}{152}{figure.caption.124}\protected@file@percent }
\newlabel{fig:threshold}{{8.14}{152}{{\small Classification of profitability according to the hysteresis threshold $T_{H}$}.\relax }{figure.caption.124}{}}
\acronymused{CP}
\acronymused{CP}
\acronymused{CP}
\@writefile{lof}{\contentsline {figure}{\numberline {8.15}{\ignorespaces {\relax \fontsize  {10}{12}\selectfont  \abovedisplayskip 10\p@ plus2\p@ minus5\p@ \abovedisplayshortskip \z@ plus3\p@ \belowdisplayshortskip 6\p@ plus3\p@ minus3\p@ \def \leftmargin \leftmargini \parsep 4.5\p@ plus2\p@ minus\p@ \topsep 9\p@ plus3\p@ minus5\p@ \itemsep 4.5\p@ plus2\p@ minus\p@ {\leftmargin \leftmargini \topsep 6\p@ plus2\p@ minus2\p@ \parsep 3\p@ plus2\p@ minus\p@ \itemsep \parsep }\belowdisplayskip \abovedisplayskip Sample Pie charts of \ac {CP} profitability for two different smarpthones}.\relax }}{152}{figure.caption.125}\protected@file@percent }
\acronymused{CP}
\newlabel{fig:04102019_ex03_piechart}{{8.15}{152}{{\small Sample Pie charts of \ac {CP} profitability for two different smarpthones}.\relax }{figure.caption.125}{}}
\acronymused{CP}
\acronymused{CP}
\acronymused{CP}
\newlabel{eq:meanErrorWhenProfitable}{{8.5}{153}{Performance metrics}{equation.8.5.5}{}}
\acronymused{GNSS}
\@writefile{lof}{\contentsline {figure}{\numberline {8.16}{\ignorespaces {\relax \fontsize  {10}{12}\selectfont  \abovedisplayskip 10\p@ plus2\p@ minus5\p@ \abovedisplayshortskip \z@ plus3\p@ \belowdisplayshortskip 6\p@ plus3\p@ minus3\p@ \def \leftmargin \leftmargini \parsep 4.5\p@ plus2\p@ minus\p@ \topsep 9\p@ plus3\p@ minus5\p@ \itemsep 4.5\p@ plus2\p@ minus\p@ {\leftmargin \leftmargini \topsep 6\p@ plus2\p@ minus2\p@ \parsep 3\p@ plus2\p@ minus\p@ \itemsep \parsep }\belowdisplayskip \abovedisplayskip Example of barplot showing superimposed (3-D and 2-D) of the positioning solution for profitable \ac {CP} and \ac {GNSS}-only (GPS) \ac {PVT} for dataset \texttt  {0210219-01}.}\relax }}{153}{figure.caption.126}\protected@file@percent }
\acronymused{CP}
\acronymused{GNSS}
\acronymused{PVT}
\newlabel{fig:0210219-ex01_barplot}{{8.16}{153}{{\small Example of barplot showing superimposed (3-D and 2-D) of the positioning solution for profitable \ac {CP} and \ac {GNSS}-only (GPS) \ac {PVT} for dataset \texttt {0210219-01}.}\relax }{figure.caption.126}{}}
\acronymused{CP}
\acronymused{CP}
\acronymused{CP}
\acronymused{GNSS}
\newlabel{eq:improvement}{{8.6}{153}{Performance metrics}{equation.8.5.6}{}}
\acronymused{GNSS}
\acronymused{GNSS}
\@writefile{toc}{\contentsline {subsection}{\numberline {8.5.3}Test Scenarios}{154}{subsection.8.5.3}\protected@file@percent }
\newlabel{subsec:testscenarios}{{8.5.3}{154}{Test Scenarios}{subsection.8.5.3}{}}
\@writefile{toc}{\contentsline {subsubsection}{Agents dynamics}{154}{subsection.8.5.3}\protected@file@percent }
\acronymused{GNSS}
\acronymused{GNSS}
\acronymused{CP}
\newlabel{fig:relDynamic01}{{8.17a}{154}{Type \textbf {B}\relax }{figure.caption.127}{}}
\newlabel{sub@fig:relDynamic01}{{a}{154}{Type \textbf {B}\relax }{figure.caption.127}{}}
\newlabel{fig:relDynamic02}{{8.17b}{154}{Type \textbf {C}\relax }{figure.caption.127}{}}
\newlabel{sub@fig:relDynamic02}{{b}{154}{Type \textbf {C}\relax }{figure.caption.127}{}}
\newlabel{fig:relDynamic03}{{8.17c}{154}{Type \textbf {D}\relax }{figure.caption.127}{}}
\newlabel{sub@fig:relDynamic03}{{c}{154}{Type \textbf {D}\relax }{figure.caption.127}{}}
\@writefile{lof}{\contentsline {figure}{\numberline {8.17}{\ignorespaces \relax \fontsize  {10}{12}\selectfont  \abovedisplayskip 10\p@ plus2\p@ minus5\p@ \abovedisplayshortskip \z@ plus3\p@ \belowdisplayshortskip 6\p@ plus3\p@ minus3\p@ \def \leftmargin \leftmargini \parsep 4.5\p@ plus2\p@ minus\p@ \topsep 9\p@ plus3\p@ minus5\p@ \itemsep 4.5\p@ plus2\p@ minus\p@ {\leftmargin \leftmargini \topsep 6\p@ plus2\p@ minus2\p@ \parsep 3\p@ plus2\p@ minus\p@ \itemsep \parsep }\belowdisplayskip \abovedisplayskip Relative dynamics example between two cooperating agents.\relax }}{154}{figure.caption.127}\protected@file@percent }
\newlabel{fig:dynamicsTest}{{8.17}{154}{\small Relative dynamics example between two cooperating agents.\relax }{figure.caption.127}{}}
\acronymused{GNSS}
\@writefile{toc}{\contentsline {subsubsection}{Baseline length}{155}{figure.caption.127}\protected@file@percent }
\acronymused{CAPS.loc}
\@writefile{lot}{\contentsline {table}{\numberline {8.8}{\ignorespaces \relax \fontsize  {10}{12}\selectfont  \abovedisplayskip 10\p@ plus2\p@ minus5\p@ \abovedisplayshortskip \z@ plus3\p@ \belowdisplayshortskip 6\p@ plus3\p@ minus3\p@ \def \leftmargin \leftmargini \parsep 4.5\p@ plus2\p@ minus\p@ \topsep 9\p@ plus3\p@ minus5\p@ \itemsep 4.5\p@ plus2\p@ minus\p@ {\leftmargin \leftmargini \topsep 6\p@ plus2\p@ minus2\p@ \parsep 3\p@ plus2\p@ minus\p@ \itemsep \parsep }\belowdisplayskip \abovedisplayskip List of experiments conducted within the internal CAPS.loc test campaign in October 2019. The blue rows indicate the selected samples detailed in \ref  {sec:results_detail}.\relax }}{155}{table.caption.128}\protected@file@percent }
\newlabel{tab:experimentTable}{{8.8}{155}{\small List of experiments conducted within the internal CAPS.loc test campaign in October 2019. The blue rows indicate the selected samples detailed in \ref {sec:results_detail}.\relax }{table.caption.128}{}}
\@writefile{toc}{\contentsline {section}{\numberline {8.6}Results}{155}{section.8.6}\protected@file@percent }
\newlabel{sec:results_detail}{{8.6}{155}{Results}{section.8.6}{}}
\acronymused{CP}
\@writefile{toc}{\contentsline {subsubsection}{Experiment f-01 16102019-01-A: Static receivers at zero-baseline}{156}{section.8.6}\protected@file@percent }
\acronymused{GPS}
\acronymused{EKF}
\@writefile{lof}{\contentsline {figure}{\numberline {8.18}{\ignorespaces {\relax \fontsize  {10}{12}\selectfont  \abovedisplayskip 10\p@ plus2\p@ minus5\p@ \abovedisplayshortskip \z@ plus3\p@ \belowdisplayshortskip 6\p@ plus3\p@ minus3\p@ \def \leftmargin \leftmargini \parsep 4.5\p@ plus2\p@ minus\p@ \topsep 9\p@ plus3\p@ minus5\p@ \itemsep 4.5\p@ plus2\p@ minus\p@ {\leftmargin \leftmargini \topsep 6\p@ plus2\p@ minus2\p@ \parsep 3\p@ plus2\p@ minus\p@ \itemsep \parsep }\belowdisplayskip \abovedisplayskip Pie charts of \ac {CP} profitability for the two smarpthone in the experiment \texttt  {f-01}}\relax }}{156}{figure.caption.129}\protected@file@percent }
\acronymused{CP}
\newlabel{fig:16102019_ex01_piechart}{{8.18}{156}{{\small Pie charts of \ac {CP} profitability for the two smarpthone in the experiment \texttt {f-01}}\relax }{figure.caption.129}{}}
\acronymused{CAPS.loc}
\acronymused{CP}
\@writefile{lof}{\contentsline {figure}{\numberline {8.19}{\ignorespaces {\relax \fontsize  {10}{12}\selectfont  \abovedisplayskip 10\p@ plus2\p@ minus5\p@ \abovedisplayshortskip \z@ plus3\p@ \belowdisplayshortskip 6\p@ plus3\p@ minus3\p@ \def \leftmargin \leftmargini \parsep 4.5\p@ plus2\p@ minus\p@ \topsep 9\p@ plus3\p@ minus5\p@ \itemsep 4.5\p@ plus2\p@ minus\p@ {\leftmargin \leftmargini \topsep 6\p@ plus2\p@ minus2\p@ \parsep 3\p@ plus2\p@ minus\p@ \itemsep \parsep }\belowdisplayskip \abovedisplayskip Time series of profitability/unprofitability of \ac {CP} in the experiment \texttt  {F-01}.}\relax }}{157}{figure.caption.130}\protected@file@percent }
\acronymused{CP}
\newlabel{fig:binary_profit}{{8.19}{157}{{\small Time series of profitability/unprofitability of \ac {CP} in the experiment \texttt {F-01}.}\relax }{figure.caption.130}{}}
\@writefile{toc}{\contentsline {subsubsection}{Experiment d-02 11102019-02-B: side-by-side pedestrian walk with variable speed and baseline}{157}{figure.caption.130}\protected@file@percent }
\acronymused{GPS}
\acronymused{EKF}
\acronymused{GNSS}
\@writefile{toc}{\contentsline {subsubsection}{Experiment g-05 30102019-05-D: Vehicular (Bicycle) and pedestrian dynamics with variable speed and baseline}{157}{figure.caption.131}\protected@file@percent }
\acronymused{GPS}
\acronymused{EKF}
\acronymused{EKF}
\@writefile{lof}{\contentsline {figure}{\numberline {8.20}{\ignorespaces {\relax \fontsize  {10}{12}\selectfont  \abovedisplayskip 10\p@ plus2\p@ minus5\p@ \abovedisplayshortskip \z@ plus3\p@ \belowdisplayshortskip 6\p@ plus3\p@ minus3\p@ \def \leftmargin \leftmargini \parsep 4.5\p@ plus2\p@ minus\p@ \topsep 9\p@ plus3\p@ minus5\p@ \itemsep 4.5\p@ plus2\p@ minus\p@ {\leftmargin \leftmargini \topsep 6\p@ plus2\p@ minus2\p@ \parsep 3\p@ plus2\p@ minus\p@ \itemsep \parsep }\belowdisplayskip \abovedisplayskip Pie charts of \ac {CP} profitability for the two smartphones in the experiment \texttt  {d-02}.}\relax }}{158}{figure.caption.131}\protected@file@percent }
\acronymused{CP}
\newlabel{fig:d02_piechart}{{8.20}{158}{{\small Pie charts of \ac {CP} profitability for the two smartphones in the experiment \texttt {d-02}.}\relax }{figure.caption.131}{}}
\acronymused{CP}
\acronymused{CP}
\@writefile{toc}{\contentsline {subsubsection}{Experiment c-01 04102019-01-C: Pedestrian relative dynamics with variable speed, baseline and altitude}{158}{figure.caption.132}\protected@file@percent }
\acronymused{GPS}
\acronymused{EKF}
\@writefile{lof}{\contentsline {figure}{\numberline {8.21}{\ignorespaces {\relax \fontsize  {10}{12}\selectfont  \abovedisplayskip 10\p@ plus2\p@ minus5\p@ \abovedisplayshortskip \z@ plus3\p@ \belowdisplayshortskip 6\p@ plus3\p@ minus3\p@ \def \leftmargin \leftmargini \parsep 4.5\p@ plus2\p@ minus\p@ \topsep 9\p@ plus3\p@ minus5\p@ \itemsep 4.5\p@ plus2\p@ minus\p@ {\leftmargin \leftmargini \topsep 6\p@ plus2\p@ minus2\p@ \parsep 3\p@ plus2\p@ minus\p@ \itemsep \parsep }\belowdisplayskip \abovedisplayskip Pie charts of \ac {CP} profitability for the two smartphones in the experiment \texttt  {g-05}.}\relax }}{159}{figure.caption.132}\protected@file@percent }
\acronymused{CP}
\newlabel{fig:g05_piechart}{{8.21}{159}{{\small Pie charts of \ac {CP} profitability for the two smartphones in the experiment \texttt {g-05}.}\relax }{figure.caption.132}{}}
\@writefile{lof}{\contentsline {figure}{\numberline {8.22}{\ignorespaces {\relax \fontsize  {10}{12}\selectfont  \abovedisplayskip 10\p@ plus2\p@ minus5\p@ \abovedisplayshortskip \z@ plus3\p@ \belowdisplayshortskip 6\p@ plus3\p@ minus3\p@ \def \leftmargin \leftmargini \parsep 4.5\p@ plus2\p@ minus\p@ \topsep 9\p@ plus3\p@ minus5\p@ \itemsep 4.5\p@ plus2\p@ minus\p@ {\leftmargin \leftmargini \topsep 6\p@ plus2\p@ minus2\p@ \parsep 3\p@ plus2\p@ minus\p@ \itemsep \parsep }\belowdisplayskip \abovedisplayskip Example of pedestrian urban scenario with anchored variable baseline vector (experiment C-01) which exploit the CAPS.loc framework for \ac {CP}.}\relax }}{159}{figure.caption.133}\protected@file@percent }
\acronymused{CP}
\newlabel{fig:exampleScenario}{{8.22}{159}{{\small Example of pedestrian urban scenario with anchored variable baseline vector (experiment C-01) which exploit the CAPS.loc framework for \ac {CP}.}\relax }{figure.caption.133}{}}
\acronymused{EKF}
\acronymused{CDF}
\@writefile{lof}{\contentsline {figure}{\numberline {8.23}{\ignorespaces {\relax \fontsize  {10}{12}\selectfont  \abovedisplayskip 10\p@ plus2\p@ minus5\p@ \abovedisplayshortskip \z@ plus3\p@ \belowdisplayshortskip 6\p@ plus3\p@ minus3\p@ \def \leftmargin \leftmargini \parsep 4.5\p@ plus2\p@ minus\p@ \topsep 9\p@ plus3\p@ minus5\p@ \itemsep 4.5\p@ plus2\p@ minus\p@ {\leftmargin \leftmargini \topsep 6\p@ plus2\p@ minus2\p@ \parsep 3\p@ plus2\p@ minus\p@ \itemsep \parsep }\belowdisplayskip \abovedisplayskip Pie charts of \ac {CP} profitability for the two smartphones in the experiment \texttt  {c-01}.}\relax }}{160}{figure.caption.134}\protected@file@percent }
\acronymused{CP}
\newlabel{fig:c01_piechart}{{8.23}{160}{{\small Pie charts of \ac {CP} profitability for the two smartphones in the experiment \texttt {c-01}.}\relax }{figure.caption.134}{}}
\@writefile{toc}{\contentsline {subsection}{\numberline {8.6.1}Summary of experimental results and general comments}{160}{subsection.8.6.1}\protected@file@percent }
\newlabel{sub:summary}{{8.6.1}{160}{Summary of experimental results and general comments}{subsection.8.6.1}{}}
\acronymused{CAPS.loc}
\@writefile{toc}{\contentsline {subsubsection}{Availability}{160}{table.caption.138}\protected@file@percent }
\acronymused{CP}
\@writefile{lof}{\contentsline {figure}{\numberline {8.24}{\ignorespaces {\relax \fontsize  {10}{12}\selectfont  \abovedisplayskip 10\p@ plus2\p@ minus5\p@ \abovedisplayshortskip \z@ plus3\p@ \belowdisplayshortskip 6\p@ plus3\p@ minus3\p@ \def \leftmargin \leftmargini \parsep 4.5\p@ plus2\p@ minus\p@ \topsep 9\p@ plus3\p@ minus5\p@ \itemsep 4.5\p@ plus2\p@ minus\p@ {\leftmargin \leftmargini \topsep 6\p@ plus2\p@ minus2\p@ \parsep 3\p@ plus2\p@ minus\p@ \itemsep \parsep }\belowdisplayskip \abovedisplayskip Collection of mean errors comparisons for the experiments described in \ref  {sec:results_detail}}.\relax }}{161}{figure.caption.135}\protected@file@percent }
\newlabel{fig:all_exampleImprovement}{{8.24}{161}{{\small Collection of mean errors comparisons for the experiments described in \ref {sec:results_detail}}.\relax }{figure.caption.135}{}}
\@writefile{lot}{\contentsline {table}{\numberline {8.9}{\ignorespaces \relax \fontsize  {10}{12}\selectfont  \abovedisplayskip 10\p@ plus2\p@ minus5\p@ \abovedisplayshortskip \z@ plus3\p@ \belowdisplayshortskip 6\p@ plus3\p@ minus3\p@ \def \leftmargin \leftmargini \parsep 4.5\p@ plus2\p@ minus\p@ \topsep 9\p@ plus3\p@ minus5\p@ \itemsep 4.5\p@ plus2\p@ minus\p@ {\leftmargin \leftmargini \topsep 6\p@ plus2\p@ minus2\p@ \parsep 3\p@ plus2\p@ minus\p@ \itemsep \parsep }\belowdisplayskip \abovedisplayskip Xiaomi Mi 8 Pro [SM01]: Static and semi-kinematic pedestrian tests in proximity to Politecnico Campus (Mixed urban environment). $T_{H}=\SI {0.05}{\meter }$.\relax }}{161}{table.caption.137}\protected@file@percent }
\newlabel{tab:resSM01}{{8.9}{161}{\small Xiaomi Mi 8 Pro [SM01]: Static and semi-kinematic pedestrian tests in proximity to Politecnico Campus (Mixed urban environment). $T_{H}=\SI {0.05}{\meter }$.\relax }{table.caption.137}{}}
\@writefile{lof}{\contentsline {figure}{\numberline {8.25}{\ignorespaces {\relax \fontsize  {10}{12}\selectfont  \abovedisplayskip 10\p@ plus2\p@ minus5\p@ \abovedisplayshortskip \z@ plus3\p@ \belowdisplayshortskip 6\p@ plus3\p@ minus3\p@ \def \leftmargin \leftmargini \parsep 4.5\p@ plus2\p@ minus\p@ \topsep 9\p@ plus3\p@ minus5\p@ \itemsep 4.5\p@ plus2\p@ minus\p@ {\leftmargin \leftmargini \topsep 6\p@ plus2\p@ minus2\p@ \parsep 3\p@ plus2\p@ minus\p@ \itemsep \parsep }\belowdisplayskip \abovedisplayskip Collection of \ac {CDF}s for the sample experiments described in Section \ref  {sec:results_detail}}.\relax }}{162}{figure.caption.136}\protected@file@percent }
\acronymused{CDF}
\newlabel{fig:all_CDF}{{8.25}{162}{{\small Collection of \ac {CDF}s for the sample experiments described in Section \ref {sec:results_detail}}.\relax }{figure.caption.136}{}}
\@writefile{lot}{\contentsline {table}{\numberline {8.10}{\ignorespaces Xiaomi Mi 8 Pro [SM02]: Static and semi-kinematic pedestrian tests in proximity to Politecnico Campus (Mixed urban environment). $T_{H}=\SI {0.05}{\meter }$.\relax }}{163}{table.caption.138}\protected@file@percent }
\newlabel{tab:resSM02}{{8.10}{163}{Xiaomi Mi 8 Pro [SM02]: Static and semi-kinematic pedestrian tests in proximity to Politecnico Campus (Mixed urban environment). $T_{H}=\SI {0.05}{\meter }$.\relax }{table.caption.138}{}}
\acronymused{CP}
\acronymused{CAPS.loc}
\acronymused{CRM}
\@writefile{toc}{\contentsline {subsubsection}{Expected improvement in real scenarios}{164}{table.caption.138}\protected@file@percent }
\acronymused{CP}
\acronymused{CP}
\@writefile{toc}{\contentsline {section}{\numberline {8.7}Final remarks and further works}{164}{section.8.7}\protected@file@percent }
\newlabel{sec:furtherworks}{{8.7}{164}{Final remarks and further works}{section.8.7}{}}
\acronymused{CAPS.loc}
\acronymused{PoC}
\acronymused{GNSS}
\acronymused{CP}
\acronymused{GNSS}
\acronymused{CRM}
\acronymused{CPS}
\acronymused{CRM}
\acronymused{CPA}
\acronymused{PoC}
\acronymused{CRLB}
\acronymused{CRM}
\acronymused{NLOS}
\acronymused{CAPS.loc}
\acronymused{CP}
\acronymused{GNSS}
\acronymused{CP}
\acronymused{CAPS.loc}
\acronymused{CAPS.loc}
\acronymused{CRU}
\AC@undonewlabel{acro:H-PVT}
\newlabel{acro:H-PVT}{{8.7}{165}{Final remarks and further works}{section.8.7}{}}
\acronymused{H-PVT}
\acronymused{GNSS}
\acronymused{GNSS}
\acronymused{CRLB}
\acronymused{CPA}
\acronymused{GNSS}
\acronymused{CP}
\acronymused{GNSS}
\@writefile{lof}{\contentsline {figure}{\numberline {8.26}{\ignorespaces {\relax \fontsize  {10}{12}\selectfont  \abovedisplayskip 10\p@ plus2\p@ minus5\p@ \abovedisplayshortskip \z@ plus3\p@ \belowdisplayshortskip 6\p@ plus3\p@ minus3\p@ \def \leftmargin \leftmargini \parsep 4.5\p@ plus2\p@ minus\p@ \topsep 9\p@ plus3\p@ minus5\p@ \itemsep 4.5\p@ plus2\p@ minus\p@ {\leftmargin \leftmargini \topsep 6\p@ plus2\p@ minus2\p@ \parsep 3\p@ plus2\p@ minus\p@ \itemsep \parsep }\belowdisplayskip \abovedisplayskip Galileo Masters 2019 award certificate for CAPS.loc.}\relax }}{166}{figure.caption.139}\protected@file@percent }
\newlabel{fig:certificate}{{8.26}{166}{{\small Galileo Masters 2019 award certificate for CAPS.loc.}\relax }{figure.caption.139}{}}
\@setckpt{Chapter8/chapter8}{
\setcounter{page}{167}
\setcounter{equation}{6}
\setcounter{enumi}{4}
\setcounter{enumii}{0}
\setcounter{enumiii}{0}
\setcounter{enumiv}{0}
\setcounter{footnote}{3}
\setcounter{mpfootnote}{0}
\setcounter{part}{0}
\setcounter{chapter}{8}
\setcounter{section}{7}
\setcounter{subsection}{0}
\setcounter{subsubsection}{0}
\setcounter{paragraph}{0}
\setcounter{subparagraph}{0}
\setcounter{figure}{26}
\setcounter{table}{10}
\setcounter{SDpage}{0}
\setcounter{NumberSD}{0}
\setcounter{tomo}{0}
\setcounter{parentequation}{0}
\setcounter{caption@flags}{0}
\setcounter{ContinuedFloat}{0}
\setcounter{subfigure}{0}
\setcounter{subtable}{0}
\setcounter{float@type}{16}
\setcounter{tabx@nest}{0}
\setcounter{listtotal}{0}
\setcounter{listcount}{0}
\setcounter{liststart}{0}
\setcounter{liststop}{0}
\setcounter{citecount}{0}
\setcounter{citetotal}{0}
\setcounter{multicitecount}{0}
\setcounter{multicitetotal}{0}
\setcounter{instcount}{396}
\setcounter{maxnames}{3}
\setcounter{minnames}{1}
\setcounter{maxitems}{3}
\setcounter{minitems}{1}
\setcounter{citecounter}{0}
\setcounter{maxcitecounter}{0}
\setcounter{savedcitecounter}{0}
\setcounter{uniquelist}{0}
\setcounter{uniquename}{0}
\setcounter{refsection}{0}
\setcounter{refsegment}{0}
\setcounter{maxextratitle}{0}
\setcounter{maxextratitleyear}{0}
\setcounter{maxextraname}{5}
\setcounter{maxextradate}{0}
\setcounter{maxextraalpha}{0}
\setcounter{abbrvpenalty}{50}
\setcounter{highnamepenalty}{50}
\setcounter{lownamepenalty}{25}
\setcounter{maxparens}{3}
\setcounter{parenlevel}{0}
\setcounter{mincomprange}{10}
\setcounter{maxcomprange}{100000}
\setcounter{mincompwidth}{1}
\setcounter{afterword}{0}
\setcounter{savedafterword}{0}
\setcounter{annotator}{0}
\setcounter{savedannotator}{0}
\setcounter{author}{0}
\setcounter{savedauthor}{0}
\setcounter{bookauthor}{0}
\setcounter{savedbookauthor}{0}
\setcounter{commentator}{0}
\setcounter{savedcommentator}{0}
\setcounter{editor}{0}
\setcounter{savededitor}{0}
\setcounter{editora}{0}
\setcounter{savededitora}{0}
\setcounter{editorb}{0}
\setcounter{savededitorb}{0}
\setcounter{editorc}{0}
\setcounter{savededitorc}{0}
\setcounter{foreword}{0}
\setcounter{savedforeword}{0}
\setcounter{holder}{0}
\setcounter{savedholder}{0}
\setcounter{introduction}{0}
\setcounter{savedintroduction}{0}
\setcounter{namea}{0}
\setcounter{savednamea}{0}
\setcounter{nameb}{0}
\setcounter{savednameb}{0}
\setcounter{namec}{0}
\setcounter{savednamec}{0}
\setcounter{translator}{0}
\setcounter{savedtranslator}{0}
\setcounter{shortauthor}{0}
\setcounter{savedshortauthor}{0}
\setcounter{shorteditor}{0}
\setcounter{savedshorteditor}{0}
\setcounter{labelname}{0}
\setcounter{savedlabelname}{0}
\setcounter{institution}{0}
\setcounter{savedinstitution}{0}
\setcounter{lista}{0}
\setcounter{savedlista}{0}
\setcounter{listb}{0}
\setcounter{savedlistb}{0}
\setcounter{listc}{0}
\setcounter{savedlistc}{0}
\setcounter{listd}{0}
\setcounter{savedlistd}{0}
\setcounter{liste}{0}
\setcounter{savedliste}{0}
\setcounter{listf}{0}
\setcounter{savedlistf}{0}
\setcounter{location}{0}
\setcounter{savedlocation}{0}
\setcounter{organization}{0}
\setcounter{savedorganization}{0}
\setcounter{origlocation}{0}
\setcounter{savedoriglocation}{0}
\setcounter{origpublisher}{0}
\setcounter{savedorigpublisher}{0}
\setcounter{publisher}{0}
\setcounter{savedpublisher}{0}
\setcounter{language}{0}
\setcounter{savedlanguage}{0}
\setcounter{origlanguage}{0}
\setcounter{savedoriglanguage}{0}
\setcounter{pageref}{0}
\setcounter{savedpageref}{0}
\setcounter{textcitecount}{0}
\setcounter{textcitetotal}{0}
\setcounter{textcitemaxnames}{0}
\setcounter{biburlnumpenalty}{0}
\setcounter{biburlucpenalty}{0}
\setcounter{biburllcpenalty}{0}
\setcounter{smartand}{1}
\setcounter{bbx:relatedcount}{0}
\setcounter{bbx:relatedtotal}{0}
\setcounter{Item}{9}
\setcounter{Hfootnote}{3}
\setcounter{bookmark@seq@number}{116}
\setcounter{nlinenum}{0}
\setcounter{algorithm}{1}
\setcounter{ALC@unique}{6}
\setcounter{ALC@line}{6}
\setcounter{ALC@rem}{0}
\setcounter{ALC@depth}{0}
\setcounter{@todonotes@numberoftodonotes}{0}
\setcounter{Changes@AuthorCount}{2}
\setcounter{Changes@Author}{2}
\setcounter{Changes@addedCount}{1}
\setcounter{Changes@deletedCount}{0}
\setcounter{Changes@replacedCount}{2}
\setcounter{Changes@highlightCount}{0}
\setcounter{Changes@commentCount}{0}
\setcounter{authorcommentcount}{0}
\setcounter{Changes@addedCount1}{41}
\setcounter{Changes@deletedCount1}{3}
\setcounter{Changes@replacedCount1}{9}
\setcounter{Changes@highlightCount1}{0}
\setcounter{Changes@commentCount1}{0}
\setcounter{lstnumber}{1}
\setcounter{FancyVerbLine}{0}
\setcounter{section@level}{0}
\setcounter{lstlisting}{0}
}
