%!PS-Adobe-3.0 EPSF-3.0
%%Creator: (MATLAB, The Mathworks, Inc. Version 9.5.0.944444 \(R2018b\). Operating System: Windows 10)
%%Title: (C:/Users/Alex/Documents/PhD Docs/01. GIT/my_phd_thesis/Chapter3/Figures/Paper/ch3_MSEvsBattha.eps)
%%CreationDate: 2019-08-05T15:48:55
%%Pages: (atend)
%%BoundingBox: 0 0 705 508
%%LanguageLevel: 3
%%EndComments
%%BeginProlog
%%BeginResource: procset (Apache XML Graphics Std ProcSet) 1.2 0
%%Version: 1.2 0
%%Copyright: (Copyright 2001-2003,2010 The Apache Software Foundation. License terms: http://www.apache.org/licenses/LICENSE-2.0)
/bd{bind def}bind def
/ld{load def}bd
/GR/grestore ld
/GS/gsave ld
/RM/rmoveto ld
/C/curveto ld
/t/show ld
/L/lineto ld
/ML/setmiterlimit ld
/CT/concat ld
/f/fill ld
/N/newpath ld
/S/stroke ld
/CC/setcmykcolor ld
/A/ashow ld
/cp/closepath ld
/RC/setrgbcolor ld
/LJ/setlinejoin ld
/GC/setgray ld
/LW/setlinewidth ld
/M/moveto ld
/re {4 2 roll M
1 index 0 rlineto
0 exch rlineto
neg 0 rlineto
cp } bd
/_ctm matrix def
/_tm matrix def
/BT { _ctm currentmatrix pop matrix _tm copy pop 0 0 moveto } bd
/ET { _ctm setmatrix } bd
/iTm { _ctm setmatrix _tm concat } bd
/Tm { _tm astore pop iTm 0 0 moveto } bd
/ux 0.0 def
/uy 0.0 def
/F {
  /Tp exch def
  /Tf exch def
  Tf findfont Tp scalefont setfont
  /cf Tf def  /cs Tp def
} bd
/ULS {currentpoint /uy exch def /ux exch def} bd
/ULE {
  /Tcx currentpoint pop def
  gsave
  newpath
  cf findfont cs scalefont dup
  /FontMatrix get 0 get /Ts exch def /FontInfo get dup
  /UnderlinePosition get Ts mul /To exch def
  /UnderlineThickness get Ts mul /Tt exch def
  ux uy To add moveto  Tcx uy To add lineto
  Tt setlinewidth stroke
  grestore
} bd
/OLE {
  /Tcx currentpoint pop def
  gsave
  newpath
  cf findfont cs scalefont dup
  /FontMatrix get 0 get /Ts exch def /FontInfo get dup
  /UnderlinePosition get Ts mul /To exch def
  /UnderlineThickness get Ts mul /Tt exch def
  ux uy To add cs add moveto Tcx uy To add cs add lineto
  Tt setlinewidth stroke
  grestore
} bd
/SOE {
  /Tcx currentpoint pop def
  gsave
  newpath
  cf findfont cs scalefont dup
  /FontMatrix get 0 get /Ts exch def /FontInfo get dup
  /UnderlinePosition get Ts mul /To exch def
  /UnderlineThickness get Ts mul /Tt exch def
  ux uy To add cs 10 mul 26 idiv add moveto Tcx uy To add cs 10 mul 26 idiv add lineto
  Tt setlinewidth stroke
  grestore
} bd
/QT {
/Y22 exch store
/X22 exch store
/Y21 exch store
/X21 exch store
currentpoint
/Y21 load 2 mul add 3 div exch
/X21 load 2 mul add 3 div exch
/X21 load 2 mul /X22 load add 3 div
/Y21 load 2 mul /Y22 load add 3 div
/X22 load /Y22 load curveto
} bd
/SSPD {
dup length /d exch dict def
{
/v exch def
/k exch def
currentpagedevice k known {
/cpdv currentpagedevice k get def
v cpdv ne {
/upd false def
/nullv v type /nulltype eq def
/nullcpdv cpdv type /nulltype eq def
nullv nullcpdv or
{
/upd true def
} {
/sametype v type cpdv type eq def
sametype {
v type /arraytype eq {
/vlen v length def
/cpdvlen cpdv length def
vlen cpdvlen eq {
0 1 vlen 1 sub {
/i exch def
/obj v i get def
/cpdobj cpdv i get def
obj cpdobj ne {
/upd true def
exit
} if
} for
} {
/upd true def
} ifelse
} {
v type /dicttype eq {
v {
/dv exch def
/dk exch def
/cpddv cpdv dk get def
dv cpddv ne {
/upd true def
exit
} if
} forall
} {
/upd true def
} ifelse
} ifelse
} if
} ifelse
upd true eq {
d k v put
} if
} if
} if
} forall
d length 0 gt {
d setpagedevice
} if
} bd
/RE { % /NewFontName [NewEncodingArray] /FontName RE -
  findfont dup length dict begin
  {
    1 index /FID ne
    {def} {pop pop} ifelse
  } forall
  /Encoding exch def
  /FontName 1 index def
  currentdict definefont pop
  end
} bind def
%%EndResource
%%BeginResource: procset (Apache XML Graphics EPS ProcSet) 1.0 0
%%Version: 1.0 0
%%Copyright: (Copyright 2002-2003 The Apache Software Foundation. License terms: http://www.apache.org/licenses/LICENSE-2.0)
/BeginEPSF { %def
/b4_Inc_state save def         % Save state for cleanup
/dict_count countdictstack def % Count objects on dict stack
/op_count count 1 sub def      % Count objects on operand stack
userdict begin                 % Push userdict on dict stack
/showpage { } def              % Redefine showpage, { } = null proc
0 setgray 0 setlinecap         % Prepare graphics state
1 setlinewidth 0 setlinejoin
10 setmiterlimit [ ] 0 setdash newpath
/languagelevel where           % If level not equal to 1 then
{pop languagelevel             % set strokeadjust and
1 ne                           % overprint to their defaults.
{false setstrokeadjust false setoverprint
} if
} if
} bd
/EndEPSF { %def
count op_count sub {pop} repeat            % Clean up stacks
countdictstack dict_count sub {end} repeat
b4_Inc_state restore
} bd
%%EndResource
%FOPBeginFontDict
%%IncludeResource: font Courier-Oblique
%%IncludeResource: font Courier-BoldOblique
%%IncludeResource: font Courier-Bold
%%IncludeResource: font ZapfDingbats
%%IncludeResource: font Symbol
%%IncludeResource: font Helvetica
%%IncludeResource: font Helvetica-Oblique
%%IncludeResource: font Helvetica-Bold
%%IncludeResource: font Helvetica-BoldOblique
%%IncludeResource: font Times-Roman
%%IncludeResource: font Times-Italic
%%IncludeResource: font Times-Bold
%%IncludeResource: font Times-BoldItalic
%%IncludeResource: font Courier
%FOPEndFontDict
%%BeginResource: encoding WinAnsiEncoding
/WinAnsiEncoding [
/.notdef /.notdef /.notdef /.notdef /.notdef
/.notdef /.notdef /.notdef /.notdef /.notdef
/.notdef /.notdef /.notdef /.notdef /.notdef
/.notdef /.notdef /.notdef /.notdef /.notdef
/.notdef /.notdef /.notdef /.notdef /.notdef
/.notdef /.notdef /.notdef /.notdef /.notdef
/.notdef /.notdef /space /exclam /quotedbl
/numbersign /dollar /percent /ampersand /quotesingle
/parenleft /parenright /asterisk /plus /comma
/hyphen /period /slash /zero /one
/two /three /four /five /six
/seven /eight /nine /colon /semicolon
/less /equal /greater /question /at
/A /B /C /D /E
/F /G /H /I /J
/K /L /M /N /O
/P /Q /R /S /T
/U /V /W /X /Y
/Z /bracketleft /backslash /bracketright /asciicircum
/underscore /quoteleft /a /b /c
/d /e /f /g /h
/i /j /k /l /m
/n /o /p /q /r
/s /t /u /v /w
/x /y /z /braceleft /bar
/braceright /asciitilde /bullet /Euro /bullet
/quotesinglbase /florin /quotedblbase /ellipsis /dagger
/daggerdbl /circumflex /perthousand /Scaron /guilsinglleft
/OE /bullet /Zcaron /bullet /bullet
/quoteleft /quoteright /quotedblleft /quotedblright /bullet
/endash /emdash /asciitilde /trademark /scaron
/guilsinglright /oe /bullet /zcaron /Ydieresis
/space /exclamdown /cent /sterling /currency
/yen /brokenbar /section /dieresis /copyright
/ordfeminine /guillemotleft /logicalnot /sfthyphen /registered
/macron /degree /plusminus /twosuperior /threesuperior
/acute /mu /paragraph /middot /cedilla
/onesuperior /ordmasculine /guillemotright /onequarter /onehalf
/threequarters /questiondown /Agrave /Aacute /Acircumflex
/Atilde /Adieresis /Aring /AE /Ccedilla
/Egrave /Eacute /Ecircumflex /Edieresis /Igrave
/Iacute /Icircumflex /Idieresis /Eth /Ntilde
/Ograve /Oacute /Ocircumflex /Otilde /Odieresis
/multiply /Oslash /Ugrave /Uacute /Ucircumflex
/Udieresis /Yacute /Thorn /germandbls /agrave
/aacute /acircumflex /atilde /adieresis /aring
/ae /ccedilla /egrave /eacute /ecircumflex
/edieresis /igrave /iacute /icircumflex /idieresis
/eth /ntilde /ograve /oacute /ocircumflex
/otilde /odieresis /divide /oslash /ugrave
/uacute /ucircumflex /udieresis /yacute /thorn
/ydieresis
] def
%%EndResource
%FOPBeginFontReencode
/Courier-Oblique findfont
dup length dict begin
  {1 index /FID ne {def} {pop pop} ifelse} forall
  /Encoding WinAnsiEncoding def
  currentdict
end
/Courier-Oblique exch definefont pop
/Courier-BoldOblique findfont
dup length dict begin
  {1 index /FID ne {def} {pop pop} ifelse} forall
  /Encoding WinAnsiEncoding def
  currentdict
end
/Courier-BoldOblique exch definefont pop
/Courier-Bold findfont
dup length dict begin
  {1 index /FID ne {def} {pop pop} ifelse} forall
  /Encoding WinAnsiEncoding def
  currentdict
end
/Courier-Bold exch definefont pop
/Helvetica findfont
dup length dict begin
  {1 index /FID ne {def} {pop pop} ifelse} forall
  /Encoding WinAnsiEncoding def
  currentdict
end
/Helvetica exch definefont pop
/Helvetica-Oblique findfont
dup length dict begin
  {1 index /FID ne {def} {pop pop} ifelse} forall
  /Encoding WinAnsiEncoding def
  currentdict
end
/Helvetica-Oblique exch definefont pop
/Helvetica-Bold findfont
dup length dict begin
  {1 index /FID ne {def} {pop pop} ifelse} forall
  /Encoding WinAnsiEncoding def
  currentdict
end
/Helvetica-Bold exch definefont pop
/Helvetica-BoldOblique findfont
dup length dict begin
  {1 index /FID ne {def} {pop pop} ifelse} forall
  /Encoding WinAnsiEncoding def
  currentdict
end
/Helvetica-BoldOblique exch definefont pop
/Times-Roman findfont
dup length dict begin
  {1 index /FID ne {def} {pop pop} ifelse} forall
  /Encoding WinAnsiEncoding def
  currentdict
end
/Times-Roman exch definefont pop
/Times-Italic findfont
dup length dict begin
  {1 index /FID ne {def} {pop pop} ifelse} forall
  /Encoding WinAnsiEncoding def
  currentdict
end
/Times-Italic exch definefont pop
/Times-Bold findfont
dup length dict begin
  {1 index /FID ne {def} {pop pop} ifelse} forall
  /Encoding WinAnsiEncoding def
  currentdict
end
/Times-Bold exch definefont pop
/Times-BoldItalic findfont
dup length dict begin
  {1 index /FID ne {def} {pop pop} ifelse} forall
  /Encoding WinAnsiEncoding def
  currentdict
end
/Times-BoldItalic exch definefont pop
/Courier findfont
dup length dict begin
  {1 index /FID ne {def} {pop pop} ifelse} forall
  /Encoding WinAnsiEncoding def
  currentdict
end
/Courier exch definefont pop
%FOPEndFontReencode
%%EndProlog
%%Page: 1 1
%%PageBoundingBox: 0 0 705 508
%%BeginPageSetup
[1 0 0 -1 0 508] CT
%%EndPageSetup
GS
[0.75 0 0 0.75 0 0.25] CT
N
0 0 M
940 0 L
940 677 L
0 677 L
0 0 L
cp
clip
1 GC
N
0 0 940 677 re
f
GR
GS
[0.75 0 0 0.75 0 0.25] CT
1 GC
N
0 0 940 677 re
f
GR
GS
[0.75 0 0 0.75 0 0.25] CT
1 GC
N
122 584 M
851 584 L
851 51 L
122 51 L
cp
f
GR
GS
[0.75 0 0 0.75 0 0.25] CT
0.873 GC
1 LJ
0.667 LW
N
122 584 M
122 51 L
S
GR
GS
[0.75 0 0 0.75 0 0.25] CT
0.873 GC
1 LJ
0.667 LW
N
267.8 584 M
267.8 51 L
S
GR
GS
[0.75 0 0 0.75 0 0.25] CT
0.873 GC
1 LJ
0.667 LW
N
413.6 584 M
413.6 51 L
S
GR
GS
[0.75 0 0 0.75 0 0.25] CT
0.873 GC
1 LJ
0.667 LW
N
559.4 584 M
559.4 51 L
S
GR
GS
[0.75 0 0 0.75 0 0.25] CT
0.873 GC
1 LJ
0.667 LW
N
705.2 584 M
705.2 51 L
S
GR
GS
[0.75 0 0 0.75 0 0.25] CT
0.873 GC
1 LJ
0.667 LW
N
851 584 M
851 51 L
S
GR
GS
[0.75 0 0 0.75 0 0.25] CT
0.873 GC
1 LJ
0.667 LW
N
851 584 M
122 584 L
S
GR
GS
[0.75 0 0 0.75 0 0.25] CT
0.873 GC
1 LJ
0.667 LW
N
851 524.778 M
122 524.778 L
S
GR
GS
[0.75 0 0 0.75 0 0.25] CT
0.873 GC
1 LJ
0.667 LW
N
851 465.556 M
122 465.556 L
S
GR
GS
[0.75 0 0 0.75 0 0.25] CT
0.873 GC
1 LJ
0.667 LW
N
851 406.333 M
122 406.333 L
S
GR
GS
[0.75 0 0 0.75 0 0.25] CT
0.873 GC
1 LJ
0.667 LW
N
851 347.111 M
122 347.111 L
S
GR
GS
[0.75 0 0 0.75 0 0.25] CT
0.873 GC
1 LJ
0.667 LW
N
851 287.889 M
122 287.889 L
S
GR
GS
[0.75 0 0 0.75 0 0.25] CT
0.873 GC
1 LJ
0.667 LW
N
851 228.667 M
122 228.667 L
S
GR
GS
[0.75 0 0 0.75 0 0.25] CT
0.873 GC
1 LJ
0.667 LW
N
851 169.444 M
122 169.444 L
S
GR
GS
[0.75 0 0 0.75 0 0.25] CT
0.873 GC
1 LJ
0.667 LW
N
851 110.222 M
122 110.222 L
S
GR
GS
[0.75 0 0 0.75 0 0.25] CT
0.873 GC
1 LJ
0.667 LW
N
851 51 M
122 51 L
S
GR
GS
[0.75 0 0 0.75 0 0.25] CT
0.149 GC
2 setlinecap
1 LJ
0.667 LW
N
122 584 M
851 584 L
S
GR
GS
[0.75 0 0 0.75 0 0.25] CT
0.149 GC
2 setlinecap
1 LJ
0.667 LW
N
122 51 M
851 51 L
S
GR
GS
[0.75 0 0 0.75 0 0.25] CT
0.149 GC
2 setlinecap
1 LJ
0.667 LW
N
122 584 M
122 576.71 L
S
GR
GS
[0.75 0 0 0.75 0 0.25] CT
0.149 GC
2 setlinecap
1 LJ
0.667 LW
N
267.8 584 M
267.8 576.71 L
S
GR
GS
[0.75 0 0 0.75 0 0.25] CT
0.149 GC
2 setlinecap
1 LJ
0.667 LW
N
413.6 584 M
413.6 576.71 L
S
GR
GS
[0.75 0 0 0.75 0 0.25] CT
0.149 GC
2 setlinecap
1 LJ
0.667 LW
N
559.4 584 M
559.4 576.71 L
S
GR
GS
[0.75 0 0 0.75 0 0.25] CT
0.149 GC
2 setlinecap
1 LJ
0.667 LW
N
705.2 584 M
705.2 576.71 L
S
GR
GS
[0.75 0 0 0.75 0 0.25] CT
0.149 GC
2 setlinecap
1 LJ
0.667 LW
N
851 584 M
851 576.71 L
S
GR
GS
[0.75 0 0 0.75 0 0.25] CT
0.149 GC
2 setlinecap
1 LJ
0.667 LW
N
122 51 M
122 58.29 L
S
GR
GS
[0.75 0 0 0.75 0 0.25] CT
0.149 GC
2 setlinecap
1 LJ
0.667 LW
N
267.8 51 M
267.8 58.29 L
S
GR
GS
[0.75 0 0 0.75 0 0.25] CT
0.149 GC
2 setlinecap
1 LJ
0.667 LW
N
413.6 51 M
413.6 58.29 L
S
GR
GS
[0.75 0 0 0.75 0 0.25] CT
0.149 GC
2 setlinecap
1 LJ
0.667 LW
N
559.4 51 M
559.4 58.29 L
S
GR
GS
[0.75 0 0 0.75 0 0.25] CT
0.149 GC
2 setlinecap
1 LJ
0.667 LW
N
705.2 51 M
705.2 58.29 L
S
GR
GS
[0.75 0 0 0.75 0 0.25] CT
0.149 GC
2 setlinecap
1 LJ
0.667 LW
N
851 51 M
851 58.29 L
S
GR
GS
[0.75 0 0 0.75 91.5 443.85001] CT
0.149 GC
/Helvetica 24 F
GS
[1 0 0 1 0 0] CT
-7 25 moveto 
1 -1 scale
(0) t 
GR
GR
GS
[0.75 0 0 0.75 200.84999 443.85001] CT
0.149 GC
/Helvetica 24 F
GS
[1 0 0 1 0 0] CT
-13.5 25 moveto 
1 -1 scale
(50) t 
GR
GR
GS
[0.75 0 0 0.75 310.2 443.85001] CT
0.149 GC
/Helvetica 24 F
GS
[1 0 0 1 0 0] CT
-20.5 25 moveto 
1 -1 scale
(100) t 
GR
GR
GS
[0.75 0 0 0.75 419.55002 443.85001] CT
0.149 GC
/Helvetica 24 F
GS
[1 0 0 1 0 0] CT
-20.5 25 moveto 
1 -1 scale
(150) t 
GR
GR
GS
[0.75 0 0 0.75 528.90001 443.85001] CT
0.149 GC
/Helvetica 24 F
GS
[1 0 0 1 0 0] CT
-20.5 25 moveto 
1 -1 scale
(200) t 
GR
GR
GS
[0.75 0 0 0.75 638.25 443.85001] CT
0.149 GC
/Helvetica 24 F
GS
[1 0 0 1 0 0] CT
-20.5 25 moveto 
1 -1 scale
(250) t 
GR
GR
GS
[0.75 0 0 0.75 365.59184 456.36975] CT
0.149 GC
N
-17.282 22.176 M
-17.532 22.176 -17.532 21.832 QT
-17.532 21.77 -17.493 21.613 QT
-17.454 21.457 -17.391 21.356 QT
-17.329 21.254 -17.188 21.254 QT
-16.454 21.254 -15.907 21.223 QT
-15.36 21.192 -14.985 21.082 QT
-14.688 20.973 -14.485 20.379 QT
-10.938 6.098 L
-10.891 5.848 -10.891 5.754 QT
-10.891 5.473 -11.188 5.426 QT
-11.688 5.332 -13.063 5.332 QT
-13.329 5.332 -13.329 4.988 QT
-13.313 4.926 -13.274 4.762 QT
-13.235 4.598 -13.165 4.504 QT
-13.095 4.41 -12.985 4.41 QT
-3.673 4.41 L
-2.829 4.41 -1.993 4.621 QT
-1.157 4.832 -0.454 5.293 QT
0.249 5.754 0.663 6.434 QT
1.077 7.113 1.077 8.004 QT
1.077 8.988 0.577 9.824 QT
0.077 10.66 -0.72 11.285 QT
-1.516 11.91 -2.438 12.309 QT
-3.36 12.707 -4.36 12.895 QT
-3.641 12.895 -2.915 13.176 QT
-2.188 13.457 -1.618 13.942 QT
-1.048 14.426 -0.696 15.098 QT
-0.345 15.77 -0.345 16.535 QT
-0.345 18.098 -1.438 19.395 QT
-2.532 20.692 -4.188 21.434 QT
-5.845 22.176 -7.391 22.176 QT
-17.282 22.176 L
cp
-12.501 21.051 M
-12.501 21.254 -11.61 21.254 QT
-7.891 21.254 L
-6.626 21.254 -5.454 20.551 QT
-4.282 19.848 -3.579 18.684 QT
-2.876 17.52 -2.876 16.254 QT
-2.876 15.473 -3.196 14.777 QT
-3.516 14.082 -4.126 13.684 QT
-4.735 13.285 -5.532 13.285 QT
-10.595 13.285 L
-12.391 20.488 L
-12.501 20.848 -12.501 21.051 QT
cp
-10.423 12.598 M
-6.47 12.598 L
-5.22 12.598 -4.048 11.965 QT
-2.876 11.332 -2.134 10.238 QT
-1.391 9.145 -1.391 7.926 QT
-1.391 6.801 -2.095 6.067 QT
-2.798 5.332 -3.923 5.332 QT
-7.485 5.332 L
-8.188 5.332 -8.423 5.457 QT
-8.657 5.582 -8.829 6.223 QT
-10.423 12.598 L
cp
f
GR
GS
[0.75 0 0 0.75 365.59184 456.36975] CT
0.149 GC
N
2.321 26.136 M
2.149 26.136 2.149 25.901 QT
2.164 25.855 2.188 25.745 QT
2.211 25.636 2.258 25.566 QT
2.305 25.495 2.383 25.495 QT
3.477 25.495 3.914 25.386 QT
4.149 25.308 4.243 24.901 QT
6.727 15.011 L
6.758 14.839 6.758 14.761 QT
6.758 14.573 6.539 14.542 QT
6.196 14.48 5.243 14.48 QT
5.071 14.48 5.071 14.23 QT
5.071 14.198 5.102 14.081 QT
5.133 13.964 5.18 13.901 QT
5.227 13.839 5.289 13.839 QT
11.758 13.839 L
13.024 13.839 13.961 14.448 QT
14.899 15.058 15.399 16.089 QT
15.899 17.12 15.899 18.37 QT
15.899 19.761 15.329 21.136 QT
14.758 22.511 13.735 23.651 QT
12.711 24.792 11.391 25.464 QT
10.071 26.136 8.68 26.136 QT
2.321 26.136 L
cp
5.696 25.355 M
5.696 25.495 6.305 25.495 QT
8.399 25.495 L
9.399 25.495 10.329 25.089 QT
11.258 24.683 11.993 23.948 QT
12.664 23.276 13.188 22.183 QT
13.711 21.089 13.993 19.894 QT
14.274 18.698 14.274 17.683 QT
14.274 16.964 14.063 16.37 QT
13.852 15.776 13.461 15.355 QT
13.071 14.933 12.477 14.706 QT
11.883 14.48 11.149 14.48 QT
9.164 14.48 L
8.68 14.48 8.524 14.558 QT
8.368 14.636 8.227 15.089 QT
5.774 24.964 L
5.696 25.183 5.696 25.355 QT
cp
f
GR
GS
[0.75 0 0 0.75 0 0.25] CT
0.149 GC
2 setlinecap
1 LJ
0.667 LW
N
122 584 M
122 51 L
S
GR
GS
[0.75 0 0 0.75 0 0.25] CT
0.149 GC
2 setlinecap
1 LJ
0.667 LW
N
851 584 M
851 51 L
S
GR
GS
[0.75 0 0 0.75 0 0.25] CT
0.149 GC
2 setlinecap
1 LJ
0.667 LW
N
122 584 M
129.29 584 L
S
GR
GS
[0.75 0 0 0.75 0 0.25] CT
0.149 GC
2 setlinecap
1 LJ
0.667 LW
N
122 524.778 M
129.29 524.778 L
S
GR
GS
[0.75 0 0 0.75 0 0.25] CT
0.149 GC
2 setlinecap
1 LJ
0.667 LW
N
122 465.556 M
129.29 465.556 L
S
GR
GS
[0.75 0 0 0.75 0 0.25] CT
0.149 GC
2 setlinecap
1 LJ
0.667 LW
N
122 406.333 M
129.29 406.333 L
S
GR
GS
[0.75 0 0 0.75 0 0.25] CT
0.149 GC
2 setlinecap
1 LJ
0.667 LW
N
122 347.111 M
129.29 347.111 L
S
GR
GS
[0.75 0 0 0.75 0 0.25] CT
0.149 GC
2 setlinecap
1 LJ
0.667 LW
N
122 287.889 M
129.29 287.889 L
S
GR
GS
[0.75 0 0 0.75 0 0.25] CT
0.149 GC
2 setlinecap
1 LJ
0.667 LW
N
122 228.667 M
129.29 228.667 L
S
GR
GS
[0.75 0 0 0.75 0 0.25] CT
0.149 GC
2 setlinecap
1 LJ
0.667 LW
N
122 169.444 M
129.29 169.444 L
S
GR
GS
[0.75 0 0 0.75 0 0.25] CT
0.149 GC
2 setlinecap
1 LJ
0.667 LW
N
122 110.222 M
129.29 110.222 L
S
GR
GS
[0.75 0 0 0.75 0 0.25] CT
0.149 GC
2 setlinecap
1 LJ
0.667 LW
N
122 51 M
129.29 51 L
S
GR
GS
[0.75 0 0 0.75 0 0.25] CT
0.149 GC
2 setlinecap
1 LJ
0.667 LW
N
851 584 M
843.71 584 L
S
GR
GS
[0.75 0 0 0.75 0 0.25] CT
0.149 GC
2 setlinecap
1 LJ
0.667 LW
N
851 524.778 M
843.71 524.778 L
S
GR
GS
[0.75 0 0 0.75 0 0.25] CT
0.149 GC
2 setlinecap
1 LJ
0.667 LW
N
851 465.556 M
843.71 465.556 L
S
GR
GS
[0.75 0 0 0.75 0 0.25] CT
0.149 GC
2 setlinecap
1 LJ
0.667 LW
N
851 406.333 M
843.71 406.333 L
S
GR
GS
[0.75 0 0 0.75 0 0.25] CT
0.149 GC
2 setlinecap
1 LJ
0.667 LW
N
851 347.111 M
843.71 347.111 L
S
GR
GS
[0.75 0 0 0.75 0 0.25] CT
0.149 GC
2 setlinecap
1 LJ
0.667 LW
N
851 287.889 M
843.71 287.889 L
S
GR
GS
[0.75 0 0 0.75 0 0.25] CT
0.149 GC
2 setlinecap
1 LJ
0.667 LW
N
851 228.667 M
843.71 228.667 L
S
GR
GS
[0.75 0 0 0.75 0 0.25] CT
0.149 GC
2 setlinecap
1 LJ
0.667 LW
N
851 169.444 M
843.71 169.444 L
S
GR
GS
[0.75 0 0 0.75 0 0.25] CT
0.149 GC
2 setlinecap
1 LJ
0.667 LW
N
851 110.222 M
843.71 110.222 L
S
GR
GS
[0.75 0 0 0.75 0 0.25] CT
0.149 GC
2 setlinecap
1 LJ
0.667 LW
N
851 51 M
843.71 51 L
S
GR
GS
[0.75 0 0 0.75 85.9 438.25] CT
0.149 GC
/Helvetica 24 F
GS
[1 0 0 1 0 0] CT
-14 9.5 moveto 
1 -1 scale
(0) t 
GR
GR
GS
[0.75 0 0 0.75 85.9 393.83333] CT
0.149 GC
/Helvetica 24 F
GS
[1 0 0 1 0 0] CT
-14 9.5 moveto 
1 -1 scale
(1) t 
GR
GR
GS
[0.75 0 0 0.75 85.9 349.41668] CT
0.149 GC
/Helvetica 24 F
GS
[1 0 0 1 0 0] CT
-14 9.5 moveto 
1 -1 scale
(2) t 
GR
GR
GS
[0.75 0 0 0.75 85.9 305.00001] CT
0.149 GC
/Helvetica 24 F
GS
[1 0 0 1 0 0] CT
-14 9.5 moveto 
1 -1 scale
(3) t 
GR
GR
GS
[0.75 0 0 0.75 85.9 260.58334] CT
0.149 GC
/Helvetica 24 F
GS
[1 0 0 1 0 0] CT
-14 9.5 moveto 
1 -1 scale
(4) t 
GR
GR
GS
[0.75 0 0 0.75 85.9 216.16666] CT
0.149 GC
/Helvetica 24 F
GS
[1 0 0 1 0 0] CT
-14 9.5 moveto 
1 -1 scale
(5) t 
GR
GR
GS
[0.75 0 0 0.75 85.9 171.75] CT
0.149 GC
/Helvetica 24 F
GS
[1 0 0 1 0 0] CT
-14 9.5 moveto 
1 -1 scale
(6) t 
GR
GR
GS
[0.75 0 0 0.75 85.9 127.33332] CT
0.149 GC
/Helvetica 24 F
GS
[1 0 0 1 0 0] CT
-14 9.5 moveto 
1 -1 scale
(7) t 
GR
GR
GS
[0.75 0 0 0.75 85.9 82.91668] CT
0.149 GC
/Helvetica 24 F
GS
[1 0 0 1 0 0] CT
-14 9.5 moveto 
1 -1 scale
(8) t 
GR
GR
GS
[0.75 0 0 0.75 85.9 38.49999] CT
0.149 GC
/Helvetica 24 F
GS
[1 0 0 1 0 0] CT
-14 9.5 moveto 
1 -1 scale
(9) t 
GR
GR
GS
[0 -0.75 0.75 0 72.4 238.37479] CT
0.149 GC
N
-27.495 -9.504 M
-27.495 -10.426 L
-24.823 -10.426 -24.823 -11.957 QT
-24.823 -25.52 L
-24.823 -26.348 -27.495 -26.348 QT
-27.495 -27.27 L
-22.589 -27.27 L
-22.276 -27.27 -22.167 -26.973 QT
-16.51 -12.254 L
-10.839 -26.973 L
-10.745 -27.27 -10.432 -27.27 QT
-5.51 -27.27 L
-5.51 -26.348 L
-8.198 -26.348 -8.198 -25.52 QT
-8.198 -11.238 L
-8.198 -10.426 -5.51 -10.426 QT
-5.51 -9.504 L
-13.073 -9.504 L
-13.073 -10.426 L
-10.401 -10.426 -10.401 -11.238 QT
-10.401 -26.379 L
-16.807 -9.801 L
-16.917 -9.504 -17.229 -9.504 QT
-17.557 -9.504 -17.682 -9.801 QT
-23.995 -26.176 L
-23.995 -11.957 L
-23.995 -10.426 -21.323 -10.426 QT
-21.323 -9.504 L
-27.495 -9.504 L
cp
f
GR
GS
[0 -0.75 0.75 0 72.4 238.37479] CT
0.149 GC
N
-2.764 -9.129 M
-2.764 -15.207 L
-2.764 -15.41 -2.529 -15.41 QT
-2.217 -15.41 L
-2.139 -15.41 -2.076 -15.348 QT
-2.014 -15.285 -2.014 -15.207 QT
-2.014 -12.66 -0.428 -11.254 QT
1.158 -9.848 3.721 -9.848 QT
4.627 -9.848 5.385 -10.371 QT
6.143 -10.895 6.565 -11.738 QT
6.986 -12.582 6.986 -13.473 QT
6.986 -14.27 6.674 -15.012 QT
6.361 -15.754 5.76 -16.301 QT
5.158 -16.848 4.424 -17.02 QT
1.033 -17.848 L
-0.639 -18.285 -1.701 -19.668 QT
-2.764 -21.051 -2.764 -22.754 QT
-2.764 -24.098 -2.076 -25.285 QT
-1.389 -26.473 -0.224 -27.153 QT
0.94 -27.832 2.283 -27.832 QT
4.893 -27.832 6.424 -26.067 QT
7.486 -27.754 L
7.565 -27.832 7.674 -27.832 QT
7.846 -27.832 L
7.924 -27.832 7.994 -27.778 QT
8.065 -27.723 8.065 -27.613 QT
8.065 -21.598 L
8.065 -21.363 7.846 -21.363 QT
7.533 -21.363 L
7.299 -21.363 7.299 -21.598 QT
7.299 -22.254 7.08 -23.043 QT
6.861 -23.832 6.463 -24.551 QT
6.065 -25.27 5.611 -25.723 QT
4.346 -27.004 2.283 -27.004 QT
1.393 -27.004 0.643 -26.551 QT
-0.107 -26.098 -0.553 -25.324 QT
-0.998 -24.551 -0.998 -23.692 QT
-0.998 -22.582 -0.303 -21.676 QT
0.393 -20.77 1.502 -20.473 QT
4.893 -19.645 L
5.721 -19.442 6.463 -18.918 QT
7.205 -18.395 7.705 -17.692 QT
8.205 -16.988 8.479 -16.137 QT
8.752 -15.285 8.752 -14.363 QT
8.752 -12.957 8.111 -11.707 QT
7.471 -10.457 6.291 -9.692 QT
5.111 -8.926 3.721 -8.926 QT
2.861 -8.926 1.955 -9.121 QT
1.049 -9.317 0.291 -9.707 QT
-0.467 -10.098 -1.092 -10.723 QT
-2.185 -9.004 L
-2.264 -8.926 -2.373 -8.926 QT
-2.529 -8.926 L
-2.764 -8.926 -2.764 -9.129 QT
cp
f
GR
GS
[0 -0.75 0.75 0 72.4 238.37479] CT
0.149 GC
N
11.247 -9.504 M
11.247 -10.426 L
13.934 -10.426 13.934 -11.238 QT
13.934 -25.52 L
13.934 -26.348 11.247 -26.348 QT
11.247 -27.27 L
25.95 -27.27 L
26.669 -21.317 L
25.919 -21.317 L
25.653 -23.551 25.145 -24.567 QT
24.638 -25.582 23.536 -25.965 QT
22.434 -26.348 20.231 -26.348 QT
17.669 -26.348 L
17.2 -26.348 16.942 -26.309 QT
16.684 -26.27 16.52 -26.09 QT
16.356 -25.91 16.356 -25.52 QT
16.356 -19.176 L
18.278 -19.176 L
19.591 -19.176 20.247 -19.403 QT
20.903 -19.629 21.145 -20.254 QT
21.388 -20.879 21.388 -22.207 QT
22.153 -22.207 L
22.153 -15.223 L
21.388 -15.223 L
21.388 -16.551 21.145 -17.184 QT
20.903 -17.817 20.247 -18.043 QT
19.591 -18.27 18.278 -18.27 QT
16.356 -18.27 L
16.356 -11.238 L
16.356 -10.692 16.669 -10.559 QT
16.981 -10.426 17.669 -10.426 QT
20.434 -10.426 L
22.231 -10.426 23.341 -10.707 QT
24.45 -10.988 25.067 -11.653 QT
25.684 -12.317 26.02 -13.379 QT
26.356 -14.442 26.653 -16.317 QT
27.403 -16.317 L
26.309 -9.504 L
11.247 -9.504 L
cp
f
GR
GS
[0.75 0 0 0.75 91.5 34] CT
0.149 GC
N
3.531 -0.688 M
3.531 -0.875 3.641 -1.031 QT
8.641 -6 L
3.641 -11 L
3.531 -11.109 3.531 -11.313 QT
3.531 -11.484 3.672 -11.641 QT
3.813 -11.797 4.016 -11.797 QT
4.172 -11.797 4.375 -11.641 QT
9.344 -6.672 L
14.281 -11.641 L
14.484 -11.797 14.641 -11.797 QT
14.844 -11.797 14.984 -11.656 QT
15.125 -11.516 15.125 -11.313 QT
15.125 -11.109 15 -11 QT
10.016 -6 L
15 -1.031 L
15.125 -0.875 15.125 -0.688 QT
15.125 -0.5 14.984 -0.359 QT
14.844 -0.219 14.641 -0.219 QT
14.469 -0.219 14.281 -0.391 QT
9.344 -5.328 L
4.375 -0.391 L
4.203 -0.219 4.016 -0.219 QT
3.813 -0.219 3.672 -0.367 QT
3.531 -0.516 3.531 -0.688 QT
cp
f
GR
GS
[0.75 0 0 0.75 105.75 34] CT
0.149 GC
/Helvetica 24 F
GS
[1 0 0 1 0 0] CT
0 0 moveto 
1 -1 scale
(10) t 
GR
GR
GS
[0.75 0 0 0.75 126 25] CT
0.149 GC
/Helvetica 19.2 F
GS
[1 0 0 1 0 0] CT
0 0 moveto 
1 -1 scale
(-5) t 
GR
GR
GS
[0.75 0 0 0.75 0 0.25] CT
1 LJ
1.333 LW
N
128.649 66.887 M
131.893 132.106 L
136.064 190.297 L
141.163 241.983 L
147.188 287.674 L
154.14 327.866 L
162.019 363.04 L
170.825 393.657 L
180.557 420.157 L
191.217 442.96 L
202.804 462.461 L
215.317 479.034 L
228.758 493.027 L
243.125 504.762 L
258.42 514.538 L
274.641 522.628 L
291.789 529.282 L
309.865 534.725 L
328.867 539.159 L
348.796 542.763 L
369.652 545.695 L
391.435 548.093 L
414.145 550.075 L
437.782 551.742 L
462.345 553.177 L
487.836 554.45 L
514.254 555.616 L
541.598 556.716 L
569.87 557.783 L
599.068 558.839 L
629.194 559.897 L
660.246 560.965 L
692.225 562.043 L
725.131 563.128 L
758.964 564.214 L
793.724 565.292 L
829.411 566.35 L
851.087 566.959 L
S
GR
GS
[0.75 0 0 0.75 96.48675 50.41551] CT
10.0 ML
1.333 LW
N
4 0 M
4 -2.209 2.209 -4 0 -4 C
-2.209 -4 -4 -2.209 -4 0 C
-4 2.209 -2.209 4 0 4 C
2.209 4 4 2.209 4 0 C
cp
S
GR
GS
[0.75 0 0 0.75 98.91996 99.32951] CT
10.0 ML
1.333 LW
N
4 0 M
4 -2.209 2.209 -4 0 -4 C
-2.209 -4 -4 -2.209 -4 0 C
-4 2.209 -2.209 4 0 4 C
2.209 4 4 2.209 4 0 C
cp
S
GR
GS
[0.75 0 0 0.75 102.04836 142.97281] CT
10.0 ML
1.333 LW
N
4 0 M
4 -2.209 2.209 -4 0 -4 C
-2.209 -4 -4 -2.209 -4 0 C
-4 2.209 -2.209 4 0 4 C
2.209 4 4 2.209 4 0 C
cp
S
GR
GS
[0.75 0 0 0.75 105.87197 181.73709] CT
10.0 ML
1.333 LW
N
4 0 M
4 -2.209 2.209 -4 0 -4 C
-2.209 -4 -4 -2.209 -4 0 C
-4 2.209 -2.209 4 0 4 C
2.209 4 4 2.209 4 0 C
cp
S
GR
GS
[0.75 0 0 0.75 110.39077 216.0053] CT
10.0 ML
1.333 LW
N
4 0 M
4 -2.209 2.209 -4 0 -4 C
-2.209 -4 -4 -2.209 -4 0 C
-4 2.209 -2.209 4 0 4 C
2.209 4 4 2.209 4 0 C
cp
S
GR
GS
[0.75 0 0 0.75 115.60478 246.1497] CT
10.0 ML
1.333 LW
N
4 0 M
4 -2.209 2.209 -4 0 -4 C
-2.209 -4 -4 -2.209 -4 0 C
-4 2.209 -2.209 4 0 4 C
2.209 4 4 2.209 4 0 C
cp
S
GR
GS
[0.75 0 0 0.75 121.51398 272.53017] CT
10.0 ML
1.333 LW
N
4 0 M
4 -2.209 2.209 -4 0 -4 C
-2.209 -4 -4 -2.209 -4 0 C
-4 2.209 -2.209 4 0 4 C
2.209 4 4 2.209 4 0 C
cp
S
GR
GS
[0.75 0 0 0.75 128.11839 295.4926] CT
10.0 ML
1.333 LW
N
4 0 M
4 -2.209 2.209 -4 0 -4 C
-2.209 -4 -4 -2.209 -4 0 C
-4 2.209 -2.209 4 0 4 C
2.209 4 4 2.209 4 0 C
cp
S
GR
GS
[0.75 0 0 0.75 135.418 315.36769] CT
10.0 ML
1.333 LW
N
4 0 M
4 -2.209 2.209 -4 0 -4 C
-2.209 -4 -4 -2.209 -4 0 C
-4 2.209 -2.209 4 0 4 C
2.209 4 4 2.209 4 0 C
cp
S
GR
GS
[0.75 0 0 0.75 143.41282 332.46976] CT
10.0 ML
1.333 LW
N
4 0 M
4 -2.209 2.209 -4 0 -4 C
-2.209 -4 -4 -2.209 -4 0 C
-4 2.209 -2.209 4 0 4 C
2.209 4 4 2.209 4 0 C
cp
S
GR
GS
[0.75 0 0 0.75 152.10283 347.09602] CT
10.0 ML
1.333 LW
N
4 0 M
4 -2.209 2.209 -4 0 -4 C
-2.209 -4 -4 -2.209 -4 0 C
-4 2.209 -2.209 4 0 4 C
2.209 4 4 2.209 4 0 C
cp
S
GR
GS
[0.75 0 0 0.75 161.48804 359.52579] CT
10.0 ML
1.333 LW
N
4 0 M
4 -2.209 2.209 -4 0 -4 C
-2.209 -4 -4 -2.209 -4 0 C
-4 2.209 -2.209 4 0 4 C
2.209 4 4 2.209 4 0 C
cp
S
GR
GS
[0.75 0 0 0.75 171.56845 370.02005] CT
10.0 ML
1.333 LW
N
4 0 M
4 -2.209 2.209 -4 0 -4 C
-2.209 -4 -4 -2.209 -4 0 C
-4 2.209 -2.209 4 0 4 C
2.209 4 4 2.209 4 0 C
cp
S
GR
GS
[0.75 0 0 0.75 182.34406 378.82129] CT
10.0 ML
1.333 LW
N
4 0 M
4 -2.209 2.209 -4 0 -4 C
-2.209 -4 -4 -2.209 -4 0 C
-4 2.209 -2.209 4 0 4 C
2.209 4 4 2.209 4 0 C
cp
S
GR
GS
[0.75 0 0 0.75 193.81487 386.15324] CT
10.0 ML
1.333 LW
N
4 0 M
4 -2.209 2.209 -4 0 -4 C
-2.209 -4 -4 -2.209 -4 0 C
-4 2.209 -2.209 4 0 4 C
2.209 4 4 2.209 4 0 C
cp
S
GR
GS
[0.75 0 0 0.75 205.98088 392.22108] CT
10.0 ML
1.333 LW
N
4 0 M
4 -2.209 2.209 -4 0 -4 C
-2.209 -4 -4 -2.209 -4 0 C
-4 2.209 -2.209 4 0 4 C
2.209 4 4 2.209 4 0 C
cp
S
GR
GS
[0.75 0 0 0.75 218.84209 397.21172] CT
10.0 ML
1.333 LW
N
4 0 M
4 -2.209 2.209 -4 0 -4 C
-2.209 -4 -4 -2.209 -4 0 C
-4 2.209 -2.209 4 0 4 C
2.209 4 4 2.209 4 0 C
cp
S
GR
GS
[0.75 0 0 0.75 232.39851 401.29396] CT
10.0 ML
1.333 LW
N
4 0 M
4 -2.209 2.209 -4 0 -4 C
-2.209 -4 -4 -2.209 -4 0 C
-4 2.209 -2.209 4 0 4 C
2.209 4 4 2.209 4 0 C
cp
S
GR
GS
[0.75 0 0 0.75 246.65014 404.61929] CT
10.0 ML
1.333 LW
N
4 0 M
4 -2.209 2.209 -4 0 -4 C
-2.209 -4 -4 -2.209 -4 0 C
-4 2.209 -2.209 4 0 4 C
2.209 4 4 2.209 4 0 C
cp
S
GR
GS
[0.75 0 0 0.75 261.59695 407.3222] CT
10.0 ML
1.333 LW
N
4 0 M
4 -2.209 2.209 -4 0 -4 C
-2.209 -4 -4 -2.209 -4 0 C
-4 2.209 -2.209 4 0 4 C
2.209 4 4 2.209 4 0 C
cp
S
GR
GS
[0.75 0 0 0.75 277.23898 409.52126] CT
10.0 ML
1.333 LW
N
4 0 M
4 -2.209 2.209 -4 0 -4 C
-2.209 -4 -4 -2.209 -4 0 C
-4 2.209 -2.209 4 0 4 C
2.209 4 4 2.209 4 0 C
cp
S
GR
GS
[0.75 0 0 0.75 293.5762 411.31963] CT
10.0 ML
1.333 LW
N
4 0 M
4 -2.209 2.209 -4 0 -4 C
-2.209 -4 -4 -2.209 -4 0 C
-4 2.209 -2.209 4 0 4 C
2.209 4 4 2.209 4 0 C
cp
S
GR
GS
[0.75 0 0 0.75 310.6086 412.80617] CT
10.0 ML
1.333 LW
N
4 0 M
4 -2.209 2.209 -4 0 -4 C
-2.209 -4 -4 -2.209 -4 0 C
-4 2.209 -2.209 4 0 4 C
2.209 4 4 2.209 4 0 C
cp
S
GR
GS
[0.75 0 0 0.75 328.33624 414.05627] CT
10.0 ML
1.333 LW
N
4 0 M
4 -2.209 2.209 -4 0 -4 C
-2.209 -4 -4 -2.209 -4 0 C
-4 2.209 -2.209 4 0 4 C
2.209 4 4 2.209 4 0 C
cp
S
GR
GS
[0.75 0 0 0.75 346.75907 415.13289] CT
10.0 ML
1.333 LW
N
4 0 M
4 -2.209 2.209 -4 0 -4 C
-2.209 -4 -4 -2.209 -4 0 C
-4 2.209 -2.209 4 0 4 C
2.209 4 4 2.209 4 0 C
cp
S
GR
GS
[0.75 0 0 0.75 365.87709 416.08765] CT
10.0 ML
1.333 LW
N
4 0 M
4 -2.209 2.209 -4 0 -4 C
-2.209 -4 -4 -2.209 -4 0 C
-4 2.209 -2.209 4 0 4 C
2.209 4 4 2.209 4 0 C
cp
S
GR
GS
[0.75 0 0 0.75 385.69029 416.96165] CT
10.0 ML
1.333 LW
N
4 0 M
4 -2.209 2.209 -4 0 -4 C
-2.209 -4 -4 -2.209 -4 0 C
-4 2.209 -2.209 4 0 4 C
2.209 4 4 2.209 4 0 C
cp
S
GR
GS
[0.75 0 0 0.75 406.19875 417.78696] CT
10.0 ML
1.333 LW
N
4 0 M
4 -2.209 2.209 -4 0 -4 C
-2.209 -4 -4 -2.209 -4 0 C
-4 2.209 -2.209 4 0 4 C
2.209 4 4 2.209 4 0 C
cp
S
GR
GS
[0.75 0 0 0.75 427.40236 418.58727] CT
10.0 ML
1.333 LW
N
4 0 M
4 -2.209 2.209 -4 0 -4 C
-2.209 -4 -4 -2.209 -4 0 C
-4 2.209 -2.209 4 0 4 C
2.209 4 4 2.209 4 0 C
cp
S
GR
GS
[0.75 0 0 0.75 449.30118 419.37906] CT
10.0 ML
1.333 LW
N
4 0 M
4 -2.209 2.209 -4 0 -4 C
-2.209 -4 -4 -2.209 -4 0 C
-4 2.209 -2.209 4 0 4 C
2.209 4 4 2.209 4 0 C
cp
S
GR
GS
[0.75 0 0 0.75 471.8952 420.17268] CT
10.0 ML
1.333 LW
N
4 0 M
4 -2.209 2.209 -4 0 -4 C
-2.209 -4 -4 -2.209 -4 0 C
-4 2.209 -2.209 4 0 4 C
2.209 4 4 2.209 4 0 C
cp
S
GR
GS
[0.75 0 0 0.75 495.18443 420.9734] CT
10.0 ML
1.333 LW
N
4 0 M
4 -2.209 2.209 -4 0 -4 C
-2.209 -4 -4 -2.209 -4 0 C
-4 2.209 -2.209 4 0 4 C
2.209 4 4 2.209 4 0 C
cp
S
GR
GS
[0.75 0 0 0.75 519.16887 421.78204] CT
10.0 ML
1.333 LW
N
4 0 M
4 -2.209 2.209 -4 0 -4 C
-2.209 -4 -4 -2.209 -4 0 C
-4 2.209 -2.209 4 0 4 C
2.209 4 4 2.209 4 0 C
cp
S
GR
GS
[0.75 0 0 0.75 543.84851 422.59613] CT
10.0 ML
1.333 LW
N
4 0 M
4 -2.209 2.209 -4 0 -4 C
-2.209 -4 -4 -2.209 -4 0 C
-4 2.209 -2.209 4 0 4 C
2.209 4 4 2.209 4 0 C
cp
S
GR
GS
[0.75 0 0 0.75 569.22336 423.41068] CT
10.0 ML
1.333 LW
N
4 0 M
4 -2.209 2.209 -4 0 -4 C
-2.209 -4 -4 -2.209 -4 0 C
-4 2.209 -2.209 4 0 4 C
2.209 4 4 2.209 4 0 C
cp
S
GR
GS
[0.75 0 0 0.75 595.29337 424.2189] CT
10.0 ML
1.333 LW
N
4 0 M
4 -2.209 2.209 -4 0 -4 C
-2.209 -4 -4 -2.209 -4 0 C
-4 2.209 -2.209 4 0 4 C
2.209 4 4 2.209 4 0 C
cp
S
GR
GS
[0.75 0 0 0.75 622.05862 425.01285] CT
10.0 ML
1.333 LW
N
4 0 M
4 -2.209 2.209 -4 0 -4 C
-2.209 -4 -4 -2.209 -4 0 C
-4 2.209 -2.209 4 0 4 C
2.209 4 4 2.209 4 0 C
cp
S
GR
%%Trailer
%%Pages: 1
%%EOF
