%!PS-Adobe-3.0 EPSF-3.0
%%Creator: (MATLAB, The Mathworks, Inc. Version 9.5.0.944444 \(R2018b\). Operating System: Windows 10)
%%Title: (C:/Users/Alex/Documents/PhD Docs/01. GIT/my_phd_thesis/Chapter8/Figures/capsloc_res/pieCharts_examples_g05.eps)
%%CreationDate: 2019-11-04T11:32:38
%%Pages: (atend)
%%BoundingBox: 0 0 603 541
%%LanguageLevel: 3
%%EndComments
%%BeginProlog
%%BeginResource: procset (Apache XML Graphics Std ProcSet) 1.2 0
%%Version: 1.2 0
%%Copyright: (Copyright 2001-2003,2010 The Apache Software Foundation. License terms: http://www.apache.org/licenses/LICENSE-2.0)
/bd{bind def}bind def
/ld{load def}bd
/GR/grestore ld
/GS/gsave ld
/RM/rmoveto ld
/C/curveto ld
/t/show ld
/L/lineto ld
/ML/setmiterlimit ld
/CT/concat ld
/f/fill ld
/N/newpath ld
/S/stroke ld
/CC/setcmykcolor ld
/A/ashow ld
/cp/closepath ld
/RC/setrgbcolor ld
/LJ/setlinejoin ld
/GC/setgray ld
/LW/setlinewidth ld
/M/moveto ld
/re {4 2 roll M
1 index 0 rlineto
0 exch rlineto
neg 0 rlineto
cp } bd
/_ctm matrix def
/_tm matrix def
/BT { _ctm currentmatrix pop matrix _tm copy pop 0 0 moveto } bd
/ET { _ctm setmatrix } bd
/iTm { _ctm setmatrix _tm concat } bd
/Tm { _tm astore pop iTm 0 0 moveto } bd
/ux 0.0 def
/uy 0.0 def
/F {
  /Tp exch def
  /Tf exch def
  Tf findfont Tp scalefont setfont
  /cf Tf def  /cs Tp def
} bd
/ULS {currentpoint /uy exch def /ux exch def} bd
/ULE {
  /Tcx currentpoint pop def
  gsave
  newpath
  cf findfont cs scalefont dup
  /FontMatrix get 0 get /Ts exch def /FontInfo get dup
  /UnderlinePosition get Ts mul /To exch def
  /UnderlineThickness get Ts mul /Tt exch def
  ux uy To add moveto  Tcx uy To add lineto
  Tt setlinewidth stroke
  grestore
} bd
/OLE {
  /Tcx currentpoint pop def
  gsave
  newpath
  cf findfont cs scalefont dup
  /FontMatrix get 0 get /Ts exch def /FontInfo get dup
  /UnderlinePosition get Ts mul /To exch def
  /UnderlineThickness get Ts mul /Tt exch def
  ux uy To add cs add moveto Tcx uy To add cs add lineto
  Tt setlinewidth stroke
  grestore
} bd
/SOE {
  /Tcx currentpoint pop def
  gsave
  newpath
  cf findfont cs scalefont dup
  /FontMatrix get 0 get /Ts exch def /FontInfo get dup
  /UnderlinePosition get Ts mul /To exch def
  /UnderlineThickness get Ts mul /Tt exch def
  ux uy To add cs 10 mul 26 idiv add moveto Tcx uy To add cs 10 mul 26 idiv add lineto
  Tt setlinewidth stroke
  grestore
} bd
/QT {
/Y22 exch store
/X22 exch store
/Y21 exch store
/X21 exch store
currentpoint
/Y21 load 2 mul add 3 div exch
/X21 load 2 mul add 3 div exch
/X21 load 2 mul /X22 load add 3 div
/Y21 load 2 mul /Y22 load add 3 div
/X22 load /Y22 load curveto
} bd
/SSPD {
dup length /d exch dict def
{
/v exch def
/k exch def
currentpagedevice k known {
/cpdv currentpagedevice k get def
v cpdv ne {
/upd false def
/nullv v type /nulltype eq def
/nullcpdv cpdv type /nulltype eq def
nullv nullcpdv or
{
/upd true def
} {
/sametype v type cpdv type eq def
sametype {
v type /arraytype eq {
/vlen v length def
/cpdvlen cpdv length def
vlen cpdvlen eq {
0 1 vlen 1 sub {
/i exch def
/obj v i get def
/cpdobj cpdv i get def
obj cpdobj ne {
/upd true def
exit
} if
} for
} {
/upd true def
} ifelse
} {
v type /dicttype eq {
v {
/dv exch def
/dk exch def
/cpddv cpdv dk get def
dv cpddv ne {
/upd true def
exit
} if
} forall
} {
/upd true def
} ifelse
} ifelse
} if
} ifelse
upd true eq {
d k v put
} if
} if
} if
} forall
d length 0 gt {
d setpagedevice
} if
} bd
/RE { % /NewFontName [NewEncodingArray] /FontName RE -
  findfont dup length dict begin
  {
    1 index /FID ne
    {def} {pop pop} ifelse
  } forall
  /Encoding exch def
  /FontName 1 index def
  currentdict definefont pop
  end
} bind def
%%EndResource
%%BeginResource: procset (Apache XML Graphics EPS ProcSet) 1.0 0
%%Version: 1.0 0
%%Copyright: (Copyright 2002-2003 The Apache Software Foundation. License terms: http://www.apache.org/licenses/LICENSE-2.0)
/BeginEPSF { %def
/b4_Inc_state save def         % Save state for cleanup
/dict_count countdictstack def % Count objects on dict stack
/op_count count 1 sub def      % Count objects on operand stack
userdict begin                 % Push userdict on dict stack
/showpage { } def              % Redefine showpage, { } = null proc
0 setgray 0 setlinecap         % Prepare graphics state
1 setlinewidth 0 setlinejoin
10 setmiterlimit [ ] 0 setdash newpath
/languagelevel where           % If level not equal to 1 then
{pop languagelevel             % set strokeadjust and
1 ne                           % overprint to their defaults.
{false setstrokeadjust false setoverprint
} if
} if
} bd
/EndEPSF { %def
count op_count sub {pop} repeat            % Clean up stacks
countdictstack dict_count sub {end} repeat
b4_Inc_state restore
} bd
%%EndResource
%FOPBeginFontDict
%%IncludeResource: font Courier-Oblique
%%IncludeResource: font Courier-BoldOblique
%%IncludeResource: font Courier-Bold
%%IncludeResource: font ZapfDingbats
%%IncludeResource: font Symbol
%%IncludeResource: font Helvetica
%%IncludeResource: font Helvetica-Oblique
%%IncludeResource: font Helvetica-Bold
%%IncludeResource: font Helvetica-BoldOblique
%%IncludeResource: font Times-Roman
%%IncludeResource: font Times-Italic
%%IncludeResource: font Times-Bold
%%IncludeResource: font Times-BoldItalic
%%IncludeResource: font Courier
%FOPEndFontDict
%%BeginResource: encoding WinAnsiEncoding
/WinAnsiEncoding [
/.notdef /.notdef /.notdef /.notdef /.notdef
/.notdef /.notdef /.notdef /.notdef /.notdef
/.notdef /.notdef /.notdef /.notdef /.notdef
/.notdef /.notdef /.notdef /.notdef /.notdef
/.notdef /.notdef /.notdef /.notdef /.notdef
/.notdef /.notdef /.notdef /.notdef /.notdef
/.notdef /.notdef /space /exclam /quotedbl
/numbersign /dollar /percent /ampersand /quotesingle
/parenleft /parenright /asterisk /plus /comma
/hyphen /period /slash /zero /one
/two /three /four /five /six
/seven /eight /nine /colon /semicolon
/less /equal /greater /question /at
/A /B /C /D /E
/F /G /H /I /J
/K /L /M /N /O
/P /Q /R /S /T
/U /V /W /X /Y
/Z /bracketleft /backslash /bracketright /asciicircum
/underscore /quoteleft /a /b /c
/d /e /f /g /h
/i /j /k /l /m
/n /o /p /q /r
/s /t /u /v /w
/x /y /z /braceleft /bar
/braceright /asciitilde /bullet /Euro /bullet
/quotesinglbase /florin /quotedblbase /ellipsis /dagger
/daggerdbl /circumflex /perthousand /Scaron /guilsinglleft
/OE /bullet /Zcaron /bullet /bullet
/quoteleft /quoteright /quotedblleft /quotedblright /bullet
/endash /emdash /asciitilde /trademark /scaron
/guilsinglright /oe /bullet /zcaron /Ydieresis
/space /exclamdown /cent /sterling /currency
/yen /brokenbar /section /dieresis /copyright
/ordfeminine /guillemotleft /logicalnot /sfthyphen /registered
/macron /degree /plusminus /twosuperior /threesuperior
/acute /mu /paragraph /middot /cedilla
/onesuperior /ordmasculine /guillemotright /onequarter /onehalf
/threequarters /questiondown /Agrave /Aacute /Acircumflex
/Atilde /Adieresis /Aring /AE /Ccedilla
/Egrave /Eacute /Ecircumflex /Edieresis /Igrave
/Iacute /Icircumflex /Idieresis /Eth /Ntilde
/Ograve /Oacute /Ocircumflex /Otilde /Odieresis
/multiply /Oslash /Ugrave /Uacute /Ucircumflex
/Udieresis /Yacute /Thorn /germandbls /agrave
/aacute /acircumflex /atilde /adieresis /aring
/ae /ccedilla /egrave /eacute /ecircumflex
/edieresis /igrave /iacute /icircumflex /idieresis
/eth /ntilde /ograve /oacute /ocircumflex
/otilde /odieresis /divide /oslash /ugrave
/uacute /ucircumflex /udieresis /yacute /thorn
/ydieresis
] def
%%EndResource
%FOPBeginFontReencode
/Courier-Oblique findfont
dup length dict begin
  {1 index /FID ne {def} {pop pop} ifelse} forall
  /Encoding WinAnsiEncoding def
  currentdict
end
/Courier-Oblique exch definefont pop
/Courier-BoldOblique findfont
dup length dict begin
  {1 index /FID ne {def} {pop pop} ifelse} forall
  /Encoding WinAnsiEncoding def
  currentdict
end
/Courier-BoldOblique exch definefont pop
/Courier-Bold findfont
dup length dict begin
  {1 index /FID ne {def} {pop pop} ifelse} forall
  /Encoding WinAnsiEncoding def
  currentdict
end
/Courier-Bold exch definefont pop
/Helvetica findfont
dup length dict begin
  {1 index /FID ne {def} {pop pop} ifelse} forall
  /Encoding WinAnsiEncoding def
  currentdict
end
/Helvetica exch definefont pop
/Helvetica-Oblique findfont
dup length dict begin
  {1 index /FID ne {def} {pop pop} ifelse} forall
  /Encoding WinAnsiEncoding def
  currentdict
end
/Helvetica-Oblique exch definefont pop
/Helvetica-Bold findfont
dup length dict begin
  {1 index /FID ne {def} {pop pop} ifelse} forall
  /Encoding WinAnsiEncoding def
  currentdict
end
/Helvetica-Bold exch definefont pop
/Helvetica-BoldOblique findfont
dup length dict begin
  {1 index /FID ne {def} {pop pop} ifelse} forall
  /Encoding WinAnsiEncoding def
  currentdict
end
/Helvetica-BoldOblique exch definefont pop
/Times-Roman findfont
dup length dict begin
  {1 index /FID ne {def} {pop pop} ifelse} forall
  /Encoding WinAnsiEncoding def
  currentdict
end
/Times-Roman exch definefont pop
/Times-Italic findfont
dup length dict begin
  {1 index /FID ne {def} {pop pop} ifelse} forall
  /Encoding WinAnsiEncoding def
  currentdict
end
/Times-Italic exch definefont pop
/Times-Bold findfont
dup length dict begin
  {1 index /FID ne {def} {pop pop} ifelse} forall
  /Encoding WinAnsiEncoding def
  currentdict
end
/Times-Bold exch definefont pop
/Times-BoldItalic findfont
dup length dict begin
  {1 index /FID ne {def} {pop pop} ifelse} forall
  /Encoding WinAnsiEncoding def
  currentdict
end
/Times-BoldItalic exch definefont pop
/Courier findfont
dup length dict begin
  {1 index /FID ne {def} {pop pop} ifelse} forall
  /Encoding WinAnsiEncoding def
  currentdict
end
/Courier exch definefont pop
%FOPEndFontReencode
%%EndProlog
%%Page: 1 1
%%PageBoundingBox: 0 0 603 541
%%BeginPageSetup
[1 0 0 -1 0 541] CT
%%EndPageSetup
GS
[0.75 0 0 0.75 0 0.25] CT
N
0 0 M
804 0 L
804 721 L
0 721 L
0 0 L
cp
clip
1 GC
N
0 0 804 721 re
f
GR
GS
[0.75 0 0 0.75 0 0.25] CT
1 GC
N
0 0 804 721 re
f
GR
GS
[0.75 0 0 0.75 178.12517 44.64999] CT
/Helvetica-Bold 17.6 F
GS
[1 0 0 1 0 0] CT
-95 -4 moveto 
1 -1 scale
(ENU Profitability SM01) t 
GR
GR
GS
[0.75 0 0 0.75 0 0.25] CT
0.302 0.745 0.933 RC
N
142.118 270.395 M
146.859 275.464 L
151.905 280.231 L
157.237 284.675 L
162.834 288.782 L
168.674 292.534 L
174.735 295.917 L
180.994 298.919 L
187.426 301.527 L
194.008 303.732 L
200.714 305.526 L
207.518 306.901 L
214.394 307.852 L
226.308 196.403 L
226.308 84.32 L
219.369 84.535 L
212.458 85.179 L
205.6 86.25 L
198.821 87.743 L
192.147 89.653 L
185.605 91.972 L
179.218 94.692 L
173.013 97.802 L
167.011 101.29 L
161.237 105.143 L
155.713 109.346 L
150.459 113.882 L
145.497 118.736 L
140.844 123.887 L
136.519 129.316 L
132.538 135.003 L
128.917 140.925 L
125.67 147.06 L
122.809 153.384 L
120.344 159.874 L
118.286 166.503 L
116.642 173.247 L
115.419 180.08 L
114.621 186.975 L
114.252 193.907 L
114.312 200.848 L
114.802 207.772 L
115.72 214.653 L
117.062 221.463 L
118.822 228.177 L
120.995 234.77 L
123.572 241.215 L
126.543 247.489 L
129.897 253.566 L
133.62 259.425 L
137.699 265.041 L
cp
f
GR
GS
[0.75 0 0 0.75 0 0.25] CT
0.302 0.745 0.933 RC
2 setlinecap
10.0 ML
0.667 LW
N
226.308 196.403 M
226.308 84.32 L
219.369 84.535 L
212.458 85.179 L
205.6 86.25 L
198.821 87.743 L
192.147 89.653 L
185.605 91.972 L
179.218 94.692 L
173.013 97.802 L
167.011 101.29 L
161.237 105.143 L
155.713 109.346 L
150.459 113.882 L
145.497 118.736 L
140.844 123.887 L
136.519 129.316 L
132.538 135.003 L
128.917 140.925 L
125.67 147.06 L
122.809 153.384 L
120.344 159.874 L
118.286 166.503 L
116.642 173.247 L
115.419 180.08 L
114.621 186.975 L
114.252 193.907 L
114.312 200.848 L
114.802 207.772 L
115.72 214.653 L
117.062 221.463 L
118.822 228.177 L
120.995 234.77 L
123.572 241.215 L
126.543 247.489 L
129.897 253.566 L
133.62 259.425 L
137.699 265.041 L
142.118 270.395 L
146.859 275.464 L
151.905 280.231 L
157.237 284.675 L
162.834 288.782 L
168.674 292.534 L
174.735 295.917 L
180.994 298.919 L
187.426 301.527 L
194.008 303.732 L
200.714 305.526 L
207.518 306.901 L
214.394 307.852 L
226.308 196.403 L
226.308 196.403 L
S
GR
GS
[0.75 0 0 0.75 0 0.25] CT
0.094 0.749 0.71 RC
N
232.077 308.952 M
238.585 309.078 L
245.09 308.826 L
251.569 308.197 L
258.001 307.192 L
264.364 305.816 L
270.636 304.073 L
276.796 301.969 L
282.824 299.511 L
288.699 296.706 L
294.401 293.566 L
237.5 197 L
225.586 308.448 L
cp
f
GR
GS
[0.75 0 0 0.75 0 0.25] CT
0 0.749 0.749 RC
2 setlinecap
10.0 ML
0.667 LW
N
237.5 197 M
225.586 308.448 L
232.077 308.952 L
238.585 309.078 L
245.09 308.826 L
251.569 308.197 L
258.001 307.192 L
264.364 305.816 L
270.636 304.073 L
276.796 301.969 L
282.824 299.511 L
288.699 296.706 L
294.401 293.566 L
237.5 197 L
237.5 197 L
S
GR
GS
[0.75 0 0 0.75 0 0.25] CT
0 0.447 0.741 RC
N
237.5 84.917 M
237.5 197 L
294.401 293.566 L
300.286 289.847 L
305.929 285.77 L
311.308 281.351 L
316.402 276.606 L
321.192 271.554 L
325.659 266.214 L
329.786 260.608 L
333.557 254.756 L
336.957 248.681 L
339.974 242.407 L
342.595 235.957 L
344.811 229.358 L
346.613 222.633 L
347.994 215.81 L
348.948 208.914 L
349.473 201.972 L
349.566 195.011 L
349.226 188.057 L
348.455 181.138 L
347.257 174.281 L
345.634 167.511 L
343.595 160.854 L
341.146 154.337 L
338.298 147.985 L
335.061 141.822 L
331.447 135.872 L
327.471 130.157 L
323.147 124.701 L
318.494 119.523 L
313.527 114.644 L
308.268 110.083 L
302.736 105.857 L
296.951 101.983 L
290.938 98.476 L
284.718 95.348 L
278.316 92.613 L
271.757 90.28 L
265.066 88.359 L
258.268 86.857 L
251.39 85.781 L
244.458 85.133 L
cp
f
GR
GS
[0.75 0 0 0.75 0 0.25] CT
0 0.447 0.741 RC
2 setlinecap
10.0 ML
0.667 LW
N
237.5 197 M
294.401 293.566 L
300.286 289.847 L
305.929 285.77 L
311.308 281.351 L
316.402 276.606 L
321.192 271.554 L
325.659 266.214 L
329.786 260.608 L
333.557 254.756 L
336.957 248.681 L
339.974 242.407 L
342.595 235.957 L
344.811 229.358 L
346.613 222.633 L
347.994 215.81 L
348.948 208.914 L
349.473 201.972 L
349.566 195.011 L
349.226 188.057 L
348.455 181.138 L
347.257 174.281 L
345.634 167.511 L
343.595 160.854 L
341.146 154.337 L
338.298 147.985 L
335.061 141.822 L
331.447 135.872 L
327.471 130.157 L
323.147 124.701 L
318.494 119.523 L
313.527 114.644 L
308.268 110.083 L
302.736 105.857 L
296.951 101.983 L
290.938 98.476 L
284.718 95.348 L
278.316 92.613 L
271.757 90.28 L
265.066 88.359 L
258.268 86.857 L
251.39 85.781 L
244.458 85.133 L
237.5 84.917 L
237.5 197 L
237.5 197 L
S
GR
GS
[0.75 0 0 0.75 131.24864 143.68382] CT
1 GC
/Helvetica-Bold 18.667 F
GS
[1 0 0 1 0 0] CT
-19 7 moveto 
1 -1 scale
(48%) t 
GR
GR
GS
[0.75 0 0 0.75 192.69823 206.09557] CT
1 GC
/Helvetica-Bold 18.667 F
GS
[1 0 0 1 0 0] CT
-19 7 moveto 
1 -1 scale
(10%) t 
GR
GR
GS
[0.75 0 0 0.75 219.94597 129.70953] CT
1 GC
/Helvetica-Bold 18.667 F
GS
[1 0 0 1 0 0] CT
-19 7 moveto 
1 -1 scale
(42%) t 
GR
GR
GS
[0.75 0 0 0.75 0 0.25] CT
1 GC
N
631 670 M
631 642 L
189 642 L
189 670 L
cp
f
GR
GS
[0.75 0 0 0.75 177 492.25] CT
/Helvetica 18.667 F
GS
[1 0 0 1 0 0] CT
0 7 moveto 
1 -1 scale
(Profitability) t 
GR
GR
GS
[0.75 0 0 0.75 0 0.25] CT
0.302 0.745 0.933 RC
N
233 665 M
233 647 L
193 647 L
193 665 L
cp
f
GR
GS
[0.75 0 0 0.75 0 0.25] CT
0.302 0.745 0.933 RC
10.0 ML
0.667 LW
N
193 665 M
193 647 L
233 647 L
233 665 L
cp
S
GR
GS
[0.75 0 0 0.75 284.25 492.25] CT
/Helvetica 18.667 F
GS
[1 0 0 1 0 0] CT
0 7 moveto 
1 -1 scale
(Hysteresis) t 
GR
GR
GS
[0.75 0 0 0.75 0 0.25] CT
0.094 0.749 0.71 RC
N
376 665 M
376 647 L
336 647 L
336 665 L
cp
f
GR
GS
[0.75 0 0 0.75 0 0.25] CT
0 0.749 0.749 RC
10.0 ML
0.667 LW
N
336 665 M
336 647 L
376 647 L
376 665 L
cp
S
GR
GS
[0.75 0 0 0.75 388.5 492.25] CT
/Helvetica 18.667 F
GS
[1 0 0 1 0 0] CT
0 7 moveto 
1 -1 scale
(Unproftability) t 
GR
GR
GS
[0.75 0 0 0.75 0 0.25] CT
0 0.447 0.741 RC
N
515 665 M
515 647 L
475 647 L
475 665 L
cp
f
GR
GS
[0.75 0 0 0.75 0 0.25] CT
0 0.447 0.741 RC
10.0 ML
0.667 LW
N
475 665 M
475 647 L
515 647 L
515 665 L
cp
S
GR
GS
[0.75 0 0 0.75 0 0.25] CT
1 GC
10.0 ML
0.667 LW
N
189 670 M
189 642 L
631 642 L
631 670 L
cp
S
GR
GS
[0.75 0 0 0.75 443.62541 44.64999] CT
/Helvetica-Bold 17.6 F
GS
[1 0 0 1 0 0] CT
-88.5 -4 moveto 
1 -1 scale
(EN Profitability SM01) t 
GR
GR
GS
[0.75 0 0 0.75 0 0.25] CT
0.302 0.745 0.933 RC
N
473.39 215.949 M
475.192 222.673 L
582.503 190.316 L
582.503 78.232 L
575.545 78.449 L
568.613 79.096 L
561.735 80.173 L
554.937 81.675 L
548.246 83.596 L
541.687 85.928 L
535.285 88.664 L
529.065 91.791 L
523.052 95.299 L
517.267 99.173 L
511.735 103.399 L
506.475 107.96 L
501.509 112.839 L
496.856 118.016 L
492.532 123.473 L
488.556 129.187 L
484.942 135.138 L
481.705 141.301 L
478.857 147.653 L
476.408 154.17 L
474.369 160.826 L
472.746 167.596 L
471.548 174.454 L
470.777 181.373 L
470.437 188.326 L
470.53 195.288 L
471.055 202.229 L
472.009 209.125 L
cp
f
GR
GS
[0.75 0 0 0.75 0 0.25] CT
0.302 0.745 0.933 RC
2 setlinecap
10.0 ML
0.667 LW
N
582.503 190.316 M
582.503 78.232 L
575.545 78.449 L
568.613 79.096 L
561.735 80.173 L
554.937 81.675 L
548.246 83.596 L
541.687 85.928 L
535.285 88.664 L
529.065 91.791 L
523.052 95.299 L
517.267 99.173 L
511.735 103.399 L
506.475 107.96 L
501.509 112.839 L
496.856 118.016 L
492.532 123.473 L
488.556 129.187 L
484.942 135.138 L
481.705 141.301 L
478.857 147.653 L
476.408 154.17 L
474.369 160.826 L
472.746 167.596 L
471.548 174.454 L
470.777 181.373 L
470.437 188.326 L
470.53 195.288 L
471.055 202.229 L
472.009 209.125 L
473.39 215.949 L
475.192 222.673 L
582.503 190.316 L
582.503 190.316 L
S
GR
GS
[0.75 0 0 0.75 0 0.25] CT
0.094 0.749 0.71 RC
N
531.603 291.737 M
537.344 295.131 L
543.276 298.179 L
549.379 300.868 L
555.631 303.189 L
562.011 305.134 L
591.5 197 L
484.189 229.358 L
486.303 235.683 L
488.79 241.871 L
491.641 247.9 L
494.845 253.75 L
498.392 259.398 L
502.268 264.825 L
506.46 270.012 L
510.953 274.941 L
515.731 279.594 L
520.777 283.954 L
526.074 288.006 L
cp
f
GR
GS
[0.75 0 0 0.75 0 0.25] CT
0 0.749 0.749 RC
2 setlinecap
10.0 ML
0.667 LW
N
591.5 197 M
484.189 229.358 L
486.303 235.683 L
488.79 241.871 L
491.641 247.9 L
494.845 253.75 L
498.392 259.398 L
502.268 264.825 L
506.46 270.012 L
510.953 274.941 L
515.731 279.594 L
520.777 283.954 L
526.074 288.006 L
531.603 291.737 L
537.344 295.131 L
543.276 298.179 L
549.379 300.868 L
555.631 303.189 L
562.011 305.134 L
591.5 197 L
591.5 197 L
S
GR
GS
[0.75 0 0 0.75 0 0.25] CT
0 0.447 0.741 RC
N
568.763 306.753 M
575.603 307.95 L
582.503 308.722 L
589.438 309.064 L
596.381 308.977 L
603.306 308.46 L
610.185 307.515 L
616.992 306.146 L
623.702 304.358 L
630.288 302.158 L
636.725 299.554 L
642.988 296.557 L
649.054 293.178 L
654.899 289.43 L
660.501 285.327 L
665.837 280.885 L
670.889 276.12 L
675.636 271.053 L
680.06 265.701 L
684.144 260.085 L
687.872 254.228 L
691.231 248.15 L
694.207 241.877 L
696.789 235.431 L
698.966 228.838 L
700.732 222.122 L
702.078 215.31 L
702.999 208.428 L
703.493 201.502 L
703.557 194.559 L
703.191 187.625 L
702.396 180.727 L
701.175 173.891 L
699.534 167.144 L
697.478 160.512 L
695.015 154.02 L
692.155 147.693 L
688.909 141.555 L
685.289 135.629 L
681.309 129.94 L
676.984 124.507 L
672.331 119.353 L
667.368 114.497 L
662.114 109.958 L
656.588 105.752 L
650.813 101.897 L
644.811 98.407 L
638.603 95.295 L
632.215 92.573 L
625.671 90.253 L
618.995 88.341 L
612.214 86.847 L
605.354 85.776 L
598.44 85.132 L
591.5 84.917 L
591.5 197 L
562.011 305.134 L
cp
f
GR
GS
[0.75 0 0 0.75 0 0.25] CT
0 0.447 0.741 RC
2 setlinecap
10.0 ML
0.667 LW
N
591.5 197 M
562.011 305.134 L
568.763 306.753 L
575.603 307.95 L
582.503 308.722 L
589.438 309.064 L
596.381 308.977 L
603.306 308.46 L
610.185 307.515 L
616.992 306.146 L
623.702 304.358 L
630.288 302.158 L
636.725 299.554 L
642.988 296.557 L
649.054 293.178 L
654.899 289.43 L
660.501 285.327 L
665.837 280.885 L
670.889 276.12 L
675.636 271.053 L
680.06 265.701 L
684.144 260.085 L
687.872 254.228 L
691.231 248.15 L
694.207 241.877 L
696.789 235.431 L
698.966 228.838 L
700.732 222.122 L
702.078 215.31 L
702.999 208.428 L
703.493 201.502 L
703.557 194.559 L
703.191 187.625 L
702.396 180.727 L
701.175 173.891 L
699.534 167.144 L
697.478 160.512 L
695.015 154.02 L
692.155 147.693 L
688.909 141.555 L
685.289 135.629 L
681.309 129.94 L
676.984 124.507 L
672.331 119.353 L
667.368 114.497 L
662.114 109.958 L
656.588 105.752 L
650.813 101.897 L
644.811 98.407 L
638.603 95.295 L
632.215 92.573 L
625.671 90.253 L
618.995 88.341 L
612.214 86.847 L
605.354 85.776 L
598.44 85.132 L
591.5 84.917 L
591.5 197 L
591.5 197 L
S
GR
GS
[0.75 0 0 0.75 400.90366 111.32823] CT
1 GC
/Helvetica-Bold 18.667 F
GS
[1 0 0 1 0 0] CT
-19 7 moveto 
1 -1 scale
(30%) t 
GR
GR
GS
[0.75 0 0 0.75 406.25143 185.77258] CT
1 GC
/Helvetica-Bold 18.667 F
GS
[1 0 0 1 0 0] CT
-19 7 moveto 
1 -1 scale
(16%) t 
GR
GR
GS
[0.75 0 0 0.75 484.35754 151.63868] CT
1 GC
/Helvetica-Bold 18.667 F
GS
[1 0 0 1 0 0] CT
-19 7 moveto 
1 -1 scale
(54%) t 
GR
GR
GS
[0.75 0 0 0.75 178.87517 275.64999] CT
/Helvetica-Bold 17.6 F
GS
[1 0 0 1 0 0] CT
-95 -4 moveto 
1 -1 scale
(ENU Profitability SM02) t 
GR
GR
GS
[0.75 0 0 0.75 0 0.25] CT
0.302 0.745 0.933 RC
N
147.963 586.127 M
153.001 590.897 L
158.325 595.346 L
163.914 599.457 L
169.746 603.215 L
175.8 606.604 L
182.052 609.612 L
188.478 612.228 L
195.054 614.441 L
201.754 616.243 L
208.552 617.627 L
215.423 618.588 L
222.341 619.122 L
229.278 619.226 L
236.209 618.902 L
243.106 618.149 L
249.943 616.971 L
256.694 615.372 L
263.334 613.358 L
269.836 610.938 L
227.501 507.157 L
227.501 395.074 L
220.566 395.288 L
213.658 395.932 L
206.803 397.001 L
200.027 398.493 L
193.357 400.401 L
186.817 402.718 L
180.433 405.435 L
174.23 408.542 L
168.231 412.027 L
162.458 415.877 L
156.935 420.076 L
151.683 424.609 L
146.721 429.458 L
142.068 434.605 L
137.743 440.03 L
133.761 445.712 L
130.139 451.629 L
126.89 457.759 L
124.027 464.079 L
121.56 470.564 L
119.499 477.188 L
117.851 483.928 L
116.624 490.757 L
115.822 497.648 L
115.448 504.576 L
115.503 511.514 L
115.987 518.435 L
116.898 525.313 L
118.233 532.122 L
119.987 538.834 L
122.153 545.426 L
124.723 551.87 L
127.686 558.144 L
131.032 564.222 L
134.747 570.081 L
138.818 575.699 L
143.229 581.055 L
cp
f
GR
GS
[0.75 0 0 0.75 0 0.25] CT
0.302 0.745 0.933 RC
2 setlinecap
10.0 ML
0.667 LW
N
227.501 507.157 M
227.501 395.074 L
220.566 395.288 L
213.658 395.932 L
206.803 397.001 L
200.027 398.493 L
193.357 400.401 L
186.817 402.718 L
180.433 405.435 L
174.23 408.542 L
168.231 412.027 L
162.458 415.877 L
156.935 420.076 L
151.683 424.609 L
146.721 429.458 L
142.068 434.605 L
137.743 440.03 L
133.761 445.712 L
130.139 451.629 L
126.89 457.759 L
124.027 464.079 L
121.56 470.564 L
119.499 477.188 L
117.851 483.928 L
116.624 490.757 L
115.822 497.648 L
115.448 504.576 L
115.503 511.514 L
115.987 518.435 L
116.898 525.313 L
118.233 532.122 L
119.987 538.834 L
122.153 545.426 L
124.723 551.87 L
127.686 558.144 L
131.032 564.222 L
134.747 570.081 L
138.818 575.699 L
143.229 581.055 L
147.963 586.127 L
153.001 590.897 L
158.325 595.346 L
163.914 599.457 L
169.746 603.215 L
175.8 606.604 L
182.052 609.612 L
188.478 612.228 L
195.054 614.441 L
201.754 616.243 L
208.552 617.627 L
215.423 618.588 L
222.341 619.122 L
229.278 619.226 L
236.209 618.902 L
243.106 618.149 L
249.943 616.971 L
256.694 615.372 L
263.334 613.358 L
269.836 610.938 L
227.501 507.157 L
227.501 507.157 L
S
GR
GS
[0.75 0 0 0.75 0 0.25] CT
0.094 0.749 0.71 RC
N
286.898 606.095 M
292.792 603.056 L
298.496 599.674 L
303.99 595.96 L
309.255 591.928 L
314.272 587.591 L
319.024 582.966 L
323.493 578.067 L
327.666 572.913 L
331.526 567.521 L
335.061 561.91 L
338.257 556.1 L
341.105 550.111 L
343.593 543.964 L
345.713 537.68 L
347.458 531.283 L
238.5 505 L
280.835 608.781 L
cp
f
GR
GS
[0.75 0 0 0.75 0 0.25] CT
0 0.749 0.749 RC
2 setlinecap
10.0 ML
0.667 LW
N
238.5 505 M
280.835 608.781 L
286.898 606.095 L
292.792 603.056 L
298.496 599.674 L
303.99 595.96 L
309.255 591.928 L
314.272 587.591 L
319.024 582.966 L
323.493 578.067 L
327.666 572.913 L
331.526 567.521 L
335.061 561.91 L
338.257 556.1 L
341.105 550.111 L
343.593 543.964 L
345.713 537.68 L
347.458 531.283 L
238.5 505 L
238.5 505 L
S
GR
GS
[0.75 0 0 0.75 0 0.25] CT
0 0.447 0.741 RC
N
238.5 392.917 M
238.5 505 L
347.458 531.283 L
348.884 524.445 L
349.881 517.532 L
350.445 510.57 L
350.574 503.586 L
350.269 496.608 L
349.529 489.663 L
348.358 482.777 L
346.761 475.977 L
344.743 469.29 L
342.312 462.742 L
339.478 456.358 L
336.253 450.163 L
332.647 444.181 L
328.676 438.435 L
324.355 432.947 L
319.7 427.739 L
314.73 422.832 L
309.464 418.243 L
303.923 413.991 L
298.127 410.093 L
292.1 406.563 L
285.864 403.416 L
279.445 400.663 L
272.867 398.315 L
266.155 396.382 L
259.336 394.87 L
252.436 393.786 L
245.481 393.134 L
cp
f
GR
GS
[0.75 0 0 0.75 0 0.25] CT
0 0.447 0.741 RC
2 setlinecap
10.0 ML
0.667 LW
N
238.5 505 M
347.458 531.283 L
348.884 524.445 L
349.881 517.532 L
350.445 510.57 L
350.574 503.586 L
350.269 496.608 L
349.529 489.663 L
348.358 482.777 L
346.761 475.977 L
344.743 469.29 L
342.312 462.742 L
339.478 456.358 L
336.253 450.163 L
332.647 444.181 L
328.676 438.435 L
324.355 432.947 L
319.7 427.739 L
314.73 422.832 L
309.464 418.243 L
303.923 413.991 L
298.127 410.093 L
292.1 406.563 L
285.864 403.416 L
279.445 400.663 L
272.867 398.315 L
266.155 396.382 L
259.336 394.87 L
252.436 393.786 L
245.481 393.134 L
238.5 392.917 L
238.5 505 L
238.5 505 L
S
GR
GS
[0.75 0 0 0.75 133.1366 385.78136] CT
1 GC
/Helvetica-Bold 18.667 F
GS
[1 0 0 1 0 0] CT
-19 7 moveto 
1 -1 scale
(56%) t 
GR
GR
GS
[0.75 0 0 0.75 225.36909 414.76031] CT
1 GC
/Helvetica-Bold 18.667 F
GS
[1 0 0 1 0 0] CT
-19 7 moveto 
1 -1 scale
(15%) t 
GR
GR
GS
[0.75 0 0 0.75 218.37744 348.09152] CT
1 GC
/Helvetica-Bold 18.667 F
GS
[1 0 0 1 0 0] CT
-19 7 moveto 
1 -1 scale
(29%) t 
GR
GR
GS
[0.75 0 0 0.75 444.37541 275.64999] CT
/Helvetica-Bold 17.6 F
GS
[1 0 0 1 0 0] CT
-88.5 -4 moveto 
1 -1 scale
(EN Profitability SM02) t 
GR
GR
GS
[0.75 0 0 0.75 0 0.25] CT
0.302 0.745 0.933 RC
N
473.658 482.592 M
472.985 489.593 L
584.834 496.823 L
584.834 384.74 L
577.805 384.96 L
570.803 385.621 L
563.856 386.72 L
556.992 388.253 L
550.237 390.213 L
543.619 392.593 L
537.163 395.383 L
530.894 398.573 L
524.838 402.149 L
519.019 406.098 L
513.458 410.405 L
508.178 415.052 L
503.201 420.02 L
498.544 425.292 L
494.228 430.844 L
490.268 436.657 L
486.681 442.707 L
483.48 448.969 L
480.678 455.42 L
478.287 462.034 L
476.314 468.785 L
474.77 475.647 L
cp
f
GR
GS
[0.75 0 0 0.75 0 0.25] CT
0.302 0.745 0.933 RC
2 setlinecap
10.0 ML
0.667 LW
N
584.834 496.823 M
584.834 384.74 L
577.805 384.96 L
570.803 385.621 L
563.856 386.72 L
556.992 388.253 L
550.237 390.213 L
543.619 392.593 L
537.163 395.383 L
530.894 398.573 L
524.838 402.149 L
519.019 406.098 L
513.458 410.405 L
508.178 415.052 L
503.201 420.02 L
498.544 425.292 L
494.228 430.844 L
490.268 436.657 L
486.681 442.707 L
483.48 448.969 L
480.678 455.42 L
478.287 462.034 L
476.314 468.785 L
474.77 475.647 L
473.658 482.592 L
472.985 489.593 L
584.834 496.823 L
584.834 496.823 L
S
GR
GS
[0.75 0 0 0.75 0 0.25] CT
0.094 0.749 0.71 RC
N
547.942 607.846 M
554.329 610.383 L
560.859 612.525 L
567.509 614.262 L
574.252 615.588 L
581.064 616.498 L
587.919 616.99 L
594.791 617.06 L
601.655 616.709 L
608.484 615.938 L
615.253 614.75 L
621.936 613.149 L
628.509 611.142 L
634.946 608.735 L
641.224 605.939 L
647.319 602.763 L
653.207 599.219 L
658.868 595.322 L
664.279 591.084 L
669.419 586.523 L
674.271 581.656 L
592.5 505 L
480.65 497.77 L
480.417 504.638 L
480.606 511.508 L
481.215 518.354 L
482.243 525.149 L
483.685 531.868 L
485.536 538.487 L
487.789 544.979 L
490.436 551.322 L
493.467 557.49 L
496.87 563.461 L
500.633 569.211 L
504.741 574.721 L
509.179 579.969 L
513.93 584.934 L
518.977 589.599 L
524.3 593.946 L
529.879 597.959 L
535.694 601.622 L
541.723 604.922 L
cp
f
GR
GS
[0.75 0 0 0.75 0 0.25] CT
0 0.749 0.749 RC
2 setlinecap
10.0 ML
0.667 LW
N
592.5 505 M
480.65 497.77 L
480.417 504.638 L
480.606 511.508 L
481.215 518.354 L
482.243 525.149 L
483.685 531.868 L
485.536 538.487 L
487.789 544.979 L
490.436 551.322 L
493.467 557.49 L
496.87 563.461 L
500.633 569.211 L
504.741 574.721 L
509.179 579.969 L
513.93 584.934 L
518.977 589.599 L
524.3 593.946 L
529.879 597.959 L
535.694 601.622 L
541.723 604.922 L
547.942 607.846 L
554.329 610.383 L
560.859 612.525 L
567.509 614.262 L
574.252 615.588 L
581.064 616.498 L
587.919 616.99 L
594.791 617.06 L
601.655 616.709 L
608.484 615.938 L
615.253 614.75 L
621.936 613.149 L
628.509 611.142 L
634.946 608.735 L
641.224 605.939 L
647.319 602.763 L
653.207 599.219 L
658.868 595.322 L
664.279 591.084 L
669.419 586.523 L
674.271 581.656 L
592.5 505 L
592.5 505 L
S
GR
GS
[0.75 0 0 0.75 0 0.25] CT
0 0.447 0.741 RC
N
592.5 392.917 M
592.5 505 L
674.271 581.656 L
678.922 576.372 L
683.231 570.807 L
687.183 564.982 L
690.761 558.921 L
693.952 552.647 L
696.742 546.185 L
699.122 539.561 L
701.081 532.801 L
702.612 525.931 L
703.708 518.978 L
704.366 511.97 L
704.583 504.935 L
704.358 497.9 L
703.692 490.893 L
702.587 483.941 L
701.048 477.073 L
699.081 470.315 L
696.694 463.693 L
693.896 457.235 L
690.698 450.965 L
687.113 444.908 L
683.154 439.087 L
678.838 433.527 L
674.182 428.249 L
669.203 423.273 L
663.922 418.62 L
658.36 414.307 L
652.537 410.352 L
646.478 406.771 L
640.206 403.576 L
633.746 400.782 L
627.123 398.398 L
620.364 396.435 L
613.495 394.901 L
606.543 393.8 L
599.535 393.138 L
cp
f
GR
GS
[0.75 0 0 0.75 0 0.25] CT
0 0.447 0.741 RC
2 setlinecap
10.0 ML
0.667 LW
N
592.5 505 M
674.271 581.656 L
678.922 576.372 L
683.231 570.807 L
687.183 564.982 L
690.761 558.921 L
693.952 552.647 L
696.742 546.185 L
699.122 539.561 L
701.081 532.801 L
702.612 525.931 L
703.708 518.978 L
704.366 511.97 L
704.583 504.935 L
704.358 497.9 L
703.692 490.893 L
702.587 483.941 L
701.048 477.073 L
699.081 470.315 L
696.694 463.693 L
693.896 457.235 L
690.698 450.965 L
687.113 444.908 L
683.154 439.087 L
678.838 433.527 L
674.182 428.249 L
669.203 423.273 L
663.922 418.62 L
658.36 414.307 L
652.537 410.352 L
646.478 406.771 L
640.206 403.576 L
633.746 400.782 L
627.123 398.398 L
620.364 396.435 L
613.495 394.901 L
606.543 393.8 L
599.535 393.138 L
592.5 392.917 L
592.5 505 L
592.5 505 L
S
GR
GS
[0.75 0 0 0.75 404.88542 335.27304] CT
1 GC
/Helvetica-Bold 18.667 F
GS
[1 0 0 1 0 0] CT
-19 7 moveto 
1 -1 scale
(24%) t 
GR
GR
GS
[0.75 0 0 0.75 429.02289 418.31123] CT
1 GC
/Helvetica-Bold 18.667 F
GS
[1 0 0 1 0 0] CT
-19 7 moveto 
1 -1 scale
(39%) t 
GR
GR
GS
[0.75 0 0 0.75 486.68623 356.89787] CT
1 GC
/Helvetica-Bold 18.667 F
GS
[1 0 0 1 0 0] CT
-19 7 moveto 
1 -1 scale
(37%) t 
GR
GR
%%Trailer
%%Pages: 1
%%EOF
