%!PS-Adobe-3.0 EPSF-3.0
%%Creator: (MATLAB, The Mathworks, Inc. Version 9.5.0.944444 \(R2018b\). Operating System: Windows 10)
%%Title: (C:/Users/navsas/Dropbox/Collaborative ranging CRLB/v02_07122018/fig/biasCDF.eps)
%%CreationDate: 2018-12-10T16:59:34
%%Pages: (atend)
%%BoundingBox: 0 0 610 242
%%LanguageLevel: 3
%%EndComments
%%BeginProlog
%%BeginResource: procset (Apache XML Graphics Std ProcSet) 1.2 0
%%Version: 1.2 0
%%Copyright: (Copyright 2001-2003,2010 The Apache Software Foundation. License terms: http://www.apache.org/licenses/LICENSE-2.0)
/bd{bind def}bind def
/ld{load def}bd
/GR/grestore ld
/GS/gsave ld
/RM/rmoveto ld
/C/curveto ld
/t/show ld
/L/lineto ld
/ML/setmiterlimit ld
/CT/concat ld
/f/fill ld
/N/newpath ld
/S/stroke ld
/CC/setcmykcolor ld
/A/ashow ld
/cp/closepath ld
/RC/setrgbcolor ld
/LJ/setlinejoin ld
/GC/setgray ld
/LW/setlinewidth ld
/M/moveto ld
/re {4 2 roll M
1 index 0 rlineto
0 exch rlineto
neg 0 rlineto
cp } bd
/_ctm matrix def
/_tm matrix def
/BT { _ctm currentmatrix pop matrix _tm copy pop 0 0 moveto } bd
/ET { _ctm setmatrix } bd
/iTm { _ctm setmatrix _tm concat } bd
/Tm { _tm astore pop iTm 0 0 moveto } bd
/ux 0.0 def
/uy 0.0 def
/F {
  /Tp exch def
  /Tf exch def
  Tf findfont Tp scalefont setfont
  /cf Tf def  /cs Tp def
} bd
/ULS {currentpoint /uy exch def /ux exch def} bd
/ULE {
  /Tcx currentpoint pop def
  gsave
  newpath
  cf findfont cs scalefont dup
  /FontMatrix get 0 get /Ts exch def /FontInfo get dup
  /UnderlinePosition get Ts mul /To exch def
  /UnderlineThickness get Ts mul /Tt exch def
  ux uy To add moveto  Tcx uy To add lineto
  Tt setlinewidth stroke
  grestore
} bd
/OLE {
  /Tcx currentpoint pop def
  gsave
  newpath
  cf findfont cs scalefont dup
  /FontMatrix get 0 get /Ts exch def /FontInfo get dup
  /UnderlinePosition get Ts mul /To exch def
  /UnderlineThickness get Ts mul /Tt exch def
  ux uy To add cs add moveto Tcx uy To add cs add lineto
  Tt setlinewidth stroke
  grestore
} bd
/SOE {
  /Tcx currentpoint pop def
  gsave
  newpath
  cf findfont cs scalefont dup
  /FontMatrix get 0 get /Ts exch def /FontInfo get dup
  /UnderlinePosition get Ts mul /To exch def
  /UnderlineThickness get Ts mul /Tt exch def
  ux uy To add cs 10 mul 26 idiv add moveto Tcx uy To add cs 10 mul 26 idiv add lineto
  Tt setlinewidth stroke
  grestore
} bd
/QT {
/Y22 exch store
/X22 exch store
/Y21 exch store
/X21 exch store
currentpoint
/Y21 load 2 mul add 3 div exch
/X21 load 2 mul add 3 div exch
/X21 load 2 mul /X22 load add 3 div
/Y21 load 2 mul /Y22 load add 3 div
/X22 load /Y22 load curveto
} bd
/SSPD {
dup length /d exch dict def
{
/v exch def
/k exch def
currentpagedevice k known {
/cpdv currentpagedevice k get def
v cpdv ne {
/upd false def
/nullv v type /nulltype eq def
/nullcpdv cpdv type /nulltype eq def
nullv nullcpdv or
{
/upd true def
} {
/sametype v type cpdv type eq def
sametype {
v type /arraytype eq {
/vlen v length def
/cpdvlen cpdv length def
vlen cpdvlen eq {
0 1 vlen 1 sub {
/i exch def
/obj v i get def
/cpdobj cpdv i get def
obj cpdobj ne {
/upd true def
exit
} if
} for
} {
/upd true def
} ifelse
} {
v type /dicttype eq {
v {
/dv exch def
/dk exch def
/cpddv cpdv dk get def
dv cpddv ne {
/upd true def
exit
} if
} forall
} {
/upd true def
} ifelse
} ifelse
} if
} ifelse
upd true eq {
d k v put
} if
} if
} if
} forall
d length 0 gt {
d setpagedevice
} if
} bd
/RE { % /NewFontName [NewEncodingArray] /FontName RE -
  findfont dup length dict begin
  {
    1 index /FID ne
    {def} {pop pop} ifelse
  } forall
  /Encoding exch def
  /FontName 1 index def
  currentdict definefont pop
  end
} bind def
%%EndResource
%%BeginResource: procset (Apache XML Graphics EPS ProcSet) 1.0 0
%%Version: 1.0 0
%%Copyright: (Copyright 2002-2003 The Apache Software Foundation. License terms: http://www.apache.org/licenses/LICENSE-2.0)
/BeginEPSF { %def
/b4_Inc_state save def         % Save state for cleanup
/dict_count countdictstack def % Count objects on dict stack
/op_count count 1 sub def      % Count objects on operand stack
userdict begin                 % Push userdict on dict stack
/showpage { } def              % Redefine showpage, { } = null proc
0 setgray 0 setlinecap         % Prepare graphics state
1 setlinewidth 0 setlinejoin
10 setmiterlimit [ ] 0 setdash newpath
/languagelevel where           % If level not equal to 1 then
{pop languagelevel             % set strokeadjust and
1 ne                           % overprint to their defaults.
{false setstrokeadjust false setoverprint
} if
} if
} bd
/EndEPSF { %def
count op_count sub {pop} repeat            % Clean up stacks
countdictstack dict_count sub {end} repeat
b4_Inc_state restore
} bd
%%EndResource
%FOPBeginFontDict
%%IncludeResource: font Courier-Oblique
%%IncludeResource: font Courier-BoldOblique
%%IncludeResource: font Courier-Bold
%%IncludeResource: font ZapfDingbats
%%IncludeResource: font Symbol
%%IncludeResource: font Helvetica
%%IncludeResource: font Helvetica-Oblique
%%IncludeResource: font Helvetica-Bold
%%IncludeResource: font Helvetica-BoldOblique
%%IncludeResource: font Times-Roman
%%IncludeResource: font Times-Italic
%%IncludeResource: font Times-Bold
%%IncludeResource: font Times-BoldItalic
%%IncludeResource: font Courier
%FOPEndFontDict
%%BeginResource: encoding WinAnsiEncoding
/WinAnsiEncoding [
/.notdef /.notdef /.notdef /.notdef /.notdef
/.notdef /.notdef /.notdef /.notdef /.notdef
/.notdef /.notdef /.notdef /.notdef /.notdef
/.notdef /.notdef /.notdef /.notdef /.notdef
/.notdef /.notdef /.notdef /.notdef /.notdef
/.notdef /.notdef /.notdef /.notdef /.notdef
/.notdef /.notdef /space /exclam /quotedbl
/numbersign /dollar /percent /ampersand /quotesingle
/parenleft /parenright /asterisk /plus /comma
/hyphen /period /slash /zero /one
/two /three /four /five /six
/seven /eight /nine /colon /semicolon
/less /equal /greater /question /at
/A /B /C /D /E
/F /G /H /I /J
/K /L /M /N /O
/P /Q /R /S /T
/U /V /W /X /Y
/Z /bracketleft /backslash /bracketright /asciicircum
/underscore /quoteleft /a /b /c
/d /e /f /g /h
/i /j /k /l /m
/n /o /p /q /r
/s /t /u /v /w
/x /y /z /braceleft /bar
/braceright /asciitilde /bullet /Euro /bullet
/quotesinglbase /florin /quotedblbase /ellipsis /dagger
/daggerdbl /circumflex /perthousand /Scaron /guilsinglleft
/OE /bullet /Zcaron /bullet /bullet
/quoteleft /quoteright /quotedblleft /quotedblright /bullet
/endash /emdash /asciitilde /trademark /scaron
/guilsinglright /oe /bullet /zcaron /Ydieresis
/space /exclamdown /cent /sterling /currency
/yen /brokenbar /section /dieresis /copyright
/ordfeminine /guillemotleft /logicalnot /sfthyphen /registered
/macron /degree /plusminus /twosuperior /threesuperior
/acute /mu /paragraph /middot /cedilla
/onesuperior /ordmasculine /guillemotright /onequarter /onehalf
/threequarters /questiondown /Agrave /Aacute /Acircumflex
/Atilde /Adieresis /Aring /AE /Ccedilla
/Egrave /Eacute /Ecircumflex /Edieresis /Igrave
/Iacute /Icircumflex /Idieresis /Eth /Ntilde
/Ograve /Oacute /Ocircumflex /Otilde /Odieresis
/multiply /Oslash /Ugrave /Uacute /Ucircumflex
/Udieresis /Yacute /Thorn /germandbls /agrave
/aacute /acircumflex /atilde /adieresis /aring
/ae /ccedilla /egrave /eacute /ecircumflex
/edieresis /igrave /iacute /icircumflex /idieresis
/eth /ntilde /ograve /oacute /ocircumflex
/otilde /odieresis /divide /oslash /ugrave
/uacute /ucircumflex /udieresis /yacute /thorn
/ydieresis
] def
%%EndResource
%FOPBeginFontReencode
/Courier-Oblique findfont
dup length dict begin
  {1 index /FID ne {def} {pop pop} ifelse} forall
  /Encoding WinAnsiEncoding def
  currentdict
end
/Courier-Oblique exch definefont pop
/Courier-BoldOblique findfont
dup length dict begin
  {1 index /FID ne {def} {pop pop} ifelse} forall
  /Encoding WinAnsiEncoding def
  currentdict
end
/Courier-BoldOblique exch definefont pop
/Courier-Bold findfont
dup length dict begin
  {1 index /FID ne {def} {pop pop} ifelse} forall
  /Encoding WinAnsiEncoding def
  currentdict
end
/Courier-Bold exch definefont pop
/Helvetica findfont
dup length dict begin
  {1 index /FID ne {def} {pop pop} ifelse} forall
  /Encoding WinAnsiEncoding def
  currentdict
end
/Helvetica exch definefont pop
/Helvetica-Oblique findfont
dup length dict begin
  {1 index /FID ne {def} {pop pop} ifelse} forall
  /Encoding WinAnsiEncoding def
  currentdict
end
/Helvetica-Oblique exch definefont pop
/Helvetica-Bold findfont
dup length dict begin
  {1 index /FID ne {def} {pop pop} ifelse} forall
  /Encoding WinAnsiEncoding def
  currentdict
end
/Helvetica-Bold exch definefont pop
/Helvetica-BoldOblique findfont
dup length dict begin
  {1 index /FID ne {def} {pop pop} ifelse} forall
  /Encoding WinAnsiEncoding def
  currentdict
end
/Helvetica-BoldOblique exch definefont pop
/Times-Roman findfont
dup length dict begin
  {1 index /FID ne {def} {pop pop} ifelse} forall
  /Encoding WinAnsiEncoding def
  currentdict
end
/Times-Roman exch definefont pop
/Times-Italic findfont
dup length dict begin
  {1 index /FID ne {def} {pop pop} ifelse} forall
  /Encoding WinAnsiEncoding def
  currentdict
end
/Times-Italic exch definefont pop
/Times-Bold findfont
dup length dict begin
  {1 index /FID ne {def} {pop pop} ifelse} forall
  /Encoding WinAnsiEncoding def
  currentdict
end
/Times-Bold exch definefont pop
/Times-BoldItalic findfont
dup length dict begin
  {1 index /FID ne {def} {pop pop} ifelse} forall
  /Encoding WinAnsiEncoding def
  currentdict
end
/Times-BoldItalic exch definefont pop
/Courier findfont
dup length dict begin
  {1 index /FID ne {def} {pop pop} ifelse} forall
  /Encoding WinAnsiEncoding def
  currentdict
end
/Courier exch definefont pop
%FOPEndFontReencode
%%EndProlog
%%Page: 1 1
%%PageBoundingBox: 0 0 610 242
%%BeginPageSetup
[1 0 0 -1 0 242] CT
%%EndPageSetup
GS
[0.75 0 0 0.75 0 -0.25] CT
N
0 0 M
813 0 L
813 323 L
0 323 L
0 0 L
cp
clip
1 GC
N
0 0 813 323 re
f
GR
GS
[0.75 0 0 0.75 0 -0.25] CT
1 GC
N
0 0 813 323 re
f
GR
GS
[0.75 0 0 0.75 0 -0.25] CT
1 GC
N
106 262 M
736 262 L
736 36 L
106 36 L
cp
f
GR
GS
[0.75 0 0 0.75 0 -0.25] CT
0.873 GC
1 LJ
0.667 LW
N
106 262 M
106 36 L
S
GR
GS
[0.75 0 0 0.75 0 -0.25] CT
0.873 GC
1 LJ
0.667 LW
N
263.463 262 M
263.463 36 L
S
GR
GS
[0.75 0 0 0.75 0 -0.25] CT
0.873 GC
1 LJ
0.667 LW
N
420.925 262 M
420.925 36 L
S
GR
GS
[0.75 0 0 0.75 0 -0.25] CT
0.873 GC
1 LJ
0.667 LW
N
578.388 262 M
578.388 36 L
S
GR
GS
[0.75 0 0 0.75 0 -0.25] CT
0.873 GC
1 LJ
0.667 LW
N
735.85 262 M
735.85 36 L
S
GR
GS
[0.75 0 0 0.75 0 -0.25] CT
0.873 GC
1 LJ
0.667 LW
N
736 262 M
106 262 L
S
GR
GS
[0.75 0 0 0.75 0 -0.25] CT
0.873 GC
1 LJ
0.667 LW
N
736 216.715 M
106 216.715 L
S
GR
GS
[0.75 0 0 0.75 0 -0.25] CT
0.873 GC
1 LJ
0.667 LW
N
736 171.43 M
106 171.43 L
S
GR
GS
[0.75 0 0 0.75 0 -0.25] CT
0.873 GC
1 LJ
0.667 LW
N
736 126.146 M
106 126.146 L
S
GR
GS
[0.75 0 0 0.75 0 -0.25] CT
0.873 GC
1 LJ
0.667 LW
N
736 80.861 M
106 80.861 L
S
GR
GS
[0.75 0 0 0.75 0 -0.25] CT
0.873 GC
1 LJ
0.667 LW
N
736 36 M
106 36 L
S
GR
GS
[0.75 0 0 0.75 0 -0.25] CT
0.149 GC
2 setlinecap
1 LJ
0.667 LW
N
106 262 M
736 262 L
S
GR
GS
[0.75 0 0 0.75 0 -0.25] CT
0.149 GC
2 setlinecap
1 LJ
0.667 LW
N
106 36 M
736 36 L
S
GR
GS
[0.75 0 0 0.75 0 -0.25] CT
0.149 GC
2 setlinecap
1 LJ
0.667 LW
N
106 262 M
106 255.7 L
S
GR
GS
[0.75 0 0 0.75 0 -0.25] CT
0.149 GC
2 setlinecap
1 LJ
0.667 LW
N
263.463 262 M
263.463 255.7 L
S
GR
GS
[0.75 0 0 0.75 0 -0.25] CT
0.149 GC
2 setlinecap
1 LJ
0.667 LW
N
420.925 262 M
420.925 255.7 L
S
GR
GS
[0.75 0 0 0.75 0 -0.25] CT
0.149 GC
2 setlinecap
1 LJ
0.667 LW
N
578.388 262 M
578.388 255.7 L
S
GR
GS
[0.75 0 0 0.75 0 -0.25] CT
0.149 GC
2 setlinecap
1 LJ
0.667 LW
N
735.85 262 M
735.85 255.7 L
S
GR
GS
[0.75 0 0 0.75 0 -0.25] CT
0.149 GC
2 setlinecap
1 LJ
0.667 LW
N
106 36 M
106 42.3 L
S
GR
GS
[0.75 0 0 0.75 0 -0.25] CT
0.149 GC
2 setlinecap
1 LJ
0.667 LW
N
263.463 36 M
263.463 42.3 L
S
GR
GS
[0.75 0 0 0.75 0 -0.25] CT
0.149 GC
2 setlinecap
1 LJ
0.667 LW
N
420.925 36 M
420.925 42.3 L
S
GR
GS
[0.75 0 0 0.75 0 -0.25] CT
0.149 GC
2 setlinecap
1 LJ
0.667 LW
N
578.388 36 M
578.388 42.3 L
S
GR
GS
[0.75 0 0 0.75 0 -0.25] CT
0.149 GC
2 setlinecap
1 LJ
0.667 LW
N
735.85 36 M
735.85 42.3 L
S
GR
GS
[0.75 0 0 0.75 79.5 201.44999] CT
0.149 GC
N
-0.083 18.389 M
-2.661 18.389 -3.583 16.264 QT
-4.505 14.139 -4.505 11.217 QT
-4.505 9.404 -4.177 7.795 QT
-3.849 6.186 -2.857 5.061 QT
-1.865 3.936 -0.083 3.936 QT
1.307 3.936 2.182 4.607 QT
3.057 5.279 3.526 6.357 QT
3.995 7.436 4.159 8.654 QT
4.323 9.873 4.323 11.217 QT
4.323 13.029 3.995 14.6 QT
3.667 16.17 2.69 17.279 QT
1.714 18.389 -0.083 18.389 QT
cp
-0.083 17.842 M
1.089 17.842 1.659 16.639 QT
2.229 15.436 2.362 13.982 QT
2.495 12.529 2.495 10.889 QT
2.495 9.311 2.362 7.975 QT
2.229 6.639 1.659 5.561 QT
1.089 4.482 -0.083 4.482 QT
-1.271 4.482 -1.849 5.568 QT
-2.427 6.654 -2.56 7.982 QT
-2.693 9.311 -2.693 10.889 QT
-2.693 12.061 -2.63 13.092 QT
-2.568 14.123 -2.326 15.225 QT
-2.083 16.326 -1.536 17.084 QT
-0.99 17.842 -0.083 17.842 QT
cp
f
GR
GS
[0.75 0 0 0.75 197.59692 201.44999] CT
0.149 GC
N
-8.38 18.389 M
-10.958 18.389 -11.88 16.264 QT
-12.802 14.139 -12.802 11.217 QT
-12.802 9.404 -12.473 7.795 QT
-12.145 6.186 -11.153 5.061 QT
-10.161 3.936 -8.38 3.936 QT
-6.989 3.936 -6.114 4.607 QT
-5.239 5.279 -4.77 6.357 QT
-4.302 7.436 -4.137 8.654 QT
-3.973 9.873 -3.973 11.217 QT
-3.973 13.029 -4.302 14.6 QT
-4.63 16.17 -5.606 17.279 QT
-6.583 18.389 -8.38 18.389 QT
cp
-8.38 17.842 M
-7.208 17.842 -6.637 16.639 QT
-6.067 15.436 -5.934 13.982 QT
-5.802 12.529 -5.802 10.889 QT
-5.802 9.311 -5.934 7.975 QT
-6.067 6.639 -6.637 5.561 QT
-7.208 4.482 -8.38 4.482 QT
-9.567 4.482 -10.145 5.568 QT
-10.723 6.654 -10.856 7.982 QT
-10.989 9.311 -10.989 10.889 QT
-10.989 12.061 -10.927 13.092 QT
-10.864 14.123 -10.622 15.225 QT
-10.38 16.326 -9.833 17.084 QT
-9.286 17.842 -8.38 17.842 QT
cp
f
GR
GS
[0.75 0 0 0.75 197.59692 201.44999] CT
0.149 GC
N
-1.197 16.764 M
-1.197 16.295 -0.846 15.951 QT
-0.494 15.607 -0.041 15.607 QT
0.24 15.607 0.521 15.764 QT
0.803 15.92 0.959 16.193 QT
1.115 16.467 1.115 16.764 QT
1.115 17.217 0.771 17.568 QT
0.428 17.92 -0.041 17.92 QT
-0.494 17.92 -0.846 17.568 QT
-1.197 17.217 -1.197 16.764 QT
cp
f
GR
GS
[0.75 0 0 0.75 197.59692 201.44999] CT
0.149 GC
N
4.791 15.529 M
5.01 16.139 5.455 16.646 QT
5.9 17.154 6.51 17.436 QT
7.119 17.717 7.775 17.717 QT
9.291 17.717 9.861 16.537 QT
10.432 15.357 10.432 13.67 QT
10.432 12.951 10.408 12.451 QT
10.385 11.951 10.275 11.498 QT
10.072 10.748 9.588 10.193 QT
9.104 9.639 8.4 9.639 QT
7.697 9.639 7.19 9.857 QT
6.682 10.076 6.361 10.365 QT
6.041 10.654 5.791 10.967 QT
5.541 11.279 5.479 11.311 QT
5.244 11.311 L
5.197 11.311 5.119 11.24 QT
5.041 11.17 5.041 11.107 QT
5.041 4.092 L
5.041 4.045 5.111 3.99 QT
5.182 3.936 5.244 3.936 QT
5.307 3.936 L
6.729 4.607 8.322 4.607 QT
9.869 4.607 11.322 3.936 QT
11.385 3.936 L
11.447 3.936 11.51 3.982 QT
11.572 4.029 11.572 4.092 QT
11.572 4.295 L
11.572 4.389 11.541 4.389 QT
10.822 5.342 9.736 5.881 QT
8.65 6.42 7.494 6.42 QT
6.65 6.42 5.775 6.186 QT
5.775 10.154 L
6.463 9.576 7.018 9.342 QT
7.572 9.107 8.416 9.107 QT
9.572 9.107 10.494 9.771 QT
11.416 10.436 11.908 11.506 QT
12.4 12.576 12.4 13.701 QT
12.4 14.951 11.775 16.029 QT
11.15 17.107 10.088 17.748 QT
9.025 18.389 7.775 18.389 QT
6.744 18.389 5.877 17.85 QT
5.01 17.311 4.51 16.412 QT
4.01 15.514 4.01 14.498 QT
4.01 14.029 4.315 13.732 QT
4.619 13.436 5.088 13.436 QT
5.541 13.436 5.854 13.732 QT
6.166 14.029 6.166 14.498 QT
6.166 14.951 5.854 15.264 QT
5.541 15.576 5.088 15.576 QT
5.01 15.576 4.916 15.561 QT
4.822 15.545 4.791 15.529 QT
cp
f
GR
GS
[0.75 0 0 0.75 315.69383 201.44999] CT
0.149 GC
N
-3.38 17.92 M
-3.38 17.186 L
-0.755 17.186 -0.755 16.514 QT
-0.755 5.498 L
-1.849 6.014 -3.505 6.014 QT
-3.505 5.279 L
-0.927 5.279 0.385 3.936 QT
0.682 3.936 L
0.745 3.936 0.815 3.99 QT
0.885 4.045 0.885 4.123 QT
0.885 16.514 L
0.885 17.186 3.51 17.186 QT
3.51 17.92 L
-3.38 17.92 L
cp
f
GR
GS
[0.75 0 0 0.75 433.79077 201.44999] CT
0.149 GC
N
-11.677 17.92 M
-11.677 17.186 L
-9.052 17.186 -9.052 16.514 QT
-9.052 5.498 L
-10.145 6.014 -11.802 6.014 QT
-11.802 5.279 L
-9.223 5.279 -7.911 3.936 QT
-7.614 3.936 L
-7.552 3.936 -7.481 3.99 QT
-7.411 4.045 -7.411 4.123 QT
-7.411 16.514 L
-7.411 17.186 -4.786 17.186 QT
-4.786 17.92 L
-11.677 17.92 L
cp
f
GR
GS
[0.75 0 0 0.75 433.79077 201.44999] CT
0.149 GC
N
/f1728610396{-1.197 16.764 M
-1.197 16.295 -0.846 15.951 QT
-0.494 15.607 -0.041 15.607 QT
0.24 15.607 0.521 15.764 QT
0.803 15.92 0.959 16.193 QT
1.115 16.467 1.115 16.764 QT
1.115 17.217 0.771 17.568 QT
0.428 17.92 -0.041 17.92 QT
-0.494 17.92 -0.846 17.568 QT
-1.197 17.217 -1.197 16.764 QT
cp}def
f1728610396
f
GR
GS
[0.75 0 0 0.75 433.79077 201.44999] CT
0.149 GC
N
/f-2052131550{4.791 15.529 M
5.01 16.139 5.455 16.646 QT
5.9 17.154 6.51 17.436 QT
7.119 17.717 7.775 17.717 QT
9.291 17.717 9.861 16.537 QT
10.432 15.357 10.432 13.67 QT
10.432 12.951 10.408 12.451 QT
10.385 11.951 10.275 11.498 QT
10.072 10.748 9.588 10.193 QT
9.104 9.639 8.4 9.639 QT
7.697 9.639 7.19 9.857 QT
6.682 10.076 6.361 10.365 QT
6.041 10.654 5.791 10.967 QT
5.541 11.279 5.479 11.311 QT
5.244 11.311 L
5.197 11.311 5.119 11.24 QT
5.041 11.17 5.041 11.107 QT
5.041 4.092 L
5.041 4.045 5.111 3.99 QT
5.182 3.936 5.244 3.936 QT
5.307 3.936 L
6.729 4.607 8.322 4.607 QT
9.869 4.607 11.322 3.936 QT
11.385 3.936 L
11.447 3.936 11.51 3.982 QT
11.572 4.029 11.572 4.092 QT
11.572 4.295 L
11.572 4.389 11.541 4.389 QT
10.822 5.342 9.736 5.881 QT
8.65 6.42 7.494 6.42 QT
6.65 6.42 5.775 6.186 QT
5.775 10.154 L
6.463 9.576 7.018 9.342 QT
7.572 9.107 8.416 9.107 QT
9.572 9.107 10.494 9.771 QT
11.416 10.436 11.908 11.506 QT
12.4 12.576 12.4 13.701 QT
12.4 14.951 11.775 16.029 QT
11.15 17.107 10.088 17.748 QT
9.025 18.389 7.775 18.389 QT
6.744 18.389 5.877 17.85 QT
5.01 17.311 4.51 16.412 QT
4.01 15.514 4.01 14.498 QT
4.01 14.029 4.315 13.732 QT
4.619 13.436 5.088 13.436 QT
5.541 13.436 5.854 13.732 QT
6.166 14.029 6.166 14.498 QT
6.166 14.951 5.854 15.264 QT
5.541 15.576 5.088 15.576 QT
5.01 15.576 4.916 15.561 QT
4.822 15.545 4.791 15.529 QT
cp}def
f-2052131550
f
GR
GS
[0.75 0 0 0.75 551.88766 201.44999] CT
0.149 GC
N
/f364372466{-4.286 17.92 M
-4.286 17.357 L
-4.286 17.311 -4.24 17.248 QT
-0.99 13.639 L
-0.24 12.826 0.221 12.287 QT
0.682 11.748 1.128 11.037 QT
1.573 10.326 1.839 9.6 QT
2.104 8.873 2.104 8.045 QT
2.104 7.186 1.784 6.396 QT
1.464 5.607 0.831 5.139 QT
0.198 4.67 -0.693 4.67 QT
-1.599 4.67 -2.326 5.217 QT
-3.052 5.764 -3.349 6.639 QT
-3.271 6.623 -3.13 6.623 QT
-2.661 6.623 -2.326 6.936 QT
-1.99 7.248 -1.99 7.764 QT
-1.99 8.232 -2.326 8.568 QT
-2.661 8.904 -3.13 8.904 QT
-3.615 8.904 -3.951 8.561 QT
-4.286 8.217 -4.286 7.764 QT
-4.286 6.967 -3.99 6.279 QT
-3.693 5.592 -3.13 5.053 QT
-2.568 4.514 -1.872 4.225 QT
-1.177 3.936 -0.38 3.936 QT
0.823 3.936 1.854 4.443 QT
2.885 4.951 3.495 5.881 QT
4.104 6.811 4.104 8.045 QT
4.104 8.951 3.706 9.771 QT
3.307 10.592 2.682 11.264 QT
2.057 11.936 1.081 12.787 QT
0.104 13.639 -0.208 13.936 QT
-2.583 16.217 L
-0.568 16.217 L
0.917 16.217 1.917 16.193 QT
2.917 16.17 2.979 16.107 QT
3.229 15.842 3.479 14.17 QT
4.104 14.17 L
3.51 17.92 L
-4.286 17.92 L
cp}def
f364372466
f
GR
GS
[0.75 0 0 0.75 316.55109 217.74306] CT
0.149 GC
N
/f-1620681364{-6.955 23.29 M
-6.924 23.024 -6.643 23.024 QT
-6.611 23.024 -6.205 23.251 QT
-5.799 23.478 -5.307 23.657 QT
-4.814 23.837 -4.314 23.837 QT
-3.893 23.837 -3.596 23.47 QT
-3.299 23.103 -3.299 22.681 QT
-3.299 22.071 -3.939 21.821 QT
-7.846 20.306 L
-8.861 19.915 -9.518 19.134 QT
-10.174 18.353 -10.174 17.368 QT
-10.174 16.478 -9.705 15.517 QT
-9.236 14.556 -8.494 13.774 QT
-7.752 12.993 -6.908 12.509 QT
-7.58 12.103 -7.955 11.47 QT
-8.33 10.837 -8.33 10.071 QT
-8.33 9.274 -8.002 8.571 QT
-7.674 7.868 -7.103 7.298 QT
-6.533 6.728 -5.822 6.329 QT
-5.111 5.931 -4.377 5.728 QT
-4.502 5.259 -4.502 4.884 QT
-4.502 3.634 -4.018 3.634 QT
-3.893 3.634 -3.799 3.72 QT
-3.705 3.806 -3.705 3.931 QT
-3.705 4.04 -3.768 4.423 QT
-3.83 4.806 -3.83 4.899 QT
-3.83 5.29 -3.736 5.603 QT
-3.143 5.478 -2.58 5.478 QT
-0.471 5.478 -0.471 6.118 QT
-0.471 6.899 -2.814 6.899 QT
-3.533 6.899 -3.986 6.415 QT
-4.658 6.759 -5.213 7.376 QT
-5.768 7.993 -6.088 8.751 QT
-6.408 9.509 -6.408 10.274 QT
-6.408 11.353 -5.783 12.009 QT
-4.971 11.728 -4.143 11.728 QT
-2.033 11.728 -2.033 12.384 QT
-2.033 13.149 -4.377 13.149 QT
-5.33 13.149 -6.174 12.868 QT
-7.205 13.415 -8.057 14.54 QT
-8.908 15.665 -8.908 16.696 QT
-8.908 17.368 -8.416 17.884 QT
-7.924 18.399 -7.205 18.696 QT
-3.143 20.29 L
-2.611 20.493 -2.275 20.931 QT
-1.939 21.368 -1.939 21.946 QT
-1.939 22.884 -2.666 23.657 QT
-3.393 24.431 -4.33 24.431 QT
-4.627 24.431 -5.291 24.274 QT
-5.955 24.118 -6.455 23.86 QT
-6.955 23.603 -6.955 23.29 QT
cp
-5.096 12.446 M
-4.783 12.556 -4.33 12.556 QT
-3.221 12.556 -2.736 12.431 QT
-3.174 12.337 -4.174 12.337 QT
-4.564 12.337 -5.096 12.446 QT
cp
-3.33 6.165 M
-3.127 6.306 -2.768 6.306 QT
-1.658 6.306 -1.174 6.165 QT
-3.33 6.165 L
cp}def
f-1620681364
f
GR
GS
[0.75 0 0 0.75 316.55109 217.74306] CT
0.149 GC
N
/f-1391825481{-0.079 23.232 M
-0.079 22.419 L
1.28 22.419 1.421 22.263 QT
3.577 19.826 L
1.187 16.935 L
-0.001 16.935 L
-0.001 16.123 L
3.765 16.123 L
3.765 16.935 L
3.187 16.935 L
4.624 18.654 L
6.015 17.076 L
6.015 16.998 5.78 16.966 QT
5.546 16.935 5.405 16.935 QT
5.405 16.123 L
8.609 16.123 L
8.609 16.935 L
7.249 16.935 7.109 17.091 QT
5.155 19.294 L
7.749 22.419 L
8.937 22.419 L
8.937 23.232 L
5.171 23.232 L
5.171 22.419 L
5.765 22.419 L
4.109 20.466 L
2.515 22.279 L
2.515 22.341 2.741 22.38 QT
2.968 22.419 3.124 22.419 QT
3.124 23.232 L
-0.079 23.232 L
cp}def
f-1391825481
f
GR
GS
[0.75 0 0 0.75 0 -0.25] CT
0.149 GC
2 setlinecap
1 LJ
0.667 LW
N
106 262 M
106 36 L
S
GR
GS
[0.75 0 0 0.75 0 -0.25] CT
0.149 GC
2 setlinecap
1 LJ
0.667 LW
N
736 262 M
736 36 L
S
GR
GS
[0.75 0 0 0.75 0 -0.25] CT
0.149 GC
2 setlinecap
1 LJ
0.667 LW
N
106 262 M
112.3 262 L
S
GR
GS
[0.75 0 0 0.75 0 -0.25] CT
0.149 GC
2 setlinecap
1 LJ
0.667 LW
N
106 216.715 M
112.3 216.715 L
S
GR
GS
[0.75 0 0 0.75 0 -0.25] CT
0.149 GC
2 setlinecap
1 LJ
0.667 LW
N
106 171.43 M
112.3 171.43 L
S
GR
GS
[0.75 0 0 0.75 0 -0.25] CT
0.149 GC
2 setlinecap
1 LJ
0.667 LW
N
106 126.146 M
112.3 126.146 L
S
GR
GS
[0.75 0 0 0.75 0 -0.25] CT
0.149 GC
2 setlinecap
1 LJ
0.667 LW
N
106 80.861 M
112.3 80.861 L
S
GR
GS
[0.75 0 0 0.75 0 -0.25] CT
0.149 GC
2 setlinecap
1 LJ
0.667 LW
N
106 36 M
112.3 36 L
S
GR
GS
[0.75 0 0 0.75 0 -0.25] CT
0.149 GC
2 setlinecap
1 LJ
0.667 LW
N
736 262 M
729.7 262 L
S
GR
GS
[0.75 0 0 0.75 0 -0.25] CT
0.149 GC
2 setlinecap
1 LJ
0.667 LW
N
736 216.715 M
729.7 216.715 L
S
GR
GS
[0.75 0 0 0.75 0 -0.25] CT
0.149 GC
2 setlinecap
1 LJ
0.667 LW
N
736 171.43 M
729.7 171.43 L
S
GR
GS
[0.75 0 0 0.75 0 -0.25] CT
0.149 GC
2 setlinecap
1 LJ
0.667 LW
N
736 126.146 M
729.7 126.146 L
S
GR
GS
[0.75 0 0 0.75 0 -0.25] CT
0.149 GC
2 setlinecap
1 LJ
0.667 LW
N
736 80.861 M
729.7 80.861 L
S
GR
GS
[0.75 0 0 0.75 0 -0.25] CT
0.149 GC
2 setlinecap
1 LJ
0.667 LW
N
736 36 M
729.7 36 L
S
GR
GS
[0.75 0 0 0.75 74.3 196.25] CT
0.149 GC
N
/f-1781641207{-5.417 5.589 M
-7.995 5.589 -8.917 3.464 QT
-9.839 1.339 -9.839 -1.583 QT
-9.839 -3.396 -9.51 -5.005 QT
-9.182 -6.614 -8.19 -7.739 QT
-7.198 -8.864 -5.417 -8.864 QT
-4.026 -8.864 -3.151 -8.193 QT
-2.276 -7.521 -1.807 -6.443 QT
-1.339 -5.364 -1.175 -4.146 QT
-1.01 -2.927 -1.01 -1.583 QT
-1.01 0.229 -1.339 1.8 QT
-1.667 3.37 -2.643 4.479 QT
-3.62 5.589 -5.417 5.589 QT
cp
-5.417 5.042 M
-4.245 5.042 -3.675 3.839 QT
-3.104 2.636 -2.971 1.182 QT
-2.839 -0.271 -2.839 -1.911 QT
-2.839 -3.489 -2.971 -4.825 QT
-3.104 -6.161 -3.675 -7.239 QT
-4.245 -8.318 -5.417 -8.318 QT
-6.604 -8.318 -7.182 -7.232 QT
-7.76 -6.146 -7.893 -4.818 QT
-8.026 -3.489 -8.026 -1.911 QT
-8.026 -0.739 -7.964 0.292 QT
-7.901 1.323 -7.659 2.425 QT
-7.417 3.526 -6.87 4.284 QT
-6.323 5.042 -5.417 5.042 QT
cp}def
f-1781641207
f
GR
GS
[0.75 0 0 0.75 74.3 162.28641] CT
0.149 GC
N
/f-2117570807{-22.009 5.589 M
-24.587 5.589 -25.509 3.464 QT
-26.431 1.339 -26.431 -1.583 QT
-26.431 -3.396 -26.103 -5.005 QT
-25.775 -6.614 -24.783 -7.739 QT
-23.791 -8.864 -22.009 -8.864 QT
-20.619 -8.864 -19.744 -8.193 QT
-18.869 -7.521 -18.4 -6.443 QT
-17.931 -5.364 -17.767 -4.146 QT
-17.603 -2.927 -17.603 -1.583 QT
-17.603 0.229 -17.931 1.8 QT
-18.259 3.37 -19.236 4.479 QT
-20.212 5.589 -22.009 5.589 QT
cp
-22.009 5.042 M
-20.837 5.042 -20.267 3.839 QT
-19.697 2.636 -19.564 1.182 QT
-19.431 -0.271 -19.431 -1.911 QT
-19.431 -3.489 -19.564 -4.825 QT
-19.697 -6.161 -20.267 -7.239 QT
-20.837 -8.318 -22.009 -8.318 QT
-23.197 -8.318 -23.775 -7.232 QT
-24.353 -6.146 -24.486 -4.818 QT
-24.619 -3.489 -24.619 -1.911 QT
-24.619 -0.739 -24.556 0.292 QT
-24.494 1.323 -24.252 2.425 QT
-24.009 3.526 -23.462 4.284 QT
-22.916 5.042 -22.009 5.042 QT
cp}def
f-2117570807
f
GR
GS
[0.75 0 0 0.75 74.3 162.28641] CT
0.149 GC
N
/f-1691089683{-14.827 3.964 M
-14.827 3.495 -14.475 3.151 QT
-14.124 2.807 -13.671 2.807 QT
-13.39 2.807 -13.108 2.964 QT
-12.827 3.12 -12.671 3.393 QT
-12.515 3.667 -12.515 3.964 QT
-12.515 4.417 -12.858 4.768 QT
-13.202 5.12 -13.671 5.12 QT
-14.124 5.12 -14.475 4.768 QT
-14.827 4.417 -14.827 3.964 QT
cp}def
f-1691089683
f
GR
GS
[0.75 0 0 0.75 74.3 162.28641] CT
0.149 GC
N
/f332566649{-9.62 5.12 M
-9.62 4.557 L
-9.62 4.511 -9.573 4.448 QT
-6.323 0.839 L
-5.573 0.026 -5.112 -0.513 QT
-4.651 -1.052 -4.206 -1.763 QT
-3.76 -2.474 -3.495 -3.2 QT
-3.229 -3.927 -3.229 -4.755 QT
-3.229 -5.614 -3.55 -6.404 QT
-3.87 -7.193 -4.503 -7.661 QT
-5.135 -8.13 -6.026 -8.13 QT
-6.932 -8.13 -7.659 -7.583 QT
-8.385 -7.036 -8.682 -6.161 QT
-8.604 -6.177 -8.464 -6.177 QT
-7.995 -6.177 -7.659 -5.864 QT
-7.323 -5.552 -7.323 -5.036 QT
-7.323 -4.568 -7.659 -4.232 QT
-7.995 -3.896 -8.464 -3.896 QT
-8.948 -3.896 -9.284 -4.239 QT
-9.62 -4.583 -9.62 -5.036 QT
-9.62 -5.833 -9.323 -6.521 QT
-9.026 -7.208 -8.464 -7.747 QT
-7.901 -8.286 -7.206 -8.575 QT
-6.51 -8.864 -5.714 -8.864 QT
-4.51 -8.864 -3.479 -8.357 QT
-2.448 -7.849 -1.839 -6.919 QT
-1.229 -5.989 -1.229 -4.755 QT
-1.229 -3.849 -1.628 -3.029 QT
-2.026 -2.208 -2.651 -1.536 QT
-3.276 -0.864 -4.253 -0.013 QT
-5.229 0.839 -5.542 1.136 QT
-7.917 3.417 L
-5.901 3.417 L
-4.417 3.417 -3.417 3.393 QT
-2.417 3.37 -2.354 3.307 QT
-2.104 3.042 -1.854 1.37 QT
-1.229 1.37 L
-1.823 5.12 L
-9.62 5.12 L
cp}def
f332566649
f
GR
GS
[0.75 0 0 0.75 74.3 128.3228] CT
0.149 GC
N
f-2117570807
f
GR
GS
[0.75 0 0 0.75 74.3 128.3228] CT
0.149 GC
N
f-1691089683
f
GR
GS
[0.75 0 0 0.75 74.3 128.3228] CT
0.149 GC
N
/f-1264211284{-10.089 1.651 M
-10.089 0.917 L
-3.589 -8.771 L
-3.526 -8.864 -3.37 -8.864 QT
-3.073 -8.864 L
-2.839 -8.864 -2.839 -8.63 QT
-2.839 0.917 L
-0.776 0.917 L
-0.776 1.651 L
-2.839 1.651 L
-2.839 3.714 L
-2.839 4.151 -2.221 4.268 QT
-1.604 4.386 -0.792 4.386 QT
-0.792 5.12 L
-6.573 5.12 L
-6.573 4.386 L
-5.76 4.386 -5.151 4.268 QT
-4.542 4.151 -4.542 3.714 QT
-4.542 1.651 L
-10.089 1.651 L
cp
-9.385 0.917 M
-4.417 0.917 L
-4.417 -6.521 L
-9.385 0.917 L
cp}def
f-1264211284
f
GR
GS
[0.75 0 0 0.75 74.3 94.35921] CT
0.149 GC
N
f-2117570807
f
GR
GS
[0.75 0 0 0.75 74.3 94.35921] CT
0.149 GC
N
f-1691089683
f
GR
GS
[0.75 0 0 0.75 74.3 94.35921] CT
0.149 GC
N
/f1443657103{-5.417 5.589 M
-6.714 5.589 -7.589 4.893 QT
-8.464 4.198 -8.94 3.096 QT
-9.417 1.995 -9.604 0.784 QT
-9.792 -0.427 -9.792 -1.661 QT
-9.792 -3.333 -9.143 -5.005 QT
-8.495 -6.677 -7.237 -7.771 QT
-5.979 -8.864 -4.26 -8.864 QT
-3.542 -8.864 -2.917 -8.591 QT
-2.292 -8.318 -1.94 -7.794 QT
-1.589 -7.271 -1.589 -6.521 QT
-1.589 -6.083 -1.885 -5.794 QT
-2.182 -5.505 -2.604 -5.505 QT
-3.01 -5.505 -3.307 -5.802 QT
-3.604 -6.099 -3.604 -6.521 QT
-3.604 -6.927 -3.307 -7.224 QT
-3.01 -7.521 -2.604 -7.521 QT
-2.495 -7.521 L
-2.76 -7.896 -3.245 -8.075 QT
-3.729 -8.255 -4.26 -8.255 QT
-4.901 -8.255 -5.432 -7.982 QT
-5.964 -7.708 -6.401 -7.239 QT
-6.839 -6.771 -7.12 -6.2 QT
-7.401 -5.63 -7.565 -4.904 QT
-7.729 -4.177 -7.768 -3.536 QT
-7.807 -2.896 -7.807 -1.943 QT
-7.432 -2.802 -6.76 -3.349 QT
-6.089 -3.896 -5.229 -3.896 QT
-4.292 -3.896 -3.526 -3.513 QT
-2.76 -3.13 -2.206 -2.458 QT
-1.651 -1.786 -1.362 -0.927 QT
-1.073 -0.068 -1.073 0.807 QT
-1.073 2.042 -1.62 3.159 QT
-2.167 4.276 -3.159 4.932 QT
-4.151 5.589 -5.417 5.589 QT
cp
-5.417 4.917 M
-4.604 4.917 -4.112 4.55 QT
-3.62 4.182 -3.393 3.573 QT
-3.167 2.964 -3.104 2.339 QT
-3.042 1.714 -3.042 0.807 QT
-3.042 -0.38 -3.159 -1.216 QT
-3.276 -2.052 -3.776 -2.693 QT
-4.276 -3.333 -5.307 -3.333 QT
-6.167 -3.333 -6.714 -2.763 QT
-7.26 -2.193 -7.51 -1.318 QT
-7.76 -0.443 -7.76 0.37 QT
-7.76 0.651 -7.745 0.792 QT
-7.745 0.823 -7.753 0.846 QT
-7.76 0.87 -7.76 0.901 QT
-7.76 1.792 -7.581 2.714 QT
-7.401 3.636 -6.878 4.276 QT
-6.354 4.917 -5.417 4.917 QT
cp}def
f1443657103
f
GR
GS
[0.75 0 0 0.75 74.3 60.39561] CT
0.149 GC
N
f-2117570807
f
GR
GS
[0.75 0 0 0.75 74.3 60.39561] CT
0.149 GC
N
f-1691089683
f
GR
GS
[0.75 0 0 0.75 74.3 60.39561] CT
0.149 GC
N
/f-671156145{-9.792 1.932 M
-9.792 0.667 -8.956 -0.302 QT
-8.12 -1.271 -6.823 -1.911 QT
-7.604 -2.411 L
-8.323 -2.896 -8.768 -3.677 QT
-9.214 -4.458 -9.214 -5.318 QT
-9.214 -6.318 -8.69 -7.13 QT
-8.167 -7.943 -7.292 -8.404 QT
-6.417 -8.864 -5.417 -8.864 QT
-4.479 -8.864 -3.612 -8.489 QT
-2.745 -8.114 -2.19 -7.404 QT
-1.635 -6.693 -1.635 -5.724 QT
-1.635 -5.005 -1.964 -4.404 QT
-2.292 -3.802 -2.878 -3.318 QT
-3.464 -2.833 -4.12 -2.505 QT
-2.917 -1.724 L
-2.089 -1.193 -1.581 -0.31 QT
-1.073 0.573 -1.073 1.557 QT
-1.073 2.682 -1.682 3.62 QT
-2.292 4.557 -3.292 5.073 QT
-4.292 5.589 -5.417 5.589 QT
-6.51 5.589 -7.518 5.143 QT
-8.526 4.698 -9.159 3.862 QT
-9.792 3.026 -9.792 1.932 QT
cp
-8.651 1.932 M
-8.651 2.761 -8.19 3.448 QT
-7.729 4.136 -6.979 4.526 QT
-6.229 4.917 -5.417 4.917 QT
-4.198 4.917 -3.206 4.206 QT
-2.214 3.495 -2.214 2.307 QT
-2.214 1.917 -2.37 1.518 QT
-2.526 1.12 -2.807 0.8 QT
-3.089 0.479 -3.432 0.276 QT
-6.26 -1.552 L
-6.917 -1.208 -7.464 -0.677 QT
-8.01 -0.146 -8.331 0.526 QT
-8.651 1.198 -8.651 1.932 QT
cp
-7.198 -4.474 M
-4.651 -2.833 L
-3.776 -3.349 -3.214 -4.075 QT
-2.651 -4.802 -2.651 -5.724 QT
-2.651 -6.427 -3.042 -7.013 QT
-3.432 -7.599 -4.073 -7.927 QT
-4.714 -8.255 -5.432 -8.255 QT
-6.073 -8.255 -6.721 -8.013 QT
-7.37 -7.771 -7.784 -7.286 QT
-8.198 -6.802 -8.198 -6.146 QT
-8.198 -5.161 -7.198 -4.474 QT
cp}def
f-671156145
f
GR
GS
[0.75 0 0 0.75 74.3 26.75] CT
0.149 GC
N
f-2117570807
f
GR
GS
[0.75 0 0 0.75 74.3 26.75] CT
0.149 GC
N
f-1691089683
f
GR
GS
[0.75 0 0 0.75 74.3 26.75] CT
0.149 GC
N
/f2067142573{-8.714 5.12 M
-8.714 4.386 L
-6.089 4.386 -6.089 3.714 QT
-6.089 -7.302 L
-7.182 -6.786 -8.839 -6.786 QT
-8.839 -7.521 L
-6.26 -7.521 -4.948 -8.864 QT
-4.651 -8.864 L
-4.589 -8.864 -4.518 -8.81 QT
-4.448 -8.755 -4.448 -8.677 QT
-4.448 3.714 L
-4.448 4.386 -1.823 4.386 QT
-1.823 5.12 L
-8.714 5.12 L
cp}def
f2067142573
f
GR
GS
[0 -0.75 0.75 0 50.85549 111.49992] CT
0.149 GC
N
/f-1993987278{-19.846 -10.901 M
-19.065 -9.901 -17.885 -9.323 QT
-16.706 -8.745 -15.44 -8.745 QT
-14.378 -8.745 -13.464 -9.167 QT
-12.549 -9.589 -11.87 -10.347 QT
-11.19 -11.104 -10.823 -12.057 QT
-10.456 -13.011 -10.456 -14.057 QT
-10.456 -14.245 -10.268 -14.245 QT
-9.987 -14.245 L
-9.799 -14.245 -9.799 -14.026 QT
-9.799 -12.823 -10.26 -11.706 QT
-10.721 -10.589 -11.565 -9.737 QT
-12.409 -8.886 -13.503 -8.417 QT
-14.596 -7.948 -15.784 -7.948 QT
-17.44 -7.948 -18.917 -8.612 QT
-20.393 -9.276 -21.487 -10.44 QT
-22.581 -11.604 -23.19 -13.128 QT
-23.799 -14.651 -23.799 -16.307 QT
-23.799 -17.964 -23.19 -19.487 QT
-22.581 -21.011 -21.487 -22.182 QT
-20.393 -23.354 -18.917 -24.011 QT
-17.44 -24.667 -15.784 -24.667 QT
-14.612 -24.667 -13.534 -24.151 QT
-12.456 -23.636 -11.643 -22.714 QT
-10.299 -24.604 L
-10.174 -24.667 -10.143 -24.667 QT
-9.987 -24.667 L
-9.909 -24.667 -9.854 -24.612 QT
-9.799 -24.557 -9.799 -24.479 QT
-9.799 -18.261 L
-9.799 -18.057 -9.987 -18.057 QT
-10.393 -18.057 L
-10.612 -18.057 -10.612 -18.261 QT
-10.612 -18.932 -10.878 -19.753 QT
-11.143 -20.573 -11.549 -21.307 QT
-11.956 -22.042 -12.503 -22.604 QT
-13.784 -23.854 -15.456 -23.854 QT
-16.737 -23.854 -17.893 -23.284 QT
-19.049 -22.714 -19.846 -21.698 QT
-20.69 -20.62 -21.018 -19.245 QT
-21.346 -17.87 -21.346 -16.307 QT
-21.346 -14.745 -21.018 -13.362 QT
-20.69 -11.979 -19.846 -10.901 QT
cp}def
f-1993987278
f
GR
GS
[0 -0.75 0.75 0 50.85549 111.49992] CT
0.149 GC
N
/f301356903{-7.383 -8.448 M
-7.383 -9.261 L
-5.008 -9.261 -5.008 -9.979 QT
-5.008 -22.62 L
-5.008 -23.354 -7.383 -23.354 QT
-7.383 -24.167 L
1.102 -24.167 L
2.664 -24.167 3.969 -23.487 QT
5.274 -22.807 6.196 -21.667 QT
7.117 -20.526 7.617 -19.089 QT
8.117 -17.651 8.117 -16.151 QT
8.117 -14.698 7.61 -13.323 QT
7.102 -11.948 6.157 -10.839 QT
5.211 -9.729 3.914 -9.089 QT
2.617 -8.448 1.102 -8.448 QT
-7.383 -8.448 L
cp
-2.945 -9.979 M
-2.945 -9.495 -2.664 -9.378 QT
-2.383 -9.261 -1.773 -9.261 QT
0.492 -9.261 L
1.68 -9.261 2.742 -9.768 QT
3.805 -10.276 4.492 -11.182 QT
5.227 -12.151 5.477 -13.347 QT
5.727 -14.542 5.727 -16.151 QT
5.727 -17.823 5.477 -19.081 QT
5.227 -20.339 4.492 -21.323 QT
3.805 -22.307 2.75 -22.831 QT
1.696 -23.354 0.492 -23.354 QT
-1.773 -23.354 L
-2.195 -23.354 -2.429 -23.315 QT
-2.664 -23.276 -2.804 -23.12 QT
-2.945 -22.964 -2.945 -22.62 QT
-2.945 -9.979 L
cp}def
f301356903
f
GR
GS
[0 -0.75 0.75 0 50.85549 111.49992] CT
0.149 GC
N
/f-337023504{10.481 -8.448 M
10.481 -9.261 L
12.856 -9.261 12.856 -9.979 QT
12.856 -22.62 L
12.856 -23.354 10.481 -23.354 QT
10.481 -24.167 L
23.168 -24.167 L
23.809 -18.886 L
23.137 -18.886 L
22.981 -20.339 22.715 -21.175 QT
22.45 -22.011 21.95 -22.487 QT
21.45 -22.964 20.598 -23.159 QT
19.747 -23.354 18.262 -23.354 QT
16.168 -23.354 L
15.747 -23.354 15.52 -23.315 QT
15.293 -23.276 15.145 -23.12 QT
14.997 -22.964 14.997 -22.62 QT
14.997 -16.698 L
16.622 -16.698 L
17.809 -16.698 18.356 -16.909 QT
18.903 -17.12 19.114 -17.667 QT
19.325 -18.214 19.325 -19.401 QT
19.981 -19.401 L
19.981 -13.214 L
19.325 -13.214 L
19.325 -14.386 19.114 -14.94 QT
18.903 -15.495 18.356 -15.698 QT
17.809 -15.901 16.622 -15.901 QT
14.997 -15.901 L
14.997 -9.979 L
14.997 -9.261 17.95 -9.261 QT
17.95 -8.448 L
10.481 -8.448 L
cp}def
f-337023504
f
GR
GS
[0.75 0 0 0.75 0 -0.25] CT
1 LJ
2.667 LW
N
108.598 262 M
108.598 261.446 L
116.277 261.446 L
116.277 260.893 L
117.828 260.893 L
117.828 260.339 L
120.675 260.339 L
120.675 259.786 L
121.198 259.786 L
121.198 259.232 L
122.487 259.232 L
122.487 258.678 L
122.578 258.678 L
122.578 258.125 L
123.181 258.125 L
123.181 257.571 L
125.157 257.571 L
125.157 257.018 L
126.362 257.018 L
126.362 256.464 L
127.065 256.464 L
127.065 255.91 L
127.539 255.91 L
127.539 255.357 L
127.726 255.357 L
127.726 254.803 L
127.941 254.803 L
127.941 254.25 L
128.134 254.25 L
128.134 253.696 L
128.621 253.696 L
128.621 253.142 L
129.222 253.142 L
129.222 252.589 L
129.85 252.589 L
129.85 252.035 L
129.856 252.035 L
129.856 251.482 L
129.955 251.482 L
129.955 250.928 L
130.044 250.928 L
130.044 250.374 L
130.743 250.374 L
130.743 249.821 L
131.133 249.821 L
131.133 249.267 L
131.745 249.267 L
131.745 248.714 L
132.054 248.714 L
132.054 248.16 L
132.115 248.16 L
132.115 247.606 L
132.82 247.606 L
132.82 247.053 L
132.907 247.053 L
132.907 246.499 L
133.426 246.499 L
133.426 245.945 L
133.481 245.945 L
133.481 245.392 L
133.661 245.392 L
133.661 244.838 L
133.697 244.838 L
133.697 244.285 L
134.745 244.285 L
134.745 243.731 L
135.149 243.731 L
135.149 243.177 L
137.851 243.177 L
137.851 242.624 L
138.725 242.624 L
138.725 242.07 L
138.853 242.07 L
138.853 241.517 L
139.402 241.517 L
139.402 240.963 L
139.904 240.963 L
139.904 240.409 L
140.071 240.409 L
140.071 239.856 L
140.075 239.856 L
140.075 239.302 L
140.19 239.302 L
140.19 238.749 L
140.288 238.749 L
140.288 238.195 L
140.57 238.195 L
140.57 237.641 L
140.926 237.641 L
140.926 237.088 L
141.974 237.088 L
141.974 236.534 L
142.051 236.534 L
142.051 235.981 L
142.514 235.981 L
142.514 235.427 L
143.028 235.427 L
143.028 234.873 L
143.572 234.873 L
143.572 234.32 L
143.666 234.32 L
143.666 233.766 L
144.226 233.766 L
144.226 233.213 L
144.982 233.213 L
144.982 232.659 L
145.181 232.659 L
145.181 232.105 L
145.464 232.105 L
145.464 231.552 L
146.109 231.552 L
146.109 230.998 L
146.568 230.998 L
146.568 230.445 L
146.6 230.445 L
146.6 229.891 L
147.428 229.891 L
147.428 229.337 L
148.195 229.337 L
148.195 228.784 L
148.255 228.784 L
148.255 228.23 L
148.434 228.23 L
148.434 227.677 L
149.091 227.677 L
149.091 227.123 L
150.475 227.123 L
150.475 226.569 L
151.318 226.569 L
151.318 226.016 L
151.343 226.016 L
151.343 225.462 L
152.066 225.462 L
152.066 224.909 L
152.328 224.909 L
152.328 224.355 L
152.741 224.355 L
152.741 223.801 L
153.518 223.801 L
153.518 223.248 L
154.708 223.248 L
154.708 222.694 L
155.469 222.694 L
155.469 222.141 L
156.177 222.141 L
156.177 221.587 L
156.28 221.587 L
156.28 221.033 L
156.437 221.033 L
156.437 220.48 L
157.197 220.48 L
157.197 219.926 L
157.706 219.926 L
157.706 219.372 L
157.924 219.372 L
157.924 218.819 L
158.248 218.819 L
158.248 218.265 L
158.275 218.265 L
158.275 217.712 L
158.769 217.712 L
158.769 217.158 L
159.507 217.158 L
159.507 216.604 L
159.827 216.604 L
159.827 216.051 L
160.317 216.051 L
160.317 215.497 L
161.187 215.497 L
161.187 214.944 L
161.603 214.944 L
161.603 214.39 L
162.019 214.39 L
162.019 213.836 L
162.04 213.836 L
162.04 213.283 L
162.081 213.283 L
162.081 212.729 L
162.084 212.729 L
162.084 212.176 L
162.905 212.176 L
162.905 211.622 L
163.024 211.622 L
163.024 211.068 L
163.146 211.068 L
163.146 210.515 L
163.434 210.515 L
163.434 209.961 L
163.47 209.961 L
163.47 209.408 L
163.719 209.408 L
163.719 208.854 L
164.688 208.854 L
164.688 208.3 L
164.72 208.3 L
164.72 207.747 L
165.058 207.747 L
165.058 207.193 L
165.196 207.193 L
165.196 206.64 L
165.24 206.64 L
165.24 206.086 L
166.53 206.086 L
166.53 205.532 L
166.693 205.532 L
166.693 204.979 L
167.014 204.979 L
167.014 204.425 L
168.487 204.425 L
168.487 203.872 L
168.555 203.872 L
168.555 203.318 L
168.85 203.318 L
168.85 202.764 L
168.872 202.764 L
168.872 202.211 L
168.933 202.211 L
168.933 201.657 L
169.674 201.657 L
169.674 201.104 L
170.044 201.104 L
170.044 200.55 L
170.406 200.55 L
170.406 199.996 L
170.467 199.996 L
170.467 199.443 L
171.989 199.443 L
171.989 198.889 L
172.008 198.889 L
172.008 198.336 L
172.837 198.336 L
172.837 197.782 L
172.874 197.782 L
172.874 197.228 L
172.97 197.228 L
172.97 196.675 L
173.439 196.675 L
173.439 196.121 L
174.445 196.121 L
174.445 195.568 L
174.584 195.568 L
174.584 195.014 L
175.24 195.014 L
175.24 194.46 L
175.248 194.46 L
175.248 193.907 L
175.907 193.907 L
175.907 193.353 L
177.469 193.353 L
177.469 192.8 L
177.761 192.8 L
177.761 192.246 L
177.937 192.246 L
177.937 191.692 L
178.326 191.692 L
178.326 191.139 L
179.292 191.139 L
179.292 190.585 L
180.701 190.585 L
180.701 190.031 L
180.728 190.031 L
180.728 189.478 L
180.778 189.478 L
180.778 188.924 L
181.246 188.924 L
181.246 188.371 L
181.638 188.371 L
181.638 187.817 L
181.977 187.817 L
181.977 187.263 L
182.429 187.263 L
182.429 186.71 L
182.839 186.71 L
182.839 186.156 L
184.603 186.156 L
184.603 185.603 L
184.665 185.603 L
184.665 185.049 L
184.841 185.049 L
184.841 184.495 L
185.009 184.495 L
185.009 183.942 L
186.185 183.942 L
186.185 183.388 L
186.261 183.388 L
186.261 182.835 L
186.366 182.835 L
186.366 182.281 L
186.399 182.281 L
186.399 181.727 L
187.264 181.727 L
187.264 181.174 L
187.712 181.174 L
187.712 180.62 L
187.755 180.62 L
187.755 180.067 L
187.919 180.067 L
187.919 179.513 L
188.008 179.513 L
188.008 178.959 L
192.738 178.959 L
192.738 178.406 L
192.955 178.406 L
192.955 177.852 L
193.221 177.852 L
193.221 177.299 L
193.318 177.299 L
193.318 176.745 L
194.114 176.745 L
194.114 176.191 L
195.833 176.191 L
195.833 175.638 L
196.538 175.638 L
196.538 175.084 L
199.075 175.084 L
199.075 174.531 L
199.35 174.531 L
199.35 173.977 L
199.603 173.977 L
199.603 173.423 L
199.635 173.423 L
199.635 172.87 L
199.78 172.87 L
199.78 172.316 L
200.293 172.316 L
200.293 171.763 L
200.392 171.763 L
200.392 171.209 L
200.485 171.209 L
200.485 170.655 L
200.741 170.655 L
200.741 170.102 L
200.778 170.102 L
200.778 169.548 L
200.886 169.548 L
200.886 168.995 L
200.944 168.995 L
200.944 168.441 L
201.029 168.441 L
201.029 167.887 L
201.521 167.887 L
201.521 167.334 L
202.519 167.334 L
202.519 166.78 L
202.79 166.78 L
202.79 166.227 L
203.824 166.227 L
203.824 165.673 L
203.854 165.673 L
203.854 165.119 L
204.873 165.119 L
204.873 164.566 L
205.718 164.566 L
205.718 164.012 L
206.226 164.012 L
206.226 163.459 L
206.72 163.459 L
206.72 162.905 L
207.436 162.905 L
207.436 162.351 L
210.595 162.351 L
210.595 161.798 L
211.411 161.798 L
211.411 161.244 L
214.196 161.244 L
214.196 160.69 L
214.277 160.69 L
214.277 160.137 L
216.448 160.137 L
216.448 159.583 L
216.526 159.583 L
216.526 159.03 L
219.396 159.03 L
219.396 158.476 L
219.429 158.476 L
219.429 157.922 L
219.602 157.922 L
219.602 157.369 L
219.81 157.369 L
219.81 156.815 L
219.934 156.815 L
219.934 156.262 L
220.118 156.262 L
220.118 155.708 L
220.373 155.708 L
220.373 155.154 L
222.011 155.154 L
222.011 154.601 L
222.571 154.601 L
222.571 154.047 L
222.758 154.047 L
222.758 153.494 L
223.639 153.494 L
223.639 152.94 L
223.995 152.94 L
223.995 152.386 L
224.888 152.386 L
224.888 151.833 L
225.536 151.833 L
225.536 151.279 L
226.434 151.279 L
226.434 150.726 L
228.088 150.726 L
228.088 150.172 L
228.281 150.172 L
228.281 149.618 L
229.248 149.618 L
229.248 149.065 L
229.361 149.065 L
229.361 148.511 L
230.321 148.511 L
230.321 147.958 L
231.345 147.958 L
231.345 147.404 L
231.45 147.404 L
231.45 146.85 L
231.607 146.85 L
231.607 146.297 L
232.296 146.297 L
232.296 145.743 L
233.09 145.743 L
233.09 145.19 L
233.324 145.19 L
233.324 144.636 L
234.899 144.636 L
234.899 144.082 L
235.027 144.082 L
235.027 143.529 L
235.058 143.529 L
235.058 142.975 L
235.545 142.975 L
235.545 142.422 L
237.995 142.422 L
237.995 141.868 L
238.212 141.868 L
238.212 141.314 L
239.062 141.314 L
239.062 140.761 L
239.234 140.761 L
239.234 140.207 L
239.412 140.207 L
239.412 139.654 L
239.512 139.654 L
239.512 139.1 L
239.641 139.1 L
239.641 138.546 L
240.101 138.546 L
240.101 137.993 L
240.144 137.993 L
240.144 137.439 L
240.708 137.439 L
240.708 136.886 L
241.335 136.886 L
241.335 136.332 L
242.527 136.332 L
242.527 135.778 L
243.387 135.778 L
243.387 135.225 L
244.108 135.225 L
244.108 134.671 L
244.944 134.671 L
244.944 134.118 L
245.31 134.118 L
245.31 133.564 L
246.833 133.564 L
246.833 133.01 L
247.112 133.01 L
247.112 132.457 L
247.805 132.457 L
247.805 131.903 L
248.848 131.903 L
248.848 131.349 L
249.042 131.349 L
249.042 130.796 L
250.242 130.796 L
250.242 130.242 L
250.49 130.242 L
250.49 129.689 L
251.879 129.689 L
251.879 129.135 L
252.123 129.135 L
252.123 128.581 L
252.497 128.581 L
252.497 128.028 L
253.708 128.028 L
253.708 127.474 L
253.838 127.474 L
253.838 126.921 L
255.319 126.921 L
255.319 126.367 L
256.086 126.367 L
256.086 125.813 L
256.235 125.813 L
256.235 125.26 L
256.376 125.26 L
256.376 124.706 L
256.392 124.706 L
256.392 124.153 L
256.51 124.153 L
256.51 123.599 L
256.638 123.599 L
256.638 123.045 L
257.291 123.045 L
257.291 122.492 L
257.54 122.492 L
257.54 121.938 L
258.192 121.938 L
258.192 121.385 L
258.472 121.385 L
258.472 120.831 L
259.132 120.831 L
259.132 120.277 L
260.504 120.277 L
260.504 119.724 L
260.517 119.724 L
260.517 119.17 L
260.857 119.17 L
260.857 118.617 L
261.099 118.617 L
261.099 118.063 L
262.407 118.063 L
262.407 117.509 L
263.262 117.509 L
263.262 116.956 L
263.528 116.956 L
263.528 116.402 L
264.229 116.402 L
264.229 115.849 L
264.504 115.849 L
264.504 115.295 L
265.227 115.295 L
265.227 114.741 L
265.381 114.741 L
265.381 114.188 L
265.79 114.188 L
265.79 113.634 L
267.09 113.634 L
267.09 113.081 L
267.776 113.081 L
267.776 112.527 L
268.099 112.527 L
268.099 111.973 L
268.411 111.973 L
268.411 111.42 L
269.214 111.42 L
269.214 110.866 L
271.599 110.866 L
271.599 110.313 L
271.714 110.313 L
271.714 109.759 L
273.408 109.759 L
273.408 109.205 L
273.984 109.205 L
273.984 108.652 L
274.317 108.652 L
274.317 108.098 L
274.749 108.098 L
274.749 107.545 L
275.317 107.545 L
275.317 106.991 L
276.168 106.991 L
276.168 106.437 L
276.81 106.437 L
276.81 105.884 L
277.714 105.884 L
277.714 105.33 L
278.398 105.33 L
278.398 104.777 L
279.218 104.777 L
279.218 104.223 L
279.559 104.223 L
279.559 103.669 L
279.829 103.669 L
279.829 103.116 L
282.867 103.116 L
282.867 102.562 L
283.872 102.562 L
283.872 102.008 L
284.794 102.008 L
284.794 101.455 L
284.808 101.455 L
284.808 100.901 L
285.07 100.901 L
285.07 100.348 L
285.954 100.348 L
285.954 99.794 L
287.454 99.794 L
287.454 99.24 L
287.537 99.24 L
287.537 98.687 L
289.165 98.687 L
289.165 98.133 L
289.48 98.133 L
289.48 97.58 L
289.576 97.58 L
289.576 97.026 L
291.63 97.026 L
291.63 96.472 L
291.774 96.472 L
291.774 95.919 L
294.018 95.919 L
294.018 95.365 L
294.794 95.365 L
294.794 94.812 L
295.611 94.812 L
295.611 94.258 L
295.687 94.258 L
295.687 93.704 L
298.524 93.704 L
298.524 93.151 L
298.878 93.151 L
298.878 92.597 L
300.383 92.597 L
300.383 92.044 L
301.064 92.044 L
301.064 91.49 L
301.936 91.49 L
301.936 90.936 L
302.971 90.936 L
302.971 90.383 L
303.512 90.383 L
303.512 89.829 L
303.922 89.829 L
303.922 89.276 L
304.3 89.276 L
304.3 88.722 L
304.465 88.722 L
304.465 88.168 L
306.486 88.168 L
306.486 87.615 L
306.767 87.615 L
306.767 87.061 L
307.262 87.061 L
307.262 86.508 L
307.855 86.508 L
307.855 85.954 L
311.39 85.954 L
311.39 85.4 L
311.803 85.4 L
311.803 84.847 L
314.603 84.847 L
314.603 84.293 L
315.662 84.293 L
315.662 83.74 L
316.286 83.74 L
316.286 83.186 L
318.421 83.186 L
318.421 82.632 L
319.657 82.632 L
319.657 82.079 L
320.453 82.079 L
320.453 81.525 L
320.886 81.525 L
320.886 80.972 L
321.035 80.972 L
321.035 80.418 L
322.797 80.418 L
322.797 79.864 L
322.849 79.864 L
322.849 79.311 L
322.88 79.311 L
322.88 78.757 L
324.36 78.757 L
324.36 78.204 L
324.706 78.204 L
324.706 77.65 L
325.309 77.65 L
325.309 77.096 L
325.618 77.096 L
325.618 76.543 L
326.271 76.543 L
326.271 75.989 L
333.067 75.989 L
333.067 75.436 L
334.4 75.436 L
334.4 74.882 L
340.852 74.882 L
340.852 74.328 L
341.801 74.328 L
341.801 73.775 L
343.071 73.775 L
343.071 73.221 L
343.483 73.221 L
343.483 72.667 L
343.582 72.667 L
343.582 72.114 L
343.995 72.114 L
343.995 71.56 L
344.014 71.56 L
344.014 71.007 L
345.861 71.007 L
345.861 70.453 L
346.213 70.453 L
346.213 69.899 L
348.497 69.899 L
348.497 69.346 L
353.469 69.346 L
353.469 68.792 L
355.876 68.792 L
355.876 68.239 L
356.243 68.239 L
356.243 67.685 L
356.803 67.685 L
356.803 67.131 L
358.831 67.131 L
358.831 66.578 L
358.945 66.578 L
358.945 66.024 L
359.15 66.024 L
359.15 65.471 L
359.812 65.471 L
359.812 64.917 L
359.896 64.917 L
359.896 64.363 L
360.891 64.363 L
360.891 63.81 L
364.245 63.81 L
364.245 63.256 L
365.121 63.256 L
365.121 62.703 L
369.052 62.703 L
369.052 62.149 L
369.095 62.149 L
369.095 61.595 L
371.151 61.595 L
371.151 61.042 L
372.355 61.042 L
372.355 60.488 L
372.503 60.488 L
372.503 59.935 L
372.78 59.935 L
372.78 59.381 L
374.761 59.381 L
374.761 58.827 L
376.331 58.827 L
376.331 58.274 L
376.972 58.274 L
376.972 57.72 L
377.638 57.72 L
377.638 57.167 L
380.593 57.167 L
380.593 56.613 L
382.527 56.613 L
382.527 56.059 L
384.683 56.059 L
384.683 55.506 L
387.565 55.506 L
387.565 54.952 L
395.718 54.952 L
395.718 54.399 L
396.253 54.399 L
396.253 53.845 L
401.127 53.845 L
401.127 53.291 L
401.465 53.291 L
401.465 52.738 L
402.955 52.738 L
402.955 52.184 L
405.476 52.184 L
405.476 51.631 L
408.971 51.631 L
408.971 51.077 L
412.129 51.077 L
412.129 50.523 L
416.693 50.523 L
416.693 49.97 L
421.567 49.97 L
421.567 49.416 L
426.722 49.416 L
426.722 48.863 L
432.313 48.863 L
432.313 48.309 L
433.066 48.309 L
433.066 47.755 L
435.612 47.755 L
435.612 47.202 L
437.754 47.202 L
437.754 46.648 L
439.288 46.648 L
439.288 46.095 L
441.692 46.095 L
441.692 45.541 L
446.977 45.541 L
446.977 44.987 L
448.574 44.987 L
448.574 44.434 L
456.364 44.434 L
456.364 43.88 L
457.082 43.88 L
457.082 43.326 L
469.331 43.326 L
469.331 42.773 L
470.174 42.773 L
470.174 42.219 L
472.088 42.219 L
472.088 41.666 L
480.208 41.666 L
480.208 41.112 L
496.408 41.112 L
496.408 40.558 L
497.463 40.558 L
497.463 40.005 L
498.957 40.005 L
498.957 39.451 L
520.9 39.451 L
520.9 38.898 L
525.598 38.898 L
525.598 38.344 L
533.87 38.344 L
533.87 37.79 L
547.476 37.79 L
547.476 37.237 L
553.628 37.237 L
553.628 36.683 L
563.092 36.683 L
563.092 36.13 L
564.41 36.13 L
564.41 35.973 L
S
GR
GS
[0.75 0 0 0.75 0 -0.25] CT
1 0 0 RC
1 LJ
2.667 LW
N
113.96 262 M
113.96 261.446 L
119.96 261.446 L
119.96 260.893 L
120.208 260.893 L
120.208 260.339 L
121.054 260.339 L
121.054 259.786 L
123.559 259.786 L
123.559 259.232 L
126.255 259.232 L
126.255 258.678 L
126.609 258.678 L
126.609 258.125 L
128.427 258.125 L
128.427 257.571 L
128.483 257.571 L
128.483 257.018 L
129.597 257.018 L
129.597 256.464 L
130.975 256.464 L
130.975 255.91 L
131.858 255.91 L
131.858 255.357 L
132.19 255.357 L
132.19 254.803 L
132.938 254.803 L
132.938 254.25 L
133.159 254.25 L
133.159 253.696 L
133.277 253.696 L
133.277 253.142 L
133.484 253.142 L
133.484 252.589 L
133.856 252.589 L
133.856 252.035 L
135.192 252.035 L
135.192 251.482 L
135.622 251.482 L
135.622 250.928 L
136.995 250.928 L
136.995 250.374 L
137.074 250.374 L
137.074 249.821 L
137.859 249.821 L
137.859 249.267 L
138.493 249.267 L
138.493 248.714 L
138.821 248.714 L
138.821 248.16 L
138.916 248.16 L
138.916 247.606 L
139.082 247.606 L
139.082 247.053 L
140.747 247.053 L
140.747 246.499 L
140.968 246.499 L
140.968 245.945 L
141.494 245.945 L
141.494 245.392 L
142.014 245.392 L
142.014 244.838 L
142.365 244.838 L
142.365 244.285 L
142.389 244.285 L
142.389 243.731 L
142.918 243.731 L
142.918 243.177 L
143.233 243.177 L
143.233 242.624 L
144.067 242.624 L
144.067 242.07 L
144.213 242.07 L
144.213 241.517 L
144.306 241.517 L
144.306 240.963 L
144.553 240.963 L
144.553 240.409 L
145.276 240.409 L
145.276 239.856 L
145.664 239.856 L
145.664 239.302 L
145.791 239.302 L
145.791 238.749 L
146.046 238.749 L
146.046 238.195 L
146.135 238.195 L
146.135 237.641 L
146.301 237.641 L
146.301 237.088 L
146.365 237.088 L
146.365 236.534 L
146.378 236.534 L
146.378 235.981 L
146.672 235.981 L
146.672 235.427 L
147.308 235.427 L
147.308 234.873 L
147.384 234.873 L
147.384 234.32 L
147.399 234.32 L
147.399 233.766 L
147.849 233.766 L
147.849 233.213 L
147.867 233.213 L
147.867 232.659 L
148.07 232.659 L
148.07 232.105 L
148.542 232.105 L
148.542 231.552 L
148.601 231.552 L
148.601 230.998 L
149.164 230.998 L
149.164 230.445 L
149.421 230.445 L
149.421 229.891 L
149.619 229.891 L
149.619 229.337 L
150.194 229.337 L
150.194 228.784 L
150.375 228.784 L
150.375 228.23 L
151.464 228.23 L
151.464 227.677 L
152.209 227.677 L
152.209 227.123 L
152.243 227.123 L
152.243 226.569 L
152.49 226.569 L
152.49 226.016 L
152.516 226.016 L
152.516 225.462 L
152.61 225.462 L
152.61 224.909 L
152.988 224.909 L
152.988 224.355 L
153.053 224.355 L
153.053 223.801 L
153.151 223.801 L
153.151 223.248 L
153.547 223.248 L
153.547 222.694 L
153.958 222.694 L
153.958 222.141 L
154.471 222.141 L
154.471 221.587 L
154.66 221.587 L
154.66 221.033 L
155.011 221.033 L
155.011 220.48 L
155.778 220.48 L
155.778 219.926 L
155.918 219.926 L
155.918 219.372 L
155.955 219.372 L
155.955 218.819 L
156.071 218.819 L
156.071 218.265 L
156.09 218.265 L
156.09 217.712 L
156.834 217.712 L
156.834 217.158 L
157.118 217.158 L
157.118 216.604 L
157.733 216.604 L
157.733 216.051 L
157.863 216.051 L
157.863 215.497 L
157.947 215.497 L
157.947 214.944 L
158.22 214.944 L
158.22 214.39 L
158.326 214.39 L
158.326 213.836 L
158.594 213.836 L
158.594 213.283 L
158.687 213.283 L
158.687 212.729 L
158.776 212.729 L
158.776 212.176 L
158.849 212.176 L
158.849 211.622 L
158.975 211.622 L
158.975 211.068 L
159.232 211.068 L
159.232 210.515 L
159.478 210.515 L
159.478 209.961 L
159.563 209.961 L
159.563 209.408 L
160.291 209.408 L
160.291 208.854 L
161.311 208.854 L
161.311 208.3 L
161.34 208.3 L
161.34 207.747 L
161.79 207.747 L
161.79 207.193 L
161.795 207.193 L
161.795 206.64 L
162.048 206.64 L
162.048 206.086 L
162.084 206.086 L
162.084 205.532 L
162.385 205.532 L
162.385 204.979 L
162.738 204.979 L
162.738 204.425 L
163.803 204.425 L
163.803 203.872 L
164.726 203.872 L
164.726 203.318 L
165.25 203.318 L
165.25 202.764 L
165.482 202.764 L
165.482 202.211 L
165.706 202.211 L
165.706 201.657 L
166.085 201.657 L
166.085 201.104 L
166.381 201.104 L
166.381 200.55 L
166.526 200.55 L
166.526 199.996 L
166.536 199.996 L
166.536 199.443 L
167.6 199.443 L
167.6 198.889 L
168.307 198.889 L
168.307 198.336 L
168.63 198.336 L
168.63 197.782 L
168.774 197.782 L
168.774 197.228 L
168.929 197.228 L
168.929 196.675 L
169.504 196.675 L
169.504 196.121 L
169.664 196.121 L
169.664 195.568 L
169.896 195.568 L
169.896 195.014 L
170.565 195.014 L
170.565 194.46 L
170.852 194.46 L
170.852 193.907 L
170.861 193.907 L
170.861 193.353 L
170.889 193.353 L
170.889 192.8 L
171.279 192.8 L
171.279 192.246 L
172.366 192.246 L
172.366 191.692 L
172.367 191.692 L
172.367 191.139 L
172.679 191.139 L
172.679 190.585 L
172.923 190.585 L
172.923 190.031 L
173.987 190.031 L
173.987 189.478 L
174.314 189.478 L
174.314 188.924 L
174.349 188.924 L
174.349 188.371 L
174.494 188.371 L
174.494 187.817 L
174.561 187.817 L
174.561 187.263 L
174.593 187.263 L
174.593 186.71 L
174.625 186.71 L
174.625 186.156 L
174.692 186.156 L
174.692 185.603 L
175.25 185.603 L
175.25 185.049 L
175.606 185.049 L
175.606 184.495 L
176.142 184.495 L
176.142 183.942 L
176.952 183.942 L
176.952 183.388 L
177.204 183.388 L
177.204 182.835 L
177.273 182.835 L
177.273 182.281 L
177.824 182.281 L
177.824 181.727 L
177.828 181.727 L
177.828 181.174 L
178.11 181.174 L
178.11 180.62 L
178.18 180.62 L
178.18 180.067 L
178.204 180.067 L
178.204 179.513 L
178.215 179.513 L
178.215 178.959 L
178.37 178.959 L
178.37 178.406 L
178.424 178.406 L
178.424 177.852 L
178.485 177.852 L
178.485 177.299 L
178.866 177.299 L
178.866 176.745 L
179.951 176.745 L
179.951 176.191 L
180.314 176.191 L
180.314 175.638 L
180.622 175.638 L
180.622 175.084 L
180.676 175.084 L
180.676 174.531 L
180.728 174.531 L
180.728 173.977 L
181.675 173.977 L
181.675 173.423 L
181.978 173.423 L
181.978 172.87 L
182.29 172.87 L
182.29 172.316 L
182.689 172.316 L
182.689 171.763 L
182.696 171.763 L
182.696 171.209 L
183.589 171.209 L
183.589 170.655 L
183.922 170.655 L
183.922 170.102 L
184.137 170.102 L
184.137 169.548 L
184.259 169.548 L
184.259 168.995 L
184.707 168.995 L
184.707 168.441 L
184.861 168.441 L
184.861 167.887 L
185.292 167.887 L
185.292 167.334 L
186.031 167.334 L
186.031 166.78 L
186.033 166.78 L
186.033 166.227 L
186.134 166.227 L
186.134 165.673 L
186.506 165.673 L
186.506 165.119 L
186.985 165.119 L
186.985 164.566 L
187.773 164.566 L
187.773 164.012 L
187.801 164.012 L
187.801 163.459 L
188.878 163.459 L
188.878 162.905 L
189.182 162.905 L
189.182 162.351 L
189.861 162.351 L
189.861 161.798 L
190.756 161.798 L
190.756 161.244 L
191.294 161.244 L
191.294 160.69 L
191.833 160.69 L
191.833 160.137 L
191.884 160.137 L
191.884 159.583 L
191.988 159.583 L
191.988 159.03 L
192.093 159.03 L
192.093 158.476 L
192.869 158.476 L
192.869 157.922 L
193.005 157.922 L
193.005 157.369 L
194.014 157.369 L
194.014 156.815 L
194.264 156.815 L
194.264 156.262 L
194.464 156.262 L
194.464 155.708 L
194.616 155.708 L
194.616 155.154 L
194.795 155.154 L
194.795 154.601 L
195.893 154.601 L
195.893 154.047 L
196.618 154.047 L
196.618 153.494 L
197.849 153.494 L
197.849 152.94 L
198.571 152.94 L
198.571 152.386 L
198.755 152.386 L
198.755 151.833 L
198.934 151.833 L
198.934 151.279 L
199.917 151.279 L
199.917 150.726 L
200.339 150.726 L
200.339 150.172 L
200.399 150.172 L
200.399 149.618 L
200.758 149.618 L
200.758 149.065 L
200.773 149.065 L
200.773 148.511 L
201.303 148.511 L
201.303 147.958 L
201.396 147.958 L
201.396 147.404 L
201.696 147.404 L
201.696 146.85 L
202.159 146.85 L
202.159 146.297 L
202.178 146.297 L
202.178 145.743 L
202.917 145.743 L
202.917 145.19 L
202.971 145.19 L
202.971 144.636 L
203.362 144.636 L
203.362 144.082 L
203.973 144.082 L
203.973 143.529 L
204.265 143.529 L
204.265 142.975 L
204.282 142.975 L
204.282 142.422 L
204.476 142.422 L
204.476 141.868 L
204.667 141.868 L
204.667 141.314 L
205 141.314 L
205 140.761 L
205.186 140.761 L
205.186 140.207 L
205.482 140.207 L
205.482 139.654 L
206.259 139.654 L
206.259 139.1 L
206.784 139.1 L
206.784 138.546 L
206.786 138.546 L
206.786 137.993 L
206.938 137.993 L
206.938 137.439 L
207.703 137.439 L
207.703 136.886 L
207.89 136.886 L
207.89 136.332 L
208.018 136.332 L
208.018 135.778 L
208.336 135.778 L
208.336 135.225 L
208.749 135.225 L
208.749 134.671 L
209.314 134.671 L
209.314 134.118 L
209.988 134.118 L
209.988 133.564 L
210.78 133.564 L
210.78 133.01 L
210.917 133.01 L
210.917 132.457 L
212.103 132.457 L
212.103 131.903 L
212.266 131.903 L
212.266 131.349 L
212.791 131.349 L
212.791 130.796 L
212.903 130.796 L
212.903 130.242 L
213.664 130.242 L
213.664 129.689 L
213.829 129.689 L
213.829 129.135 L
214.325 129.135 L
214.325 128.581 L
214.621 128.581 L
214.621 128.028 L
214.974 128.028 L
214.974 127.474 L
215.958 127.474 L
215.958 126.921 L
216.192 126.921 L
216.192 126.367 L
216.202 126.367 L
216.202 125.813 L
216.791 125.813 L
216.791 125.26 L
218.185 125.26 L
218.185 124.706 L
219.279 124.706 L
219.279 124.153 L
222.077 124.153 L
222.077 123.599 L
222.152 123.599 L
222.152 123.045 L
223.561 123.045 L
223.561 122.492 L
223.715 122.492 L
223.715 121.938 L
223.858 121.938 L
223.858 121.385 L
224.532 121.385 L
224.532 120.831 L
224.775 120.831 L
224.775 120.277 L
225.088 120.277 L
225.088 119.724 L
226.035 119.724 L
226.035 119.17 L
226.633 119.17 L
226.633 118.617 L
226.814 118.617 L
226.814 118.063 L
227.132 118.063 L
227.132 117.509 L
227.215 117.509 L
227.215 116.956 L
227.455 116.956 L
227.455 116.402 L
227.518 116.402 L
227.518 115.849 L
228.939 115.849 L
228.939 115.295 L
229.538 115.295 L
229.538 114.741 L
229.609 114.741 L
229.609 114.188 L
229.626 114.188 L
229.626 113.634 L
229.723 113.634 L
229.723 113.081 L
229.943 113.081 L
229.943 112.527 L
230.211 112.527 L
230.211 111.973 L
230.847 111.973 L
230.847 111.42 L
232.821 111.42 L
232.821 110.866 L
233.034 110.866 L
233.034 110.313 L
233.127 110.313 L
233.127 109.759 L
233.598 109.759 L
233.598 109.205 L
233.695 109.205 L
233.695 108.652 L
234.074 108.652 L
234.074 108.098 L
235.089 108.098 L
235.089 107.545 L
235.313 107.545 L
235.313 106.991 L
235.59 106.991 L
235.59 106.437 L
236.003 106.437 L
236.003 105.884 L
236.409 105.884 L
236.409 105.33 L
236.586 105.33 L
236.586 104.777 L
241.298 104.777 L
241.298 104.223 L
241.351 104.223 L
241.351 103.669 L
241.501 103.669 L
241.501 103.116 L
242.091 103.116 L
242.091 102.562 L
242.829 102.562 L
242.829 102.008 L
242.973 102.008 L
242.973 101.455 L
243.098 101.455 L
243.098 100.901 L
243.969 100.901 L
243.969 100.348 L
244.241 100.348 L
244.241 99.794 L
244.674 99.794 L
244.674 99.24 L
244.944 99.24 L
244.944 98.687 L
245.638 98.687 L
245.638 98.133 L
245.735 98.133 L
245.735 97.58 L
247.276 97.58 L
247.276 97.026 L
247.328 97.026 L
247.328 96.472 L
247.892 96.472 L
247.892 95.919 L
248.352 95.919 L
248.352 95.365 L
248.835 95.365 L
248.835 94.812 L
249.397 94.812 L
249.397 94.258 L
249.782 94.258 L
249.782 93.704 L
250.278 93.704 L
250.278 93.151 L
251.042 93.151 L
251.042 92.597 L
251.38 92.597 L
251.38 92.044 L
252.283 92.044 L
252.283 91.49 L
252.87 91.49 L
252.87 90.936 L
253.862 90.936 L
253.862 90.383 L
255.31 90.383 L
255.31 89.829 L
255.585 89.829 L
255.585 89.276 L
256.767 89.276 L
256.767 88.722 L
257.655 88.722 L
257.655 88.168 L
260.187 88.168 L
260.187 87.615 L
260.33 87.615 L
260.33 87.061 L
261.75 87.061 L
261.75 86.508 L
262.705 86.508 L
262.705 85.954 L
264.365 85.954 L
264.365 85.4 L
266.336 85.4 L
266.336 84.847 L
270.47 84.847 L
270.47 84.293 L
271.077 84.293 L
271.077 83.74 L
271.793 83.74 L
271.793 83.186 L
273.654 83.186 L
273.654 82.632 L
273.952 82.632 L
273.952 82.079 L
274.267 82.079 L
274.267 81.525 L
274.288 81.525 L
274.288 80.972 L
274.895 80.972 L
274.895 80.418 L
276.076 80.418 L
276.076 79.864 L
277.68 79.864 L
277.68 79.311 L
279.536 79.311 L
279.536 78.757 L
280.793 78.757 L
280.793 78.204 L
283.748 78.204 L
283.748 77.65 L
285.373 77.65 L
285.373 77.096 L
287.586 77.096 L
287.586 76.543 L
289.573 76.543 L
289.573 75.989 L
299.025 75.989 L
299.025 75.436 L
302.503 75.436 L
302.503 74.882 L
302.8 74.882 L
302.8 74.328 L
303.048 74.328 L
303.048 73.775 L
303.386 73.775 L
303.386 73.221 L
305.796 73.221 L
305.796 72.667 L
306.008 72.667 L
306.008 72.114 L
309.521 72.114 L
309.521 71.56 L
314.227 71.56 L
314.227 71.007 L
316.588 71.007 L
316.588 70.453 L
318.84 70.453 L
318.84 69.899 L
320.3 69.899 L
320.3 69.346 L
323.189 69.346 L
323.189 68.792 L
323.931 68.792 L
323.931 68.239 L
332.533 68.239 L
332.533 67.685 L
333.561 67.685 L
333.561 67.131 L
339.407 67.131 L
339.407 66.578 L
343.259 66.578 L
343.259 66.024 L
344.527 66.024 L
344.527 65.471 L
345.429 65.471 L
345.429 64.917 L
345.444 64.917 L
345.444 64.363 L
346.361 64.363 L
346.361 63.81 L
347.795 63.81 L
347.795 63.256 L
353.301 63.256 L
353.301 62.703 L
354 62.703 L
354 62.149 L
354.805 62.149 L
354.805 61.595 L
355.358 61.595 L
355.358 61.042 L
356.063 61.042 L
356.063 60.488 L
361.029 60.488 L
361.029 59.935 L
361.49 59.935 L
361.49 59.381 L
368.549 59.381 L
368.549 58.827 L
374.845 58.827 L
374.845 58.274 L
378.653 58.274 L
378.653 57.72 L
378.709 57.72 L
378.709 57.167 L
379.207 57.167 L
379.207 56.613 L
383.782 56.613 L
383.782 56.059 L
383.906 56.059 L
383.906 55.506 L
385.382 55.506 L
385.382 54.952 L
385.559 54.952 L
385.559 54.399 L
392.662 54.399 L
392.662 53.845 L
393.078 53.845 L
393.078 53.291 L
394.381 53.291 L
394.381 52.738 L
395.048 52.738 L
395.048 52.184 L
397.179 52.184 L
397.179 51.631 L
398.916 51.631 L
398.916 51.077 L
399.08 51.077 L
399.08 50.523 L
403.674 50.523 L
403.674 49.97 L
407.526 49.97 L
407.526 49.416 L
408.334 49.416 L
408.334 48.863 L
416.999 48.863 L
416.999 48.309 L
422.492 48.309 L
422.492 47.755 L
425.722 47.755 L
425.722 47.202 L
437.899 47.202 L
437.899 46.648 L
439.681 46.648 L
439.681 46.095 L
441.509 46.095 L
441.509 45.541 L
448.967 45.541 L
448.967 44.987 L
450.931 44.987 L
450.931 44.434 L
453.784 44.434 L
453.784 43.88 L
467.164 43.88 L
467.164 43.326 L
484.912 43.326 L
484.912 42.773 L
486.166 42.773 L
486.166 42.219 L
490.728 42.219 L
490.728 41.666 L
496.058 41.666 L
496.058 41.112 L
504.85 41.112 L
504.85 40.558 L
506.03 40.558 L
506.03 40.005 L
548.249 40.005 L
548.249 39.451 L
559.396 39.451 L
559.396 38.898 L
562.375 38.898 L
562.375 38.344 L
572.127 38.344 L
572.127 37.79 L
588.668 37.79 L
588.668 37.237 L
626.374 37.237 L
626.374 36.683 L
641.235 36.683 L
641.235 36.13 L
720.547 36.13 L
720.547 35.973 L
S
GR
GS
[0.75 0 0 0.75 0 -0.25] CT
1 GC
N
725 252 M
725 196 L
606 196 L
606 252 L
cp
f
GR
GS
[0.75 0 0 0.75 489.7939 157.90979] CT
N
/f1816321008{0.641 5.12 M
0.641 4.386 L
2.813 4.386 2.813 3.714 QT
2.813 -7.818 L
2.813 -8.489 0.641 -8.489 QT
0.641 -9.224 L
7.453 -9.224 L
7.453 -8.489 L
4.766 -8.489 4.766 -7.818 QT
4.766 3.714 L
4.766 4.167 5.023 4.276 QT
5.281 4.386 5.828 4.386 QT
7.453 4.386 L
9.031 4.386 9.875 3.807 QT
10.719 3.229 11.078 2.245 QT
11.438 1.261 11.625 -0.38 QT
12.219 -0.38 L
11.641 5.12 L
0.641 5.12 L
cp}def
f1816321008
f
GR
GS
[0.75 0 0 0.75 489.7939 157.90979] CT
N
/f-1254475979{14.068 5.12 M
14.068 4.386 L
16.24 4.386 16.24 3.136 QT
16.24 -7.818 L
16.24 -8.489 14.068 -8.489 QT
14.068 -9.224 L
18.036 -9.224 L
18.302 -9.224 18.38 -8.989 QT
22.958 2.901 L
27.521 -8.989 L
27.615 -9.224 27.865 -9.224 QT
31.833 -9.224 L
31.833 -8.489 L
29.661 -8.489 29.661 -7.818 QT
29.661 3.714 L
29.661 4.386 31.833 4.386 QT
31.833 5.12 L
25.724 5.12 L
25.724 4.386 L
27.88 4.386 27.88 3.714 QT
27.88 -8.505 L
22.708 4.886 L
22.63 5.12 22.365 5.12 QT
22.099 5.12 22.005 4.886 QT
16.896 -8.349 L
16.896 3.136 L
16.896 4.386 19.068 4.386 QT
19.068 5.12 L
14.068 5.12 L
cp}def
f-1254475979
f
GR
GS
[0.75 0 0 0.75 489.7939 157.90979] CT
N
/f-1795888728{34.061 5.417 M
34.061 0.511 L
34.061 0.354 34.248 0.354 QT
34.514 0.354 L
34.576 0.354 34.623 0.401 QT
34.67 0.448 34.67 0.511 QT
34.67 2.573 35.951 3.706 QT
37.233 4.839 39.295 4.839 QT
40.03 4.839 40.647 4.417 QT
41.264 3.995 41.6 3.315 QT
41.936 2.636 41.936 1.917 QT
41.936 1.276 41.686 0.675 QT
41.436 0.073 40.951 -0.364 QT
40.467 -0.802 39.858 -0.958 QT
37.139 -1.614 L
35.78 -1.974 34.92 -3.091 QT
34.061 -4.208 34.061 -5.583 QT
34.061 -6.677 34.616 -7.63 QT
35.17 -8.583 36.108 -9.138 QT
37.045 -9.693 38.139 -9.693 QT
40.248 -9.693 41.483 -8.255 QT
42.342 -9.63 L
42.405 -9.693 42.483 -9.693 QT
42.623 -9.693 L
42.686 -9.693 42.748 -9.646 QT
42.811 -9.599 42.811 -9.505 QT
42.811 -4.646 L
42.811 -4.458 42.623 -4.458 QT
42.389 -4.458 L
42.186 -4.458 42.186 -4.646 QT
42.186 -5.177 42.006 -5.81 QT
41.826 -6.443 41.514 -7.029 QT
41.201 -7.614 40.826 -7.989 QT
39.811 -9.005 38.139 -9.005 QT
37.42 -9.005 36.819 -8.646 QT
36.217 -8.286 35.858 -7.661 QT
35.498 -7.036 35.498 -6.349 QT
35.498 -5.443 36.053 -4.708 QT
36.608 -3.974 37.514 -3.739 QT
40.248 -3.068 L
40.92 -2.911 41.522 -2.482 QT
42.123 -2.052 42.522 -1.489 QT
42.92 -0.927 43.147 -0.239 QT
43.373 0.448 43.373 1.198 QT
43.373 2.323 42.85 3.339 QT
42.326 4.354 41.373 4.971 QT
40.42 5.589 39.295 5.589 QT
38.608 5.589 37.873 5.432 QT
37.139 5.276 36.53 4.956 QT
35.92 4.636 35.405 4.136 QT
34.53 5.526 L
34.467 5.589 34.373 5.589 QT
34.248 5.589 L
34.061 5.589 34.061 5.417 QT
cp}def
f-1795888728
f
GR
GS
[0.75 0 0 0.75 0 -0.25] CT
1 LJ
2.667 LW
N
610.005 210.88 M
650.055 210.88 L
S
GR
GS
[0.75 0 0 0.75 489.7939 177.59021] CT
N
/f-1753218115{0.641 5.12 M
0.641 4.386 L
2.813 4.386 2.813 3.714 QT
2.813 -7.818 L
2.813 -8.489 0.641 -8.489 QT
0.641 -9.224 L
6.938 -9.224 L
6.938 -8.489 L
4.766 -8.489 4.766 -7.818 QT
4.766 -2.708 L
10.969 -2.708 L
10.969 -7.818 L
10.969 -8.489 8.797 -8.489 QT
8.797 -9.224 L
15.078 -9.224 L
15.078 -8.489 L
12.922 -8.489 12.922 -7.818 QT
12.922 3.714 L
12.922 4.386 15.078 4.386 QT
15.078 5.12 L
8.797 5.12 L
8.797 4.386 L
10.969 4.386 10.969 3.714 QT
10.969 -1.974 L
4.766 -1.974 L
4.766 3.714 L
4.766 4.386 6.938 4.386 QT
6.938 5.12 L
0.641 5.12 L
cp}def
f-1753218115
f
GR
GS
[0.75 0 0 0.75 489.7939 177.59021] CT
N
/f1247936638{16.234 1.229 M
16.234 -0.068 L
21.797 -0.068 L
21.797 1.229 L
16.234 1.229 L
cp}def
f1247936638
f
GR
GS
[0.75 0 0 0.75 489.7939 177.59021] CT
N
/f-914098448{23.752 5.12 M
23.752 4.386 L
25.924 4.386 25.924 3.714 QT
25.924 -7.818 L
25.924 -8.489 23.752 -8.489 QT
23.752 -9.224 L
30.564 -9.224 L
30.564 -8.489 L
27.877 -8.489 27.877 -7.818 QT
27.877 3.714 L
27.877 4.167 28.135 4.276 QT
28.392 4.386 28.939 4.386 QT
30.564 4.386 L
32.142 4.386 32.986 3.807 QT
33.83 3.229 34.189 2.245 QT
34.549 1.261 34.736 -0.38 QT
35.33 -0.38 L
34.752 5.12 L
23.752 5.12 L
cp}def
f-914098448
f
GR
GS
[0.75 0 0 0.75 489.7939 177.59021] CT
N
/f116352523{37.179 5.12 M
37.179 4.386 L
39.351 4.386 39.351 3.136 QT
39.351 -7.818 L
39.351 -8.489 37.179 -8.489 QT
37.179 -9.224 L
41.148 -9.224 L
41.413 -9.224 41.491 -8.989 QT
46.069 2.901 L
50.632 -8.989 L
50.726 -9.224 50.976 -9.224 QT
54.944 -9.224 L
54.944 -8.489 L
52.773 -8.489 52.773 -7.818 QT
52.773 3.714 L
52.773 4.386 54.944 4.386 QT
54.944 5.12 L
48.835 5.12 L
48.835 4.386 L
50.991 4.386 50.991 3.714 QT
50.991 -8.505 L
45.819 4.886 L
45.741 5.12 45.476 5.12 QT
45.21 5.12 45.116 4.886 QT
40.007 -8.349 L
40.007 3.136 L
40.007 4.386 42.179 4.386 QT
42.179 5.12 L
37.179 5.12 L
cp}def
f116352523
f
GR
GS
[0.75 0 0 0.75 489.7939 177.59021] CT
N
/f1156609090{57.172 5.417 M
57.172 0.511 L
57.172 0.354 57.359 0.354 QT
57.625 0.354 L
57.688 0.354 57.734 0.401 QT
57.781 0.448 57.781 0.511 QT
57.781 2.573 59.063 3.706 QT
60.344 4.839 62.406 4.839 QT
63.141 4.839 63.758 4.417 QT
64.375 3.995 64.711 3.315 QT
65.047 2.636 65.047 1.917 QT
65.047 1.276 64.797 0.675 QT
64.547 0.073 64.063 -0.364 QT
63.578 -0.802 62.969 -0.958 QT
60.25 -1.614 L
58.891 -1.974 58.031 -3.091 QT
57.172 -4.208 57.172 -5.583 QT
57.172 -6.677 57.727 -7.63 QT
58.281 -8.583 59.219 -9.138 QT
60.156 -9.693 61.25 -9.693 QT
63.359 -9.693 64.594 -8.255 QT
65.453 -9.63 L
65.516 -9.693 65.594 -9.693 QT
65.734 -9.693 L
65.797 -9.693 65.859 -9.646 QT
65.922 -9.599 65.922 -9.505 QT
65.922 -4.646 L
65.922 -4.458 65.734 -4.458 QT
65.5 -4.458 L
65.297 -4.458 65.297 -4.646 QT
65.297 -5.177 65.117 -5.81 QT
64.938 -6.443 64.625 -7.029 QT
64.313 -7.614 63.938 -7.989 QT
62.922 -9.005 61.25 -9.005 QT
60.531 -9.005 59.93 -8.646 QT
59.328 -8.286 58.969 -7.661 QT
58.609 -7.036 58.609 -6.349 QT
58.609 -5.443 59.164 -4.708 QT
59.719 -3.974 60.625 -3.739 QT
63.359 -3.068 L
64.031 -2.911 64.633 -2.482 QT
65.234 -2.052 65.633 -1.489 QT
66.031 -0.927 66.258 -0.239 QT
66.484 0.448 66.484 1.198 QT
66.484 2.323 65.961 3.339 QT
65.438 4.354 64.484 4.971 QT
63.531 5.589 62.406 5.589 QT
61.719 5.589 60.984 5.432 QT
60.25 5.276 59.641 4.956 QT
59.031 4.636 58.516 4.136 QT
57.641 5.526 L
57.578 5.589 57.484 5.589 QT
57.359 5.589 L
57.172 5.589 57.172 5.417 QT
cp}def
f1156609090
f
GR
GS
[0.75 0 0 0.75 0 -0.25] CT
1 0 0 RC
1 LJ
2.667 LW
N
610.005 237.12 M
650.055 237.12 L
S
GR
GS
[0.75 0 0 0.75 0 -0.25] CT
0.149 GC
10.0 ML
0.667 LW
N
606 252 M
606 196 L
725 196 L
725 252 L
cp
S
GR
%%Trailer
%%Pages: 1
%%EOF
