%!PS-Adobe-3.0 EPSF-3.0
%%Creator: (MATLAB, The Mathworks, Inc. Version 9.5.0.944444 \(R2018b\). Operating System: Windows 10)
%%Title: (C:/Users/Alex/Documents/PhD Docs/01. GIT/my_phd_thesis/Chapter8/Figures/capsloc_res/04102019_ex03_pieCharts_example_singleSmarpthone.eps)
%%CreationDate: 2019-11-05T15:38:14
%%Pages: (atend)
%%BoundingBox: 0 0 592 361
%%LanguageLevel: 3
%%EndComments
%%BeginProlog
%%BeginResource: procset (Apache XML Graphics Std ProcSet) 1.2 0
%%Version: 1.2 0
%%Copyright: (Copyright 2001-2003,2010 The Apache Software Foundation. License terms: http://www.apache.org/licenses/LICENSE-2.0)
/bd{bind def}bind def
/ld{load def}bd
/GR/grestore ld
/GS/gsave ld
/RM/rmoveto ld
/C/curveto ld
/t/show ld
/L/lineto ld
/ML/setmiterlimit ld
/CT/concat ld
/f/fill ld
/N/newpath ld
/S/stroke ld
/CC/setcmykcolor ld
/A/ashow ld
/cp/closepath ld
/RC/setrgbcolor ld
/LJ/setlinejoin ld
/GC/setgray ld
/LW/setlinewidth ld
/M/moveto ld
/re {4 2 roll M
1 index 0 rlineto
0 exch rlineto
neg 0 rlineto
cp } bd
/_ctm matrix def
/_tm matrix def
/BT { _ctm currentmatrix pop matrix _tm copy pop 0 0 moveto } bd
/ET { _ctm setmatrix } bd
/iTm { _ctm setmatrix _tm concat } bd
/Tm { _tm astore pop iTm 0 0 moveto } bd
/ux 0.0 def
/uy 0.0 def
/F {
  /Tp exch def
  /Tf exch def
  Tf findfont Tp scalefont setfont
  /cf Tf def  /cs Tp def
} bd
/ULS {currentpoint /uy exch def /ux exch def} bd
/ULE {
  /Tcx currentpoint pop def
  gsave
  newpath
  cf findfont cs scalefont dup
  /FontMatrix get 0 get /Ts exch def /FontInfo get dup
  /UnderlinePosition get Ts mul /To exch def
  /UnderlineThickness get Ts mul /Tt exch def
  ux uy To add moveto  Tcx uy To add lineto
  Tt setlinewidth stroke
  grestore
} bd
/OLE {
  /Tcx currentpoint pop def
  gsave
  newpath
  cf findfont cs scalefont dup
  /FontMatrix get 0 get /Ts exch def /FontInfo get dup
  /UnderlinePosition get Ts mul /To exch def
  /UnderlineThickness get Ts mul /Tt exch def
  ux uy To add cs add moveto Tcx uy To add cs add lineto
  Tt setlinewidth stroke
  grestore
} bd
/SOE {
  /Tcx currentpoint pop def
  gsave
  newpath
  cf findfont cs scalefont dup
  /FontMatrix get 0 get /Ts exch def /FontInfo get dup
  /UnderlinePosition get Ts mul /To exch def
  /UnderlineThickness get Ts mul /Tt exch def
  ux uy To add cs 10 mul 26 idiv add moveto Tcx uy To add cs 10 mul 26 idiv add lineto
  Tt setlinewidth stroke
  grestore
} bd
/QT {
/Y22 exch store
/X22 exch store
/Y21 exch store
/X21 exch store
currentpoint
/Y21 load 2 mul add 3 div exch
/X21 load 2 mul add 3 div exch
/X21 load 2 mul /X22 load add 3 div
/Y21 load 2 mul /Y22 load add 3 div
/X22 load /Y22 load curveto
} bd
/SSPD {
dup length /d exch dict def
{
/v exch def
/k exch def
currentpagedevice k known {
/cpdv currentpagedevice k get def
v cpdv ne {
/upd false def
/nullv v type /nulltype eq def
/nullcpdv cpdv type /nulltype eq def
nullv nullcpdv or
{
/upd true def
} {
/sametype v type cpdv type eq def
sametype {
v type /arraytype eq {
/vlen v length def
/cpdvlen cpdv length def
vlen cpdvlen eq {
0 1 vlen 1 sub {
/i exch def
/obj v i get def
/cpdobj cpdv i get def
obj cpdobj ne {
/upd true def
exit
} if
} for
} {
/upd true def
} ifelse
} {
v type /dicttype eq {
v {
/dv exch def
/dk exch def
/cpddv cpdv dk get def
dv cpddv ne {
/upd true def
exit
} if
} forall
} {
/upd true def
} ifelse
} ifelse
} if
} ifelse
upd true eq {
d k v put
} if
} if
} if
} forall
d length 0 gt {
d setpagedevice
} if
} bd
/RE { % /NewFontName [NewEncodingArray] /FontName RE -
  findfont dup length dict begin
  {
    1 index /FID ne
    {def} {pop pop} ifelse
  } forall
  /Encoding exch def
  /FontName 1 index def
  currentdict definefont pop
  end
} bind def
%%EndResource
%%BeginResource: procset (Apache XML Graphics EPS ProcSet) 1.0 0
%%Version: 1.0 0
%%Copyright: (Copyright 2002-2003 The Apache Software Foundation. License terms: http://www.apache.org/licenses/LICENSE-2.0)
/BeginEPSF { %def
/b4_Inc_state save def         % Save state for cleanup
/dict_count countdictstack def % Count objects on dict stack
/op_count count 1 sub def      % Count objects on operand stack
userdict begin                 % Push userdict on dict stack
/showpage { } def              % Redefine showpage, { } = null proc
0 setgray 0 setlinecap         % Prepare graphics state
1 setlinewidth 0 setlinejoin
10 setmiterlimit [ ] 0 setdash newpath
/languagelevel where           % If level not equal to 1 then
{pop languagelevel             % set strokeadjust and
1 ne                           % overprint to their defaults.
{false setstrokeadjust false setoverprint
} if
} if
} bd
/EndEPSF { %def
count op_count sub {pop} repeat            % Clean up stacks
countdictstack dict_count sub {end} repeat
b4_Inc_state restore
} bd
%%EndResource
%FOPBeginFontDict
%%IncludeResource: font Courier-Oblique
%%IncludeResource: font Courier-BoldOblique
%%IncludeResource: font Courier-Bold
%%IncludeResource: font ZapfDingbats
%%IncludeResource: font Symbol
%%IncludeResource: font Helvetica
%%IncludeResource: font Helvetica-Oblique
%%IncludeResource: font Helvetica-Bold
%%IncludeResource: font Helvetica-BoldOblique
%%IncludeResource: font Times-Roman
%%IncludeResource: font Times-Italic
%%IncludeResource: font Times-Bold
%%IncludeResource: font Times-BoldItalic
%%IncludeResource: font Courier
%FOPEndFontDict
%%BeginResource: encoding WinAnsiEncoding
/WinAnsiEncoding [
/.notdef /.notdef /.notdef /.notdef /.notdef
/.notdef /.notdef /.notdef /.notdef /.notdef
/.notdef /.notdef /.notdef /.notdef /.notdef
/.notdef /.notdef /.notdef /.notdef /.notdef
/.notdef /.notdef /.notdef /.notdef /.notdef
/.notdef /.notdef /.notdef /.notdef /.notdef
/.notdef /.notdef /space /exclam /quotedbl
/numbersign /dollar /percent /ampersand /quotesingle
/parenleft /parenright /asterisk /plus /comma
/hyphen /period /slash /zero /one
/two /three /four /five /six
/seven /eight /nine /colon /semicolon
/less /equal /greater /question /at
/A /B /C /D /E
/F /G /H /I /J
/K /L /M /N /O
/P /Q /R /S /T
/U /V /W /X /Y
/Z /bracketleft /backslash /bracketright /asciicircum
/underscore /quoteleft /a /b /c
/d /e /f /g /h
/i /j /k /l /m
/n /o /p /q /r
/s /t /u /v /w
/x /y /z /braceleft /bar
/braceright /asciitilde /bullet /Euro /bullet
/quotesinglbase /florin /quotedblbase /ellipsis /dagger
/daggerdbl /circumflex /perthousand /Scaron /guilsinglleft
/OE /bullet /Zcaron /bullet /bullet
/quoteleft /quoteright /quotedblleft /quotedblright /bullet
/endash /emdash /asciitilde /trademark /scaron
/guilsinglright /oe /bullet /zcaron /Ydieresis
/space /exclamdown /cent /sterling /currency
/yen /brokenbar /section /dieresis /copyright
/ordfeminine /guillemotleft /logicalnot /sfthyphen /registered
/macron /degree /plusminus /twosuperior /threesuperior
/acute /mu /paragraph /middot /cedilla
/onesuperior /ordmasculine /guillemotright /onequarter /onehalf
/threequarters /questiondown /Agrave /Aacute /Acircumflex
/Atilde /Adieresis /Aring /AE /Ccedilla
/Egrave /Eacute /Ecircumflex /Edieresis /Igrave
/Iacute /Icircumflex /Idieresis /Eth /Ntilde
/Ograve /Oacute /Ocircumflex /Otilde /Odieresis
/multiply /Oslash /Ugrave /Uacute /Ucircumflex
/Udieresis /Yacute /Thorn /germandbls /agrave
/aacute /acircumflex /atilde /adieresis /aring
/ae /ccedilla /egrave /eacute /ecircumflex
/edieresis /igrave /iacute /icircumflex /idieresis
/eth /ntilde /ograve /oacute /ocircumflex
/otilde /odieresis /divide /oslash /ugrave
/uacute /ucircumflex /udieresis /yacute /thorn
/ydieresis
] def
%%EndResource
%FOPBeginFontReencode
/Courier-Oblique findfont
dup length dict begin
  {1 index /FID ne {def} {pop pop} ifelse} forall
  /Encoding WinAnsiEncoding def
  currentdict
end
/Courier-Oblique exch definefont pop
/Courier-BoldOblique findfont
dup length dict begin
  {1 index /FID ne {def} {pop pop} ifelse} forall
  /Encoding WinAnsiEncoding def
  currentdict
end
/Courier-BoldOblique exch definefont pop
/Courier-Bold findfont
dup length dict begin
  {1 index /FID ne {def} {pop pop} ifelse} forall
  /Encoding WinAnsiEncoding def
  currentdict
end
/Courier-Bold exch definefont pop
/Helvetica findfont
dup length dict begin
  {1 index /FID ne {def} {pop pop} ifelse} forall
  /Encoding WinAnsiEncoding def
  currentdict
end
/Helvetica exch definefont pop
/Helvetica-Oblique findfont
dup length dict begin
  {1 index /FID ne {def} {pop pop} ifelse} forall
  /Encoding WinAnsiEncoding def
  currentdict
end
/Helvetica-Oblique exch definefont pop
/Helvetica-Bold findfont
dup length dict begin
  {1 index /FID ne {def} {pop pop} ifelse} forall
  /Encoding WinAnsiEncoding def
  currentdict
end
/Helvetica-Bold exch definefont pop
/Helvetica-BoldOblique findfont
dup length dict begin
  {1 index /FID ne {def} {pop pop} ifelse} forall
  /Encoding WinAnsiEncoding def
  currentdict
end
/Helvetica-BoldOblique exch definefont pop
/Times-Roman findfont
dup length dict begin
  {1 index /FID ne {def} {pop pop} ifelse} forall
  /Encoding WinAnsiEncoding def
  currentdict
end
/Times-Roman exch definefont pop
/Times-Italic findfont
dup length dict begin
  {1 index /FID ne {def} {pop pop} ifelse} forall
  /Encoding WinAnsiEncoding def
  currentdict
end
/Times-Italic exch definefont pop
/Times-Bold findfont
dup length dict begin
  {1 index /FID ne {def} {pop pop} ifelse} forall
  /Encoding WinAnsiEncoding def
  currentdict
end
/Times-Bold exch definefont pop
/Times-BoldItalic findfont
dup length dict begin
  {1 index /FID ne {def} {pop pop} ifelse} forall
  /Encoding WinAnsiEncoding def
  currentdict
end
/Times-BoldItalic exch definefont pop
/Courier findfont
dup length dict begin
  {1 index /FID ne {def} {pop pop} ifelse} forall
  /Encoding WinAnsiEncoding def
  currentdict
end
/Courier exch definefont pop
%FOPEndFontReencode
%%EndProlog
%%Page: 1 1
%%PageBoundingBox: 0 0 592 361
%%BeginPageSetup
[1 0 0 -1 0 361] CT
%%EndPageSetup
GS
[0.75 0 0 0.75 0 0.25] CT
1 GC
N
0 0 789 481 re
f
GR
GS
[0.75 0 0 0.75 0 0.25] CT
1 GC
N
0 0 789 481 re
f
GR
GS
[0.75 0 0 0.75 436.50041 46.8625] CT
/Helvetica-Bold 20.533 F
GS
[1 0 0 1 0 0] CT
-111 -5 moveto 
1 -1 scale
(ENU Profitability SM02) t 
GR
GR
GS
[0.75 0 0 0.75 0 0.25] CT
0.302 0.749 0.929 RC
N
467.259 226.693 M
469.556 233.189 L
472.256 239.528 L
475.347 245.686 L
478.817 251.638 L
482.653 257.361 L
486.84 262.833 L
572.063 193.283 L
572.063 83.283 L
565.176 83.499 L
558.316 84.146 L
551.511 85.22 L
544.786 86.719 L
538.168 88.636 L
531.683 90.963 L
525.356 93.692 L
519.213 96.811 L
513.277 100.309 L
507.571 104.172 L
502.119 108.384 L
496.941 112.93 L
492.058 117.79 L
487.488 122.947 L
483.251 128.38 L
479.362 134.067 L
475.836 139.987 L
472.688 146.116 L
469.93 152.43 L
467.573 158.904 L
465.626 165.513 L
464.096 172.231 L
462.99 179.032 L
462.311 185.888 L
462.064 192.774 L
462.248 199.661 L
462.862 206.524 L
463.906 213.334 L
465.373 220.066 L
cp
f
GR
GS
[0.75 0 0 0.75 0 0.25] CT
0.094 0.749 0.71 RC
N
516.469 286.35 M
522.072 290.242 L
527.906 293.78 L
533.947 296.949 L
540.174 299.738 L
546.562 302.135 L
553.085 304.132 L
559.72 305.72 L
566.441 306.894 L
573.222 307.649 L
580.036 307.982 L
586.858 307.893 L
593.661 307.38 L
600.42 306.447 L
607.107 305.096 L
613.698 303.334 L
620.167 301.166 L
626.49 298.602 L
632.641 295.65 L
638.597 292.323 L
644.335 288.633 L
649.834 284.594 L
655.072 280.222 L
660.029 275.534 L
664.685 270.548 L
669.023 265.282 L
673.027 259.758 L
676.681 253.996 L
679.97 248.019 L
682.882 241.849 L
685.407 235.511 L
687.533 229.028 L
689.254 222.426 L
690.562 215.73 L
691.452 208.966 L
691.921 202.16 L
691.968 195.337 L
691.591 188.525 L
690.793 181.75 L
689.576 175.036 L
687.946 168.412 L
685.908 161.901 L
683.47 155.528 L
680.642 149.32 L
677.434 143.298 L
673.86 137.487 L
669.932 131.909 L
665.665 126.585 L
661.077 121.535 L
656.185 116.78 L
651.007 112.338 L
645.564 108.224 L
639.876 104.457 L
633.966 101.049 L
627.855 98.014 L
582 198 L
496.778 267.55 L
501.253 272.699 L
506.039 277.561 L
511.118 282.117 L
cp
f
GR
GS
[0.75 0 0 0.75 0 0.25] CT
0 0.451 0.741 RC
N
582 88 M
582 198 L
627.855 98.014 L
621.631 95.387 L
615.257 93.148 L
608.757 91.304 L
602.157 89.863 L
595.48 88.829 L
588.753 88.207 L
cp
f
GR
GS
[0.75 0 0 0.75 408.25667 133.83014] CT
1 GC
/Helvetica-Bold 21.333 F
GS
[1 0 0 1 0 0] CT
-43 -5 moveto 
1 -1 scale
(36%) t 
GR
GR
GS
[0.75 0 0 0.75 457.02122 158.96315] CT
1 GC
/Helvetica-Bold 21.333 F
GS
[1 0 0 1 0 0] CT
0 22 moveto 
1 -1 scale
(57%) t 
GR
GR
GS
[0.75 0 0 0.75 452.10246 94.14263] CT
1 GC
/Helvetica-Bold 21.333 F
GS
[1 0 0 1 0 0] CT
-15.5 -5 moveto 
1 -1 scale
(7%) t 
GR
GR
GS
[0.75 0 0 0.75 0 0.25] CT
1 GC
N
537 443 M
537 330 L
258 330 L
258 443 L
cp
f
GR
GS
[0.75 0 0 0.75 228.76957 263.24445] CT
N
3.094 7.433 M
3.125 7.214 3.359 7.214 QT
3.375 7.214 3.711 7.402 QT
4.047 7.589 4.461 7.738 QT
4.875 7.886 5.281 7.886 QT
5.625 7.886 5.867 7.581 QT
6.109 7.277 6.109 6.933 QT
6.109 6.433 5.578 6.23 QT
2.359 4.964 L
1.516 4.652 0.977 4.003 QT
0.438 3.355 0.438 2.542 QT
0.438 1.808 0.828 1.011 QT
1.219 0.214 1.828 -0.426 QT
2.438 -1.067 3.141 -1.473 QT
2.578 -1.801 2.266 -2.325 QT
1.953 -2.848 1.953 -3.473 QT
1.953 -4.145 2.227 -4.723 QT
2.5 -5.301 2.977 -5.77 QT
3.453 -6.239 4.039 -6.575 QT
4.625 -6.911 5.219 -7.067 QT
5.125 -7.458 5.125 -7.77 QT
5.125 -8.801 5.531 -8.801 QT
5.625 -8.801 5.703 -8.731 QT
5.781 -8.661 5.781 -8.551 QT
5.781 -8.458 5.727 -8.145 QT
5.672 -7.833 5.672 -7.754 QT
5.672 -7.426 5.766 -7.176 QT
6.25 -7.286 6.703 -7.286 QT
8.453 -7.286 8.453 -6.739 QT
8.453 -6.098 6.516 -6.098 QT
5.922 -6.098 5.547 -6.504 QT
5 -6.223 4.539 -5.715 QT
4.078 -5.208 3.813 -4.583 QT
3.547 -3.958 3.547 -3.317 QT
3.547 -2.426 4.063 -1.879 QT
4.734 -2.114 5.422 -2.114 QT
7.156 -2.114 7.156 -1.583 QT
7.156 -0.942 5.219 -0.942 QT
4.438 -0.942 3.734 -1.176 QT
2.891 -0.723 2.188 0.206 QT
1.484 1.136 1.484 1.996 QT
1.484 2.542 1.891 2.972 QT
2.297 3.402 2.891 3.652 QT
6.25 4.949 L
6.688 5.121 6.961 5.488 QT
7.234 5.855 7.234 6.324 QT
7.234 7.105 6.641 7.738 QT
6.047 8.371 5.266 8.371 QT
5.016 8.371 4.469 8.246 QT
3.922 8.121 3.508 7.902 QT
3.094 7.683 3.094 7.433 QT
cp
4.641 -1.52 M
4.891 -1.426 5.266 -1.426 QT
6.172 -1.426 6.578 -1.536 QT
6.219 -1.614 5.406 -1.614 QT
5.078 -1.614 4.641 -1.52 QT
cp
6.094 -6.708 M
6.266 -6.598 6.563 -6.598 QT
7.469 -6.598 7.875 -6.708 QT
6.094 -6.708 L
cp
f
GR
GS
[0.75 0 0 0.75 228.76957 263.24445] CT
N
10.057 4.467 M
10.057 5.249 10.362 5.842 QT
10.667 6.436 11.245 6.772 QT
11.823 7.108 12.604 7.108 QT
13.417 7.108 14.175 6.686 QT
14.932 6.264 15.471 5.569 QT
16.01 4.874 16.198 4.077 QT
16.229 3.999 16.307 3.999 QT
16.464 3.999 L
16.51 3.999 16.542 4.038 QT
16.573 4.077 16.573 4.124 QT
16.573 4.124 16.557 4.155 QT
16.339 5.061 15.706 5.85 QT
15.073 6.639 14.182 7.1 QT
13.292 7.561 12.354 7.561 QT
11.339 7.561 10.534 7.108 QT
9.729 6.655 9.276 5.842 QT
8.823 5.03 8.823 3.999 QT
8.823 2.905 9.315 1.842 QT
9.807 0.78 10.628 -0.056 QT
11.448 -0.892 12.51 -1.392 QT
13.573 -1.892 14.651 -1.892 QT
15.089 -1.892 15.479 -1.759 QT
15.87 -1.626 16.206 -1.361 QT
16.542 -1.095 16.76 -0.751 QT
17.792 -1.861 L
17.792 -1.892 17.854 -1.892 QT
17.932 -1.892 L
17.979 -1.892 18.01 -1.845 QT
18.042 -1.798 18.042 -1.751 QT
17.167 1.764 L
17.167 1.842 17.057 1.842 QT
16.823 1.842 L
16.729 1.842 16.729 1.702 QT
16.776 1.421 16.776 1.014 QT
16.776 0.374 16.557 -0.189 QT
16.339 -0.751 15.885 -1.087 QT
15.432 -1.423 14.776 -1.423 QT
13.714 -1.423 12.839 -0.892 QT
11.964 -0.361 11.346 0.506 QT
10.729 1.374 10.393 2.428 QT
10.057 3.483 10.057 4.467 QT
cp
f
GR
GS
[0.75 0 0 0.75 228.76957 263.24445] CT
N
19.081 7.28 M
18.956 7.28 18.956 7.108 QT
18.956 7.077 18.972 6.999 QT
18.987 6.921 19.026 6.874 QT
19.065 6.827 19.112 6.827 QT
19.909 6.827 20.222 6.733 QT
20.393 6.671 20.472 6.389 QT
22.253 -0.751 L
22.268 -0.876 22.268 -0.939 QT
22.268 -1.079 22.128 -1.095 QT
21.878 -1.142 21.19 -1.142 QT
21.05 -1.142 21.05 -1.314 QT
21.065 -1.345 21.081 -1.423 QT
21.097 -1.501 21.136 -1.548 QT
21.175 -1.595 21.222 -1.595 QT
25.706 -1.595 L
26.331 -1.595 26.909 -1.376 QT
27.487 -1.158 27.854 -0.712 QT
28.222 -0.267 28.222 0.374 QT
28.222 1.202 27.636 1.85 QT
27.05 2.499 26.183 2.858 QT
25.315 3.217 24.503 3.217 QT
22.393 3.217 L
21.597 6.436 L
21.581 6.561 21.581 6.624 QT
21.581 6.671 21.597 6.702 QT
21.612 6.733 21.636 6.749 QT
21.659 6.764 21.722 6.764 QT
21.972 6.827 22.675 6.827 QT
22.8 6.827 22.8 6.999 QT
22.753 7.171 22.729 7.225 QT
22.706 7.28 22.565 7.28 QT
19.081 7.28 L
cp
22.456 2.842 M
24.284 2.842 L
25.55 2.842 26.206 2.155 QT
26.534 1.827 26.753 1.186 QT
26.972 0.546 26.972 0.03 QT
26.972 -0.611 26.479 -0.876 QT
25.987 -1.142 25.268 -1.142 QT
24.018 -1.142 L
23.659 -1.142 23.55 -1.079 QT
23.44 -1.017 23.347 -0.704 QT
22.456 2.842 L
cp
f
GR
GS
[0.75 0 0 0.75 228.76957 263.24445] CT
N
36.341 4.855 M
36.341 4.621 36.591 4.496 QT
46.669 -0.27 L
36.528 -5.083 L
36.341 -5.129 36.341 -5.395 QT
36.341 -5.536 36.45 -5.661 QT
36.559 -5.786 36.716 -5.786 QT
36.763 -5.786 36.872 -5.739 QT
47.778 -0.598 L
47.95 -0.504 47.95 -0.27 QT
47.95 -0.02 47.716 0.074 QT
36.872 5.199 L
36.763 5.246 36.716 5.246 QT
36.559 5.246 36.45 5.121 QT
36.341 4.996 36.341 4.855 QT
cp
f
GR
GS
[0.75 0 0 0.75 228.76957 263.24445] CT
N
57.56 7.433 M
57.591 7.214 57.826 7.214 QT
57.841 7.214 58.177 7.402 QT
58.513 7.589 58.927 7.738 QT
59.341 7.886 59.747 7.886 QT
60.091 7.886 60.333 7.581 QT
60.576 7.277 60.576 6.933 QT
60.576 6.433 60.044 6.23 QT
56.826 4.964 L
55.982 4.652 55.443 4.003 QT
54.904 3.355 54.904 2.542 QT
54.904 1.808 55.294 1.011 QT
55.685 0.214 56.294 -0.426 QT
56.904 -1.067 57.607 -1.473 QT
57.044 -1.801 56.732 -2.325 QT
56.419 -2.848 56.419 -3.473 QT
56.419 -4.145 56.693 -4.723 QT
56.966 -5.301 57.443 -5.77 QT
57.919 -6.239 58.505 -6.575 QT
59.091 -6.911 59.685 -7.067 QT
59.591 -7.458 59.591 -7.77 QT
59.591 -8.801 59.997 -8.801 QT
60.091 -8.801 60.169 -8.731 QT
60.247 -8.661 60.247 -8.551 QT
60.247 -8.458 60.193 -8.145 QT
60.138 -7.833 60.138 -7.754 QT
60.138 -7.426 60.232 -7.176 QT
60.716 -7.286 61.169 -7.286 QT
62.919 -7.286 62.919 -6.739 QT
62.919 -6.098 60.982 -6.098 QT
60.388 -6.098 60.013 -6.504 QT
59.466 -6.223 59.005 -5.715 QT
58.544 -5.208 58.279 -4.583 QT
58.013 -3.958 58.013 -3.317 QT
58.013 -2.426 58.529 -1.879 QT
59.201 -2.114 59.888 -2.114 QT
61.622 -2.114 61.622 -1.583 QT
61.622 -0.942 59.685 -0.942 QT
58.904 -0.942 58.201 -1.176 QT
57.357 -0.723 56.654 0.206 QT
55.951 1.136 55.951 1.996 QT
55.951 2.542 56.357 2.972 QT
56.763 3.402 57.357 3.652 QT
60.716 4.949 L
61.154 5.121 61.427 5.488 QT
61.701 5.855 61.701 6.324 QT
61.701 7.105 61.107 7.738 QT
60.513 8.371 59.732 8.371 QT
59.482 8.371 58.935 8.246 QT
58.388 8.121 57.974 7.902 QT
57.56 7.683 57.56 7.433 QT
cp
59.107 -1.52 M
59.357 -1.426 59.732 -1.426 QT
60.638 -1.426 61.044 -1.536 QT
60.685 -1.614 59.872 -1.614 QT
59.544 -1.614 59.107 -1.52 QT
cp
60.56 -6.708 M
60.732 -6.598 61.029 -6.598 QT
61.935 -6.598 62.341 -6.708 QT
60.56 -6.708 L
cp
f
GR
GS
[0.75 0 0 0.75 228.76957 263.24445] CT
N
63.43 7.561 M
63.383 7.561 63.352 7.522 QT
63.32 7.483 63.32 7.436 QT
64.07 4.405 L
64.102 4.327 64.18 4.327 QT
64.336 4.327 L
64.383 4.327 64.414 4.366 QT
64.445 4.405 64.445 4.467 QT
64.336 4.905 64.336 5.249 QT
64.336 6.202 64.984 6.655 QT
65.633 7.108 66.617 7.108 QT
67.039 7.108 67.453 6.897 QT
67.867 6.686 68.172 6.35 QT
68.477 6.014 68.664 5.6 QT
68.852 5.186 68.852 4.764 QT
68.852 4.296 68.609 3.944 QT
68.367 3.592 67.945 3.483 QT
66.352 3.061 L
65.711 2.889 65.328 2.374 QT
64.945 1.858 64.945 1.217 QT
64.945 0.436 65.414 -0.29 QT
65.883 -1.017 66.625 -1.454 QT
67.367 -1.892 68.148 -1.892 QT
68.742 -1.892 69.242 -1.673 QT
69.742 -1.454 70.008 -0.97 QT
70.742 -1.845 L
70.82 -1.892 70.836 -1.892 QT
70.914 -1.892 L
70.961 -1.892 70.992 -1.845 QT
71.023 -1.798 71.023 -1.751 QT
70.273 1.264 L
70.258 1.358 70.18 1.358 QT
70.008 1.358 L
69.898 1.358 69.898 1.217 QT
69.961 0.796 69.961 0.499 QT
69.961 -0.111 69.758 -0.556 QT
69.555 -1.001 69.141 -1.236 QT
68.727 -1.47 68.102 -1.47 QT
67.586 -1.47 67.07 -1.173 QT
66.555 -0.876 66.234 -0.376 QT
65.914 0.124 65.914 0.655 QT
65.914 1.077 66.164 1.397 QT
66.414 1.717 66.82 1.827 QT
68.398 2.249 L
68.836 2.358 69.156 2.647 QT
69.477 2.936 69.641 3.335 QT
69.805 3.733 69.805 4.202 QT
69.805 4.811 69.547 5.413 QT
69.289 6.014 68.82 6.514 QT
68.352 7.014 67.758 7.288 QT
67.164 7.561 66.555 7.561 QT
65.008 7.561 64.336 6.655 QT
63.617 7.53 L
63.539 7.561 63.508 7.561 QT
63.43 7.561 L
cp
f
GR
GS
[0.75 0 0 0.75 228.76957 263.24445] CT
N
71.977 7.28 M
71.852 7.28 71.852 7.108 QT
71.914 6.827 72.023 6.827 QT
72.555 6.827 72.937 6.616 QT
73.32 6.405 73.602 5.967 QT
73.617 5.936 73.617 5.936 QT
78.258 -1.892 L
78.367 -2.033 78.508 -2.033 QT
78.68 -2.033 L
78.711 -2.033 78.75 -2.017 QT
78.789 -2.001 78.82 -1.962 QT
78.852 -1.923 78.852 -1.892 QT
79.633 6.514 L
79.633 6.561 79.695 6.686 QT
79.82 6.827 80.664 6.827 QT
80.805 6.827 80.805 6.999 QT
80.758 7.171 80.727 7.225 QT
80.695 7.28 80.57 7.28 QT
77.32 7.28 L
77.211 7.28 77.211 7.108 QT
77.273 6.827 77.383 6.827 QT
78.414 6.827 78.477 6.467 QT
78.273 4.327 L
75.07 4.327 L
74.023 6.077 L
73.93 6.217 73.93 6.405 QT
73.93 6.624 74.148 6.725 QT
74.367 6.827 74.633 6.827 QT
74.758 6.827 74.758 6.999 QT
74.711 7.171 74.687 7.225 QT
74.664 7.28 74.555 7.28 QT
71.977 7.28 L
cp
75.32 3.874 M
78.227 3.874 L
77.836 -0.345 L
75.32 3.874 L
cp
f
GR
GS
[0.75 0 0 0.75 228.76957 263.24445] CT
N
87.702 0.105 M
87.545 0.105 87.444 -0.012 QT
87.342 -0.129 87.342 -0.27 QT
87.342 -0.411 87.444 -0.528 QT
87.545 -0.645 87.702 -0.645 QT
93.295 -0.645 L
93.295 -6.254 L
93.295 -6.395 93.405 -6.497 QT
93.514 -6.598 93.67 -6.598 QT
93.811 -6.598 93.936 -6.497 QT
94.061 -6.395 94.061 -6.254 QT
94.061 -0.645 L
99.639 -0.645 L
99.78 -0.645 99.881 -0.528 QT
99.983 -0.411 99.983 -0.27 QT
99.983 -0.129 99.881 -0.012 QT
99.78 0.105 99.639 0.105 QT
94.061 0.105 L
94.061 5.714 L
94.061 5.855 93.936 5.956 QT
93.811 6.058 93.67 6.058 QT
93.514 6.058 93.405 5.956 QT
93.295 5.855 93.295 5.714 QT
93.295 0.105 L
87.702 0.105 L
cp
f
GR
GS
[0.75 0 0 0.75 228.76957 263.24445] CT
N
105.821 4.23 M
105.821 4.183 105.86 4.066 QT
105.899 3.949 105.946 3.878 QT
105.993 3.808 106.087 3.808 QT
107.728 3.808 108.243 3.714 QT
108.759 3.589 108.868 3.167 QT
111.462 -7.27 L
111.54 -7.504 111.54 -7.676 QT
111.54 -7.833 110.868 -7.833 QT
109.774 -7.833 L
108.493 -7.833 107.806 -7.442 QT
107.118 -7.051 106.79 -6.411 QT
106.462 -5.77 105.962 -4.317 QT
105.899 -4.145 105.759 -4.145 QT
105.603 -4.145 L
105.399 -4.145 105.399 -4.395 QT
106.759 -8.317 L
106.79 -8.504 106.946 -8.504 QT
118.165 -8.504 L
118.368 -8.504 118.368 -8.254 QT
117.728 -4.317 L
117.728 -4.254 117.665 -4.2 QT
117.603 -4.145 117.54 -4.145 QT
117.368 -4.145 L
117.181 -4.145 117.181 -4.395 QT
117.384 -5.739 117.384 -6.286 QT
117.384 -6.958 117.11 -7.301 QT
116.837 -7.645 116.392 -7.739 QT
115.946 -7.833 115.228 -7.833 QT
114.103 -7.833 L
113.587 -7.833 113.415 -7.739 QT
113.243 -7.645 113.118 -7.176 QT
110.509 3.246 L
110.509 3.277 110.501 3.316 QT
110.493 3.355 110.478 3.417 QT
110.478 3.652 110.759 3.714 QT
111.259 3.808 112.868 3.808 QT
113.056 3.808 113.056 4.058 QT
112.993 4.324 112.954 4.402 QT
112.915 4.48 112.743 4.48 QT
106.009 4.48 L
105.821 4.48 105.821 4.23 QT
cp
f
GR
GS
[0.75 0 0 0.75 228.76957 263.24445] CT
N
116.464 7.28 M
116.339 7.28 116.339 7.108 QT
116.339 7.077 116.363 6.999 QT
116.386 6.921 116.417 6.874 QT
116.448 6.827 116.495 6.827 QT
117.292 6.827 117.605 6.733 QT
117.777 6.671 117.855 6.389 QT
119.636 -0.751 L
119.667 -0.876 119.667 -0.939 QT
119.667 -1.079 119.511 -1.095 QT
119.261 -1.142 118.573 -1.142 QT
118.448 -1.142 118.448 -1.314 QT
118.495 -1.486 118.519 -1.54 QT
118.542 -1.595 118.667 -1.595 QT
122.152 -1.595 L
122.292 -1.595 122.292 -1.423 QT
122.292 -1.392 122.269 -1.322 QT
122.245 -1.251 122.214 -1.197 QT
122.183 -1.142 122.12 -1.142 QT
121.323 -1.142 121.011 -1.048 QT
120.839 -0.986 120.761 -0.704 QT
119.98 2.436 L
123.886 2.436 L
124.683 -0.751 L
124.714 -0.876 124.714 -0.939 QT
124.714 -1.079 124.558 -1.095 QT
124.308 -1.142 123.62 -1.142 QT
123.48 -1.142 123.48 -1.314 QT
123.527 -1.486 123.55 -1.54 QT
123.573 -1.595 123.714 -1.595 QT
127.198 -1.595 L
127.339 -1.595 127.339 -1.423 QT
127.323 -1.392 127.308 -1.314 QT
127.292 -1.236 127.253 -1.189 QT
127.214 -1.142 127.167 -1.142 QT
126.37 -1.142 126.058 -1.048 QT
125.886 -1.001 125.808 -0.704 QT
124.027 6.436 L
124.011 6.561 124.011 6.624 QT
124.011 6.749 124.167 6.764 QT
124.417 6.827 125.105 6.827 QT
125.23 6.827 125.23 6.999 QT
125.198 7.139 125.159 7.21 QT
125.12 7.28 125.011 7.28 QT
121.511 7.28 L
121.37 7.28 121.37 7.108 QT
121.402 7.014 121.417 6.967 QT
121.433 6.921 121.464 6.874 QT
121.495 6.827 121.542 6.827 QT
122.339 6.827 122.652 6.733 QT
122.823 6.671 122.902 6.389 QT
123.777 2.889 L
119.87 2.889 L
118.995 6.436 L
118.964 6.592 118.964 6.624 QT
118.964 6.749 119.12 6.764 QT
119.37 6.827 120.058 6.827 QT
120.183 6.827 120.183 6.999 QT
120.136 7.171 120.113 7.225 QT
120.089 7.28 119.964 7.28 QT
116.464 7.28 L
cp
f
GR
GS
[0.75 0 0 0.75 0 0.25] CT
0.302 0.749 0.929 RC
N
302.024 363.806 M
302.024 337.512 L
262.002 337.512 L
262.002 363.806 L
cp
f
GR
GS
[0.75 0 0 0.75 228.76957 290.125] CT
N
/f22378643{3.094 7.433 M
3.125 7.214 3.359 7.214 QT
3.375 7.214 3.711 7.402 QT
4.047 7.589 4.461 7.738 QT
4.875 7.886 5.281 7.886 QT
5.625 7.886 5.867 7.581 QT
6.109 7.277 6.109 6.933 QT
6.109 6.433 5.578 6.23 QT
2.359 4.964 L
1.516 4.652 0.977 4.003 QT
0.438 3.355 0.438 2.542 QT
0.438 1.808 0.828 1.011 QT
1.219 0.214 1.828 -0.426 QT
2.438 -1.067 3.141 -1.473 QT
2.578 -1.801 2.266 -2.325 QT
1.953 -2.848 1.953 -3.473 QT
1.953 -4.145 2.227 -4.723 QT
2.5 -5.301 2.977 -5.77 QT
3.453 -6.239 4.039 -6.575 QT
4.625 -6.911 5.219 -7.067 QT
5.125 -7.458 5.125 -7.77 QT
5.125 -8.801 5.531 -8.801 QT
5.625 -8.801 5.703 -8.731 QT
5.781 -8.661 5.781 -8.551 QT
5.781 -8.458 5.727 -8.145 QT
5.672 -7.833 5.672 -7.754 QT
5.672 -7.426 5.766 -7.176 QT
6.25 -7.286 6.703 -7.286 QT
8.453 -7.286 8.453 -6.739 QT
8.453 -6.098 6.516 -6.098 QT
5.922 -6.098 5.547 -6.504 QT
5 -6.223 4.539 -5.715 QT
4.078 -5.208 3.813 -4.583 QT
3.547 -3.958 3.547 -3.317 QT
3.547 -2.426 4.063 -1.879 QT
4.734 -2.114 5.422 -2.114 QT
7.156 -2.114 7.156 -1.583 QT
7.156 -0.942 5.219 -0.942 QT
4.438 -0.942 3.734 -1.176 QT
2.891 -0.723 2.188 0.206 QT
1.484 1.136 1.484 1.996 QT
1.484 2.542 1.891 2.972 QT
2.297 3.402 2.891 3.652 QT
6.25 4.949 L
6.688 5.121 6.961 5.488 QT
7.234 5.855 7.234 6.324 QT
7.234 7.105 6.641 7.738 QT
6.047 8.371 5.266 8.371 QT
5.016 8.371 4.469 8.246 QT
3.922 8.121 3.508 7.902 QT
3.094 7.683 3.094 7.433 QT
cp
4.641 -1.52 M
4.891 -1.426 5.266 -1.426 QT
6.172 -1.426 6.578 -1.536 QT
6.219 -1.614 5.406 -1.614 QT
5.078 -1.614 4.641 -1.52 QT
cp
6.094 -6.708 M
6.266 -6.598 6.563 -6.598 QT
7.469 -6.598 7.875 -6.708 QT
6.094 -6.708 L
cp}def
f22378643
f
GR
GS
[0.75 0 0 0.75 228.76957 290.125] CT
N
/f1137627489{8.964 7.561 M
8.917 7.561 8.885 7.522 QT
8.854 7.483 8.854 7.436 QT
9.604 4.405 L
9.635 4.327 9.714 4.327 QT
9.87 4.327 L
9.917 4.327 9.948 4.366 QT
9.979 4.405 9.979 4.467 QT
9.87 4.905 9.87 5.249 QT
9.87 6.202 10.518 6.655 QT
11.167 7.108 12.151 7.108 QT
12.573 7.108 12.987 6.897 QT
13.401 6.686 13.706 6.35 QT
14.01 6.014 14.198 5.6 QT
14.385 5.186 14.385 4.764 QT
14.385 4.296 14.143 3.944 QT
13.901 3.592 13.479 3.483 QT
11.885 3.061 L
11.245 2.889 10.862 2.374 QT
10.479 1.858 10.479 1.217 QT
10.479 0.436 10.948 -0.29 QT
11.417 -1.017 12.159 -1.454 QT
12.901 -1.892 13.682 -1.892 QT
14.276 -1.892 14.776 -1.673 QT
15.276 -1.454 15.542 -0.97 QT
16.276 -1.845 L
16.354 -1.892 16.37 -1.892 QT
16.448 -1.892 L
16.495 -1.892 16.526 -1.845 QT
16.557 -1.798 16.557 -1.751 QT
15.807 1.264 L
15.792 1.358 15.714 1.358 QT
15.542 1.358 L
15.432 1.358 15.432 1.217 QT
15.495 0.796 15.495 0.499 QT
15.495 -0.111 15.292 -0.556 QT
15.089 -1.001 14.675 -1.236 QT
14.26 -1.47 13.635 -1.47 QT
13.12 -1.47 12.604 -1.173 QT
12.089 -0.876 11.768 -0.376 QT
11.448 0.124 11.448 0.655 QT
11.448 1.077 11.698 1.397 QT
11.948 1.717 12.354 1.827 QT
13.932 2.249 L
14.37 2.358 14.69 2.647 QT
15.01 2.936 15.175 3.335 QT
15.339 3.733 15.339 4.202 QT
15.339 4.811 15.081 5.413 QT
14.823 6.014 14.354 6.514 QT
13.885 7.014 13.292 7.288 QT
12.698 7.561 12.089 7.561 QT
10.542 7.561 9.87 6.655 QT
9.151 7.53 L
9.073 7.561 9.042 7.561 QT
8.964 7.561 L
cp}def
f1137627489
f
GR
GS
[0.75 0 0 0.75 228.76957 290.125] CT
N
/f789388096{17.51 7.28 M
17.385 7.28 17.385 7.108 QT
17.448 6.827 17.557 6.827 QT
18.088 6.827 18.471 6.616 QT
18.854 6.405 19.135 5.967 QT
19.151 5.936 19.151 5.936 QT
23.792 -1.892 L
23.901 -2.033 24.042 -2.033 QT
24.213 -2.033 L
24.245 -2.033 24.284 -2.017 QT
24.323 -2.001 24.354 -1.962 QT
24.385 -1.923 24.385 -1.892 QT
25.167 6.514 L
25.167 6.561 25.229 6.686 QT
25.354 6.827 26.198 6.827 QT
26.338 6.827 26.338 6.999 QT
26.292 7.171 26.26 7.225 QT
26.229 7.28 26.104 7.28 QT
22.854 7.28 L
22.745 7.28 22.745 7.108 QT
22.807 6.827 22.917 6.827 QT
23.948 6.827 24.01 6.467 QT
23.807 4.327 L
20.604 4.327 L
19.557 6.077 L
19.463 6.217 19.463 6.405 QT
19.463 6.624 19.682 6.725 QT
19.901 6.827 20.167 6.827 QT
20.292 6.827 20.292 6.999 QT
20.245 7.171 20.221 7.225 QT
20.198 7.28 20.088 7.28 QT
17.51 7.28 L
cp
20.854 3.874 M
23.76 3.874 L
23.37 -0.345 L
20.854 3.874 L
cp}def
f789388096
f
GR
GS
[0.75 0 0 0.75 228.76957 290.125] CT
N
/f-1780779191{33.751 0.105 M
33.595 0.105 33.493 -0.012 QT
33.392 -0.129 33.392 -0.27 QT
33.392 -0.411 33.493 -0.528 QT
33.595 -0.645 33.751 -0.645 QT
44.657 -0.645 L
44.798 -0.645 44.9 -0.528 QT
45.001 -0.411 45.001 -0.27 QT
45.001 -0.129 44.9 -0.012 QT
44.798 0.105 44.657 0.105 QT
33.751 0.105 L
cp}def
f-1780779191
f
GR
GS
[0.75 0 0 0.75 228.76957 290.125] CT
N
/f1709134632{51.355 4.23 M
51.355 4.183 51.394 4.066 QT
51.433 3.949 51.48 3.878 QT
51.527 3.808 51.621 3.808 QT
53.261 3.808 53.777 3.714 QT
54.293 3.589 54.402 3.167 QT
56.996 -7.27 L
57.074 -7.504 57.074 -7.676 QT
57.074 -7.833 56.402 -7.833 QT
55.308 -7.833 L
54.027 -7.833 53.34 -7.442 QT
52.652 -7.051 52.324 -6.411 QT
51.996 -5.77 51.496 -4.317 QT
51.433 -4.145 51.293 -4.145 QT
51.136 -4.145 L
50.933 -4.145 50.933 -4.395 QT
52.293 -8.317 L
52.324 -8.504 52.48 -8.504 QT
63.699 -8.504 L
63.902 -8.504 63.902 -8.254 QT
63.261 -4.317 L
63.261 -4.254 63.199 -4.2 QT
63.136 -4.145 63.074 -4.145 QT
62.902 -4.145 L
62.715 -4.145 62.715 -4.395 QT
62.918 -5.739 62.918 -6.286 QT
62.918 -6.958 62.644 -7.301 QT
62.371 -7.645 61.926 -7.739 QT
61.48 -7.833 60.761 -7.833 QT
59.636 -7.833 L
59.121 -7.833 58.949 -7.739 QT
58.777 -7.645 58.652 -7.176 QT
56.043 3.246 L
56.043 3.277 56.035 3.316 QT
56.027 3.355 56.011 3.417 QT
56.011 3.652 56.293 3.714 QT
56.793 3.808 58.402 3.808 QT
58.59 3.808 58.59 4.058 QT
58.527 4.324 58.488 4.402 QT
58.449 4.48 58.277 4.48 QT
51.543 4.48 L
51.355 4.48 51.355 4.23 QT
cp}def
f1709134632
f
GR
GS
[0.75 0 0 0.75 228.76957 290.125] CT
N
/f-1624309327{61.998 7.28 M
61.873 7.28 61.873 7.108 QT
61.873 7.077 61.896 6.999 QT
61.92 6.921 61.951 6.874 QT
61.982 6.827 62.029 6.827 QT
62.826 6.827 63.139 6.733 QT
63.31 6.671 63.389 6.389 QT
65.17 -0.751 L
65.201 -0.876 65.201 -0.939 QT
65.201 -1.079 65.045 -1.095 QT
64.795 -1.142 64.107 -1.142 QT
63.982 -1.142 63.982 -1.314 QT
64.029 -1.486 64.053 -1.54 QT
64.076 -1.595 64.201 -1.595 QT
67.685 -1.595 L
67.826 -1.595 67.826 -1.423 QT
67.826 -1.392 67.803 -1.322 QT
67.779 -1.251 67.748 -1.197 QT
67.717 -1.142 67.654 -1.142 QT
66.857 -1.142 66.545 -1.048 QT
66.373 -0.986 66.295 -0.704 QT
65.514 2.436 L
69.42 2.436 L
70.217 -0.751 L
70.248 -0.876 70.248 -0.939 QT
70.248 -1.079 70.092 -1.095 QT
69.842 -1.142 69.154 -1.142 QT
69.014 -1.142 69.014 -1.314 QT
69.06 -1.486 69.084 -1.54 QT
69.107 -1.595 69.248 -1.595 QT
72.732 -1.595 L
72.873 -1.595 72.873 -1.423 QT
72.857 -1.392 72.842 -1.314 QT
72.826 -1.236 72.787 -1.189 QT
72.748 -1.142 72.701 -1.142 QT
71.904 -1.142 71.592 -1.048 QT
71.42 -1.001 71.342 -0.704 QT
69.56 6.436 L
69.545 6.561 69.545 6.624 QT
69.545 6.749 69.701 6.764 QT
69.951 6.827 70.639 6.827 QT
70.764 6.827 70.764 6.999 QT
70.732 7.139 70.693 7.21 QT
70.654 7.28 70.545 7.28 QT
67.045 7.28 L
66.904 7.28 66.904 7.108 QT
66.935 7.014 66.951 6.967 QT
66.967 6.921 66.998 6.874 QT
67.029 6.827 67.076 6.827 QT
67.873 6.827 68.185 6.733 QT
68.357 6.671 68.435 6.389 QT
69.31 2.889 L
65.404 2.889 L
64.529 6.436 L
64.498 6.592 64.498 6.624 QT
64.498 6.749 64.654 6.764 QT
64.904 6.827 65.592 6.827 QT
65.717 6.827 65.717 6.999 QT
65.67 7.171 65.646 7.225 QT
65.623 7.28 65.498 7.28 QT
61.998 7.28 L
cp}def
f-1624309327
f
GR
GS
[0.75 0 0 0.75 228.76957 290.125] CT
N
/f2134042891{81.196 0.058 M
81.008 -0.036 81.008 -0.27 QT
81.008 -0.504 81.258 -0.629 QT
92.102 -5.739 L
92.18 -5.786 92.227 -5.786 QT
92.399 -5.786 92.508 -5.669 QT
92.618 -5.551 92.618 -5.395 QT
92.618 -5.176 92.383 -5.036 QT
82.274 -0.27 L
92.446 4.542 L
92.618 4.589 92.618 4.855 QT
92.618 5.011 92.508 5.128 QT
92.399 5.246 92.227 5.246 QT
92.18 5.246 92.102 5.199 QT
81.196 0.058 L
cp}def
f2134042891
f
GR
GS
[0.75 0 0 0.75 228.76957 290.125] CT
N
/f-275753604{102.228 7.433 M
102.259 7.214 102.493 7.214 QT
102.509 7.214 102.845 7.402 QT
103.181 7.589 103.595 7.738 QT
104.009 7.886 104.415 7.886 QT
104.759 7.886 105.001 7.581 QT
105.243 7.277 105.243 6.933 QT
105.243 6.433 104.712 6.23 QT
101.493 4.964 L
100.649 4.652 100.11 4.003 QT
99.571 3.355 99.571 2.542 QT
99.571 1.808 99.962 1.011 QT
100.353 0.214 100.962 -0.426 QT
101.571 -1.067 102.274 -1.473 QT
101.712 -1.801 101.399 -2.325 QT
101.087 -2.848 101.087 -3.473 QT
101.087 -4.145 101.36 -4.723 QT
101.634 -5.301 102.11 -5.77 QT
102.587 -6.239 103.173 -6.575 QT
103.759 -6.911 104.353 -7.067 QT
104.259 -7.458 104.259 -7.77 QT
104.259 -8.801 104.665 -8.801 QT
104.759 -8.801 104.837 -8.731 QT
104.915 -8.661 104.915 -8.551 QT
104.915 -8.458 104.86 -8.145 QT
104.806 -7.833 104.806 -7.754 QT
104.806 -7.426 104.899 -7.176 QT
105.384 -7.286 105.837 -7.286 QT
107.587 -7.286 107.587 -6.739 QT
107.587 -6.098 105.649 -6.098 QT
105.056 -6.098 104.681 -6.504 QT
104.134 -6.223 103.673 -5.715 QT
103.212 -5.208 102.946 -4.583 QT
102.681 -3.958 102.681 -3.317 QT
102.681 -2.426 103.196 -1.879 QT
103.868 -2.114 104.556 -2.114 QT
106.29 -2.114 106.29 -1.583 QT
106.29 -0.942 104.353 -0.942 QT
103.571 -0.942 102.868 -1.176 QT
102.024 -0.723 101.321 0.206 QT
100.618 1.136 100.618 1.996 QT
100.618 2.542 101.024 2.972 QT
101.431 3.402 102.024 3.652 QT
105.384 4.949 L
105.821 5.121 106.095 5.488 QT
106.368 5.855 106.368 6.324 QT
106.368 7.105 105.774 7.738 QT
105.181 8.371 104.399 8.371 QT
104.149 8.371 103.603 8.246 QT
103.056 8.121 102.642 7.902 QT
102.228 7.683 102.228 7.433 QT
cp
103.774 -1.52 M
104.024 -1.426 104.399 -1.426 QT
105.306 -1.426 105.712 -1.536 QT
105.353 -1.614 104.54 -1.614 QT
104.212 -1.614 103.774 -1.52 QT
cp
105.228 -6.708 M
105.399 -6.598 105.696 -6.598 QT
106.603 -6.598 107.009 -6.708 QT
105.228 -6.708 L
cp}def
f-275753604
f
GR
GS
[0.75 0 0 0.75 228.76957 290.125] CT
N
/f356424937{109.191 4.467 M
109.191 5.249 109.496 5.842 QT
109.801 6.436 110.379 6.772 QT
110.957 7.108 111.738 7.108 QT
112.551 7.108 113.308 6.686 QT
114.066 6.264 114.605 5.569 QT
115.144 4.874 115.332 4.077 QT
115.363 3.999 115.441 3.999 QT
115.597 3.999 L
115.644 3.999 115.676 4.038 QT
115.707 4.077 115.707 4.124 QT
115.707 4.124 115.691 4.155 QT
115.472 5.061 114.84 5.85 QT
114.207 6.639 113.316 7.1 QT
112.426 7.561 111.488 7.561 QT
110.472 7.561 109.668 7.108 QT
108.863 6.655 108.41 5.842 QT
107.957 5.03 107.957 3.999 QT
107.957 2.905 108.449 1.842 QT
108.941 0.78 109.761 -0.056 QT
110.582 -0.892 111.644 -1.392 QT
112.707 -1.892 113.785 -1.892 QT
114.222 -1.892 114.613 -1.759 QT
115.004 -1.626 115.34 -1.361 QT
115.676 -1.095 115.894 -0.751 QT
116.926 -1.861 L
116.926 -1.892 116.988 -1.892 QT
117.066 -1.892 L
117.113 -1.892 117.144 -1.845 QT
117.176 -1.798 117.176 -1.751 QT
116.301 1.764 L
116.301 1.842 116.191 1.842 QT
115.957 1.842 L
115.863 1.842 115.863 1.702 QT
115.91 1.421 115.91 1.014 QT
115.91 0.374 115.691 -0.189 QT
115.472 -0.751 115.019 -1.087 QT
114.566 -1.423 113.91 -1.423 QT
112.847 -1.423 111.972 -0.892 QT
111.097 -0.361 110.48 0.506 QT
109.863 1.374 109.527 2.428 QT
109.191 3.483 109.191 4.467 QT
cp}def
f356424937
f
GR
GS
[0.75 0 0 0.75 228.76957 290.125] CT
N
/f496678195{118.215 7.28 M
118.09 7.28 118.09 7.108 QT
118.09 7.077 118.105 6.999 QT
118.121 6.921 118.16 6.874 QT
118.199 6.827 118.246 6.827 QT
119.043 6.827 119.355 6.733 QT
119.527 6.671 119.605 6.389 QT
121.387 -0.751 L
121.402 -0.876 121.402 -0.939 QT
121.402 -1.079 121.262 -1.095 QT
121.012 -1.142 120.324 -1.142 QT
120.184 -1.142 120.184 -1.314 QT
120.199 -1.345 120.215 -1.423 QT
120.23 -1.501 120.27 -1.548 QT
120.309 -1.595 120.355 -1.595 QT
124.84 -1.595 L
125.465 -1.595 126.043 -1.376 QT
126.621 -1.158 126.988 -0.712 QT
127.355 -0.267 127.355 0.374 QT
127.355 1.202 126.77 1.85 QT
126.184 2.499 125.316 2.858 QT
124.449 3.217 123.637 3.217 QT
121.527 3.217 L
120.73 6.436 L
120.715 6.561 120.715 6.624 QT
120.715 6.671 120.73 6.702 QT
120.746 6.733 120.77 6.749 QT
120.793 6.764 120.855 6.764 QT
121.105 6.827 121.809 6.827 QT
121.934 6.827 121.934 6.999 QT
121.887 7.171 121.863 7.225 QT
121.84 7.28 121.699 7.28 QT
118.215 7.28 L
cp
121.59 2.842 M
123.418 2.842 L
124.684 2.842 125.34 2.155 QT
125.668 1.827 125.887 1.186 QT
126.105 0.546 126.105 0.03 QT
126.105 -0.611 125.613 -0.876 QT
125.121 -1.142 124.402 -1.142 QT
123.152 -1.142 L
122.793 -1.142 122.684 -1.079 QT
122.574 -1.017 122.48 -0.704 QT
121.59 2.842 L
cp}def
f496678195
f
GR
GS
[0.75 0 0 0.75 228.76957 290.125] CT
N
/f1823885689{135.662 0.058 M
135.475 -0.036 135.475 -0.27 QT
135.475 -0.504 135.725 -0.629 QT
146.568 -5.739 L
146.646 -5.786 146.693 -5.786 QT
146.865 -5.786 146.975 -5.669 QT
147.084 -5.551 147.084 -5.395 QT
147.084 -5.176 146.85 -5.036 QT
136.74 -0.27 L
146.912 4.542 L
147.084 4.589 147.084 4.855 QT
147.084 5.011 146.975 5.128 QT
146.865 5.246 146.693 5.246 QT
146.646 5.246 146.568 5.199 QT
135.662 0.058 L
cp}def
f1823885689
f
GR
GS
[0.75 0 0 0.75 228.76957 290.125] CT
N
/f-354929822{156.694 7.433 M
156.725 7.214 156.959 7.214 QT
156.975 7.214 157.311 7.402 QT
157.647 7.589 158.061 7.738 QT
158.475 7.886 158.881 7.886 QT
159.225 7.886 159.467 7.581 QT
159.709 7.277 159.709 6.933 QT
159.709 6.433 159.178 6.23 QT
155.959 4.964 L
155.116 4.652 154.577 4.003 QT
154.038 3.355 154.038 2.542 QT
154.038 1.808 154.428 1.011 QT
154.819 0.214 155.428 -0.426 QT
156.038 -1.067 156.741 -1.473 QT
156.178 -1.801 155.866 -2.325 QT
155.553 -2.848 155.553 -3.473 QT
155.553 -4.145 155.827 -4.723 QT
156.1 -5.301 156.577 -5.77 QT
157.053 -6.239 157.639 -6.575 QT
158.225 -6.911 158.819 -7.067 QT
158.725 -7.458 158.725 -7.77 QT
158.725 -8.801 159.131 -8.801 QT
159.225 -8.801 159.303 -8.731 QT
159.381 -8.661 159.381 -8.551 QT
159.381 -8.458 159.327 -8.145 QT
159.272 -7.833 159.272 -7.754 QT
159.272 -7.426 159.366 -7.176 QT
159.85 -7.286 160.303 -7.286 QT
162.053 -7.286 162.053 -6.739 QT
162.053 -6.098 160.116 -6.098 QT
159.522 -6.098 159.147 -6.504 QT
158.6 -6.223 158.139 -5.715 QT
157.678 -5.208 157.413 -4.583 QT
157.147 -3.958 157.147 -3.317 QT
157.147 -2.426 157.663 -1.879 QT
158.334 -2.114 159.022 -2.114 QT
160.756 -2.114 160.756 -1.583 QT
160.756 -0.942 158.819 -0.942 QT
158.038 -0.942 157.334 -1.176 QT
156.491 -0.723 155.788 0.206 QT
155.084 1.136 155.084 1.996 QT
155.084 2.542 155.491 2.972 QT
155.897 3.402 156.491 3.652 QT
159.85 4.949 L
160.288 5.121 160.561 5.488 QT
160.834 5.855 160.834 6.324 QT
160.834 7.105 160.241 7.738 QT
159.647 8.371 158.866 8.371 QT
158.616 8.371 158.069 8.246 QT
157.522 8.121 157.108 7.902 QT
156.694 7.683 156.694 7.433 QT
cp
158.241 -1.52 M
158.491 -1.426 158.866 -1.426 QT
159.772 -1.426 160.178 -1.536 QT
159.819 -1.614 159.006 -1.614 QT
158.678 -1.614 158.241 -1.52 QT
cp
159.694 -6.708 M
159.866 -6.598 160.163 -6.598 QT
161.069 -6.598 161.475 -6.708 QT
159.694 -6.708 L
cp}def
f-354929822
f
GR
GS
[0.75 0 0 0.75 228.76957 290.125] CT
N
/f837842699{162.564 7.561 M
162.517 7.561 162.485 7.522 QT
162.454 7.483 162.454 7.436 QT
163.204 4.405 L
163.235 4.327 163.314 4.327 QT
163.47 4.327 L
163.517 4.327 163.548 4.366 QT
163.579 4.405 163.579 4.467 QT
163.47 4.905 163.47 5.249 QT
163.47 6.202 164.118 6.655 QT
164.767 7.108 165.751 7.108 QT
166.173 7.108 166.587 6.897 QT
167.001 6.686 167.306 6.35 QT
167.61 6.014 167.798 5.6 QT
167.985 5.186 167.985 4.764 QT
167.985 4.296 167.743 3.944 QT
167.501 3.592 167.079 3.483 QT
165.485 3.061 L
164.845 2.889 164.462 2.374 QT
164.079 1.858 164.079 1.217 QT
164.079 0.436 164.548 -0.29 QT
165.017 -1.017 165.759 -1.454 QT
166.501 -1.892 167.282 -1.892 QT
167.876 -1.892 168.376 -1.673 QT
168.876 -1.454 169.142 -0.97 QT
169.876 -1.845 L
169.954 -1.892 169.97 -1.892 QT
170.048 -1.892 L
170.095 -1.892 170.126 -1.845 QT
170.157 -1.798 170.157 -1.751 QT
169.407 1.264 L
169.392 1.358 169.314 1.358 QT
169.142 1.358 L
169.032 1.358 169.032 1.217 QT
169.095 0.796 169.095 0.499 QT
169.095 -0.111 168.892 -0.556 QT
168.689 -1.001 168.275 -1.236 QT
167.86 -1.47 167.235 -1.47 QT
166.72 -1.47 166.204 -1.173 QT
165.689 -0.876 165.368 -0.376 QT
165.048 0.124 165.048 0.655 QT
165.048 1.077 165.298 1.397 QT
165.548 1.717 165.954 1.827 QT
167.532 2.249 L
167.97 2.358 168.29 2.647 QT
168.61 2.936 168.775 3.335 QT
168.939 3.733 168.939 4.202 QT
168.939 4.811 168.681 5.413 QT
168.423 6.014 167.954 6.514 QT
167.485 7.014 166.892 7.288 QT
166.298 7.561 165.689 7.561 QT
164.142 7.561 163.47 6.655 QT
162.751 7.53 L
162.673 7.561 162.642 7.561 QT
162.564 7.561 L
cp}def
f837842699
f
GR
GS
[0.75 0 0 0.75 228.76957 290.125] CT
N
/f-1329438486{171.11 7.28 M
170.985 7.28 170.985 7.108 QT
171.048 6.827 171.157 6.827 QT
171.688 6.827 172.071 6.616 QT
172.454 6.405 172.735 5.967 QT
172.751 5.936 172.751 5.936 QT
177.392 -1.892 L
177.501 -2.033 177.642 -2.033 QT
177.813 -2.033 L
177.845 -2.033 177.884 -2.017 QT
177.923 -2.001 177.954 -1.962 QT
177.985 -1.923 177.985 -1.892 QT
178.767 6.514 L
178.767 6.561 178.829 6.686 QT
178.954 6.827 179.798 6.827 QT
179.938 6.827 179.938 6.999 QT
179.892 7.171 179.86 7.225 QT
179.829 7.28 179.704 7.28 QT
176.454 7.28 L
176.345 7.28 176.345 7.108 QT
176.407 6.827 176.517 6.827 QT
177.548 6.827 177.61 6.467 QT
177.407 4.327 L
174.204 4.327 L
173.157 6.077 L
173.063 6.217 173.063 6.405 QT
173.063 6.624 173.282 6.725 QT
173.501 6.827 173.767 6.827 QT
173.892 6.827 173.892 6.999 QT
173.845 7.171 173.821 7.225 QT
173.798 7.28 173.688 7.28 QT
171.11 7.28 L
cp
174.454 3.874 M
177.36 3.874 L
176.97 -0.345 L
174.454 3.874 L
cp}def
f-1329438486
f
GR
GS
[0.75 0 0 0.75 228.76957 290.125] CT
N
/f2088097583{186.835 0.105 M
186.679 0.105 186.578 -0.012 QT
186.476 -0.129 186.476 -0.27 QT
186.476 -0.411 186.578 -0.528 QT
186.679 -0.645 186.835 -0.645 QT
192.429 -0.645 L
192.429 -6.254 L
192.429 -6.395 192.539 -6.497 QT
192.648 -6.598 192.804 -6.598 QT
192.945 -6.598 193.07 -6.497 QT
193.195 -6.395 193.195 -6.254 QT
193.195 -0.645 L
198.773 -0.645 L
198.914 -0.645 199.015 -0.528 QT
199.117 -0.411 199.117 -0.27 QT
199.117 -0.129 199.015 -0.012 QT
198.914 0.105 198.773 0.105 QT
193.195 0.105 L
193.195 5.714 L
193.195 5.855 193.07 5.956 QT
192.945 6.058 192.804 6.058 QT
192.648 6.058 192.539 5.956 QT
192.429 5.855 192.429 5.714 QT
192.429 0.105 L
186.835 0.105 L
cp}def
f2088097583
f
GR
GS
[0.75 0 0 0.75 228.76957 290.125] CT
N
/f1255184688{204.955 4.23 M
204.955 4.183 204.994 4.066 QT
205.033 3.949 205.08 3.878 QT
205.127 3.808 205.221 3.808 QT
206.861 3.808 207.377 3.714 QT
207.893 3.589 208.002 3.167 QT
210.596 -7.27 L
210.674 -7.504 210.674 -7.676 QT
210.674 -7.833 210.002 -7.833 QT
208.908 -7.833 L
207.627 -7.833 206.94 -7.442 QT
206.252 -7.051 205.924 -6.411 QT
205.596 -5.77 205.096 -4.317 QT
205.033 -4.145 204.893 -4.145 QT
204.736 -4.145 L
204.533 -4.145 204.533 -4.395 QT
205.893 -8.317 L
205.924 -8.504 206.08 -8.504 QT
217.299 -8.504 L
217.502 -8.504 217.502 -8.254 QT
216.861 -4.317 L
216.861 -4.254 216.799 -4.2 QT
216.736 -4.145 216.674 -4.145 QT
216.502 -4.145 L
216.315 -4.145 216.315 -4.395 QT
216.518 -5.739 216.518 -6.286 QT
216.518 -6.958 216.244 -7.301 QT
215.971 -7.645 215.526 -7.739 QT
215.08 -7.833 214.361 -7.833 QT
213.236 -7.833 L
212.721 -7.833 212.549 -7.739 QT
212.377 -7.645 212.252 -7.176 QT
209.643 3.246 L
209.643 3.277 209.635 3.316 QT
209.627 3.355 209.611 3.417 QT
209.611 3.652 209.893 3.714 QT
210.393 3.808 212.002 3.808 QT
212.19 3.808 212.19 4.058 QT
212.127 4.324 212.088 4.402 QT
212.049 4.48 211.877 4.48 QT
205.143 4.48 L
204.955 4.48 204.955 4.23 QT
cp}def
f1255184688
f
GR
GS
[0.75 0 0 0.75 228.76957 290.125] CT
N
/f-1570077545{215.598 7.28 M
215.473 7.28 215.473 7.108 QT
215.473 7.077 215.496 6.999 QT
215.52 6.921 215.551 6.874 QT
215.582 6.827 215.629 6.827 QT
216.426 6.827 216.739 6.733 QT
216.91 6.671 216.989 6.389 QT
218.77 -0.751 L
218.801 -0.876 218.801 -0.939 QT
218.801 -1.079 218.645 -1.095 QT
218.395 -1.142 217.707 -1.142 QT
217.582 -1.142 217.582 -1.314 QT
217.629 -1.486 217.653 -1.54 QT
217.676 -1.595 217.801 -1.595 QT
221.285 -1.595 L
221.426 -1.595 221.426 -1.423 QT
221.426 -1.392 221.403 -1.322 QT
221.379 -1.251 221.348 -1.197 QT
221.317 -1.142 221.254 -1.142 QT
220.457 -1.142 220.145 -1.048 QT
219.973 -0.986 219.895 -0.704 QT
219.114 2.436 L
223.02 2.436 L
223.817 -0.751 L
223.848 -0.876 223.848 -0.939 QT
223.848 -1.079 223.692 -1.095 QT
223.442 -1.142 222.754 -1.142 QT
222.614 -1.142 222.614 -1.314 QT
222.66 -1.486 222.684 -1.54 QT
222.707 -1.595 222.848 -1.595 QT
226.332 -1.595 L
226.473 -1.595 226.473 -1.423 QT
226.457 -1.392 226.442 -1.314 QT
226.426 -1.236 226.387 -1.189 QT
226.348 -1.142 226.301 -1.142 QT
225.504 -1.142 225.192 -1.048 QT
225.02 -1.001 224.942 -0.704 QT
223.16 6.436 L
223.145 6.561 223.145 6.624 QT
223.145 6.749 223.301 6.764 QT
223.551 6.827 224.239 6.827 QT
224.364 6.827 224.364 6.999 QT
224.332 7.139 224.293 7.21 QT
224.254 7.28 224.145 7.28 QT
220.645 7.28 L
220.504 7.28 220.504 7.108 QT
220.535 7.014 220.551 6.967 QT
220.567 6.921 220.598 6.874 QT
220.629 6.827 220.676 6.827 QT
221.473 6.827 221.785 6.733 QT
221.957 6.671 222.035 6.389 QT
222.91 2.889 L
219.004 2.889 L
218.129 6.436 L
218.098 6.592 218.098 6.624 QT
218.098 6.749 218.254 6.764 QT
218.504 6.827 219.192 6.827 QT
219.317 6.827 219.317 6.999 QT
219.27 7.171 219.246 7.225 QT
219.223 7.28 219.098 7.28 QT
215.598 7.28 L
cp}def
f-1570077545
f
GR
GS
[0.75 0 0 0.75 0 0.25] CT
0.094 0.749 0.71 RC
N
302.024 399.647 M
302.024 373.353 L
262.002 373.353 L
262.002 399.647 L
cp
f
GR
GS
[0.75 0 0 0.75 228.76957 317.00555] CT
N
f22378643
f
GR
GS
[0.75 0 0 0.75 228.76957 317.00555] CT
N
/f-2094851359{10.057 4.467 M
10.057 5.249 10.362 5.842 QT
10.667 6.436 11.245 6.772 QT
11.823 7.108 12.604 7.108 QT
13.417 7.108 14.175 6.686 QT
14.932 6.264 15.471 5.569 QT
16.01 4.874 16.198 4.077 QT
16.229 3.999 16.307 3.999 QT
16.464 3.999 L
16.51 3.999 16.542 4.038 QT
16.573 4.077 16.573 4.124 QT
16.573 4.124 16.557 4.155 QT
16.339 5.061 15.706 5.85 QT
15.073 6.639 14.182 7.1 QT
13.292 7.561 12.354 7.561 QT
11.339 7.561 10.534 7.108 QT
9.729 6.655 9.276 5.842 QT
8.823 5.03 8.823 3.999 QT
8.823 2.905 9.315 1.842 QT
9.807 0.78 10.628 -0.056 QT
11.448 -0.892 12.51 -1.392 QT
13.573 -1.892 14.651 -1.892 QT
15.089 -1.892 15.479 -1.759 QT
15.87 -1.626 16.206 -1.361 QT
16.542 -1.095 16.76 -0.751 QT
17.792 -1.861 L
17.792 -1.892 17.854 -1.892 QT
17.932 -1.892 L
17.979 -1.892 18.01 -1.845 QT
18.042 -1.798 18.042 -1.751 QT
17.167 1.764 L
17.167 1.842 17.057 1.842 QT
16.823 1.842 L
16.729 1.842 16.729 1.702 QT
16.776 1.421 16.776 1.014 QT
16.776 0.374 16.557 -0.189 QT
16.339 -0.751 15.885 -1.087 QT
15.432 -1.423 14.776 -1.423 QT
13.714 -1.423 12.839 -0.892 QT
11.964 -0.361 11.346 0.506 QT
10.729 1.374 10.393 2.428 QT
10.057 3.483 10.057 4.467 QT
cp}def
f-2094851359
f
GR
GS
[0.75 0 0 0.75 228.76957 317.00555] CT
N
/f-673469741{19.081 7.28 M
18.956 7.28 18.956 7.108 QT
18.956 7.077 18.972 6.999 QT
18.987 6.921 19.026 6.874 QT
19.065 6.827 19.112 6.827 QT
19.909 6.827 20.222 6.733 QT
20.393 6.671 20.472 6.389 QT
22.253 -0.751 L
22.268 -0.876 22.268 -0.939 QT
22.268 -1.079 22.128 -1.095 QT
21.878 -1.142 21.19 -1.142 QT
21.05 -1.142 21.05 -1.314 QT
21.065 -1.345 21.081 -1.423 QT
21.097 -1.501 21.136 -1.548 QT
21.175 -1.595 21.222 -1.595 QT
25.706 -1.595 L
26.331 -1.595 26.909 -1.376 QT
27.487 -1.158 27.854 -0.712 QT
28.222 -0.267 28.222 0.374 QT
28.222 1.202 27.636 1.85 QT
27.05 2.499 26.183 2.858 QT
25.315 3.217 24.503 3.217 QT
22.393 3.217 L
21.597 6.436 L
21.581 6.561 21.581 6.624 QT
21.581 6.671 21.597 6.702 QT
21.612 6.733 21.636 6.749 QT
21.659 6.764 21.722 6.764 QT
21.972 6.827 22.675 6.827 QT
22.8 6.827 22.8 6.999 QT
22.753 7.171 22.729 7.225 QT
22.706 7.28 22.565 7.28 QT
19.081 7.28 L
cp
22.456 2.842 M
24.284 2.842 L
25.55 2.842 26.206 2.155 QT
26.534 1.827 26.753 1.186 QT
26.972 0.546 26.972 0.03 QT
26.972 -0.611 26.479 -0.876 QT
25.987 -1.142 25.268 -1.142 QT
24.018 -1.142 L
23.659 -1.142 23.55 -1.079 QT
23.44 -1.017 23.347 -0.704 QT
22.456 2.842 L
cp}def
f-673469741
f
GR
GS
[0.75 0 0 0.75 228.76957 317.00555] CT
N
/f-2014946347{36.341 4.855 M
36.341 4.621 36.591 4.496 QT
46.669 -0.27 L
36.528 -5.083 L
36.341 -5.129 36.341 -5.395 QT
36.341 -5.536 36.45 -5.661 QT
36.559 -5.786 36.716 -5.786 QT
36.763 -5.786 36.872 -5.739 QT
47.778 -0.598 L
47.95 -0.504 47.95 -0.27 QT
47.95 -0.02 47.716 0.074 QT
36.872 5.199 L
36.763 5.246 36.716 5.246 QT
36.559 5.246 36.45 5.121 QT
36.341 4.996 36.341 4.855 QT
cp}def
f-2014946347
f
GR
GS
[0.75 0 0 0.75 228.76957 317.00555] CT
N
/f-610038369{57.56 7.433 M
57.591 7.214 57.826 7.214 QT
57.841 7.214 58.177 7.402 QT
58.513 7.589 58.927 7.738 QT
59.341 7.886 59.747 7.886 QT
60.091 7.886 60.333 7.581 QT
60.576 7.277 60.576 6.933 QT
60.576 6.433 60.044 6.23 QT
56.826 4.964 L
55.982 4.652 55.443 4.003 QT
54.904 3.355 54.904 2.542 QT
54.904 1.808 55.294 1.011 QT
55.685 0.214 56.294 -0.426 QT
56.904 -1.067 57.607 -1.473 QT
57.044 -1.801 56.732 -2.325 QT
56.419 -2.848 56.419 -3.473 QT
56.419 -4.145 56.693 -4.723 QT
56.966 -5.301 57.443 -5.77 QT
57.919 -6.239 58.505 -6.575 QT
59.091 -6.911 59.685 -7.067 QT
59.591 -7.458 59.591 -7.77 QT
59.591 -8.801 59.997 -8.801 QT
60.091 -8.801 60.169 -8.731 QT
60.247 -8.661 60.247 -8.551 QT
60.247 -8.458 60.193 -8.145 QT
60.138 -7.833 60.138 -7.754 QT
60.138 -7.426 60.232 -7.176 QT
60.716 -7.286 61.169 -7.286 QT
62.919 -7.286 62.919 -6.739 QT
62.919 -6.098 60.982 -6.098 QT
60.388 -6.098 60.013 -6.504 QT
59.466 -6.223 59.005 -5.715 QT
58.544 -5.208 58.279 -4.583 QT
58.013 -3.958 58.013 -3.317 QT
58.013 -2.426 58.529 -1.879 QT
59.201 -2.114 59.888 -2.114 QT
61.622 -2.114 61.622 -1.583 QT
61.622 -0.942 59.685 -0.942 QT
58.904 -0.942 58.201 -1.176 QT
57.357 -0.723 56.654 0.206 QT
55.951 1.136 55.951 1.996 QT
55.951 2.542 56.357 2.972 QT
56.763 3.402 57.357 3.652 QT
60.716 4.949 L
61.154 5.121 61.427 5.488 QT
61.701 5.855 61.701 6.324 QT
61.701 7.105 61.107 7.738 QT
60.513 8.371 59.732 8.371 QT
59.482 8.371 58.935 8.246 QT
58.388 8.121 57.974 7.902 QT
57.56 7.683 57.56 7.433 QT
cp
59.107 -1.52 M
59.357 -1.426 59.732 -1.426 QT
60.638 -1.426 61.044 -1.536 QT
60.685 -1.614 59.872 -1.614 QT
59.544 -1.614 59.107 -1.52 QT
cp
60.56 -6.708 M
60.732 -6.598 61.029 -6.598 QT
61.935 -6.598 62.341 -6.708 QT
60.56 -6.708 L
cp}def
f-610038369
f
GR
GS
[0.75 0 0 0.75 228.76957 317.00555] CT
N
/f515303561{63.43 7.561 M
63.383 7.561 63.352 7.522 QT
63.32 7.483 63.32 7.436 QT
64.07 4.405 L
64.102 4.327 64.18 4.327 QT
64.336 4.327 L
64.383 4.327 64.414 4.366 QT
64.445 4.405 64.445 4.467 QT
64.336 4.905 64.336 5.249 QT
64.336 6.202 64.984 6.655 QT
65.633 7.108 66.617 7.108 QT
67.039 7.108 67.453 6.897 QT
67.867 6.686 68.172 6.35 QT
68.477 6.014 68.664 5.6 QT
68.852 5.186 68.852 4.764 QT
68.852 4.296 68.609 3.944 QT
68.367 3.592 67.945 3.483 QT
66.352 3.061 L
65.711 2.889 65.328 2.374 QT
64.945 1.858 64.945 1.217 QT
64.945 0.436 65.414 -0.29 QT
65.883 -1.017 66.625 -1.454 QT
67.367 -1.892 68.148 -1.892 QT
68.742 -1.892 69.242 -1.673 QT
69.742 -1.454 70.008 -0.97 QT
70.742 -1.845 L
70.82 -1.892 70.836 -1.892 QT
70.914 -1.892 L
70.961 -1.892 70.992 -1.845 QT
71.023 -1.798 71.023 -1.751 QT
70.273 1.264 L
70.258 1.358 70.18 1.358 QT
70.008 1.358 L
69.898 1.358 69.898 1.217 QT
69.961 0.796 69.961 0.499 QT
69.961 -0.111 69.758 -0.556 QT
69.555 -1.001 69.141 -1.236 QT
68.727 -1.47 68.102 -1.47 QT
67.586 -1.47 67.07 -1.173 QT
66.555 -0.876 66.234 -0.376 QT
65.914 0.124 65.914 0.655 QT
65.914 1.077 66.164 1.397 QT
66.414 1.717 66.82 1.827 QT
68.398 2.249 L
68.836 2.358 69.156 2.647 QT
69.477 2.936 69.641 3.335 QT
69.805 3.733 69.805 4.202 QT
69.805 4.811 69.547 5.413 QT
69.289 6.014 68.82 6.514 QT
68.352 7.014 67.758 7.288 QT
67.164 7.561 66.555 7.561 QT
65.008 7.561 64.336 6.655 QT
63.617 7.53 L
63.539 7.561 63.508 7.561 QT
63.43 7.561 L
cp}def
f515303561
f
GR
GS
[0.75 0 0 0.75 228.76957 317.00555] CT
N
/f2034993174{71.977 7.28 M
71.852 7.28 71.852 7.108 QT
71.914 6.827 72.023 6.827 QT
72.555 6.827 72.937 6.616 QT
73.32 6.405 73.602 5.967 QT
73.617 5.936 73.617 5.936 QT
78.258 -1.892 L
78.367 -2.033 78.508 -2.033 QT
78.68 -2.033 L
78.711 -2.033 78.75 -2.017 QT
78.789 -2.001 78.82 -1.962 QT
78.852 -1.923 78.852 -1.892 QT
79.633 6.514 L
79.633 6.561 79.695 6.686 QT
79.82 6.827 80.664 6.827 QT
80.805 6.827 80.805 6.999 QT
80.758 7.171 80.727 7.225 QT
80.695 7.28 80.57 7.28 QT
77.32 7.28 L
77.211 7.28 77.211 7.108 QT
77.273 6.827 77.383 6.827 QT
78.414 6.827 78.477 6.467 QT
78.273 4.327 L
75.07 4.327 L
74.023 6.077 L
73.93 6.217 73.93 6.405 QT
73.93 6.624 74.148 6.725 QT
74.367 6.827 74.633 6.827 QT
74.758 6.827 74.758 6.999 QT
74.711 7.171 74.687 7.225 QT
74.664 7.28 74.555 7.28 QT
71.977 7.28 L
cp
75.32 3.874 M
78.227 3.874 L
77.836 -0.345 L
75.32 3.874 L
cp}def
f2034993174
f
GR
GS
[0.75 0 0 0.75 228.76957 317.00555] CT
N
/f1506630159{88.217 0.105 M
88.061 0.105 87.959 -0.012 QT
87.858 -0.129 87.858 -0.27 QT
87.858 -0.411 87.959 -0.528 QT
88.061 -0.645 88.217 -0.645 QT
99.124 -0.645 L
99.264 -0.645 99.366 -0.528 QT
99.467 -0.411 99.467 -0.27 QT
99.467 -0.129 99.366 -0.012 QT
99.264 0.105 99.124 0.105 QT
88.217 0.105 L
cp}def
f1506630159
f
GR
GS
[0.75 0 0 0.75 228.76957 317.00555] CT
N
/f-581883669{105.821 4.23 M
105.821 4.183 105.86 4.066 QT
105.899 3.949 105.946 3.878 QT
105.993 3.808 106.087 3.808 QT
107.728 3.808 108.243 3.714 QT
108.759 3.589 108.868 3.167 QT
111.462 -7.27 L
111.54 -7.504 111.54 -7.676 QT
111.54 -7.833 110.868 -7.833 QT
109.774 -7.833 L
108.493 -7.833 107.806 -7.442 QT
107.118 -7.051 106.79 -6.411 QT
106.462 -5.77 105.962 -4.317 QT
105.899 -4.145 105.759 -4.145 QT
105.603 -4.145 L
105.399 -4.145 105.399 -4.395 QT
106.759 -8.317 L
106.79 -8.504 106.946 -8.504 QT
118.165 -8.504 L
118.368 -8.504 118.368 -8.254 QT
117.728 -4.317 L
117.728 -4.254 117.665 -4.2 QT
117.603 -4.145 117.54 -4.145 QT
117.368 -4.145 L
117.181 -4.145 117.181 -4.395 QT
117.384 -5.739 117.384 -6.286 QT
117.384 -6.958 117.11 -7.301 QT
116.837 -7.645 116.392 -7.739 QT
115.946 -7.833 115.228 -7.833 QT
114.103 -7.833 L
113.587 -7.833 113.415 -7.739 QT
113.243 -7.645 113.118 -7.176 QT
110.509 3.246 L
110.509 3.277 110.501 3.316 QT
110.493 3.355 110.478 3.417 QT
110.478 3.652 110.759 3.714 QT
111.259 3.808 112.868 3.808 QT
113.056 3.808 113.056 4.058 QT
112.993 4.324 112.954 4.402 QT
112.915 4.48 112.743 4.48 QT
106.009 4.48 L
105.821 4.48 105.821 4.23 QT
cp}def
f-581883669
f
GR
GS
[0.75 0 0 0.75 228.76957 317.00555] CT
N
/f-1659262137{116.464 7.28 M
116.339 7.28 116.339 7.108 QT
116.339 7.077 116.363 6.999 QT
116.386 6.921 116.417 6.874 QT
116.448 6.827 116.495 6.827 QT
117.292 6.827 117.605 6.733 QT
117.777 6.671 117.855 6.389 QT
119.636 -0.751 L
119.667 -0.876 119.667 -0.939 QT
119.667 -1.079 119.511 -1.095 QT
119.261 -1.142 118.573 -1.142 QT
118.448 -1.142 118.448 -1.314 QT
118.495 -1.486 118.519 -1.54 QT
118.542 -1.595 118.667 -1.595 QT
122.152 -1.595 L
122.292 -1.595 122.292 -1.423 QT
122.292 -1.392 122.269 -1.322 QT
122.245 -1.251 122.214 -1.197 QT
122.183 -1.142 122.12 -1.142 QT
121.323 -1.142 121.011 -1.048 QT
120.839 -0.986 120.761 -0.704 QT
119.98 2.436 L
123.886 2.436 L
124.683 -0.751 L
124.714 -0.876 124.714 -0.939 QT
124.714 -1.079 124.558 -1.095 QT
124.308 -1.142 123.62 -1.142 QT
123.48 -1.142 123.48 -1.314 QT
123.527 -1.486 123.55 -1.54 QT
123.573 -1.595 123.714 -1.595 QT
127.198 -1.595 L
127.339 -1.595 127.339 -1.423 QT
127.323 -1.392 127.308 -1.314 QT
127.292 -1.236 127.253 -1.189 QT
127.214 -1.142 127.167 -1.142 QT
126.37 -1.142 126.058 -1.048 QT
125.886 -1.001 125.808 -0.704 QT
124.027 6.436 L
124.011 6.561 124.011 6.624 QT
124.011 6.749 124.167 6.764 QT
124.417 6.827 125.105 6.827 QT
125.23 6.827 125.23 6.999 QT
125.198 7.139 125.159 7.21 QT
125.12 7.28 125.011 7.28 QT
121.511 7.28 L
121.37 7.28 121.37 7.108 QT
121.402 7.014 121.417 6.967 QT
121.433 6.921 121.464 6.874 QT
121.495 6.827 121.542 6.827 QT
122.339 6.827 122.652 6.733 QT
122.823 6.671 122.902 6.389 QT
123.777 2.889 L
119.87 2.889 L
118.995 6.436 L
118.964 6.592 118.964 6.624 QT
118.964 6.749 119.12 6.764 QT
119.37 6.827 120.058 6.827 QT
120.183 6.827 120.183 6.999 QT
120.136 7.171 120.113 7.225 QT
120.089 7.28 119.964 7.28 QT
116.464 7.28 L
cp}def
f-1659262137
f
GR
GS
[0.75 0 0 0.75 0 0.25] CT
0 0.451 0.741 RC
N
302.024 435.488 M
302.024 409.194 L
262.002 409.194 L
262.002 435.488 L
cp
f
GR
GS
[0.75 0 0 0.75 0 0.25] CT
1 GC
10.0 ML
0.667 LW
N
258 443 M
258 330 L
537 330 L
537 443 L
cp
S
GR
GS
[0.75 0 0 0.75 176.25017 46.8625] CT
/Helvetica-Bold 20.533 F
GS
[1 0 0 1 0 0] CT
-111 -5 moveto 
1 -1 scale
(ENU Profitability SM01) t 
GR
GR
GS
[0.75 0 0 0.75 0 0.25] CT
0.302 0.749 0.929 RC
N
138.501 266.404 M
142.99 271.612 L
147.796 276.531 L
152.9 281.139 L
158.282 285.419 L
163.921 289.355 L
169.795 292.931 L
175.881 296.132 L
182.155 298.947 L
188.593 301.365 L
195.169 303.375 L
201.858 304.971 L
208.633 306.146 L
224.027 197.228 L
224.027 87.228 L
217.154 87.443 L
210.307 88.087 L
203.515 89.158 L
196.802 90.651 L
190.196 92.56 L
183.722 94.879 L
177.405 97.597 L
171.271 100.705 L
165.343 104.19 L
159.644 108.038 L
154.197 112.236 L
149.023 116.765 L
144.142 121.609 L
139.573 126.748 L
135.334 132.163 L
131.442 137.832 L
127.911 143.733 L
124.757 149.843 L
121.99 156.139 L
119.622 162.595 L
117.662 169.186 L
116.117 175.887 L
114.995 182.671 L
114.298 189.512 L
114.03 196.384 L
114.192 203.258 L
114.784 210.11 L
115.802 216.91 L
117.244 223.634 L
119.102 230.255 L
121.371 236.746 L
124.041 243.084 L
127.101 249.242 L
130.541 255.196 L
134.345 260.924 L
cp
f
GR
GS
[0.75 0 0 0.75 0 0.25] CT
0.094 0.749 0.71 RC
N
232.886 307.98 M
239.549 307.906 L
246.196 307.429 L
252.802 306.55 L
259.343 305.273 L
265.794 303.602 L
272.132 301.543 L
278.334 299.105 L
284.377 296.295 L
290.239 293.125 L
295.898 289.605 L
301.333 285.749 L
306.525 281.571 L
311.454 277.087 L
316.103 272.312 L
320.454 267.265 L
324.492 261.963 L
328.201 256.426 L
331.568 250.675 L
334.58 244.731 L
235 198 L
219.606 306.918 L
226.23 307.65 L
cp
f
GR
GS
[0.75 0 0 0.75 0 0.25] CT
0 0.451 0.741 RC
N
235 88 M
235 198 L
334.58 244.731 L
337.317 238.389 L
339.65 231.889 L
341.57 225.254 L
343.071 218.512 L
344.145 211.69 L
344.789 204.813 L
345 197.91 L
344.777 191.006 L
344.122 184.131 L
343.037 177.31 L
341.525 170.57 L
339.594 163.939 L
337.25 157.442 L
334.503 151.105 L
331.364 144.953 L
327.845 139.01 L
323.96 133.3 L
319.724 127.844 L
315.154 122.666 L
310.269 117.784 L
305.086 113.218 L
299.627 108.987 L
293.913 105.106 L
287.968 101.592 L
281.813 98.458 L
275.474 95.717 L
268.975 93.378 L
262.342 91.452 L
255.601 89.946 L
248.779 88.866 L
241.903 88.217 L
cp
f
GR
GS
[0.75 0 0 0.75 145.32085 141.80559] CT
1 GC
/Helvetica-Bold 21.333 F
GS
[1 0 0 1 0 0] CT
-43 8.5 moveto 
1 -1 scale
(48%) t 
GR
GR
GS
[0.75 0 0 0.75 188.94123 184.44274] CT
1 GC
/Helvetica-Bold 21.333 F
GS
[1 0 0 1 0 0] CT
0 22 moveto 
1 -1 scale
(20%) t 
GR
GR
GS
[0.75 0 0 0.75 202.96564 129.47102] CT
1 GC
/Helvetica-Bold 21.333 F
GS
[1 0 0 1 0 0] CT
0 -5 moveto 
1 -1 scale
(32%) t 
GR
GR
%%Trailer
%%Pages: 1
%%EOF
