%!PS-Adobe-3.0 EPSF-3.0
%%Creator: (MATLAB, The Mathworks, Inc. Version 9.5.0.944444 \(R2018b\). Operating System: Windows 10)
%%Title: (C:/Users/Alex/Dropbox/Analisi Statistica Metodi/Barplots/PRR_combined_histDistrib.eps)
%%CreationDate: 2019-09-06T12:02:58
%%Pages: (atend)
%%BoundingBox: 0 0 402 425
%%LanguageLevel: 3
%%EndComments
%%BeginProlog
%%BeginResource: procset (Apache XML Graphics Std ProcSet) 1.2 0
%%Version: 1.2 0
%%Copyright: (Copyright 2001-2003,2010 The Apache Software Foundation. License terms: http://www.apache.org/licenses/LICENSE-2.0)
/bd{bind def}bind def
/ld{load def}bd
/GR/grestore ld
/GS/gsave ld
/RM/rmoveto ld
/C/curveto ld
/t/show ld
/L/lineto ld
/ML/setmiterlimit ld
/CT/concat ld
/f/fill ld
/N/newpath ld
/S/stroke ld
/CC/setcmykcolor ld
/A/ashow ld
/cp/closepath ld
/RC/setrgbcolor ld
/LJ/setlinejoin ld
/GC/setgray ld
/LW/setlinewidth ld
/M/moveto ld
/re {4 2 roll M
1 index 0 rlineto
0 exch rlineto
neg 0 rlineto
cp } bd
/_ctm matrix def
/_tm matrix def
/BT { _ctm currentmatrix pop matrix _tm copy pop 0 0 moveto } bd
/ET { _ctm setmatrix } bd
/iTm { _ctm setmatrix _tm concat } bd
/Tm { _tm astore pop iTm 0 0 moveto } bd
/ux 0.0 def
/uy 0.0 def
/F {
  /Tp exch def
  /Tf exch def
  Tf findfont Tp scalefont setfont
  /cf Tf def  /cs Tp def
} bd
/ULS {currentpoint /uy exch def /ux exch def} bd
/ULE {
  /Tcx currentpoint pop def
  gsave
  newpath
  cf findfont cs scalefont dup
  /FontMatrix get 0 get /Ts exch def /FontInfo get dup
  /UnderlinePosition get Ts mul /To exch def
  /UnderlineThickness get Ts mul /Tt exch def
  ux uy To add moveto  Tcx uy To add lineto
  Tt setlinewidth stroke
  grestore
} bd
/OLE {
  /Tcx currentpoint pop def
  gsave
  newpath
  cf findfont cs scalefont dup
  /FontMatrix get 0 get /Ts exch def /FontInfo get dup
  /UnderlinePosition get Ts mul /To exch def
  /UnderlineThickness get Ts mul /Tt exch def
  ux uy To add cs add moveto Tcx uy To add cs add lineto
  Tt setlinewidth stroke
  grestore
} bd
/SOE {
  /Tcx currentpoint pop def
  gsave
  newpath
  cf findfont cs scalefont dup
  /FontMatrix get 0 get /Ts exch def /FontInfo get dup
  /UnderlinePosition get Ts mul /To exch def
  /UnderlineThickness get Ts mul /Tt exch def
  ux uy To add cs 10 mul 26 idiv add moveto Tcx uy To add cs 10 mul 26 idiv add lineto
  Tt setlinewidth stroke
  grestore
} bd
/QT {
/Y22 exch store
/X22 exch store
/Y21 exch store
/X21 exch store
currentpoint
/Y21 load 2 mul add 3 div exch
/X21 load 2 mul add 3 div exch
/X21 load 2 mul /X22 load add 3 div
/Y21 load 2 mul /Y22 load add 3 div
/X22 load /Y22 load curveto
} bd
/SSPD {
dup length /d exch dict def
{
/v exch def
/k exch def
currentpagedevice k known {
/cpdv currentpagedevice k get def
v cpdv ne {
/upd false def
/nullv v type /nulltype eq def
/nullcpdv cpdv type /nulltype eq def
nullv nullcpdv or
{
/upd true def
} {
/sametype v type cpdv type eq def
sametype {
v type /arraytype eq {
/vlen v length def
/cpdvlen cpdv length def
vlen cpdvlen eq {
0 1 vlen 1 sub {
/i exch def
/obj v i get def
/cpdobj cpdv i get def
obj cpdobj ne {
/upd true def
exit
} if
} for
} {
/upd true def
} ifelse
} {
v type /dicttype eq {
v {
/dv exch def
/dk exch def
/cpddv cpdv dk get def
dv cpddv ne {
/upd true def
exit
} if
} forall
} {
/upd true def
} ifelse
} ifelse
} if
} ifelse
upd true eq {
d k v put
} if
} if
} if
} forall
d length 0 gt {
d setpagedevice
} if
} bd
/RE { % /NewFontName [NewEncodingArray] /FontName RE -
  findfont dup length dict begin
  {
    1 index /FID ne
    {def} {pop pop} ifelse
  } forall
  /Encoding exch def
  /FontName 1 index def
  currentdict definefont pop
  end
} bind def
%%EndResource
%%BeginResource: procset (Apache XML Graphics EPS ProcSet) 1.0 0
%%Version: 1.0 0
%%Copyright: (Copyright 2002-2003 The Apache Software Foundation. License terms: http://www.apache.org/licenses/LICENSE-2.0)
/BeginEPSF { %def
/b4_Inc_state save def         % Save state for cleanup
/dict_count countdictstack def % Count objects on dict stack
/op_count count 1 sub def      % Count objects on operand stack
userdict begin                 % Push userdict on dict stack
/showpage { } def              % Redefine showpage, { } = null proc
0 setgray 0 setlinecap         % Prepare graphics state
1 setlinewidth 0 setlinejoin
10 setmiterlimit [ ] 0 setdash newpath
/languagelevel where           % If level not equal to 1 then
{pop languagelevel             % set strokeadjust and
1 ne                           % overprint to their defaults.
{false setstrokeadjust false setoverprint
} if
} if
} bd
/EndEPSF { %def
count op_count sub {pop} repeat            % Clean up stacks
countdictstack dict_count sub {end} repeat
b4_Inc_state restore
} bd
%%EndResource
%FOPBeginFontDict
%%IncludeResource: font Courier-Oblique
%%IncludeResource: font Courier-BoldOblique
%%IncludeResource: font Courier-Bold
%%IncludeResource: font ZapfDingbats
%%IncludeResource: font Symbol
%%IncludeResource: font Helvetica
%%IncludeResource: font Helvetica-Oblique
%%IncludeResource: font Helvetica-Bold
%%IncludeResource: font Helvetica-BoldOblique
%%IncludeResource: font Times-Roman
%%IncludeResource: font Times-Italic
%%IncludeResource: font Times-Bold
%%IncludeResource: font Times-BoldItalic
%%IncludeResource: font Courier
%FOPEndFontDict
%%BeginResource: encoding WinAnsiEncoding
/WinAnsiEncoding [
/.notdef /.notdef /.notdef /.notdef /.notdef
/.notdef /.notdef /.notdef /.notdef /.notdef
/.notdef /.notdef /.notdef /.notdef /.notdef
/.notdef /.notdef /.notdef /.notdef /.notdef
/.notdef /.notdef /.notdef /.notdef /.notdef
/.notdef /.notdef /.notdef /.notdef /.notdef
/.notdef /.notdef /space /exclam /quotedbl
/numbersign /dollar /percent /ampersand /quotesingle
/parenleft /parenright /asterisk /plus /comma
/hyphen /period /slash /zero /one
/two /three /four /five /six
/seven /eight /nine /colon /semicolon
/less /equal /greater /question /at
/A /B /C /D /E
/F /G /H /I /J
/K /L /M /N /O
/P /Q /R /S /T
/U /V /W /X /Y
/Z /bracketleft /backslash /bracketright /asciicircum
/underscore /quoteleft /a /b /c
/d /e /f /g /h
/i /j /k /l /m
/n /o /p /q /r
/s /t /u /v /w
/x /y /z /braceleft /bar
/braceright /asciitilde /bullet /Euro /bullet
/quotesinglbase /florin /quotedblbase /ellipsis /dagger
/daggerdbl /circumflex /perthousand /Scaron /guilsinglleft
/OE /bullet /Zcaron /bullet /bullet
/quoteleft /quoteright /quotedblleft /quotedblright /bullet
/endash /emdash /asciitilde /trademark /scaron
/guilsinglright /oe /bullet /zcaron /Ydieresis
/space /exclamdown /cent /sterling /currency
/yen /brokenbar /section /dieresis /copyright
/ordfeminine /guillemotleft /logicalnot /sfthyphen /registered
/macron /degree /plusminus /twosuperior /threesuperior
/acute /mu /paragraph /middot /cedilla
/onesuperior /ordmasculine /guillemotright /onequarter /onehalf
/threequarters /questiondown /Agrave /Aacute /Acircumflex
/Atilde /Adieresis /Aring /AE /Ccedilla
/Egrave /Eacute /Ecircumflex /Edieresis /Igrave
/Iacute /Icircumflex /Idieresis /Eth /Ntilde
/Ograve /Oacute /Ocircumflex /Otilde /Odieresis
/multiply /Oslash /Ugrave /Uacute /Ucircumflex
/Udieresis /Yacute /Thorn /germandbls /agrave
/aacute /acircumflex /atilde /adieresis /aring
/ae /ccedilla /egrave /eacute /ecircumflex
/edieresis /igrave /iacute /icircumflex /idieresis
/eth /ntilde /ograve /oacute /ocircumflex
/otilde /odieresis /divide /oslash /ugrave
/uacute /ucircumflex /udieresis /yacute /thorn
/ydieresis
] def
%%EndResource
%FOPBeginFontReencode
/Courier-Oblique findfont
dup length dict begin
  {1 index /FID ne {def} {pop pop} ifelse} forall
  /Encoding WinAnsiEncoding def
  currentdict
end
/Courier-Oblique exch definefont pop
/Courier-BoldOblique findfont
dup length dict begin
  {1 index /FID ne {def} {pop pop} ifelse} forall
  /Encoding WinAnsiEncoding def
  currentdict
end
/Courier-BoldOblique exch definefont pop
/Courier-Bold findfont
dup length dict begin
  {1 index /FID ne {def} {pop pop} ifelse} forall
  /Encoding WinAnsiEncoding def
  currentdict
end
/Courier-Bold exch definefont pop
/Helvetica findfont
dup length dict begin
  {1 index /FID ne {def} {pop pop} ifelse} forall
  /Encoding WinAnsiEncoding def
  currentdict
end
/Helvetica exch definefont pop
/Helvetica-Oblique findfont
dup length dict begin
  {1 index /FID ne {def} {pop pop} ifelse} forall
  /Encoding WinAnsiEncoding def
  currentdict
end
/Helvetica-Oblique exch definefont pop
/Helvetica-Bold findfont
dup length dict begin
  {1 index /FID ne {def} {pop pop} ifelse} forall
  /Encoding WinAnsiEncoding def
  currentdict
end
/Helvetica-Bold exch definefont pop
/Helvetica-BoldOblique findfont
dup length dict begin
  {1 index /FID ne {def} {pop pop} ifelse} forall
  /Encoding WinAnsiEncoding def
  currentdict
end
/Helvetica-BoldOblique exch definefont pop
/Times-Roman findfont
dup length dict begin
  {1 index /FID ne {def} {pop pop} ifelse} forall
  /Encoding WinAnsiEncoding def
  currentdict
end
/Times-Roman exch definefont pop
/Times-Italic findfont
dup length dict begin
  {1 index /FID ne {def} {pop pop} ifelse} forall
  /Encoding WinAnsiEncoding def
  currentdict
end
/Times-Italic exch definefont pop
/Times-Bold findfont
dup length dict begin
  {1 index /FID ne {def} {pop pop} ifelse} forall
  /Encoding WinAnsiEncoding def
  currentdict
end
/Times-Bold exch definefont pop
/Times-BoldItalic findfont
dup length dict begin
  {1 index /FID ne {def} {pop pop} ifelse} forall
  /Encoding WinAnsiEncoding def
  currentdict
end
/Times-BoldItalic exch definefont pop
/Courier findfont
dup length dict begin
  {1 index /FID ne {def} {pop pop} ifelse} forall
  /Encoding WinAnsiEncoding def
  currentdict
end
/Courier exch definefont pop
%FOPEndFontReencode
%%EndProlog
%%Page: 1 1
%%PageBoundingBox: 0 0 402 425
%%BeginPageSetup
[1 0 0 -1 0 425] CT
%%EndPageSetup
GS
[0.75 0 0 0.75 0 0.5] CT
1 GC
N
0 0 536 566 re
f
GR
GS
[0.75 0 0 0.75 0 0.5] CT
1 GC
N
0 0 536 566 re
f
GR
GS
[0.75 0 0 0.75 0 0.5] CT
0.149 GC
1 LJ
0.667 LW
N
150 199 M
150 43 L
S
GR
GS
[0.75 0 0 0.75 0 0.5] CT
0 0.447 0.741 RC
N
150 145 M
435.54 145 L
435.54 121 L
150 121 L
cp
150 85 M
347.317 85 L
347.317 61 L
150 61 L
cp
f
GR
GS
[0.75 0 0 0.75 0 0.5] CT
0.149 GC
1 LJ
0.667 LW
N
151 366 M
151 213 L
S
GR
GS
[0.75 0 0 0.75 0 0.5] CT
0 0.447 0.741 RC
N
151 313.038 M
292.347 313.038 L
292.347 289.5 L
151 289.5 L
cp
151 283.615 M
164.281 283.615 L
164.281 260.077 L
151 260.077 L
cp
151 254.192 M
479.229 254.192 L
479.229 230.654 L
151 230.654 L
cp
f
GR
GS
[0.75 0 0 0.75 0 0.5] CT
0.149 GC
1 LJ
0.667 LW
N
151 542 M
151 384 L
S
GR
GS
[0.75 0 0 0.75 0 0.5] CT
0 0.447 0.741 RC
N
151 487.308 M
444.997 487.308 L
444.997 463 L
151 463 L
cp
151 456.923 M
164.32 456.923 L
164.32 432.615 L
151 432.615 L
cp
151 426.538 M
327.969 426.538 L
327.969 402.231 L
151 402.231 L
cp
f
GR
GS
[0.75 0 0 0.75 106 47.75001] CT
/Helvetica 16 F
GS
[1 0 0 1 0 0] CT
-34 17 moveto 
1 -1 scale
(GEV) t 
GR
GR
GS
[0.75 0 0 0.75 106 176.00001] CT
/Helvetica 16 F
GS
[1 0 0 1 0 0] CT
-34 17 moveto 
1 -1 scale
(GEV) t 
GR
GR
GS
[0.75 0 0 0.75 106 197] CT
/Helvetica 16 F
GS
[1 0 0 1 0 0] CT
-81 17 moveto 
1 -1 scale
(T-loc Scale) t 
GR
GR
GS
[0.75 0 0 0.75 106 323.75] CT
/Helvetica 16 F
GS
[1 0 0 1 0 0] CT
-81 17 moveto 
1 -1 scale
(T-loc Scale) t 
GR
GR
GS
[0.75 0 0 0.75 106 71] CT
/Helvetica 16 F
GS
[1 0 0 1 0 0] CT
-81 17 moveto 
1 -1 scale
(T-loc Scale) t 
GR
GR
GS
[0.75 0 0 0.75 106 303.5] CT
/Helvetica 16 F
GS
[1 0 0 1 0 0] CT
-34 17 moveto 
1 -1 scale
(GEV) t 
GR
GR
GS
[0.75 0 0 0.75 301.652 171.84241] CT
1 GC
/Helvetica-Bold 21.333 F
GS
[1 0 0 1 0 0] CT
0 22 moveto 
1 -1 scale
(67.98%) t 
GR
GR
GS
[0.75 0 0 0.75 129.152 193.59241] CT
/Helvetica-Bold 21.333 F
GS
[1 0 0 1 0 0] CT
0 22 moveto 
1 -1 scale
(2.75 %) t 
GR
GR
GS
[0.75 0 0 0.75 162.902 215.73837] CT
1 GC
/Helvetica-Bold 21.333 F
GS
[1 0 0 1 0 0] CT
0 22 moveto 
1 -1 scale
(29.27%) t 
GR
GR
GS
[0.75 0 0 0.75 268.65198 88.98837] CT
1 GC
/Helvetica-Bold 21.333 F
GS
[1 0 0 1 0 0] CT
0 22 moveto 
1 -1 scale
(59.14%) t 
GR
GR
GS
[0.75 0 0 0.75 196.652 43.75249] CT
1 GC
/Helvetica-Bold 21.333 F
GS
[1 0 0 1 0 0] CT
0 22 moveto 
1 -1 scale
(40.86 %) t 
GR
GR
GS
[0.75 0 0 0.75 127.652 321.84243] CT
/Helvetica-Bold 21.333 F
GS
[1 0 0 1 0 0] CT
0 22 moveto 
1 -1 scale
(2.75%) t 
GR
GR
GS
[0.75 0 0 0.75 106.75001 91.25001] CT
/Helvetica-Bold 16 F
GS
[1 0 0 1 0 0] CT
-67 17 moveto 
1 -1 scale
(Rayleigh) t 
GR
GR
GS
[0.75 0 0 0.75 105.25 218] CT
/Helvetica-Bold 16 F
GS
[1 0 0 1 0 0] CT
-67 17 moveto 
1 -1 scale
(Rayleigh) t 
GR
GR
GS
[0.75 0 0 0.75 105.25 343.25] CT
/Helvetica-Bold 16 F
GS
[1 0 0 1 0 0] CT
-67 17 moveto 
1 -1 scale
(Rayleigh) t 
GR
GR
GS
[0.75 0 0 0.75 106 368] CT
/Helvetica 16 F
GS
[1 0 0 1 0 0] CT
-52 17 moveto 
1 -1 scale
(Normal) t 
GR
GR
GS
[0.75 0 0 0.75 106 239.75] CT
/Helvetica 16 F
GS
[1 0 0 1 0 0] CT
-52 17 moveto 
1 -1 scale
(Normal) t 
GR
GR
GS
[0.75 0 0 0.75 106 114.5] CT
/Helvetica 16 F
GS
[1 0 0 1 0 0] CT
-52 17 moveto 
1 -1 scale
(Normal) t 
GR
GR
GS
[0.75 0 0 0.75 270.152 345.48837] CT
1 GC
/Helvetica-Bold 21.333 F
GS
[1 0 0 1 0 0] CT
0 22 moveto 
1 -1 scale
(60.71 %) t 
GR
GR
GS
[0.75 0 0 0.75 189.902 300.84243] CT
1 GC
/Helvetica-Bold 21.333 F
GS
[1 0 0 1 0 0] CT
0 22 moveto 
1 -1 scale
(36.54%) t 
GR
GR
%%Trailer
%%Pages: 1
%%EOF
