\relax 
\providecommand\hyper@newdestlabel[2]{}
\@writefile{toc}{\contentsline {chapter}{\numberline {4}GNSS-based collaborative ranging algorithms}{41}{chapter.4}\protected@file@percent }
\@writefile{lof}{\addvspace {10\p@ }}
\@writefile{lot}{\addvspace {10\p@ }}
\newlabel{ch:rangingAlgorithms}{{4}{41}{GNSS-based collaborative ranging algorithms}{chapter.4}{}}
\acronymused{CP}
\acronymused{CP}
\acronymused{GNSS}
\acronymused{GNSS}
\acronymused{LoS}
\acronymused{GNSS}
\acronymused{GNSS}
\acronymused{DGNSS}
\acronymused{IAR}
\@writefile{toc}{\contentsline {section}{\numberline {4.1}Baseline: Fundamental Definitions}{41}{section.4.1}\protected@file@percent }
\newlabel{sec:definitions}{{4.1}{41}{Baseline: Fundamental Definitions}{section.4.1}{}}
\acronymused{GNSS}
\newlabel{eq:displacement}{{4.1}{41}{Baseline: Fundamental Definitions}{equation.4.1.1}{}}
\newlabel{eq:euclidean}{{4.2}{41}{Baseline: Fundamental Definitions}{equation.4.1.2}{}}
\@writefile{loc}{\ChangesListline {added}{Added~(1)}{Inertial Cartesian reference frame}{42}}
\newlabel{fig:relative}{{4.1a}{42}{\added [id=1]{Inertial Cartesian reference frame}\relax }{figure.caption.28}{}}
\newlabel{sub@fig:relative}{{a}{42}{\added [id=1]{Inertial Cartesian reference frame}\relax }{figure.caption.28}{}}
\@writefile{loc}{\ChangesListline {added}{Added~(1)}{Absolute Cartesian reference frame}{42}}
\newlabel{fig:absolute}{{4.1b}{42}{\added [id=1]{Absolute Cartesian reference frame}\relax }{figure.caption.28}{}}
\newlabel{sub@fig:absolute}{{b}{42}{\added [id=1]{Absolute Cartesian reference frame}\relax }{figure.caption.28}{}}
\@writefile{lof}{\contentsline {figure}{\numberline {4.1}{\ignorespaces Baseline vectors shown in different 2D Cartesian reference frames.\relax }}{42}{figure.caption.28}\protected@file@percent }
\newlabel{fig:euclideanBasics}{{4.1}{42}{Baseline vectors shown in different 2D Cartesian reference frames.\relax }{figure.caption.28}{}}
\@writefile{toc}{\contentsline {subsection}{\numberline {4.1.1}Sensor-based baseline estimation}{42}{subsection.4.1.1}\protected@file@percent }
\newlabel{sec:sensors}{{4.1.1}{42}{Sensor-based baseline estimation}{subsection.4.1.1}{}}
\acronymused{UWB}
\AC@undonewlabel{acro:LiDAR}
\newlabel{acro:LiDAR}{{4.1.1}{42}{Sensor-based baseline estimation}{subsection.4.1.1}{}}
\acronymused{LiDAR}
\AC@undonewlabel{acro:SONAR}
\newlabel{acro:SONAR}{{4.1.1}{42}{Sensor-based baseline estimation}{subsection.4.1.1}{}}
\acronymused{SONAR}
\acronymused{ToA}
\AC@undonewlabel{acro:RADAR}
\newlabel{acro:RADAR}{{4.1.1}{42}{Sensor-based baseline estimation}{subsection.4.1.1}{}}
\acronymused{RADAR}
\acronymused{RF}
\acronymused{LoS}
\acronymused{CP}
\acronymused{RF}
\acronymused{LoS}
\acronymused{RF}
\acronymused{SONAR}
\acronymused{UWB}
\acronymused{LiDAR}
\acronymused{LiDAR}
\acronymused{UWB}
\acronymused{INS}
\acronymused{ToF}
\acronymused{CP}
\@writefile{toc}{\contentsline {section}{\numberline {4.2}Absolute Positions Distance (APD)}{43}{section.4.2}\protected@file@percent }
\newlabel{sec:apd}{{4.2}{43}{Absolute Positions Distance (APD)}{section.4.2}{}}
\acronymused{GNSS}
\acronymused{GNSS}
\@writefile{loc}{\ChangesListline {added}{Added}{s}{43}}
\acronymused{APD}
\acronymused{GNSS}
\newlabel{eq:APD}{{4.3}{43}{Absolute Positions Distance (APD)}{equation.4.2.3}{}}
\newlabel{eq:euclideanFormula}{{4.4}{43}{Absolute Positions Distance (APD)}{equation.4.2.4}{}}
\acronymused{GDOP}
\newlabel{eq:APDapprox}{{4.5}{43}{Absolute Positions Distance (APD)}{equation.4.2.5}{}}
\newlabel{eq:oldbutgold}{{4.6}{44}{Absolute Positions Distance (APD)}{equation.4.2.6}{}}
\newlabel{eq:inconsistent}{{4.7}{44}{Absolute Positions Distance (APD)}{equation.4.2.7}{}}
\@writefile{lof}{\contentsline {figure}{\numberline {4.2}{\ignorespaces Geometrical effect of the network delay on the baseline estimation in dynamic scenario. \relax }}{44}{figure.caption.29}\protected@file@percent }
\newlabel{fig:dynamicEuclidean}{{4.2}{44}{Geometrical effect of the network delay on the baseline estimation in dynamic scenario. \relax }{figure.caption.29}{}}
\acronymused{APD}
\acronymused{GNSS}
\AC@undonewlabel{acro:SD}
\newlabel{acro:SD}{{4.2}{44}{Absolute Positions Distance (APD)}{figure.caption.29}{}}
\acronymused{SD}
\AC@undonewlabel{acro:DD}
\newlabel{acro:DD}{{4.2}{44}{Absolute Positions Distance (APD)}{figure.caption.29}{}}
\acronymused{DD}
\@writefile{toc}{\contentsline {subsection}{\numberline {4.2.1}Error modelling of Euclidean distance in {GNSS} positioning solutions}{44}{subsection.4.2.1}\protected@file@percent }
\newlabel{sub:errModelAPD}{{4.2.1}{44}{Error modelling of Euclidean distance in {GNSS} positioning solutions}{subsection.4.2.1}{}}
\acronymused{GNSS}
\@writefile{toc}{\contentsline {subsubsection}{Distribution of GNSS positioning solutions}{45}{subsection.4.2.1}\protected@file@percent }
\newlabel{sub:distributionPosSolutions}{{4.2.1}{45}{Distribution of GNSS positioning solutions}{subsection.4.2.1}{}}
\acronymused{GNSS}
\AC@undonewlabel{acro:WGN}
\newlabel{acro:WGN}{{4.2.1}{45}{Distribution of GNSS positioning solutions}{subsection.4.2.1}{}}
\acronymused{WGN}
\@writefile{lof}{\contentsline {figure}{\numberline {4.3}{\ignorespaces Example of bivariate Gaussian distributed \ac {PVT} solutions (Horizontal positioning solution) with a graphical visualization of the error covariance matrices in terms of 95\% and 99\% confidence intervals.\relax }}{45}{figure.caption.30}\protected@file@percent }
\acronymused{PVT}
\newlabel{fig:exDistribution}{{4.3}{45}{Example of bivariate Gaussian distributed \ac {PVT} solutions (Horizontal positioning solution) with a graphical visualization of the error covariance matrices in terms of 95\% and 99\% confidence intervals.\relax }{figure.caption.30}{}}
\acronymused{GNSS}
\acronymused{APD}
\acronymused{APD}
\@writefile{toc}{\contentsline {subsubsection}{On the generalization of \ac {APD} error distribution}{46}{figure.caption.30}\protected@file@percent }
\newlabel{sub:generalization}{{4.2.1}{46}{On the generalization of \ac {APD} error distribution}{figure.caption.30}{}}
\newlabel{eq:combined}{{4.8}{46}{On the generalization of \ac {APD} error distribution}{equation.4.2.8}{}}
\acronymused{PVT}
\AC@undonewlabel{acro:DOP}
\newlabel{acro:DOP}{{4.2.1}{46}{On the generalization of \ac {APD} error distribution}{equation.4.2.8}{}}
\acronymused{DOP}
\acronymused{GNSS}
\newlabel{eq:battha}{{4.9}{46}{On the generalization of \ac {APD} error distribution}{equation.4.2.9}{}}
\AC@undonewlabel{acro:MSE}
\newlabel{acro:MSE}{{4.2.1}{46}{On the generalization of \ac {APD} error distribution}{equation.4.2.10}{}}
\acronymused{MSE}
\acronymused{PDF}
\acronymused{APD}
\AC@undonewlabel{acro:GoF}
\newlabel{acro:GoF}{{4.2.1}{46}{On the generalization of \ac {APD} error distribution}{equation.4.2.10}{}}
\acronymused{GoF}
\acronymused{APD}
\@writefile{loc}{\ChangesListline {added}{Added~(1)}{Qualitative comparison between real and approximated probability distributions}{47}}
\newlabel{fig:convergence}{{4.4a}{47}{\added [id=1]{Qualitative comparison between real and approximated probability distributions}\relax }{figure.caption.31}{}}
\newlabel{sub@fig:convergence}{{a}{47}{\added [id=1]{Qualitative comparison between real and approximated probability distributions}\relax }{figure.caption.31}{}}
\acronymused{MSE}
\@writefile{loc}{\ChangesListline {added}{Added~(1)}{Sample-based \ac {MSE} reduction by increasing $D_\text  {\relax \fontsize  {6}{7}\selectfont  $B$}$}{47}}
\newlabel{fig:geometry2}{{4.4b}{47}{\added [id=1]{Sample-based \ac {MSE} reduction by increasing $D_\ti {B}$}\relax }{figure.caption.31}{}}
\newlabel{sub@fig:geometry2}{{b}{47}{\added [id=1]{Sample-based \ac {MSE} reduction by increasing $D_\ti {B}$}\relax }{figure.caption.31}{}}
\@writefile{lof}{\contentsline {figure}{\numberline {4.4}{\ignorespaces \ac {APD} distribution approaching Gaussian distribution with the same mean and variance with the increase of $D_\text  {\relax \fontsize  {6}{7}\selectfont  $B$}$.\relax }}{47}{figure.caption.31}\protected@file@percent }
\acronymused{APD}
\@writefile{toc}{\contentsline {section}{\numberline {4.3}GNSS-based differential baseline computation}{47}{section.4.3}\protected@file@percent }
\newlabel{sec:diffGNSSranging}{{4.3}{47}{GNSS-based differential baseline computation}{section.4.3}{}}
\acronymused{GNSS}
\acronymused{APD}
\acronymused{GNSS}
\@writefile{toc}{\contentsline {subsection}{\numberline {4.3.1}GNSS-based baseline estimation}{48}{subsection.4.3.1}\protected@file@percent }
\newlabel{sub:gnssBaselineEst}{{4.3.1}{48}{GNSS-based baseline estimation}{subsection.4.3.1}{}}
\acronymused{DGPS}
\acronymused{DGNSS}
\acronymused{GNSS}
\newlabel{fig:sce_a}{{4.5a}{48}{\relax }{figure.caption.32}{}}
\newlabel{sub@fig:sce_a}{{a}{48}{\relax }{figure.caption.32}{}}
\newlabel{fig:sce_b}{{4.5b}{48}{\relax }{figure.caption.32}{}}
\newlabel{sub@fig:sce_b}{{b}{48}{\relax }{figure.caption.32}{}}
\@writefile{lof}{\contentsline {figure}{\numberline {4.5}{\ignorespaces {\relax \fontsize  {10}{12}\selectfont  \abovedisplayskip 10\p@ plus2\p@ minus5\p@ \abovedisplayshortskip \z@ plus3\p@ \belowdisplayshortskip 6\p@ plus3\p@ minus3\p@ \def \leftmargin \leftmargini \parsep 4.5\p@ plus2\p@ minus\p@ \topsep 9\p@ plus3\p@ minus5\p@ \itemsep 4.5\p@ plus2\p@ minus\p@ {\leftmargin \leftmargini \topsep 6\p@ plus2\p@ minus2\p@ \parsep 3\p@ plus2\p@ minus\p@ \itemsep \parsep }\belowdisplayskip \abovedisplayskip GNSS-based ranging: open sky scenarios characterized by the full common visibility of the satellites (\ref  {fig:sce_a}) and urban scenario with a single satellite in common view (\ref  {fig:sce_b})}.\relax }}{48}{figure.caption.32}\protected@file@percent }
\newlabel{fig:scenarios}{{4.5}{48}{{\small GNSS-based ranging: open sky scenarios characterized by the full common visibility of the satellites (\ref {fig:sce_a}) and urban scenario with a single satellite in common view (\ref {fig:sce_b})}.\relax }{figure.caption.32}{}}
\acronymused{GNSS}
\acronymused{APD}
\acronymused{LBS}
\acronymused{GNSS}
\acronymused{DGPS}
\AC@undonewlabel{acro:PR}
\newlabel{acro:PR}{{4.3.1}{48}{GNSS-based baseline estimation}{figure.caption.32}{}}
\acronymused{PR}
\acronymused{SD}
\acronymused{DD}
\acronymused{GNSS}
\acronymused{IAR}
\acronymused{GNSS}
\acronymused{GNSS}
\acronymused{DGPS}
\acronymused{CP}
\acronymused{RTK}
\acronymused{DGPS}
\AC@undonewlabel{acro:ITS}
\newlabel{acro:ITS}{{4.3.1}{49}{GNSS-based baseline estimation}{figure.caption.32}{}}
\acronymused{ITS}
\acronymused{GNSS}
\@writefile{toc}{\contentsline {subsection}{\numberline {4.3.2}Time-compensation of asynchronous observables (Doppler-based)}{49}{subsection.4.3.2}\protected@file@percent }
\newlabel{sub:timeCompDoppler}{{4.3.2}{49}{Time-compensation of asynchronous observables (Doppler-based)}{subsection.4.3.2}{}}
\acronymused{GNSS}
\acronymused{PVT}
\acronymused{GNSS}
\newlabel{eq:timeSync}{{4.11}{49}{Time-compensation of asynchronous observables (Doppler-based)}{equation.4.3.11}{}}
\acronymused{GNSS}
\acronymused{GPS}
\@writefile{toc}{\contentsline {subsection}{\numberline {4.3.3}Raw Pseudorange Ranging (PR)}{49}{subsection.4.3.3}\protected@file@percent }
\newlabel{sub:pr}{{4.3.3}{49}{Raw Pseudorange Ranging (PR)}{subsection.4.3.3}{}}
\newlabel{eq:PRdisplacement}{{4.12}{50}{Raw Pseudorange Ranging (PR)}{equation.4.3.12}{}}
\acronymused{PR}
\newlabel{eq:PRpseudoequation}{{4.13}{50}{Raw Pseudorange Ranging (PR)}{equation.4.3.13}{}}
\acronymused{WLS}
\newlabel{eq:PRequation}{{4.15}{50}{Raw Pseudorange Ranging (PR)}{equation.4.3.15}{}}
\@writefile{loc}{\ChangesListline {added}{Added~(1)}{$\Delta \bm  {\rho }_{ij}(t_k)=\left [ \bm  {\rho }_{i} - \bm  {\rho }_{j} \right ]$ for the same satellites and}{50}}
\acronymused{PVT}
\newlabel{eq:approxDisplacement}{{4.16}{50}{Raw Pseudorange Ranging (PR)}{equation.4.3.16}{}}
\@writefile{toc}{\contentsline {subsection}{\numberline {4.3.4}Single Difference Ranging (SD)}{50}{subsection.4.3.4}\protected@file@percent }
\newlabel{sub:sd}{{4.3.4}{50}{Single Difference Ranging (SD)}{subsection.4.3.4}{}}
\@writefile{lof}{\contentsline {figure}{\numberline {4.6}{\ignorespaces {\relax \fontsize  {10}{12}\selectfont  \abovedisplayskip 10\p@ plus2\p@ minus5\p@ \abovedisplayshortskip \z@ plus3\p@ \belowdisplayshortskip 6\p@ plus3\p@ minus3\p@ \def \leftmargin \leftmargini \parsep 4.5\p@ plus2\p@ minus\p@ \topsep 9\p@ plus3\p@ minus5\p@ \itemsep 4.5\p@ plus2\p@ minus\p@ {\leftmargin \leftmargini \topsep 6\p@ plus2\p@ minus2\p@ \parsep 3\p@ plus2\p@ minus\p@ \itemsep \parsep }\belowdisplayskip \abovedisplayskip Single Difference principle applied to two \ac {GPS} receivers. Image taken from \cite {differentialGEOSPATIAL}. }\relax }}{50}{figure.caption.33}\protected@file@percent }
\acronymused{GPS}
\newlabel{fig:singleDiff}{{4.6}{50}{{\small Single Difference principle applied to two \ac {GPS} receivers. Image taken from \cite {differentialGEOSPATIAL}. }\relax }{figure.caption.33}{}}
\acronymused{GNSS}
\newlabel{eq:singleDiff}{{4.17}{51}{Single Difference Ranging (SD)}{equation.4.3.17}{}}
\newlabel{eq:singleDiff_mat}{{4.18}{51}{Single Difference Ranging (SD)}{equation.4.3.18}{}}
\acronymused{SD}
\newlabel{eq:SDranging}{{4.19}{51}{Single Difference Ranging (SD)}{equation.4.3.19}{}}
\acronymused{SD}
\newlabel{eq:sdcov}{{4.20}{51}{Single Difference Ranging (SD)}{equation.4.3.20}{}}
\@writefile{loc}{\ChangesListline {replaced}{Replaced~(1)}{where $\mathbf  {R}_{\text  {\relax \fontsize  {6}{7}\selectfont  $SD$}}$ is the error covariance matrix of the single differences and $\mathbf  {H}$ is the second term in \textup  {\hbox {\mathsurround \z@ \normalfont  (\ignorespaces \ref  {SDranging}\unskip \@@italiccorr )}}.}{51}}
\@writefile{toc}{\contentsline {subsection}{\numberline {4.3.5}Double Difference Ranging (DD)}{51}{subsection.4.3.5}\protected@file@percent }
\newlabel{sub:dd}{{4.3.5}{51}{Double Difference Ranging (DD)}{subsection.4.3.5}{}}
\newlabel{eq:double}{{4.21}{51}{Double Difference Ranging (DD)}{equation.4.3.21}{}}
\@writefile{lof}{\contentsline {figure}{\numberline {4.7}{\ignorespaces {\relax \fontsize  {10}{12}\selectfont  \abovedisplayskip 10\p@ plus2\p@ minus5\p@ \abovedisplayshortskip \z@ plus3\p@ \belowdisplayshortskip 6\p@ plus3\p@ minus3\p@ \def \leftmargin \leftmargini \parsep 4.5\p@ plus2\p@ minus\p@ \topsep 9\p@ plus3\p@ minus5\p@ \itemsep 4.5\p@ plus2\p@ minus\p@ {\leftmargin \leftmargini \topsep 6\p@ plus2\p@ minus2\p@ \parsep 3\p@ plus2\p@ minus\p@ \itemsep \parsep }\belowdisplayskip \abovedisplayskip Single Difference principle applied between two \ac {GPS} receivers.}\relax }}{52}{figure.caption.34}\protected@file@percent }
\acronymused{GPS}
\newlabel{fig:singleDiff}{{4.7}{52}{{\small Single Difference principle applied between two \ac {GPS} receivers.}\relax }{figure.caption.34}{}}
\newlabel{eq:DeltaR}{{4.22}{52}{Double Difference Ranging (DD)}{equation.4.3.22}{}}
\acronymused{DD}
\newlabel{eq:doubleDiff_mat}{{4.23}{52}{Double Difference Ranging (DD)}{equation.4.3.23}{}}
\newlabel{eq:dd}{{4.24}{52}{Double Difference Ranging (DD)}{equation.4.3.24}{}}
\AC@undonewlabel{acro:LS}
\newlabel{acro:LS}{{4.3.5}{52}{Double Difference Ranging (DD)}{equation.4.3.24}{}}
\acronymused{LS}
\newlabel{eq:LMSdisplacement}{{4.25}{52}{Double Difference Ranging (DD)}{equation.4.3.25}{}}
\acronymused{GNSS}
\newlabel{eq:ddcov}{{4.26}{53}{Double Difference Ranging (DD)}{equation.4.3.26}{}}
\acronymused{SD}
\@writefile{toc}{\contentsline {subsubsection}{Timing of observables exchange through packet network}{53}{equation.4.3.27}\protected@file@percent }
\newlabel{sub:timing}{{4.3.5}{53}{Timing of observables exchange through packet network}{equation.4.3.27}{}}
\acronymused{GNSS}
\acronymused{GNSS}
\acronymused{GNSS}
\acronymused{ITS}
\acronymused{GNSS}
\acronymused{GNSS}
\@writefile{lof}{\contentsline {figure}{\numberline {4.8}{\ignorespaces {\relax \fontsize  {10}{12}\selectfont  \abovedisplayskip 10\p@ plus2\p@ minus5\p@ \abovedisplayshortskip \z@ plus3\p@ \belowdisplayshortskip 6\p@ plus3\p@ minus3\p@ \def \leftmargin \leftmargini \parsep 4.5\p@ plus2\p@ minus\p@ \topsep 9\p@ plus3\p@ minus5\p@ \itemsep 4.5\p@ plus2\p@ minus\p@ {\leftmargin \leftmargini \topsep 6\p@ plus2\p@ minus2\p@ \parsep 3\p@ plus2\p@ minus\p@ \itemsep \parsep }\belowdisplayskip \abovedisplayskip Timing of the exchange of navigation data for the computation of collaborative measurements between agents retrieving asynchronous measurements and \ac {PVT} solutions.}\relax }}{54}{figure.caption.35}\protected@file@percent }
\acronymused{PVT}
\newlabel{fig:timeSchematic}{{4.8}{54}{{\small Timing of the exchange of navigation data for the computation of collaborative measurements between agents retrieving asynchronous measurements and \ac {PVT} solutions.}\relax }{figure.caption.35}{}}
\acronymused{GNSS}
\@writefile{toc}{\contentsline {section}{\numberline {4.4}Inter-agent Ranging (IAR)}{54}{section.4.4}\protected@file@percent }
\newlabel{sec:iar}{{4.4}{54}{Inter-agent Ranging (IAR)}{section.4.4}{}}
\acronymused{GNSS}
\acronymused{IAR}
\acronymused{PVT}
\@writefile{toc}{\contentsline {subsection}{\numberline {4.4.1}Theoretical Inter Agent Range}{54}{subsection.4.4.1}\protected@file@percent }
\newlabel{sub:IARtheory}{{4.4.1}{54}{Theoretical Inter Agent Range}{subsection.4.4.1}{}}
\acronymused{LoS}
\acronymused{IAR}
\@writefile{lof}{\contentsline {figure}{\numberline {4.9}{\ignorespaces \relax \fontsize  {10}{12}\selectfont  \abovedisplayskip 10\p@ plus2\p@ minus5\p@ \abovedisplayshortskip \z@ plus3\p@ \belowdisplayshortskip 6\p@ plus3\p@ minus3\p@ \def \leftmargin \leftmargini \parsep 4.5\p@ plus2\p@ minus\p@ \topsep 9\p@ plus3\p@ minus5\p@ \itemsep 4.5\p@ plus2\p@ minus\p@ {\leftmargin \leftmargini \topsep 6\p@ plus2\p@ minus2\p@ \parsep 3\p@ plus2\p@ minus\p@ \itemsep \parsep }\belowdisplayskip \abovedisplayskip \ac {IAR} geometrical scenario. Ranging description with highlighted \textit  {ambiguity circumference} and \textit  {ambiguity line}.\relax }}{55}{figure.caption.36}\protected@file@percent }
\acronymused{IAR}
\newlabel{fig:geometry}{{4.9}{55}{\small \ac {IAR} geometrical scenario. Ranging description with highlighted \textit {ambiguity circumference} and \textit {ambiguity line}.\relax }{figure.caption.36}{}}
\acronymused{IAR}
\newlabel{eq:idealIAR}{{4.28}{55}{Theoretical Inter Agent Range}{equation.4.4.28}{}}
\newlabel{eq:gamma}{{4.29}{55}{Theoretical Inter Agent Range}{equation.4.4.29}{}}
\acronymused{GNSS}
\acronymused{IAR}
\newlabel{eq:realIAR}{{4.30}{55}{Theoretical Inter Agent Range}{equation.4.4.30}{}}
\acronymused{IAR}
\acronymused{IAR}
\acronymused{GNSS}
\@writefile{toc}{\contentsline {subsection}{\numberline {4.4.2}Numerically-stable Law of Cosines for \ac {GNSS} applications}{56}{subsection.4.4.2}\protected@file@percent }
\newlabel{sub:carnotStable}{{4.4.2}{56}{Numerically-stable Law of Cosines for \ac {GNSS} applications}{subsection.4.4.2}{}}
\newlabel{eq:carnotTheorem}{{4.31}{56}{Numerically-stable Law of Cosines for \ac {GNSS} applications}{equation.4.4.31}{}}
\newlabel{fig:carnot}{{\caption@xref {fig:carnot}{ on input line 673}}{56}{Numerically-stable Law of Cosines for \ac {GNSS} applications}{figure.caption.37}{}}
\@writefile{lof}{\contentsline {figure}{\numberline {4.10}{\ignorespaces Triangular geometry emphasizing the limiting conditions of \ac {IAR} implementation: $a\simeq b$ and $\gamma \simeq 0$.\relax }}{56}{figure.caption.37}\protected@file@percent }
\acronymused{IAR}
\newlabel{eq:carnotTheoremSide}{{4.32}{56}{Numerically-stable Law of Cosines for \ac {GNSS} applications}{equation.4.4.32}{}}
\acronymused{IAR}
\newlabel{eq:limitCarnot}{{4.33}{56}{Numerically-stable Law of Cosines for \ac {GNSS} applications}{equation.4.4.33}{}}
\newlabel{eq:carnotExpansion}{{4.34}{57}{Numerically-stable Law of Cosines for \ac {GNSS} applications}{equation.4.4.34}{}}
\newlabel{eq:iarStable}{{4.39}{57}{Numerically-stable Law of Cosines for \ac {GNSS} applications}{equation.4.4.39}{}}
\@writefile{toc}{\contentsline {subsection}{\numberline {4.4.3}Time-compensation of asynchronous observables (orbit-based)}{57}{subsection.4.4.3}\protected@file@percent }
\newlabel{sub:timeCompensation}{{4.4.3}{57}{Time-compensation of asynchronous observables (orbit-based)}{subsection.4.4.3}{}}
\acronymused{IAR}
\acronymused{IAR}
\newlabel{eq:compensated_range}{{4.40}{57}{Time-compensation of asynchronous observables (orbit-based)}{equation.4.4.40}{}}
\acronymused{IAR}
\acronymused{IAR}
\acronymused{APD}
\acronymused{GNSS}
\acronymused{IAR}
\acronymused{IAR}
\acronymused{IAR}
\acronymused{GNSS}
\@writefile{toc}{\contentsline {subsection}{\numberline {4.4.4}Mean and variance analytical derivation}{58}{subsection.4.4.4}\protected@file@percent }
\newlabel{sub:IAR_ApproxVar}{{4.4.4}{58}{Mean and variance analytical derivation}{subsection.4.4.4}{}}
\newlabel{eq:taylorExpansion}{{4.44}{58}{Mean and variance analytical derivation}{equation.4.4.44}{}}
\newlabel{eq:avgIAR}{{4.46}{58}{Mean and variance analytical derivation}{equation.4.4.46}{}}
\acronymused{IAR}
\acronymused{IAR}
\newlabel{eq:generalizedVar}{{4.47}{59}{Mean and variance analytical derivation}{equation.4.4.47}{}}
\newlabel{eq:generalizedIARvar}{{4.49}{59}{Mean and variance analytical derivation}{equation.4.4.49}{}}
\acronymused{IAR}
\acronymused{IAR}
\newlabel{eq:varIAR_uncorr}{{4.51}{59}{Mean and variance analytical derivation}{equation.4.4.51}{}}
\AC@undonewlabel{acro:UERE}
\newlabel{acro:UERE}{{4.4.4}{60}{Mean and variance analytical derivation}{equation.4.4.51}{}}
\acronymused{UERE}
\acronymused{IAR}
\acronymused{IAR}
\acronymused{LTP}
\acronymused{LTP}
\acronymused{IAR}
\@writefile{toc}{\contentsline {section}{\numberline {4.5}Final remarks}{60}{section.4.5}\protected@file@percent }
\newlabel{sec:final3}{{4.5}{60}{Final remarks}{section.4.5}{}}
\@writefile{lof}{\contentsline {figure}{\numberline {4.11}{\ignorespaces {\relax \fontsize  {10}{12}\selectfont  \abovedisplayskip 10\p@ plus2\p@ minus5\p@ \abovedisplayshortskip \z@ plus3\p@ \belowdisplayshortskip 6\p@ plus3\p@ minus3\p@ \def \leftmargin \leftmargini \parsep 4.5\p@ plus2\p@ minus\p@ \topsep 9\p@ plus3\p@ minus5\p@ \itemsep 4.5\p@ plus2\p@ minus\p@ {\leftmargin \leftmargini \topsep 6\p@ plus2\p@ minus2\p@ \parsep 3\p@ plus2\p@ minus\p@ \itemsep \parsep }\belowdisplayskip \abovedisplayskip Example of simultaneous \ac {GNSS} satellites visibility for two agents following an experimental trajectory in urban environment (upper) and practicability of GNSS-only ranging methods along the time (bottom).}\relax }}{60}{figure.caption.38}\protected@file@percent }
\acronymused{GNSS}
\newlabel{fig:visibility}{{4.11}{60}{{\small Example of simultaneous \ac {GNSS} satellites visibility for two agents following an experimental trajectory in urban environment (upper) and practicability of GNSS-only ranging methods along the time (bottom).}\relax }{figure.caption.38}{}}
\acronymused{APD}
\acronymused{APD}
\acronymused{LoS}
\acronymused{IAR}
\@setckpt{Chapter3/chapter3}{
\setcounter{page}{62}
\setcounter{equation}{51}
\setcounter{enumi}{0}
\setcounter{enumii}{0}
\setcounter{enumiii}{0}
\setcounter{enumiv}{0}
\setcounter{footnote}{0}
\setcounter{mpfootnote}{0}
\setcounter{part}{0}
\setcounter{chapter}{4}
\setcounter{section}{5}
\setcounter{subsection}{0}
\setcounter{subsubsection}{0}
\setcounter{paragraph}{0}
\setcounter{subparagraph}{0}
\setcounter{figure}{11}
\setcounter{table}{0}
\setcounter{SDpage}{0}
\setcounter{NumberSD}{0}
\setcounter{tomo}{0}
\setcounter{parentequation}{0}
\setcounter{caption@flags}{0}
\setcounter{ContinuedFloat}{0}
\setcounter{subfigure}{0}
\setcounter{subtable}{0}
\setcounter{float@type}{16}
\setcounter{tabx@nest}{0}
\setcounter{listtotal}{0}
\setcounter{listcount}{0}
\setcounter{liststart}{0}
\setcounter{liststop}{0}
\setcounter{citecount}{0}
\setcounter{citetotal}{0}
\setcounter{multicitecount}{0}
\setcounter{multicitetotal}{0}
\setcounter{instcount}{253}
\setcounter{maxnames}{3}
\setcounter{minnames}{1}
\setcounter{maxitems}{3}
\setcounter{minitems}{1}
\setcounter{citecounter}{0}
\setcounter{maxcitecounter}{0}
\setcounter{savedcitecounter}{0}
\setcounter{uniquelist}{0}
\setcounter{uniquename}{0}
\setcounter{refsection}{0}
\setcounter{refsegment}{0}
\setcounter{maxextratitle}{0}
\setcounter{maxextratitleyear}{0}
\setcounter{maxextraname}{5}
\setcounter{maxextradate}{0}
\setcounter{maxextraalpha}{0}
\setcounter{abbrvpenalty}{50}
\setcounter{highnamepenalty}{50}
\setcounter{lownamepenalty}{25}
\setcounter{maxparens}{3}
\setcounter{parenlevel}{0}
\setcounter{mincomprange}{10}
\setcounter{maxcomprange}{100000}
\setcounter{mincompwidth}{1}
\setcounter{afterword}{0}
\setcounter{savedafterword}{0}
\setcounter{annotator}{0}
\setcounter{savedannotator}{0}
\setcounter{author}{0}
\setcounter{savedauthor}{0}
\setcounter{bookauthor}{0}
\setcounter{savedbookauthor}{0}
\setcounter{commentator}{0}
\setcounter{savedcommentator}{0}
\setcounter{editor}{0}
\setcounter{savededitor}{0}
\setcounter{editora}{0}
\setcounter{savededitora}{0}
\setcounter{editorb}{0}
\setcounter{savededitorb}{0}
\setcounter{editorc}{0}
\setcounter{savededitorc}{0}
\setcounter{foreword}{0}
\setcounter{savedforeword}{0}
\setcounter{holder}{0}
\setcounter{savedholder}{0}
\setcounter{introduction}{0}
\setcounter{savedintroduction}{0}
\setcounter{namea}{0}
\setcounter{savednamea}{0}
\setcounter{nameb}{0}
\setcounter{savednameb}{0}
\setcounter{namec}{0}
\setcounter{savednamec}{0}
\setcounter{translator}{0}
\setcounter{savedtranslator}{0}
\setcounter{shortauthor}{0}
\setcounter{savedshortauthor}{0}
\setcounter{shorteditor}{0}
\setcounter{savedshorteditor}{0}
\setcounter{labelname}{0}
\setcounter{savedlabelname}{0}
\setcounter{institution}{0}
\setcounter{savedinstitution}{0}
\setcounter{lista}{0}
\setcounter{savedlista}{0}
\setcounter{listb}{0}
\setcounter{savedlistb}{0}
\setcounter{listc}{0}
\setcounter{savedlistc}{0}
\setcounter{listd}{0}
\setcounter{savedlistd}{0}
\setcounter{liste}{0}
\setcounter{savedliste}{0}
\setcounter{listf}{0}
\setcounter{savedlistf}{0}
\setcounter{location}{0}
\setcounter{savedlocation}{0}
\setcounter{organization}{0}
\setcounter{savedorganization}{0}
\setcounter{origlocation}{0}
\setcounter{savedoriglocation}{0}
\setcounter{origpublisher}{0}
\setcounter{savedorigpublisher}{0}
\setcounter{publisher}{0}
\setcounter{savedpublisher}{0}
\setcounter{language}{0}
\setcounter{savedlanguage}{0}
\setcounter{origlanguage}{0}
\setcounter{savedoriglanguage}{0}
\setcounter{pageref}{0}
\setcounter{savedpageref}{0}
\setcounter{textcitecount}{0}
\setcounter{textcitetotal}{0}
\setcounter{textcitemaxnames}{0}
\setcounter{biburlnumpenalty}{0}
\setcounter{biburlucpenalty}{0}
\setcounter{biburllcpenalty}{0}
\setcounter{smartand}{1}
\setcounter{bbx:relatedcount}{0}
\setcounter{bbx:relatedtotal}{0}
\setcounter{Item}{0}
\setcounter{Hfootnote}{0}
\setcounter{bookmark@seq@number}{46}
\setcounter{nlinenum}{0}
\setcounter{algorithm}{0}
\setcounter{ALC@unique}{0}
\setcounter{ALC@line}{0}
\setcounter{ALC@rem}{0}
\setcounter{ALC@depth}{0}
\setcounter{@todonotes@numberoftodonotes}{0}
\setcounter{Changes@AuthorCount}{2}
\setcounter{Changes@Author}{2}
\setcounter{Changes@addedCount}{1}
\setcounter{Changes@deletedCount}{0}
\setcounter{Changes@replacedCount}{1}
\setcounter{Changes@highlightCount}{0}
\setcounter{Changes@commentCount}{0}
\setcounter{authorcommentcount}{0}
\setcounter{Changes@addedCount1}{21}
\setcounter{Changes@deletedCount1}{2}
\setcounter{Changes@replacedCount1}{6}
\setcounter{Changes@highlightCount1}{0}
\setcounter{Changes@commentCount1}{0}
\setcounter{lstnumber}{1}
\setcounter{FancyVerbLine}{0}
\setcounter{section@level}{0}
\setcounter{lstlisting}{0}
}
