%!PS-Adobe-3.0 EPSF-3.0
%%Creator: (MATLAB, The Mathworks, Inc. Version 9.5.0.944444 \(R2018b\). Operating System: Windows 10)
%%Title: (C:/Users/navsas/Dropbox/ION GNSS+2019 Extended Abstract [DET_DAUIN]/VTC-19/LaTex/fig/ZeroBaselineFig.eps)
%%CreationDate: 2019-07-08T12:29:24
%%Pages: (atend)
%%BoundingBox: 0 0 701 360
%%LanguageLevel: 3
%%EndComments
%%BeginProlog
%%BeginResource: procset (Apache XML Graphics Std ProcSet) 1.2 0
%%Version: 1.2 0
%%Copyright: (Copyright 2001-2003,2010 The Apache Software Foundation. License terms: http://www.apache.org/licenses/LICENSE-2.0)
/bd{bind def}bind def
/ld{load def}bd
/GR/grestore ld
/GS/gsave ld
/RM/rmoveto ld
/C/curveto ld
/t/show ld
/L/lineto ld
/ML/setmiterlimit ld
/CT/concat ld
/f/fill ld
/N/newpath ld
/S/stroke ld
/CC/setcmykcolor ld
/A/ashow ld
/cp/closepath ld
/RC/setrgbcolor ld
/LJ/setlinejoin ld
/GC/setgray ld
/LW/setlinewidth ld
/M/moveto ld
/re {4 2 roll M
1 index 0 rlineto
0 exch rlineto
neg 0 rlineto
cp } bd
/_ctm matrix def
/_tm matrix def
/BT { _ctm currentmatrix pop matrix _tm copy pop 0 0 moveto } bd
/ET { _ctm setmatrix } bd
/iTm { _ctm setmatrix _tm concat } bd
/Tm { _tm astore pop iTm 0 0 moveto } bd
/ux 0.0 def
/uy 0.0 def
/F {
  /Tp exch def
  /Tf exch def
  Tf findfont Tp scalefont setfont
  /cf Tf def  /cs Tp def
} bd
/ULS {currentpoint /uy exch def /ux exch def} bd
/ULE {
  /Tcx currentpoint pop def
  gsave
  newpath
  cf findfont cs scalefont dup
  /FontMatrix get 0 get /Ts exch def /FontInfo get dup
  /UnderlinePosition get Ts mul /To exch def
  /UnderlineThickness get Ts mul /Tt exch def
  ux uy To add moveto  Tcx uy To add lineto
  Tt setlinewidth stroke
  grestore
} bd
/OLE {
  /Tcx currentpoint pop def
  gsave
  newpath
  cf findfont cs scalefont dup
  /FontMatrix get 0 get /Ts exch def /FontInfo get dup
  /UnderlinePosition get Ts mul /To exch def
  /UnderlineThickness get Ts mul /Tt exch def
  ux uy To add cs add moveto Tcx uy To add cs add lineto
  Tt setlinewidth stroke
  grestore
} bd
/SOE {
  /Tcx currentpoint pop def
  gsave
  newpath
  cf findfont cs scalefont dup
  /FontMatrix get 0 get /Ts exch def /FontInfo get dup
  /UnderlinePosition get Ts mul /To exch def
  /UnderlineThickness get Ts mul /Tt exch def
  ux uy To add cs 10 mul 26 idiv add moveto Tcx uy To add cs 10 mul 26 idiv add lineto
  Tt setlinewidth stroke
  grestore
} bd
/QT {
/Y22 exch store
/X22 exch store
/Y21 exch store
/X21 exch store
currentpoint
/Y21 load 2 mul add 3 div exch
/X21 load 2 mul add 3 div exch
/X21 load 2 mul /X22 load add 3 div
/Y21 load 2 mul /Y22 load add 3 div
/X22 load /Y22 load curveto
} bd
/SSPD {
dup length /d exch dict def
{
/v exch def
/k exch def
currentpagedevice k known {
/cpdv currentpagedevice k get def
v cpdv ne {
/upd false def
/nullv v type /nulltype eq def
/nullcpdv cpdv type /nulltype eq def
nullv nullcpdv or
{
/upd true def
} {
/sametype v type cpdv type eq def
sametype {
v type /arraytype eq {
/vlen v length def
/cpdvlen cpdv length def
vlen cpdvlen eq {
0 1 vlen 1 sub {
/i exch def
/obj v i get def
/cpdobj cpdv i get def
obj cpdobj ne {
/upd true def
exit
} if
} for
} {
/upd true def
} ifelse
} {
v type /dicttype eq {
v {
/dv exch def
/dk exch def
/cpddv cpdv dk get def
dv cpddv ne {
/upd true def
exit
} if
} forall
} {
/upd true def
} ifelse
} ifelse
} if
} ifelse
upd true eq {
d k v put
} if
} if
} if
} forall
d length 0 gt {
d setpagedevice
} if
} bd
/RE { % /NewFontName [NewEncodingArray] /FontName RE -
  findfont dup length dict begin
  {
    1 index /FID ne
    {def} {pop pop} ifelse
  } forall
  /Encoding exch def
  /FontName 1 index def
  currentdict definefont pop
  end
} bind def
%%EndResource
%%BeginResource: procset (Apache XML Graphics EPS ProcSet) 1.0 0
%%Version: 1.0 0
%%Copyright: (Copyright 2002-2003 The Apache Software Foundation. License terms: http://www.apache.org/licenses/LICENSE-2.0)
/BeginEPSF { %def
/b4_Inc_state save def         % Save state for cleanup
/dict_count countdictstack def % Count objects on dict stack
/op_count count 1 sub def      % Count objects on operand stack
userdict begin                 % Push userdict on dict stack
/showpage { } def              % Redefine showpage, { } = null proc
0 setgray 0 setlinecap         % Prepare graphics state
1 setlinewidth 0 setlinejoin
10 setmiterlimit [ ] 0 setdash newpath
/languagelevel where           % If level not equal to 1 then
{pop languagelevel             % set strokeadjust and
1 ne                           % overprint to their defaults.
{false setstrokeadjust false setoverprint
} if
} if
} bd
/EndEPSF { %def
count op_count sub {pop} repeat            % Clean up stacks
countdictstack dict_count sub {end} repeat
b4_Inc_state restore
} bd
%%EndResource
%FOPBeginFontDict
%%IncludeResource: font Courier-Oblique
%%IncludeResource: font Courier-BoldOblique
%%IncludeResource: font Courier-Bold
%%IncludeResource: font ZapfDingbats
%%IncludeResource: font Symbol
%%IncludeResource: font Helvetica
%%IncludeResource: font Helvetica-Oblique
%%IncludeResource: font Helvetica-Bold
%%IncludeResource: font Helvetica-BoldOblique
%%IncludeResource: font Times-Roman
%%IncludeResource: font Times-Italic
%%IncludeResource: font Times-Bold
%%IncludeResource: font Times-BoldItalic
%%IncludeResource: font Courier
%FOPEndFontDict
%%BeginResource: encoding WinAnsiEncoding
/WinAnsiEncoding [
/.notdef /.notdef /.notdef /.notdef /.notdef
/.notdef /.notdef /.notdef /.notdef /.notdef
/.notdef /.notdef /.notdef /.notdef /.notdef
/.notdef /.notdef /.notdef /.notdef /.notdef
/.notdef /.notdef /.notdef /.notdef /.notdef
/.notdef /.notdef /.notdef /.notdef /.notdef
/.notdef /.notdef /space /exclam /quotedbl
/numbersign /dollar /percent /ampersand /quotesingle
/parenleft /parenright /asterisk /plus /comma
/hyphen /period /slash /zero /one
/two /three /four /five /six
/seven /eight /nine /colon /semicolon
/less /equal /greater /question /at
/A /B /C /D /E
/F /G /H /I /J
/K /L /M /N /O
/P /Q /R /S /T
/U /V /W /X /Y
/Z /bracketleft /backslash /bracketright /asciicircum
/underscore /quoteleft /a /b /c
/d /e /f /g /h
/i /j /k /l /m
/n /o /p /q /r
/s /t /u /v /w
/x /y /z /braceleft /bar
/braceright /asciitilde /bullet /Euro /bullet
/quotesinglbase /florin /quotedblbase /ellipsis /dagger
/daggerdbl /circumflex /perthousand /Scaron /guilsinglleft
/OE /bullet /Zcaron /bullet /bullet
/quoteleft /quoteright /quotedblleft /quotedblright /bullet
/endash /emdash /asciitilde /trademark /scaron
/guilsinglright /oe /bullet /zcaron /Ydieresis
/space /exclamdown /cent /sterling /currency
/yen /brokenbar /section /dieresis /copyright
/ordfeminine /guillemotleft /logicalnot /sfthyphen /registered
/macron /degree /plusminus /twosuperior /threesuperior
/acute /mu /paragraph /middot /cedilla
/onesuperior /ordmasculine /guillemotright /onequarter /onehalf
/threequarters /questiondown /Agrave /Aacute /Acircumflex
/Atilde /Adieresis /Aring /AE /Ccedilla
/Egrave /Eacute /Ecircumflex /Edieresis /Igrave
/Iacute /Icircumflex /Idieresis /Eth /Ntilde
/Ograve /Oacute /Ocircumflex /Otilde /Odieresis
/multiply /Oslash /Ugrave /Uacute /Ucircumflex
/Udieresis /Yacute /Thorn /germandbls /agrave
/aacute /acircumflex /atilde /adieresis /aring
/ae /ccedilla /egrave /eacute /ecircumflex
/edieresis /igrave /iacute /icircumflex /idieresis
/eth /ntilde /ograve /oacute /ocircumflex
/otilde /odieresis /divide /oslash /ugrave
/uacute /ucircumflex /udieresis /yacute /thorn
/ydieresis
] def
%%EndResource
%FOPBeginFontReencode
/Courier-Oblique findfont
dup length dict begin
  {1 index /FID ne {def} {pop pop} ifelse} forall
  /Encoding WinAnsiEncoding def
  currentdict
end
/Courier-Oblique exch definefont pop
/Courier-BoldOblique findfont
dup length dict begin
  {1 index /FID ne {def} {pop pop} ifelse} forall
  /Encoding WinAnsiEncoding def
  currentdict
end
/Courier-BoldOblique exch definefont pop
/Courier-Bold findfont
dup length dict begin
  {1 index /FID ne {def} {pop pop} ifelse} forall
  /Encoding WinAnsiEncoding def
  currentdict
end
/Courier-Bold exch definefont pop
/Helvetica findfont
dup length dict begin
  {1 index /FID ne {def} {pop pop} ifelse} forall
  /Encoding WinAnsiEncoding def
  currentdict
end
/Helvetica exch definefont pop
/Helvetica-Oblique findfont
dup length dict begin
  {1 index /FID ne {def} {pop pop} ifelse} forall
  /Encoding WinAnsiEncoding def
  currentdict
end
/Helvetica-Oblique exch definefont pop
/Helvetica-Bold findfont
dup length dict begin
  {1 index /FID ne {def} {pop pop} ifelse} forall
  /Encoding WinAnsiEncoding def
  currentdict
end
/Helvetica-Bold exch definefont pop
/Helvetica-BoldOblique findfont
dup length dict begin
  {1 index /FID ne {def} {pop pop} ifelse} forall
  /Encoding WinAnsiEncoding def
  currentdict
end
/Helvetica-BoldOblique exch definefont pop
/Times-Roman findfont
dup length dict begin
  {1 index /FID ne {def} {pop pop} ifelse} forall
  /Encoding WinAnsiEncoding def
  currentdict
end
/Times-Roman exch definefont pop
/Times-Italic findfont
dup length dict begin
  {1 index /FID ne {def} {pop pop} ifelse} forall
  /Encoding WinAnsiEncoding def
  currentdict
end
/Times-Italic exch definefont pop
/Times-Bold findfont
dup length dict begin
  {1 index /FID ne {def} {pop pop} ifelse} forall
  /Encoding WinAnsiEncoding def
  currentdict
end
/Times-Bold exch definefont pop
/Times-BoldItalic findfont
dup length dict begin
  {1 index /FID ne {def} {pop pop} ifelse} forall
  /Encoding WinAnsiEncoding def
  currentdict
end
/Times-BoldItalic exch definefont pop
/Courier findfont
dup length dict begin
  {1 index /FID ne {def} {pop pop} ifelse} forall
  /Encoding WinAnsiEncoding def
  currentdict
end
/Courier exch definefont pop
%FOPEndFontReencode
%%EndProlog
%%Page: 1 1
%%PageBoundingBox: 0 0 701 360
%%BeginPageSetup
[1 0 0 -1 0 360] CT
%%EndPageSetup
GS
[0.75 0 0 0.75 0 0] CT
1 GC
N
0 0 935 480 re
f
GR
GS
[0.75 0 0 0.75 0 0] CT
1 GC
N
0 0 935 480 re
f
GR
GS
[0.75 0 0 0.75 0 0] CT
1 GC
N
122 401 M
847 401 L
847 36 L
122 36 L
cp
f
GR
GS
[0.75 0 0 0.75 0 0] CT
0.149 GC
2 setlinecap
1 LJ
1.333 LW
N
122 401 M
847 401 L
S
GR
GS
[0.75 0 0 0.75 0 0] CT
0.149 GC
2 setlinecap
1 LJ
1.333 LW
N
122 36 M
847 36 L
S
GR
GS
[0.75 0 0 0.75 0 0] CT
0.149 GC
2 setlinecap
1 LJ
1.333 LW
N
122 401 M
122 393.75 L
S
GR
GS
[0.75 0 0 0.75 0 0] CT
0.149 GC
2 setlinecap
1 LJ
1.333 LW
N
242.833 401 M
242.833 393.75 L
S
GR
GS
[0.75 0 0 0.75 0 0] CT
0.149 GC
2 setlinecap
1 LJ
1.333 LW
N
363.667 401 M
363.667 393.75 L
S
GR
GS
[0.75 0 0 0.75 0 0] CT
0.149 GC
2 setlinecap
1 LJ
1.333 LW
N
484.5 401 M
484.5 393.75 L
S
GR
GS
[0.75 0 0 0.75 0 0] CT
0.149 GC
2 setlinecap
1 LJ
1.333 LW
N
605.333 401 M
605.333 393.75 L
S
GR
GS
[0.75 0 0 0.75 0 0] CT
0.149 GC
2 setlinecap
1 LJ
1.333 LW
N
726.167 401 M
726.167 393.75 L
S
GR
GS
[0.75 0 0 0.75 0 0] CT
0.149 GC
2 setlinecap
1 LJ
1.333 LW
N
847 401 M
847 393.75 L
S
GR
GS
[0.75 0 0 0.75 0 0] CT
0.149 GC
2 setlinecap
1 LJ
1.333 LW
N
122 36 M
122 43.25 L
S
GR
GS
[0.75 0 0 0.75 0 0] CT
0.149 GC
2 setlinecap
1 LJ
1.333 LW
N
242.833 36 M
242.833 43.25 L
S
GR
GS
[0.75 0 0 0.75 0 0] CT
0.149 GC
2 setlinecap
1 LJ
1.333 LW
N
363.667 36 M
363.667 43.25 L
S
GR
GS
[0.75 0 0 0.75 0 0] CT
0.149 GC
2 setlinecap
1 LJ
1.333 LW
N
484.5 36 M
484.5 43.25 L
S
GR
GS
[0.75 0 0 0.75 0 0] CT
0.149 GC
2 setlinecap
1 LJ
1.333 LW
N
605.333 36 M
605.333 43.25 L
S
GR
GS
[0.75 0 0 0.75 0 0] CT
0.149 GC
2 setlinecap
1 LJ
1.333 LW
N
726.167 36 M
726.167 43.25 L
S
GR
GS
[0.75 0 0 0.75 0 0] CT
0.149 GC
2 setlinecap
1 LJ
1.333 LW
N
847 36 M
847 43.25 L
S
GR
GS
[0.75 0 0 0.75 91.5 306.75] CT
0.149 GC
N
0.083 22.994 M
-3.229 22.994 -4.417 20.267 QT
-5.604 17.541 -5.604 13.791 QT
-5.604 11.447 -5.182 9.376 QT
-4.76 7.306 -3.487 5.861 QT
-2.214 4.416 0.083 4.416 QT
1.865 4.416 2.997 5.283 QT
4.13 6.15 4.724 7.533 QT
5.318 8.916 5.536 10.486 QT
5.755 12.056 5.755 13.791 QT
5.755 16.119 5.326 18.142 QT
4.896 20.166 3.646 21.58 QT
2.396 22.994 0.083 22.994 QT
cp
0.083 22.291 M
1.583 22.291 2.326 20.751 QT
3.068 19.212 3.24 17.337 QT
3.411 15.462 3.411 13.353 QT
3.411 11.322 3.24 9.611 QT
3.068 7.9 2.333 6.509 QT
1.599 5.119 0.083 5.119 QT
-1.448 5.119 -2.182 6.517 QT
-2.917 7.916 -3.089 9.619 QT
-3.26 11.322 -3.26 13.353 QT
-3.26 14.853 -3.19 16.189 QT
-3.12 17.525 -2.807 18.939 QT
-2.495 20.353 -1.784 21.322 QT
-1.073 22.291 0.083 22.291 QT
cp
f
GR
GS
[0.75 0 0 0.75 182.125 306.75] CT
0.149 GC
N
-10.99 19.322 M
-10.708 20.119 -10.138 20.767 QT
-9.568 21.416 -8.779 21.775 QT
-7.99 22.134 -7.146 22.134 QT
-5.193 22.134 -4.458 20.619 QT
-3.724 19.103 -3.724 16.947 QT
-3.724 16.009 -3.755 15.369 QT
-3.786 14.728 -3.927 14.134 QT
-4.177 13.181 -4.81 12.47 QT
-5.443 11.759 -6.349 11.759 QT
-7.255 11.759 -7.911 12.041 QT
-8.568 12.322 -8.974 12.689 QT
-9.38 13.056 -9.693 13.462 QT
-10.005 13.869 -10.083 13.9 QT
-10.396 13.9 L
-10.458 13.9 -10.56 13.814 QT
-10.661 13.728 -10.661 13.65 QT
-10.661 4.634 L
-10.661 4.556 -10.576 4.486 QT
-10.49 4.416 -10.396 4.416 QT
-10.318 4.416 L
-8.49 5.291 -6.458 5.291 QT
-4.443 5.291 -2.583 4.416 QT
-2.505 4.416 L
-2.411 4.416 -2.333 4.486 QT
-2.255 4.556 -2.255 4.634 QT
-2.255 4.884 L
-2.255 5.009 -2.318 5.009 QT
-3.24 6.244 -4.63 6.923 QT
-6.021 7.603 -7.505 7.603 QT
-8.583 7.603 -9.724 7.306 QT
-9.724 12.4 L
-8.818 11.681 -8.115 11.369 QT
-7.411 11.056 -6.318 11.056 QT
-4.833 11.056 -3.654 11.916 QT
-2.474 12.775 -1.841 14.15 QT
-1.208 15.525 -1.208 16.962 QT
-1.208 18.587 -2.005 19.97 QT
-2.802 21.353 -4.169 22.173 QT
-5.536 22.994 -7.146 22.994 QT
-8.474 22.994 -9.591 22.306 QT
-10.708 21.619 -11.349 20.462 QT
-11.99 19.306 -11.99 17.994 QT
-11.99 17.384 -11.591 17.001 QT
-11.193 16.619 -10.599 16.619 QT
-10.005 16.619 -9.607 17.009 QT
-9.208 17.4 -9.208 17.994 QT
-9.208 18.572 -9.607 18.978 QT
-10.005 19.384 -10.599 19.384 QT
-10.693 19.384 -10.81 19.361 QT
-10.927 19.337 -10.99 19.322 QT
cp
f
GR
GS
[0.75 0 0 0.75 182.125 306.75] CT
0.149 GC
N
6.75 22.994 M
3.438 22.994 2.25 20.267 QT
1.063 17.541 1.063 13.791 QT
1.063 11.447 1.484 9.376 QT
1.906 7.306 3.18 5.861 QT
4.453 4.416 6.75 4.416 QT
8.531 4.416 9.664 5.283 QT
10.797 6.15 11.391 7.533 QT
11.984 8.916 12.203 10.486 QT
12.422 12.056 12.422 13.791 QT
12.422 16.119 11.992 18.142 QT
11.563 20.166 10.313 21.58 QT
9.063 22.994 6.75 22.994 QT
cp
6.75 22.291 M
8.25 22.291 8.992 20.751 QT
9.734 19.212 9.906 17.337 QT
10.078 15.462 10.078 13.353 QT
10.078 11.322 9.906 9.611 QT
9.734 7.9 9 6.509 QT
8.266 5.119 6.75 5.119 QT
5.219 5.119 4.484 6.517 QT
3.75 7.916 3.578 9.619 QT
3.406 11.322 3.406 13.353 QT
3.406 14.853 3.477 16.189 QT
3.547 17.525 3.859 18.939 QT
4.172 20.353 4.883 21.322 QT
5.594 22.291 6.75 22.291 QT
cp
f
GR
GS
[0.75 0 0 0.75 272.74999 306.75] CT
0.149 GC
N
-17.5 22.4 M
-17.5 21.447 L
-14.125 21.447 -14.125 20.587 QT
-14.125 6.416 L
-15.516 7.087 -17.656 7.087 QT
-17.656 6.15 L
-14.344 6.15 -12.656 4.416 QT
-12.281 4.416 L
-12.188 4.416 -12.102 4.486 QT
-12.016 4.556 -12.016 4.65 QT
-12.016 20.587 L
-12.016 21.447 -8.641 21.447 QT
-8.641 22.4 L
-17.5 22.4 L
cp
f
GR
GS
[0.75 0 0 0.75 272.74999 306.75] CT
0.149 GC
N
/f177720031{0.083 22.994 M
-3.229 22.994 -4.417 20.267 QT
-5.604 17.541 -5.604 13.791 QT
-5.604 11.447 -5.182 9.376 QT
-4.76 7.306 -3.487 5.861 QT
-2.214 4.416 0.083 4.416 QT
1.865 4.416 2.997 5.283 QT
4.13 6.15 4.724 7.533 QT
5.318 8.916 5.536 10.486 QT
5.755 12.056 5.755 13.791 QT
5.755 16.119 5.326 18.142 QT
4.896 20.166 3.646 21.58 QT
2.396 22.994 0.083 22.994 QT
cp
0.083 22.291 M
1.583 22.291 2.326 20.751 QT
3.068 19.212 3.24 17.337 QT
3.411 15.462 3.411 13.353 QT
3.411 11.322 3.24 9.611 QT
3.068 7.9 2.333 6.509 QT
1.599 5.119 0.083 5.119 QT
-1.448 5.119 -2.182 6.517 QT
-2.917 7.916 -3.089 9.619 QT
-3.26 11.322 -3.26 13.353 QT
-3.26 14.853 -3.19 16.189 QT
-3.12 17.525 -2.807 18.939 QT
-2.495 20.353 -1.784 21.322 QT
-1.073 22.291 0.083 22.291 QT
cp}def
f177720031
f
GR
GS
[0.75 0 0 0.75 272.74999 306.75] CT
0.149 GC
N
/f1112785499{13.417 22.994 M
10.104 22.994 8.917 20.267 QT
7.729 17.541 7.729 13.791 QT
7.729 11.447 8.151 9.376 QT
8.573 7.306 9.846 5.861 QT
11.12 4.416 13.417 4.416 QT
15.198 4.416 16.331 5.283 QT
17.464 6.15 18.057 7.533 QT
18.651 8.916 18.87 10.486 QT
19.089 12.056 19.089 13.791 QT
19.089 16.119 18.659 18.142 QT
18.229 20.166 16.979 21.58 QT
15.729 22.994 13.417 22.994 QT
cp
13.417 22.291 M
14.917 22.291 15.659 20.751 QT
16.401 19.212 16.573 17.337 QT
16.745 15.462 16.745 13.353 QT
16.745 11.322 16.573 9.611 QT
16.401 7.9 15.667 6.509 QT
14.932 5.119 13.417 5.119 QT
11.885 5.119 11.151 6.517 QT
10.417 7.916 10.245 9.619 QT
10.073 11.322 10.073 13.353 QT
10.073 14.853 10.143 16.189 QT
10.214 17.525 10.526 18.939 QT
10.839 20.353 11.55 21.322 QT
12.26 22.291 13.417 22.291 QT
cp}def
f1112785499
f
GR
GS
[0.75 0 0 0.75 363.375 306.75] CT
0.149 GC
N
/f1870840577{-17.5 22.4 M
-17.5 21.447 L
-14.125 21.447 -14.125 20.587 QT
-14.125 6.416 L
-15.516 7.087 -17.656 7.087 QT
-17.656 6.15 L
-14.344 6.15 -12.656 4.416 QT
-12.281 4.416 L
-12.188 4.416 -12.102 4.486 QT
-12.016 4.556 -12.016 4.65 QT
-12.016 20.587 L
-12.016 21.447 -8.641 21.447 QT
-8.641 22.4 L
-17.5 22.4 L
cp}def
f1870840577
f
GR
GS
[0.75 0 0 0.75 363.375 306.75] CT
0.149 GC
N
/f1443191156{-4.323 19.322 M
-4.042 20.119 -3.471 20.767 QT
-2.901 21.416 -2.112 21.775 QT
-1.323 22.134 -0.479 22.134 QT
1.474 22.134 2.208 20.619 QT
2.943 19.103 2.943 16.947 QT
2.943 16.009 2.911 15.369 QT
2.88 14.728 2.74 14.134 QT
2.49 13.181 1.857 12.47 QT
1.224 11.759 0.318 11.759 QT
-0.589 11.759 -1.245 12.041 QT
-1.901 12.322 -2.307 12.689 QT
-2.714 13.056 -3.026 13.462 QT
-3.339 13.869 -3.417 13.9 QT
-3.729 13.9 L
-3.792 13.9 -3.893 13.814 QT
-3.995 13.728 -3.995 13.65 QT
-3.995 4.634 L
-3.995 4.556 -3.909 4.486 QT
-3.823 4.416 -3.729 4.416 QT
-3.651 4.416 L
-1.823 5.291 0.208 5.291 QT
2.224 5.291 4.083 4.416 QT
4.161 4.416 L
4.255 4.416 4.333 4.486 QT
4.411 4.556 4.411 4.634 QT
4.411 4.884 L
4.411 5.009 4.349 5.009 QT
3.427 6.244 2.036 6.923 QT
0.646 7.603 -0.839 7.603 QT
-1.917 7.603 -3.057 7.306 QT
-3.057 12.4 L
-2.151 11.681 -1.448 11.369 QT
-0.745 11.056 0.349 11.056 QT
1.833 11.056 3.013 11.916 QT
4.193 12.775 4.826 14.15 QT
5.458 15.525 5.458 16.962 QT
5.458 18.587 4.661 19.97 QT
3.865 21.353 2.497 22.173 QT
1.13 22.994 -0.479 22.994 QT
-1.807 22.994 -2.924 22.306 QT
-4.042 21.619 -4.682 20.462 QT
-5.323 19.306 -5.323 17.994 QT
-5.323 17.384 -4.924 17.001 QT
-4.526 16.619 -3.932 16.619 QT
-3.339 16.619 -2.94 17.009 QT
-2.542 17.4 -2.542 17.994 QT
-2.542 18.572 -2.94 18.978 QT
-3.339 19.384 -3.932 19.384 QT
-4.026 19.384 -4.143 19.361 QT
-4.26 19.337 -4.323 19.322 QT
cp}def
f1443191156
f
GR
GS
[0.75 0 0 0.75 363.375 306.75] CT
0.149 GC
N
f1112785499
f
GR
GS
[0.75 0 0 0.75 453.99998 306.75] CT
0.149 GC
N
/f44339815{-18.656 22.4 M
-18.656 21.681 L
-18.656 21.603 -18.609 21.525 QT
-14.406 16.884 L
-13.453 15.853 -12.867 15.158 QT
-12.281 14.462 -11.695 13.556 QT
-11.109 12.65 -10.773 11.705 QT
-10.438 10.759 -10.438 9.697 QT
-10.438 8.603 -10.852 7.587 QT
-11.266 6.572 -12.07 5.97 QT
-12.875 5.369 -14.031 5.369 QT
-15.203 5.369 -16.141 6.072 QT
-17.078 6.775 -17.453 7.9 QT
-17.344 7.869 -17.172 7.869 QT
-16.563 7.869 -16.133 8.275 QT
-15.703 8.681 -15.703 9.337 QT
-15.703 9.947 -16.133 10.376 QT
-16.563 10.806 -17.172 10.806 QT
-17.797 10.806 -18.227 10.369 QT
-18.656 9.931 -18.656 9.337 QT
-18.656 8.322 -18.273 7.431 QT
-17.891 6.541 -17.172 5.845 QT
-16.453 5.15 -15.547 4.783 QT
-14.641 4.416 -13.625 4.416 QT
-12.094 4.416 -10.758 5.072 QT
-9.422 5.728 -8.648 6.916 QT
-7.875 8.103 -7.875 9.697 QT
-7.875 10.884 -8.391 11.939 QT
-8.906 12.994 -9.703 13.853 QT
-10.5 14.712 -11.758 15.806 QT
-13.016 16.9 -13.406 17.275 QT
-16.469 20.212 L
-13.875 20.212 L
-11.953 20.212 -10.672 20.181 QT
-9.391 20.15 -9.313 20.072 QT
-8.984 19.744 -8.656 17.587 QT
-7.875 17.587 L
-8.641 22.4 L
-18.656 22.4 L
cp}def
f44339815
f
GR
GS
[0.75 0 0 0.75 453.99998 306.75] CT
0.149 GC
N
f177720031
f
GR
GS
[0.75 0 0 0.75 453.99998 306.75] CT
0.149 GC
N
f1112785499
f
GR
GS
[0.75 0 0 0.75 544.62502 306.75] CT
0.149 GC
N
f44339815
f
GR
GS
[0.75 0 0 0.75 544.62502 306.75] CT
0.149 GC
N
f1443191156
f
GR
GS
[0.75 0 0 0.75 544.62502 306.75] CT
0.149 GC
N
f1112785499
f
GR
GS
[0.75 0 0 0.75 635.25 306.75] CT
0.149 GC
N
/f-89277197{-17.422 20.322 M
-16.797 21.244 -15.727 21.689 QT
-14.656 22.134 -13.438 22.134 QT
-11.859 22.134 -11.203 20.798 QT
-10.547 19.462 -10.547 17.759 QT
-10.547 16.994 -10.688 16.228 QT
-10.828 15.462 -11.156 14.806 QT
-11.484 14.15 -12.055 13.751 QT
-12.625 13.353 -13.453 13.353 QT
-15.25 13.353 L
-15.484 13.353 -15.484 13.103 QT
-15.484 12.869 L
-15.484 12.65 -15.25 12.65 QT
-13.766 12.541 L
-12.813 12.541 -12.188 11.83 QT
-11.563 11.119 -11.273 10.095 QT
-10.984 9.072 -10.984 8.15 QT
-10.984 6.853 -11.586 6.025 QT
-12.188 5.197 -13.438 5.197 QT
-14.469 5.197 -15.398 5.587 QT
-16.328 5.978 -16.891 6.759 QT
-16.828 6.744 -16.789 6.744 QT
-16.75 6.744 -16.703 6.744 QT
-16.094 6.744 -15.688 7.166 QT
-15.281 7.587 -15.281 8.181 QT
-15.281 8.759 -15.688 9.181 QT
-16.094 9.603 -16.703 9.603 QT
-17.297 9.603 -17.719 9.181 QT
-18.141 8.759 -18.141 8.181 QT
-18.141 7.009 -17.445 6.158 QT
-16.75 5.306 -15.648 4.861 QT
-14.547 4.416 -13.438 4.416 QT
-12.609 4.416 -11.703 4.658 QT
-10.797 4.9 -10.063 5.361 QT
-9.328 5.822 -8.859 6.533 QT
-8.391 7.244 -8.391 8.15 QT
-8.391 9.275 -8.898 10.244 QT
-9.406 11.212 -10.289 11.908 QT
-11.172 12.603 -12.219 12.947 QT
-11.047 13.166 -9.992 13.83 QT
-8.938 14.494 -8.297 15.517 QT
-7.656 16.541 -7.656 17.728 QT
-7.656 19.228 -8.477 20.431 QT
-9.297 21.634 -10.625 22.314 QT
-11.953 22.994 -13.438 22.994 QT
-14.703 22.994 -15.977 22.509 QT
-17.25 22.025 -18.055 21.064 QT
-18.859 20.103 -18.859 18.759 QT
-18.859 18.087 -18.414 17.642 QT
-17.969 17.197 -17.297 17.197 QT
-16.859 17.197 -16.5 17.4 QT
-16.141 17.603 -15.938 17.97 QT
-15.734 18.337 -15.734 18.759 QT
-15.734 19.416 -16.195 19.869 QT
-16.656 20.322 -17.297 20.322 QT
-17.422 20.322 L
cp}def
f-89277197
f
GR
GS
[0.75 0 0 0.75 635.25 306.75] CT
0.149 GC
N
f177720031
f
GR
GS
[0.75 0 0 0.75 635.25 306.75] CT
0.149 GC
N
f1112785499
f
GR
GS
[0.75 0 0 0.75 363.37525 331.75001] CT
0.149 GC
N
/f715256087{-56.098 22.4 M
-56.098 21.447 L
-53.317 21.447 -53.317 20.587 QT
-53.317 5.759 L
-53.317 4.9 -56.098 4.9 QT
-56.098 3.962 L
-40.832 3.962 L
-40.082 10.134 L
-40.848 10.134 L
-41.145 7.806 -41.668 6.751 QT
-42.192 5.697 -43.332 5.298 QT
-44.473 4.9 -46.77 4.9 QT
-49.426 4.9 L
-49.91 4.9 -50.184 4.939 QT
-50.457 4.978 -50.629 5.173 QT
-50.801 5.369 -50.801 5.759 QT
-50.801 12.353 L
-48.801 12.353 L
-47.426 12.353 -46.754 12.126 QT
-46.082 11.9 -45.824 11.244 QT
-45.567 10.587 -45.567 9.197 QT
-44.77 9.197 L
-44.77 16.447 L
-45.567 16.447 L
-45.567 15.087 -45.824 14.423 QT
-46.082 13.759 -46.754 13.533 QT
-47.426 13.306 -48.801 13.306 QT
-50.801 13.306 L
-50.801 20.587 L
-50.801 21.181 -50.465 21.314 QT
-50.129 21.447 -49.426 21.447 QT
-46.567 21.447 L
-44.692 21.447 -43.535 21.15 QT
-42.379 20.853 -41.739 20.166 QT
-41.098 19.478 -40.754 18.376 QT
-40.41 17.275 -40.098 15.322 QT
-39.332 15.322 L
-40.457 22.4 L
-56.098 22.4 L
cp}def
f715256087
f
GR
GS
[0.75 0 0 0.75 363.37525 331.75001] CT
0.149 GC
N
/f1996770945{-38.075 27.634 M
-38.075 26.697 L
-37.153 26.697 -36.559 26.541 QT
-35.965 26.384 -35.965 25.822 QT
-35.965 12.822 L
-35.965 12.072 -36.497 11.892 QT
-37.028 11.712 -38.075 11.712 QT
-38.075 10.759 L
-34.09 10.462 L
-34.09 12.15 L
-33.34 11.322 -32.364 10.892 QT
-31.387 10.462 -30.278 10.462 QT
-28.684 10.462 -27.403 11.33 QT
-26.122 12.197 -25.403 13.603 QT
-24.684 15.009 -24.684 16.572 QT
-24.684 18.212 -25.481 19.619 QT
-26.278 21.025 -27.653 21.861 QT
-29.028 22.697 -30.684 22.697 QT
-32.653 22.697 -34.012 21.103 QT
-34.012 25.822 L
-34.012 26.384 -33.411 26.541 QT
-32.809 26.697 -31.903 26.697 QT
-31.903 27.634 L
-38.075 27.634 L
cp
-34.012 19.775 M
-33.528 20.744 -32.684 21.369 QT
-31.84 21.994 -30.84 21.994 QT
-29.903 21.994 -29.184 21.494 QT
-28.465 20.994 -27.981 20.15 QT
-27.497 19.306 -27.262 18.376 QT
-27.028 17.447 -27.028 16.572 QT
-27.028 15.494 -27.418 14.236 QT
-27.809 12.978 -28.606 12.111 QT
-29.403 11.244 -30.543 11.244 QT
-31.637 11.244 -32.551 11.806 QT
-33.465 12.369 -34.012 13.322 QT
-34.012 19.775 L
cp}def
f1996770945
f
GR
GS
[0.75 0 0 0.75 363.37525 331.75001] CT
0.149 GC
N
/f-1811329156{-16.472 22.697 M
-18.097 22.697 -19.48 21.876 QT
-20.863 21.056 -21.668 19.673 QT
-22.472 18.291 -22.472 16.65 QT
-22.472 15.416 -22.027 14.267 QT
-21.582 13.119 -20.761 12.212 QT
-19.941 11.306 -18.847 10.798 QT
-17.753 10.291 -16.472 10.291 QT
-14.816 10.291 -13.449 11.173 QT
-12.082 12.056 -11.293 13.525 QT
-10.503 14.994 -10.503 16.65 QT
-10.503 18.275 -11.308 19.666 QT
-12.113 21.056 -13.488 21.876 QT
-14.863 22.697 -16.472 22.697 QT
cp
-16.472 21.916 M
-14.316 21.916 -13.589 20.345 QT
-12.863 18.775 -12.863 16.353 QT
-12.863 14.994 -13.003 14.103 QT
-13.144 13.212 -13.644 12.478 QT
-13.941 12.041 -14.41 11.705 QT
-14.878 11.369 -15.402 11.189 QT
-15.925 11.009 -16.472 11.009 QT
-17.316 11.009 -18.074 11.392 QT
-18.832 11.775 -19.332 12.478 QT
-19.832 13.244 -19.972 14.166 QT
-20.113 15.087 -20.113 16.353 QT
-20.113 17.869 -19.847 19.072 QT
-19.582 20.275 -18.785 21.095 QT
-17.988 21.916 -16.472 21.916 QT
cp}def
f-1811329156
f
GR
GS
[0.75 0 0 0.75 363.37525 331.75001] CT
0.149 GC
N
/f-310920149{-2.429 22.697 M
-4.054 22.697 -5.39 21.853 QT
-6.726 21.009 -7.492 19.587 QT
-8.257 18.166 -8.257 16.572 QT
-8.257 14.978 -7.5 13.517 QT
-6.742 12.056 -5.398 11.173 QT
-4.054 10.291 -2.429 10.291 QT
-0.836 10.291 0.461 10.916 QT
1.758 11.541 1.758 12.947 QT
1.758 13.478 1.383 13.869 QT
1.008 14.259 0.461 14.259 QT
-0.07 14.259 -0.453 13.869 QT
-0.836 13.478 -0.836 12.947 QT
-0.836 12.478 -0.531 12.126 QT
-0.226 11.775 0.227 11.681 QT
-0.711 11.087 -2.398 11.087 QT
-3.695 11.087 -4.484 11.947 QT
-5.273 12.806 -5.586 14.072 QT
-5.898 15.337 -5.898 16.572 QT
-5.898 17.884 -5.515 19.103 QT
-5.132 20.322 -4.265 21.119 QT
-3.398 21.916 -2.101 21.916 QT
-0.82 21.916 0.078 21.126 QT
0.977 20.337 1.305 19.072 QT
1.305 18.916 1.524 18.916 QT
1.852 18.916 L
1.93 18.916 1.993 18.994 QT
2.055 19.072 2.055 19.15 QT
2.055 19.228 L
1.649 20.837 0.438 21.767 QT
-0.773 22.697 -2.429 22.697 QT
cp}def
f-310920149
f
GR
GS
[0.75 0 0 0.75 363.37525 331.75001] CT
0.149 GC
N
/f-1966931042{2.76 22.4 M
2.76 21.447 L
3.697 21.447 4.283 21.306 QT
4.869 21.166 4.869 20.587 QT
4.869 6.416 L
4.869 5.697 4.658 5.376 QT
4.447 5.056 4.033 4.978 QT
3.619 4.9 2.76 4.9 QT
2.76 3.962 L
6.776 3.666 L
6.776 12.947 L
7.338 11.822 8.354 11.142 QT
9.369 10.462 10.604 10.462 QT
12.463 10.462 13.408 11.361 QT
14.354 12.259 14.354 14.103 QT
14.354 20.587 L
14.354 21.166 14.947 21.306 QT
15.541 21.447 16.463 21.447 QT
16.463 22.4 L
10.276 22.4 L
10.276 21.447 L
11.197 21.447 11.791 21.306 QT
12.385 21.166 12.385 20.587 QT
12.385 14.181 L
12.385 12.869 12.002 12.017 QT
11.619 11.166 10.447 11.166 QT
8.869 11.166 7.861 12.416 QT
6.854 13.666 6.854 15.275 QT
6.854 20.587 L
6.854 21.166 7.447 21.306 QT
8.041 21.447 8.947 21.447 QT
8.947 22.4 L
2.76 22.4 L
cp}def
f-1966931042
f
GR
GS
[0.75 0 0 0.75 363.37525 331.75001] CT
0.149 GC
N
/f932262502{34.042 29.103 M
32.542 27.916 31.448 26.376 QT
30.354 24.837 29.667 23.095 QT
28.979 21.353 28.635 19.455 QT
28.292 17.556 28.292 15.65 QT
28.292 13.712 28.635 11.814 QT
28.979 9.916 29.682 8.166 QT
30.385 6.416 31.479 4.884 QT
32.573 3.353 34.042 2.197 QT
34.042 2.15 34.167 2.15 QT
34.417 2.15 L
34.495 2.15 34.565 2.22 QT
34.635 2.291 34.635 2.384 QT
34.635 2.509 34.573 2.556 QT
33.26 3.853 32.385 5.33 QT
31.51 6.806 30.971 8.47 QT
30.432 10.134 30.198 11.923 QT
29.964 13.712 29.964 15.65 QT
29.964 24.228 34.557 28.681 QT
34.635 28.775 34.635 28.916 QT
34.635 28.978 34.557 29.064 QT
34.479 29.15 34.417 29.15 QT
34.167 29.15 L
34.042 29.15 34.042 29.103 QT
cp}def
f932262502
f
GR
GS
[0.75 0 0 0.75 363.37525 331.75001] CT
0.149 GC
N
/f-252573450{36.928 22.478 M
36.928 18.072 L
36.928 17.869 37.178 17.869 QT
37.506 17.869 L
37.662 17.869 37.709 18.072 QT
38.459 21.994 41.35 21.994 QT
42.631 21.994 43.49 21.416 QT
44.35 20.837 44.35 19.619 QT
44.35 18.744 43.678 18.134 QT
43.006 17.525 42.084 17.291 QT
40.287 16.947 L
39.365 16.744 38.623 16.337 QT
37.881 15.931 37.404 15.251 QT
36.928 14.572 36.928 13.666 QT
36.928 12.478 37.561 11.72 QT
38.193 10.962 39.193 10.626 QT
40.193 10.291 41.35 10.291 QT
42.74 10.291 43.756 11.041 QT
44.537 10.369 L
44.537 10.291 44.678 10.291 QT
44.865 10.291 L
44.943 10.291 45.014 10.369 QT
45.084 10.447 45.084 10.525 QT
45.084 14.056 L
45.084 14.306 44.865 14.306 QT
44.537 14.306 L
44.303 14.306 44.303 14.056 QT
44.303 12.65 43.522 11.791 QT
42.74 10.931 41.318 10.931 QT
40.115 10.931 39.225 11.376 QT
38.334 11.822 38.334 12.916 QT
38.334 13.666 38.975 14.15 QT
39.615 14.634 40.475 14.853 QT
42.303 15.181 L
43.225 15.4 44.022 15.9 QT
44.818 16.4 45.287 17.166 QT
45.756 17.931 45.756 18.9 QT
45.756 19.869 45.42 20.587 QT
45.084 21.306 44.482 21.783 QT
43.881 22.259 43.061 22.478 QT
42.24 22.697 41.35 22.697 QT
39.662 22.697 38.459 21.572 QT
37.475 22.634 L
37.475 22.697 37.334 22.697 QT
37.178 22.697 L
36.928 22.697 36.928 22.478 QT
cp}def
f-252573450
f
GR
GS
[0.75 0 0 0.75 363.37525 331.75001] CT
0.149 GC
N
/f334490459{48.306 29.15 M
48.071 29.15 48.071 28.916 QT
48.071 28.791 48.118 28.744 QT
52.743 24.228 52.743 15.65 QT
52.743 7.072 48.181 2.619 QT
48.071 2.541 48.071 2.384 QT
48.071 2.291 48.142 2.22 QT
48.212 2.15 48.306 2.15 QT
48.556 2.15 L
48.634 2.15 48.696 2.197 QT
50.634 3.728 51.923 5.916 QT
53.212 8.103 53.813 10.587 QT
54.415 13.072 54.415 15.65 QT
54.415 17.556 54.095 19.408 QT
53.774 21.259 53.063 23.064 QT
52.353 24.869 51.274 26.392 QT
50.196 27.916 48.696 29.103 QT
48.634 29.15 48.556 29.15 QT
48.306 29.15 L
cp}def
f334490459
f
GR
GS
[0.75 0 0 0.75 0 0] CT
0.149 GC
2 setlinecap
1 LJ
1.333 LW
N
122 401 M
122 36 L
S
GR
GS
[0.75 0 0 0.75 0 0] CT
0.149 GC
2 setlinecap
1 LJ
1.333 LW
N
847 401 M
847 36 L
S
GR
GS
[0.75 0 0 0.75 0 0] CT
0.149 GC
2 setlinecap
1 LJ
1.333 LW
N
122 401 M
129.25 401 L
S
GR
GS
[0.75 0 0 0.75 0 0] CT
0.149 GC
2 setlinecap
1 LJ
1.333 LW
N
122 309.75 M
129.25 309.75 L
S
GR
GS
[0.75 0 0 0.75 0 0] CT
0.149 GC
2 setlinecap
1 LJ
1.333 LW
N
122 218.5 M
129.25 218.5 L
S
GR
GS
[0.75 0 0 0.75 0 0] CT
0.149 GC
2 setlinecap
1 LJ
1.333 LW
N
122 127.25 M
129.25 127.25 L
S
GR
GS
[0.75 0 0 0.75 0 0] CT
0.149 GC
2 setlinecap
1 LJ
1.333 LW
N
122 36 M
129.25 36 L
S
GR
GS
[0.75 0 0 0.75 0 0] CT
0.149 GC
2 setlinecap
1 LJ
1.333 LW
N
847 401 M
839.75 401 L
S
GR
GS
[0.75 0 0 0.75 0 0] CT
0.149 GC
2 setlinecap
1 LJ
1.333 LW
N
847 309.75 M
839.75 309.75 L
S
GR
GS
[0.75 0 0 0.75 0 0] CT
0.149 GC
2 setlinecap
1 LJ
1.333 LW
N
847 218.5 M
839.75 218.5 L
S
GR
GS
[0.75 0 0 0.75 0 0] CT
0.149 GC
2 setlinecap
1 LJ
1.333 LW
N
847 127.25 M
839.75 127.25 L
S
GR
GS
[0.75 0 0 0.75 0 0] CT
0.149 GC
2 setlinecap
1 LJ
1.333 LW
N
847 36 M
839.75 36 L
S
GR
GS
[0.75 0 0 0.75 85.5 300.75] CT
0.149 GC
N
/f408188114{-6.583 6.994 M
-9.896 6.994 -11.083 4.267 QT
-12.271 1.541 -12.271 -2.209 QT
-12.271 -4.553 -11.849 -6.624 QT
-11.427 -8.694 -10.154 -10.139 QT
-8.88 -11.584 -6.583 -11.584 QT
-4.802 -11.584 -3.669 -10.717 QT
-2.536 -9.85 -1.943 -8.467 QT
-1.349 -7.084 -1.13 -5.514 QT
-0.911 -3.944 -0.911 -2.209 QT
-0.911 0.119 -1.341 2.142 QT
-1.771 4.166 -3.021 5.58 QT
-4.271 6.994 -6.583 6.994 QT
cp
-6.583 6.291 M
-5.083 6.291 -4.341 4.751 QT
-3.599 3.212 -3.427 1.337 QT
-3.255 -0.538 -3.255 -2.647 QT
-3.255 -4.678 -3.427 -6.389 QT
-3.599 -8.1 -4.333 -9.491 QT
-5.068 -10.881 -6.583 -10.881 QT
-8.115 -10.881 -8.849 -9.483 QT
-9.583 -8.084 -9.755 -6.381 QT
-9.927 -4.678 -9.927 -2.647 QT
-9.927 -1.147 -9.857 0.189 QT
-9.786 1.525 -9.474 2.939 QT
-9.161 4.353 -8.451 5.322 QT
-7.74 6.291 -6.583 6.291 QT
cp}def
f408188114
f
GR
GS
[0.75 0 0 0.75 85.5 232.3125] CT
0.149 GC
N
/f-483093008{-10.99 3.322 M
-10.708 4.119 -10.138 4.767 QT
-9.568 5.416 -8.779 5.775 QT
-7.99 6.134 -7.146 6.134 QT
-5.193 6.134 -4.458 4.619 QT
-3.724 3.103 -3.724 0.947 QT
-3.724 0.009 -3.755 -0.631 QT
-3.786 -1.272 -3.927 -1.866 QT
-4.177 -2.819 -4.81 -3.53 QT
-5.443 -4.241 -6.349 -4.241 QT
-7.255 -4.241 -7.911 -3.959 QT
-8.568 -3.678 -8.974 -3.311 QT
-9.38 -2.944 -9.693 -2.538 QT
-10.005 -2.131 -10.083 -2.1 QT
-10.396 -2.1 L
-10.458 -2.1 -10.56 -2.186 QT
-10.661 -2.272 -10.661 -2.35 QT
-10.661 -11.366 L
-10.661 -11.444 -10.576 -11.514 QT
-10.49 -11.584 -10.396 -11.584 QT
-10.318 -11.584 L
-8.49 -10.709 -6.458 -10.709 QT
-4.443 -10.709 -2.583 -11.584 QT
-2.505 -11.584 L
-2.411 -11.584 -2.333 -11.514 QT
-2.255 -11.444 -2.255 -11.366 QT
-2.255 -11.116 L
-2.255 -10.991 -2.318 -10.991 QT
-3.24 -9.756 -4.63 -9.077 QT
-6.021 -8.397 -7.505 -8.397 QT
-8.583 -8.397 -9.724 -8.694 QT
-9.724 -3.6 L
-8.818 -4.319 -8.115 -4.631 QT
-7.411 -4.944 -6.318 -4.944 QT
-4.833 -4.944 -3.654 -4.084 QT
-2.474 -3.225 -1.841 -1.85 QT
-1.208 -0.475 -1.208 0.962 QT
-1.208 2.587 -2.005 3.97 QT
-2.802 5.353 -4.169 6.173 QT
-5.536 6.994 -7.146 6.994 QT
-8.474 6.994 -9.591 6.306 QT
-10.708 5.619 -11.349 4.462 QT
-11.99 3.306 -11.99 1.994 QT
-11.99 1.384 -11.591 1.001 QT
-11.193 0.619 -10.599 0.619 QT
-10.005 0.619 -9.607 1.009 QT
-9.208 1.4 -9.208 1.994 QT
-9.208 2.572 -9.607 2.978 QT
-10.005 3.384 -10.599 3.384 QT
-10.693 3.384 -10.81 3.361 QT
-10.927 3.337 -10.99 3.322 QT
cp}def
f-483093008
f
GR
GS
[0.75 0 0 0.75 85.5 163.875] CT
0.149 GC
N
/f-1480714725{-24.167 6.4 M
-24.167 5.447 L
-20.792 5.447 -20.792 4.587 QT
-20.792 -9.584 L
-22.182 -8.913 -24.323 -8.913 QT
-24.323 -9.85 L
-21.01 -9.85 -19.323 -11.584 QT
-18.948 -11.584 L
-18.854 -11.584 -18.768 -11.514 QT
-18.682 -11.444 -18.682 -11.35 QT
-18.682 4.587 L
-18.682 5.447 -15.307 5.447 QT
-15.307 6.4 L
-24.167 6.4 L
cp}def
f-1480714725
f
GR
GS
[0.75 0 0 0.75 85.5 163.875] CT
0.149 GC
N
f408188114
f
GR
GS
[0.75 0 0 0.75 85.5 95.4375] CT
0.149 GC
N
f-1480714725
f
GR
GS
[0.75 0 0 0.75 85.5 95.4375] CT
0.149 GC
N
f-483093008
f
GR
GS
[0.75 0 0 0.75 85.5 27] CT
0.149 GC
N
/f-679582782{-25.323 6.4 M
-25.323 5.681 L
-25.323 5.603 -25.276 5.525 QT
-21.073 0.884 L
-20.12 -0.147 -19.534 -0.842 QT
-18.948 -1.538 -18.362 -2.444 QT
-17.776 -3.35 -17.44 -4.295 QT
-17.104 -5.241 -17.104 -6.303 QT
-17.104 -7.397 -17.518 -8.413 QT
-17.932 -9.428 -18.737 -10.03 QT
-19.542 -10.631 -20.698 -10.631 QT
-21.87 -10.631 -22.807 -9.928 QT
-23.745 -9.225 -24.12 -8.1 QT
-24.01 -8.131 -23.839 -8.131 QT
-23.229 -8.131 -22.8 -7.725 QT
-22.37 -7.319 -22.37 -6.663 QT
-22.37 -6.053 -22.8 -5.624 QT
-23.229 -5.194 -23.839 -5.194 QT
-24.464 -5.194 -24.893 -5.631 QT
-25.323 -6.069 -25.323 -6.663 QT
-25.323 -7.678 -24.94 -8.569 QT
-24.557 -9.459 -23.839 -10.155 QT
-23.12 -10.85 -22.214 -11.217 QT
-21.307 -11.584 -20.292 -11.584 QT
-18.76 -11.584 -17.425 -10.928 QT
-16.089 -10.272 -15.315 -9.084 QT
-14.542 -7.897 -14.542 -6.303 QT
-14.542 -5.116 -15.057 -4.061 QT
-15.573 -3.006 -16.37 -2.147 QT
-17.167 -1.288 -18.425 -0.194 QT
-19.682 0.9 -20.073 1.275 QT
-23.135 4.212 L
-20.542 4.212 L
-18.62 4.212 -17.339 4.181 QT
-16.057 4.15 -15.979 4.072 QT
-15.651 3.744 -15.323 1.587 QT
-14.542 1.587 L
-15.307 6.4 L
-25.323 6.4 L
cp}def
f-679582782
f
GR
GS
[0.75 0 0 0.75 85.5 27] CT
0.149 GC
N
f408188114
f
GR
GS
[0 -0.75 0.75 0 62.49994 163.87487] CT
0.149 GC
N
/f-1995095113{-61.517 -9.6 M
-61.517 -10.553 L
-58.736 -10.553 -58.736 -11.413 QT
-58.736 -26.241 L
-58.736 -27.1 -61.517 -27.1 QT
-61.517 -28.038 L
-53.033 -28.038 L
-51.517 -28.038 -49.853 -27.491 QT
-48.189 -26.944 -47.064 -25.827 QT
-45.939 -24.709 -45.939 -23.147 QT
-45.939 -22.022 -46.618 -21.131 QT
-47.298 -20.241 -48.361 -19.639 QT
-49.423 -19.038 -50.533 -18.772 QT
-49.314 -18.35 -48.408 -17.428 QT
-47.501 -16.506 -47.314 -15.319 QT
-46.923 -12.928 L
-46.673 -11.303 -46.376 -10.506 QT
-46.079 -9.709 -45.095 -9.709 QT
-44.251 -9.709 -43.837 -10.491 QT
-43.423 -11.272 -43.423 -12.194 QT
-43.423 -12.288 -43.337 -12.358 QT
-43.251 -12.428 -43.158 -12.428 QT
-42.908 -12.428 L
-42.642 -12.428 -42.642 -12.084 QT
-42.642 -11.334 -42.931 -10.631 QT
-43.22 -9.928 -43.767 -9.467 QT
-44.314 -9.006 -45.064 -9.006 QT
-47.017 -9.006 -48.423 -9.975 QT
-49.829 -10.944 -49.829 -12.819 QT
-49.829 -15.209 L
-49.829 -16.569 -50.767 -17.53 QT
-51.704 -18.491 -53.064 -18.491 QT
-56.298 -18.491 L
-56.298 -11.413 L
-56.298 -10.553 -53.517 -10.553 QT
-53.517 -9.6 L
-61.517 -9.6 L
cp
-56.298 -19.178 M
-53.423 -19.178 L
-51.173 -19.178 -50.001 -20.084 QT
-48.829 -20.991 -48.829 -23.147 QT
-48.829 -25.303 -49.986 -26.202 QT
-51.142 -27.1 -53.423 -27.1 QT
-54.939 -27.1 L
-55.423 -27.1 -55.689 -27.061 QT
-55.954 -27.022 -56.126 -26.827 QT
-56.298 -26.631 -56.298 -26.241 QT
-56.298 -19.178 L
cp}def
f-1995095113
f
GR
GS
[0 -0.75 0.75 0 62.49994 163.87487] CT
0.149 GC
N
/f1089275222{-41.7 -12.256 M
-41.7 -13.866 -40.434 -14.874 QT
-39.168 -15.881 -37.395 -16.295 QT
-35.622 -16.709 -34.028 -16.709 QT
-34.028 -17.819 L
-34.028 -18.584 -34.372 -19.319 QT
-34.715 -20.053 -35.356 -20.522 QT
-35.997 -20.991 -36.778 -20.991 QT
-38.575 -20.991 -39.512 -20.194 QT
-38.997 -20.194 -38.661 -19.803 QT
-38.325 -19.413 -38.325 -18.897 QT
-38.325 -18.35 -38.708 -17.967 QT
-39.09 -17.584 -39.606 -17.584 QT
-40.153 -17.584 -40.536 -17.967 QT
-40.918 -18.35 -40.918 -18.897 QT
-40.918 -20.319 -39.629 -21.014 QT
-38.34 -21.709 -36.778 -21.709 QT
-35.684 -21.709 -34.575 -21.241 QT
-33.465 -20.772 -32.762 -19.897 QT
-32.059 -19.022 -32.059 -17.866 QT
-32.059 -11.788 L
-32.059 -11.256 -31.833 -10.819 QT
-31.606 -10.381 -31.137 -10.381 QT
-30.684 -10.381 -30.465 -10.827 QT
-30.247 -11.272 -30.247 -11.788 QT
-30.247 -13.522 L
-29.465 -13.522 L
-29.465 -11.788 L
-29.465 -11.178 -29.778 -10.631 QT
-30.09 -10.084 -30.629 -9.764 QT
-31.168 -9.444 -31.778 -9.444 QT
-32.575 -9.444 -33.145 -10.053 QT
-33.715 -10.663 -33.793 -11.506 QT
-34.293 -10.491 -35.262 -9.897 QT
-36.231 -9.303 -37.34 -9.303 QT
-38.372 -9.303 -39.372 -9.6 QT
-40.372 -9.897 -41.036 -10.553 QT
-41.7 -11.209 -41.7 -12.256 QT
cp
-39.512 -12.256 M
-39.512 -11.303 -38.809 -10.655 QT
-38.106 -10.006 -37.168 -10.006 QT
-36.293 -10.006 -35.583 -10.444 QT
-34.872 -10.881 -34.45 -11.631 QT
-34.028 -12.381 -34.028 -13.209 QT
-34.028 -16.022 L
-35.247 -16.022 -36.536 -15.616 QT
-37.825 -15.209 -38.668 -14.358 QT
-39.512 -13.506 -39.512 -12.256 QT
cp}def
f1089275222
f
GR
GS
[0 -0.75 0.75 0 62.49994 163.87487] CT
0.149 GC
N
/f-1214189525{-28.648 -9.6 M
-28.648 -10.553 L
-27.71 -10.553 -27.124 -10.694 QT
-26.538 -10.834 -26.538 -11.413 QT
-26.538 -18.772 L
-26.538 -19.506 -26.749 -19.827 QT
-26.96 -20.147 -27.374 -20.217 QT
-27.788 -20.288 -28.648 -20.288 QT
-28.648 -21.241 L
-24.726 -21.538 L
-24.726 -18.897 L
-24.179 -20.053 -23.116 -20.795 QT
-22.054 -21.538 -20.804 -21.538 QT
-18.944 -21.538 -17.999 -20.639 QT
-17.054 -19.741 -17.054 -17.897 QT
-17.054 -11.413 L
-17.054 -10.834 -16.46 -10.694 QT
-15.866 -10.553 -14.944 -10.553 QT
-14.944 -9.6 L
-21.132 -9.6 L
-21.132 -10.553 L
-20.21 -10.553 -19.616 -10.694 QT
-19.023 -10.834 -19.023 -11.413 QT
-19.023 -17.819 L
-19.023 -19.131 -19.405 -19.983 QT
-19.788 -20.834 -20.96 -20.834 QT
-22.538 -20.834 -23.546 -19.584 QT
-24.554 -18.334 -24.554 -16.725 QT
-24.554 -11.413 L
-24.554 -10.834 -23.96 -10.694 QT
-23.366 -10.553 -22.46 -10.553 QT
-22.46 -9.6 L
-28.648 -9.6 L
cp}def
f-1214189525
f
GR
GS
[0 -0.75 0.75 0 62.49994 163.87487] CT
0.149 GC
N
/f921052904{-13.88 -7.491 M
-13.88 -8.459 -13.177 -9.178 QT
-12.473 -9.897 -11.52 -10.194 QT
-12.052 -10.6 -12.341 -11.217 QT
-12.63 -11.834 -12.63 -12.538 QT
-12.63 -13.803 -11.817 -14.788 QT
-13.067 -15.991 -13.067 -17.569 QT
-13.067 -18.413 -12.7 -19.147 QT
-12.333 -19.881 -11.684 -20.42 QT
-11.036 -20.959 -10.247 -21.249 QT
-9.458 -21.538 -8.63 -21.538 QT
-7.02 -21.538 -5.739 -20.6 QT
-5.192 -21.194 -4.434 -21.514 QT
-3.677 -21.834 -2.864 -21.834 QT
-2.27 -21.834 -1.903 -21.42 QT
-1.536 -21.006 -1.536 -20.428 QT
-1.536 -20.1 -1.786 -19.85 QT
-2.036 -19.6 -2.364 -19.6 QT
-2.708 -19.6 -2.958 -19.85 QT
-3.208 -20.1 -3.208 -20.428 QT
-3.208 -20.928 -2.88 -21.116 QT
-4.286 -21.116 -5.286 -20.163 QT
-4.802 -19.678 -4.505 -18.967 QT
-4.208 -18.256 -4.208 -17.569 QT
-4.208 -16.413 -4.841 -15.499 QT
-5.473 -14.584 -6.505 -14.077 QT
-7.536 -13.569 -8.63 -13.569 QT
-10.114 -13.569 -11.333 -14.366 QT
-11.723 -13.85 -11.723 -13.194 QT
-11.723 -12.475 -11.255 -11.944 QT
-10.786 -11.413 -10.067 -11.413 QT
-7.848 -11.413 L
-6.239 -11.413 -4.95 -11.116 QT
-3.661 -10.819 -2.786 -9.952 QT
-1.911 -9.084 -1.911 -7.491 QT
-1.911 -6.303 -2.911 -5.522 QT
-3.911 -4.741 -5.302 -4.389 QT
-6.692 -4.038 -7.88 -4.038 QT
-9.083 -4.038 -10.481 -4.389 QT
-11.88 -4.741 -12.88 -5.522 QT
-13.88 -6.303 -13.88 -7.491 QT
cp
-12.364 -7.491 M
-12.364 -6.584 -11.622 -5.967 QT
-10.88 -5.35 -9.841 -5.053 QT
-8.802 -4.756 -7.88 -4.756 QT
-6.973 -4.756 -5.927 -5.053 QT
-4.88 -5.35 -4.153 -5.967 QT
-3.427 -6.584 -3.427 -7.491 QT
-3.427 -8.897 -4.716 -9.311 QT
-6.005 -9.725 -7.848 -9.725 QT
-10.067 -9.725 L
-10.692 -9.725 -11.208 -9.428 QT
-11.723 -9.131 -12.044 -8.6 QT
-12.364 -8.069 -12.364 -7.491 QT
cp
-8.63 -14.288 M
-6.333 -14.288 -6.333 -17.569 QT
-6.333 -18.975 -6.825 -19.889 QT
-7.317 -20.803 -8.63 -20.803 QT
-9.942 -20.803 -10.434 -19.889 QT
-10.927 -18.975 -10.927 -17.569 QT
-10.927 -16.663 -10.739 -15.936 QT
-10.552 -15.209 -10.052 -14.749 QT
-9.552 -14.288 -8.63 -14.288 QT
cp}def
f921052904
f
GR
GS
[0 -0.75 0.75 0 62.49994 163.87487] CT
0.149 GC
N
/f-667380654{5.422 -9.303 M
3.782 -9.303 2.407 -10.163 QT
1.032 -11.022 0.243 -12.467 QT
-0.546 -13.913 -0.546 -15.522 QT
-0.546 -17.1 0.172 -18.522 QT
0.891 -19.944 2.18 -20.827 QT
3.469 -21.709 5.047 -21.709 QT
6.282 -21.709 7.196 -21.288 QT
8.11 -20.866 8.704 -20.131 QT
9.297 -19.397 9.602 -18.397 QT
9.907 -17.397 9.907 -16.194 QT
9.907 -15.834 9.626 -15.834 QT
1.813 -15.834 L
1.813 -15.553 L
1.813 -13.303 2.719 -11.694 QT
3.626 -10.084 5.672 -10.084 QT
6.501 -10.084 7.204 -10.452 QT
7.907 -10.819 8.43 -11.483 QT
8.954 -12.147 9.126 -12.897 QT
9.157 -12.991 9.227 -13.061 QT
9.297 -13.131 9.391 -13.131 QT
9.626 -13.131 L
9.907 -13.131 9.907 -12.788 QT
9.532 -11.256 8.266 -10.28 QT
7.001 -9.303 5.422 -9.303 QT
cp
1.844 -16.506 M
8.001 -16.506 L
8.001 -17.522 7.719 -18.561 QT
7.438 -19.6 6.774 -20.295 QT
6.11 -20.991 5.047 -20.991 QT
3.516 -20.991 2.68 -19.561 QT
1.844 -18.131 1.844 -16.506 QT
cp}def
f-667380654
f
GR
GS
[0 -0.75 0.75 0 62.49994 163.87487] CT
0.149 GC
N
/f320198268{27.819 -2.897 M
26.319 -4.084 25.226 -5.624 QT
24.132 -7.163 23.444 -8.905 QT
22.757 -10.647 22.413 -12.545 QT
22.069 -14.444 22.069 -16.35 QT
22.069 -18.288 22.413 -20.186 QT
22.757 -22.084 23.46 -23.834 QT
24.163 -25.584 25.257 -27.116 QT
26.351 -28.647 27.819 -29.803 QT
27.819 -29.85 27.944 -29.85 QT
28.194 -29.85 L
28.273 -29.85 28.343 -29.78 QT
28.413 -29.709 28.413 -29.616 QT
28.413 -29.491 28.351 -29.444 QT
27.038 -28.147 26.163 -26.67 QT
25.288 -25.194 24.749 -23.53 QT
24.21 -21.866 23.976 -20.077 QT
23.741 -18.288 23.741 -16.35 QT
23.741 -7.772 28.335 -3.319 QT
28.413 -3.225 28.413 -3.084 QT
28.413 -3.022 28.335 -2.936 QT
28.257 -2.85 28.194 -2.85 QT
27.944 -2.85 L
27.819 -2.85 27.819 -2.897 QT
cp}def
f320198268
f
GR
GS
[0 -0.75 0.75 0 62.49994 163.87487] CT
0.149 GC
N
/f-976764053{30.612 -9.6 M
30.612 -10.553 L
31.549 -10.553 32.135 -10.694 QT
32.721 -10.834 32.721 -11.413 QT
32.721 -18.772 L
32.721 -19.506 32.51 -19.827 QT
32.299 -20.147 31.885 -20.217 QT
31.471 -20.288 30.612 -20.288 QT
30.612 -21.241 L
34.534 -21.538 L
34.534 -18.897 L
35.08 -20.053 36.143 -20.795 QT
37.205 -21.538 38.455 -21.538 QT
41.565 -21.538 42.096 -19.006 QT
42.643 -20.131 43.682 -20.834 QT
44.721 -21.538 45.971 -21.538 QT
47.19 -21.538 48.026 -21.139 QT
48.862 -20.741 49.284 -19.928 QT
49.705 -19.116 49.705 -17.897 QT
49.705 -11.413 L
49.705 -10.834 50.307 -10.694 QT
50.909 -10.553 51.815 -10.553 QT
51.815 -9.6 L
45.643 -9.6 L
45.643 -10.553 L
46.565 -10.553 47.159 -10.694 QT
47.752 -10.834 47.752 -11.413 QT
47.752 -17.819 L
47.752 -19.178 47.37 -20.006 QT
46.987 -20.834 45.799 -20.834 QT
44.237 -20.834 43.221 -19.584 QT
42.205 -18.334 42.205 -16.725 QT
42.205 -11.413 L
42.205 -10.834 42.799 -10.694 QT
43.393 -10.553 44.315 -10.553 QT
44.315 -9.6 L
38.127 -9.6 L
38.127 -10.553 L
39.049 -10.553 39.643 -10.694 QT
40.237 -10.834 40.237 -11.413 QT
40.237 -17.819 L
40.237 -19.131 39.854 -19.983 QT
39.471 -20.834 38.299 -20.834 QT
36.721 -20.834 35.713 -19.584 QT
34.705 -18.334 34.705 -16.725 QT
34.705 -11.413 L
34.705 -10.834 35.299 -10.694 QT
35.893 -10.553 36.799 -10.553 QT
36.799 -9.6 L
30.612 -9.6 L
cp}def
f-976764053
f
GR
GS
[0 -0.75 0.75 0 62.49994 163.87487] CT
0.149 GC
N
/f-879261752{53.787 -2.85 M
53.553 -2.85 53.553 -3.084 QT
53.553 -3.209 53.6 -3.256 QT
58.225 -7.772 58.225 -16.35 QT
58.225 -24.928 53.662 -29.381 QT
53.553 -29.459 53.553 -29.616 QT
53.553 -29.709 53.623 -29.78 QT
53.693 -29.85 53.787 -29.85 QT
54.037 -29.85 L
54.115 -29.85 54.178 -29.803 QT
56.115 -28.272 57.404 -26.084 QT
58.693 -23.897 59.295 -21.413 QT
59.897 -18.928 59.897 -16.35 QT
59.897 -14.444 59.576 -12.592 QT
59.256 -10.741 58.545 -8.936 QT
57.834 -7.131 56.756 -5.608 QT
55.678 -4.084 54.178 -2.897 QT
54.115 -2.85 54.037 -2.85 QT
53.787 -2.85 L
cp}def
f-879261752
f
GR
GS
[0.75 0 0 0.75 0 0] CT
0 0.447 0.741 RC
1 LJ
1.333 LW
N
124.417 341.761 M
126.833 341.036 L
129.25 315.284 L
131.667 303.4 L
134.083 266.77 L
136.5 345.206 L
138.917 256.598 L
141.333 329.05 L
143.75 319.512 L
146.167 228.605 L
148.583 271.831 L
151 321.191 L
153.417 311.497 L
155.833 320.912 L
158.25 285.677 L
160.667 289.782 L
163.083 313.109 L
165.5 340.452 L
167.917 290.751 L
170.333 335.523 L
172.75 271.588 L
175.167 257.156 L
177.583 322.189 L
180 302.189 L
182.417 338.119 L
184.833 321.935 L
187.25 310.77 L
189.667 251.318 L
192.083 335.423 L
194.5 281.116 L
196.917 319.733 L
199.333 306.291 L
201.75 332.95 L
204.167 230.704 L
206.583 211.949 L
209 345.905 L
211.417 285.469 L
213.833 279.893 L
216.25 247.346 L
218.667 293.745 L
221.083 338.812 L
223.5 237.597 L
225.917 244.516 L
228.333 293.495 L
230.75 340.079 L
233.167 339.584 L
235.583 294.266 L
238 258.239 L
240.417 236.889 L
242.833 269.459 L
245.25 235.029 L
247.667 244.976 L
250.083 350.125 L
252.5 341.4 L
254.917 270.977 L
257.333 323.827 L
259.75 212.737 L
262.167 247.634 L
264.583 215.003 L
267 278.454 L
269.417 239.126 L
271.833 179.3 L
274.25 276.214 L
276.667 328.356 L
279.083 365.839 L
281.5 295.875 L
283.917 260.662 L
286.333 259.273 L
288.75 282.079 L
291.167 222.253 L
293.583 357.063 L
296 300.713 L
298.417 280.619 L
300.833 300.11 L
303.25 248.317 L
305.667 296.012 L
308.083 225.9 L
310.5 333.752 L
312.917 270.498 L
315.333 336.902 L
317.75 276.273 L
320.167 201.524 L
322.583 230.52 L
325 169.233 L
327.417 145.679 L
329.833 177.372 L
332.25 143.696 L
334.667 84.386 L
337.083 203.782 L
339.5 330.775 L
341.917 242.757 L
344.333 265.746 L
346.75 242.292 L
349.167 203.423 L
351.583 267.874 L
354 202.371 L
356.417 80.294 L
358.833 174.39 L
361.25 327.029 L
363.667 258.224 L
366.083 284.443 L
368.5 223.902 L
370.917 292.524 L
373.333 221.967 L
375.75 197.171 L
378.167 338.057 L
380.583 279.109 L
383 222.671 L
385.417 236.639 L
387.833 233.206 L
390.25 345.892 L
392.667 210.807 L
395.083 323.413 L
397.5 344.466 L
399.917 331.911 L
402.333 332.086 L
404.75 355.064 L
407.167 381.126 L
409.583 185.259 L
412 322.338 L
414.417 269.62 L
416.833 266.081 L
419.25 214.381 L
421.667 288.557 L
424.083 319.317 L
426.5 323 L
428.917 237.336 L
431.333 219.452 L
433.75 297.9 L
436.167 326.621 L
438.583 351.422 L
441 158.661 L
443.417 182.739 L
445.833 350.009 L
448.25 329.658 L
450.667 239.261 L
453.083 359.809 L
455.5 298.561 L
457.917 328.542 L
460.333 280.632 L
462.75 327.669 L
465.167 299.537 L
467.583 290.523 L
470 357.947 L
472.417 276.931 L
474.833 326.113 L
477.25 237.539 L
479.667 193.251 L
482.083 243.722 L
484.5 194.729 L
486.917 355.253 L
489.333 253.142 L
491.75 187.063 L
494.167 236.333 L
496.583 192.257 L
499 55.71 L
501.417 212.563 L
503.833 316.67 L
506.25 243.487 L
508.667 234.285 L
511.083 255.454 L
513.5 313.789 L
515.917 153.741 L
518.333 323.685 L
520.75 269.996 L
523.167 258.475 L
525.583 220.151 L
528 306.143 L
530.417 287.56 L
532.833 306.783 L
535.25 356.32 L
537.667 334.842 L
540.083 291.757 L
542.5 310.785 L
544.917 302.863 L
547.333 373.848 L
549.75 359.809 L
552.167 320.899 L
554.583 269.359 L
557 318.33 L
559.417 307.039 L
561.833 232.417 L
564.25 296.973 L
566.667 351.183 L
569.083 346.563 L
571.5 339.829 L
573.917 294.853 L
576.333 313.045 L
578.75 266.22 L
581.167 234.859 L
583.583 246.199 L
586 325.107 L
588.417 347.762 L
590.833 301.914 L
593.25 363.355 L
595.667 192.496 L
598.083 186.562 L
600.5 333.545 L
602.917 293.404 L
605.333 293.873 L
607.75 302.162 L
610.167 205.728 L
612.583 323.666 L
615 291.625 L
617.417 215.091 L
619.833 279.391 L
622.25 325.844 L
624.667 331.51 L
627.083 283.701 L
629.5 375.432 L
631.917 287.165 L
634.333 320.859 L
636.75 246.145 L
639.167 328.101 L
641.583 240.94 L
644 327.633 L
646.417 265.58 L
648.833 267.452 L
651.25 327.42 L
653.667 196.857 L
656.083 301.611 L
658.5 317.826 L
660.917 297.193 L
663.333 236.608 L
665.75 286.432 L
668.167 300.367 L
670.583 202.128 L
673 266.831 L
675.417 144.415 L
677.833 264.548 L
680.25 258.517 L
682.667 274.225 L
685.083 283.547 L
687.5 319.174 L
689.917 202.555 L
692.333 327.393 L
694.75 212.844 L
697.167 269.736 L
699.583 239.523 L
702 270.062 L
704.417 297.114 L
706.833 353.472 L
709.25 253.121 L
711.667 241.985 L
714.083 212.892 L
716.5 270.951 L
718.917 226.303 L
721.333 277.221 L
723.75 294.302 L
726.167 286.439 L
728.583 289.313 L
731 377.419 L
733.417 287.499 L
735.833 299.507 L
738.25 287.954 L
740.667 314.853 L
743.083 306.778 L
745.5 280.298 L
747.917 231.477 L
750.333 296.988 L
752.75 371.437 L
755.167 315.576 L
757.583 324.464 L
760 303.694 L
762.417 346.676 L
764.833 272.219 L
767.25 365.456 L
769.667 317.885 L
772.083 368.601 L
774.5 329.346 L
776.917 329.104 L
779.333 367.314 L
781.75 326.9 L
784.167 347.403 L
786.583 345.75 L
789 354.573 L
791.417 290.147 L
793.833 303.397 L
796.25 214.181 L
798.667 228.313 L
801.083 272.64 L
803.5 209.254 L
805.917 249.164 L
808.333 279.786 L
810.75 283.377 L
813.167 315.992 L
815.583 212.042 L
818 301.306 L
820.417 137.651 L
822.833 235.821 L
825.25 296.588 L
827.667 333.651 L
830.083 337.219 L
832.5 338.135 L
834.917 268.226 L
837.333 345.02 L
839.75 274.043 L
842.167 243.921 L
844.583 298.154 L
847 350.472 L
847.086 350.268 L
S
GR
GS
[0.75 0 0 0.75 0 0] CT
0.851 0.325 0.098 RC
1 LJ
1.333 LW
N
124.417 345.078 M
126.833 347.675 L
129.25 349.796 L
131.667 352.619 L
134.083 357.903 L
136.5 362.087 L
138.917 367.122 L
141.333 368.219 L
143.75 369.794 L
146.167 374.956 L
148.583 377.327 L
151 378.853 L
153.417 377.756 L
155.833 381.727 L
158.25 387.03 L
160.667 390.603 L
163.083 396.888 L
165.5 400.692 L
167.917 396.681 L
170.333 395.098 L
172.75 387.934 L
175.167 380.674 L
177.583 376.678 L
180 372.459 L
182.417 371.212 L
184.833 370.809 L
187.25 368.411 L
189.667 368.328 L
192.083 369.174 L
194.5 371.199 L
196.917 376.728 L
199.333 376.681 L
201.75 379.66 L
204.167 376.958 L
206.583 377.199 L
209 380.659 L
211.417 383.515 L
213.833 382.287 L
216.25 383.857 L
218.667 381.919 L
221.083 383.413 L
223.5 382.343 L
225.917 379.65 L
228.333 379.559 L
230.75 380.677 L
233.167 401 L
235.583 382.331 L
238 401 L
240.417 371.944 L
242.833 371.534 L
245.25 371.437 L
247.667 374.862 L
250.083 378.704 L
252.5 381.057 L
254.917 381.881 L
257.333 383.451 L
259.75 390.447 L
262.167 392.419 L
264.583 398.526 L
267 400.997 L
269.417 400.134 L
271.833 395.148 L
274.25 392.287 L
276.667 390.746 L
279.083 388.068 L
281.5 386.593 L
283.917 385.889 L
286.333 386.432 L
288.75 384.736 L
291.167 383.177 L
293.583 381.213 L
296 380.227 L
298.417 377.67 L
300.833 377.725 L
303.25 378.624 L
305.667 380.129 L
308.083 385.784 L
310.5 388.203 L
312.917 390.587 L
315.333 392.731 L
317.75 395.99 L
320.167 399.108 L
322.583 398.203 L
325 394.47 L
327.417 393.059 L
329.833 387.799 L
332.25 401 L
334.667 373.837 L
337.083 401 L
339.5 370.069 L
341.917 401 L
344.333 401 L
346.75 401 L
349.167 401 L
351.583 401 L
354 401 L
356.417 401 L
358.833 401 L
361.25 401 L
363.667 401 L
366.083 354.937 L
368.5 350.3 L
370.917 347.954 L
373.333 346.942 L
375.75 346.849 L
378.167 345.789 L
380.583 345.503 L
383 344.834 L
385.417 344.952 L
387.833 347.89 L
390.25 353.011 L
392.667 348.951 L
395.083 351.979 L
397.5 353.102 L
399.917 356.851 L
402.333 366.526 L
404.75 369.187 L
407.167 378.894 L
409.583 388.593 L
412 392.576 L
414.417 397.028 L
416.833 400.426 L
419.25 395.706 L
421.667 393.051 L
424.083 389.049 L
426.5 387.119 L
428.917 383.264 L
431.333 401 L
433.75 376.38 L
436.167 375.698 L
438.583 401 L
441 401 L
443.417 401 L
445.833 401 L
448.25 401 L
450.667 401 L
453.083 401 L
455.5 401 L
457.917 401 L
460.333 401 L
462.75 401 L
465.167 344.565 L
467.583 401 L
470 347.209 L
472.417 345.888 L
474.833 401 L
477.25 281.443 L
479.667 281.827 L
482.083 284.058 L
484.5 288.609 L
486.917 343.803 L
489.333 296.372 L
491.75 305.187 L
494.167 309.567 L
496.583 317.92 L
499 325.313 L
501.417 332.54 L
503.833 339.916 L
506.25 343.801 L
508.667 346.652 L
511.083 351.24 L
513.5 358.057 L
515.917 360.026 L
518.333 365.4 L
520.75 371.981 L
523.167 375.793 L
525.583 386.417 L
528 388.38 L
530.417 391.225 L
532.833 384.546 L
535.25 386.213 L
537.667 379.727 L
540.083 378.566 L
542.5 375.369 L
544.917 372.175 L
547.333 378.141 L
549.75 376.987 L
552.167 384.504 L
554.583 385.43 L
557 394.169 L
559.417 395.229 L
561.833 396.413 L
564.25 395.039 L
566.667 386.9 L
569.083 388.607 L
571.5 393.488 L
573.917 392.105 L
576.333 392.549 L
578.75 392.972 L
581.167 392.716 L
583.583 393.063 L
586 396.472 L
588.417 396.135 L
590.833 398.078 L
593.25 396.535 L
595.667 394.524 L
598.083 391.368 L
600.5 390.926 L
602.917 393.409 L
605.333 389.692 L
607.75 386.695 L
610.167 384.332 L
612.583 384.486 L
615 388.947 L
617.417 385.499 L
619.833 383.558 L
622.25 380.815 L
624.667 380.709 L
627.083 378.448 L
629.5 376.005 L
631.917 375.612 L
634.333 375.013 L
636.75 376.148 L
639.167 375.771 L
641.583 372.683 L
644 373.104 L
646.417 378.379 L
648.833 381.596 L
651.25 386.578 L
653.667 393.362 L
656.083 397.879 L
658.5 400.204 L
660.917 394.3 L
663.333 385.299 L
665.75 378.288 L
668.167 374.205 L
670.583 364.756 L
673 351.754 L
675.417 348.831 L
677.833 395.145 L
680.25 342.284 L
682.667 338.397 L
685.083 339.319 L
687.5 334.303 L
689.917 335 L
692.333 329.301 L
694.75 327.022 L
697.167 338.966 L
699.583 342.865 L
702 348.64 L
704.417 350.65 L
706.833 357.463 L
709.25 361.487 L
711.667 367.665 L
714.083 372.802 L
716.5 374.394 L
718.917 379.852 L
721.333 380.137 L
723.75 382.358 L
726.167 381.867 L
728.583 378.54 L
731 378.439 L
733.417 376.961 L
735.833 371.912 L
738.25 364.691 L
740.667 364.235 L
743.083 364.616 L
745.5 357.552 L
747.917 355.918 L
750.333 353.914 L
752.75 355.616 L
755.167 354.832 L
757.583 351.881 L
760 348.516 L
762.417 348.114 L
764.833 348.416 L
767.25 353.172 L
769.667 354.295 L
772.083 358.077 L
774.5 362.051 L
776.917 370.147 L
779.333 375.246 L
781.75 374.451 L
784.167 376.435 L
786.583 378.255 L
789 380.456 L
791.417 383.9 L
793.833 386.054 L
796.25 386.97 L
798.667 387.946 L
801.083 387.314 L
803.5 385.39 L
805.917 381.515 L
808.333 377.843 L
810.75 376.758 L
813.167 371.181 L
815.583 365.923 L
818 365.378 L
820.417 353.37 L
822.833 356.413 L
825.25 350.272 L
827.667 359.095 L
830.083 358.618 L
832.5 354.615 L
834.917 357.871 L
837.333 357.173 L
839.75 359.345 L
842.167 360.553 L
844.583 360.977 L
847 360.663 L
847.086 360.788 L
S
GR
GS
[0.75 0 0 0.75 0 0] CT
0.929 0.694 0.125 RC
1 LJ
1.333 LW
N
124.417 357.177 M
126.833 359.207 L
129.25 360.863 L
131.667 363.071 L
134.083 367.208 L
136.5 370.485 L
138.917 374.429 L
141.333 375.286 L
143.75 376.518 L
146.167 380.565 L
148.583 382.423 L
151 383.618 L
153.417 382.755 L
155.833 385.869 L
158.25 390.031 L
160.667 392.836 L
163.083 397.77 L
165.5 400.758 L
167.917 397.607 L
170.333 396.362 L
172.75 390.733 L
175.167 385.025 L
177.583 381.882 L
180 378.562 L
182.417 377.578 L
184.833 377.258 L
187.25 375.369 L
189.667 375.3 L
192.083 375.962 L
194.5 377.552 L
196.917 381.899 L
199.333 381.86 L
201.75 384.202 L
204.167 382.072 L
206.583 382.26 L
209 384.982 L
211.417 387.229 L
213.833 386.26 L
216.25 387.495 L
218.667 385.966 L
221.083 387.141 L
223.5 386.296 L
225.917 384.171 L
228.333 384.097 L
230.75 384.977 L
233.167 401 L
235.583 386.276 L
238 401 L
240.417 378.078 L
242.833 377.751 L
245.25 377.672 L
247.667 380.372 L
250.083 383.401 L
252.5 385.256 L
254.917 385.905 L
257.333 387.143 L
259.75 392.666 L
262.167 394.223 L
264.583 399.046 L
267 400.998 L
269.417 400.316 L
271.833 396.376 L
274.25 394.113 L
276.667 392.894 L
279.083 390.775 L
281.5 389.608 L
283.917 389.05 L
286.333 389.477 L
288.75 388.135 L
291.167 386.9 L
293.583 385.344 L
296 384.561 L
298.417 382.535 L
300.833 382.576 L
303.25 383.285 L
305.667 384.474 L
308.083 388.95 L
310.5 390.865 L
312.917 392.752 L
315.333 394.449 L
317.75 397.03 L
320.167 399.501 L
322.583 398.783 L
325 395.824 L
327.417 394.704 L
329.833 390.533 L
332.25 401 L
334.667 379.458 L
337.083 401 L
339.5 376.462 L
341.917 401 L
344.333 401 L
346.75 401 L
349.167 401 L
351.583 401 L
354 401 L
356.417 401 L
358.833 401 L
361.25 401 L
363.667 401 L
366.083 364.405 L
368.5 360.715 L
370.917 358.845 L
373.333 358.036 L
375.75 357.956 L
378.167 357.108 L
380.583 356.874 L
383 356.336 L
385.417 356.424 L
387.833 358.755 L
390.25 362.823 L
392.667 359.588 L
395.083 361.992 L
397.5 362.881 L
399.917 365.86 L
402.333 373.557 L
404.75 375.672 L
407.167 383.397 L
409.583 391.12 L
412 394.291 L
414.417 397.836 L
416.833 400.543 L
419.25 396.782 L
421.667 394.665 L
424.083 391.475 L
426.5 389.936 L
428.917 386.861 L
431.333 401 L
433.75 381.368 L
436.167 380.821 L
438.583 401 L
441 401 L
443.417 401 L
445.833 401 L
448.25 401 L
450.667 401 L
453.083 401 L
455.5 401 L
457.917 401 L
460.333 401 L
462.75 401 L
465.167 347.917 L
467.583 401 L
470 358.022 L
472.417 349.162 L
474.833 401 L
477.25 282.011 L
479.667 282.364 L
482.083 284.59 L
484.5 289.141 L
486.917 355.259 L
489.333 296.85 L
491.75 305.661 L
494.167 310.016 L
496.583 318.307 L
499 325.709 L
501.417 332.9 L
503.833 340.25 L
506.25 344.154 L
508.667 346.97 L
511.083 351.545 L
513.5 358.329 L
515.917 360.362 L
518.333 365.724 L
520.75 372.273 L
523.167 376.082 L
525.583 386.761 L
528 388.714 L
530.417 391.471 L
532.833 384.58 L
535.25 386.273 L
537.667 379.73 L
540.083 378.576 L
542.5 375.37 L
544.917 372.176 L
547.333 378.141 L
549.75 376.989 L
552.167 384.504 L
554.583 385.431 L
557 394.184 L
559.417 395.294 L
561.833 396.531 L
564.25 395.139 L
566.667 386.998 L
569.083 388.653 L
571.5 393.513 L
573.917 392.14 L
576.333 392.599 L
578.75 392.973 L
581.167 392.754 L
583.583 393.096 L
586 396.492 L
588.417 396.139 L
590.833 398.139 L
593.25 396.583 L
595.667 394.526 L
598.083 391.368 L
600.5 390.927 L
602.917 393.416 L
605.333 389.694 L
607.75 386.698 L
610.167 384.351 L
612.583 384.507 L
615 389.039 L
617.417 385.572 L
619.833 383.596 L
622.25 380.86 L
624.667 380.762 L
627.083 378.514 L
629.5 376.045 L
631.917 375.657 L
634.333 375.056 L
636.75 376.208 L
639.167 375.816 L
641.583 372.733 L
644 373.14 L
646.417 378.409 L
648.833 381.605 L
651.25 386.605 L
653.667 393.375 L
656.083 397.884 L
658.5 400.204 L
660.917 394.33 L
663.333 385.313 L
665.75 378.293 L
668.167 374.206 L
670.583 364.756 L
673 351.756 L
675.417 348.834 L
677.833 395.494 L
680.25 342.297 L
682.667 338.414 L
685.083 339.343 L
687.5 334.321 L
689.917 335.038 L
692.333 329.321 L
694.75 327.051 L
697.167 339.019 L
699.583 342.92 L
702 348.742 L
704.417 350.747 L
706.833 357.591 L
709.25 361.631 L
711.667 367.88 L
714.083 372.978 L
716.5 374.569 L
718.917 380.172 L
721.333 380.476 L
723.75 382.828 L
726.167 382.444 L
728.583 379.145 L
731 379.018 L
733.417 377.565 L
735.833 372.526 L
738.25 365.252 L
740.667 364.835 L
743.083 365.217 L
745.5 358.193 L
747.917 356.622 L
750.333 354.644 L
752.75 356.335 L
755.167 355.585 L
757.583 352.647 L
760 349.271 L
762.417 348.878 L
764.833 349.128 L
767.25 353.847 L
769.667 354.933 L
772.083 358.657 L
774.5 362.604 L
776.917 370.644 L
779.333 375.706 L
781.75 374.948 L
784.167 376.891 L
786.583 378.657 L
789 380.819 L
791.417 384.219 L
793.833 386.394 L
796.25 387.337 L
798.667 388.339 L
801.083 387.688 L
803.5 385.707 L
805.917 381.774 L
808.333 378.018 L
810.75 376.948 L
813.167 371.312 L
815.583 366.045 L
818 365.504 L
820.417 353.444 L
822.833 356.51 L
825.25 350.342 L
827.667 359.193 L
830.083 358.695 L
832.5 354.666 L
834.917 357.909 L
837.333 357.208 L
839.75 359.368 L
842.167 360.57 L
844.583 360.987 L
847 360.666 L
847.086 360.791 L
S
GR
GS
[0.75 0 0 0.75 0 0] CT
1 GC
N
836 138 M
836 47 L
698 47 L
698 138 L
cp
f
GR
GS
[0.75 0 0 0.75 558.74995 47.49617] CT
N
/f-1830405052{0.797 5.76 M
0.797 4.916 L
3.266 4.916 3.266 4.151 QT
3.266 -9.037 L
3.266 -9.787 0.797 -9.787 QT
0.797 -10.631 L
9.344 -10.631 L
10.656 -10.631 11.969 -10.092 QT
13.281 -9.553 14.133 -8.521 QT
14.984 -7.49 14.984 -6.131 QT
14.984 -4.787 14.125 -3.779 QT
13.266 -2.771 11.969 -2.248 QT
10.672 -1.724 9.344 -1.724 QT
5.5 -1.724 L
5.5 4.151 L
5.5 4.916 7.969 4.916 QT
7.969 5.76 L
0.797 5.76 L
cp
5.422 -2.443 M
8.688 -2.443 L
10.016 -2.443 10.836 -2.826 QT
11.656 -3.209 12.031 -4.014 QT
12.406 -4.818 12.406 -6.131 QT
12.406 -8.084 11.547 -8.935 QT
10.688 -9.787 8.688 -9.787 QT
6.641 -9.787 L
6.219 -9.787 5.977 -9.756 QT
5.734 -9.724 5.578 -9.553 QT
5.422 -9.381 5.422 -9.037 QT
5.422 -2.443 L
cp}def
f-1830405052
f
GR
GS
[0.75 0 0 0.75 558.74995 47.49617] CT
N
/f-370551762{24.786 6.026 M
19.13 -9.037 L
18.911 -9.537 18.318 -9.662 QT
17.724 -9.787 16.786 -9.787 QT
16.786 -10.631 L
23.396 -10.631 L
23.396 -9.787 L
21.396 -9.787 21.396 -9.178 QT
21.411 -9.131 21.419 -9.107 QT
21.427 -9.084 21.427 -9.037 QT
26.021 3.213 L
30.38 -8.381 L
30.427 -8.474 30.427 -8.662 QT
30.427 -9.256 29.888 -9.521 QT
29.349 -9.787 28.677 -9.787 QT
28.677 -10.631 L
33.849 -10.631 L
33.849 -9.787 L
32.958 -9.787 32.271 -9.459 QT
31.583 -9.131 31.286 -8.381 QT
25.865 6.026 L
25.786 6.291 25.474 6.291 QT
25.177 6.291 L
24.849 6.291 24.786 6.026 QT
cp}def
f-370551762
f
GR
GS
[0.75 0 0 0.75 558.74995 47.49617] CT
N
/f-467109162{38.396 5.76 M
38.396 4.916 L
39.599 4.916 40.732 4.783 QT
41.865 4.651 41.865 4.151 QT
41.865 -9.037 L
41.865 -9.553 41.583 -9.67 QT
41.302 -9.787 40.646 -9.787 QT
39.646 -9.787 L
37.662 -9.787 36.833 -8.928 QT
36.396 -8.49 36.208 -7.537 QT
36.021 -6.584 35.896 -5.146 QT
35.208 -5.146 L
35.662 -10.631 L
50.318 -10.631 L
50.771 -5.146 L
50.068 -5.146 L
49.927 -6.693 49.763 -7.599 QT
49.599 -8.506 49.146 -8.928 QT
48.302 -9.787 46.333 -9.787 QT
45.333 -9.787 L
44.896 -9.787 44.654 -9.756 QT
44.412 -9.724 44.263 -9.553 QT
44.115 -9.381 44.115 -9.037 QT
44.115 4.151 L
44.115 4.651 45.247 4.783 QT
46.38 4.916 47.583 4.916 QT
47.583 5.76 L
38.396 5.76 L
cp}def
f-467109162
f
GR
GS
[0.75 0 0 0.75 558.74995 47.49617] CT
N
/f-1443658756{51.932 1.322 M
51.932 -0.178 L
58.292 -0.178 L
58.292 1.322 L
51.932 1.322 L
cp}def
f-1443658756
f
GR
GS
[0.75 0 0 0.75 558.74995 47.49617] CT
N
/f1344707165{60.464 5.76 M
60.464 4.916 L
62.932 4.916 62.932 4.151 QT
62.932 -9.037 L
62.932 -9.787 60.464 -9.787 QT
60.464 -10.631 L
67.995 -10.631 L
69.354 -10.631 70.831 -10.146 QT
72.307 -9.662 73.307 -8.67 QT
74.307 -7.678 74.307 -6.287 QT
74.307 -5.287 73.706 -4.49 QT
73.104 -3.693 72.159 -3.162 QT
71.214 -2.631 70.229 -2.396 QT
71.307 -2.021 72.112 -1.201 QT
72.917 -0.381 73.089 0.666 QT
73.432 2.807 L
73.667 4.244 73.925 4.955 QT
74.182 5.666 75.057 5.666 QT
75.807 5.666 76.175 4.971 QT
76.542 4.276 76.542 3.447 QT
76.542 3.369 76.62 3.307 QT
76.698 3.244 76.776 3.244 QT
76.995 3.244 L
77.229 3.244 77.229 3.557 QT
77.229 4.213 76.971 4.838 QT
76.714 5.463 76.229 5.877 QT
75.745 6.291 75.073 6.291 QT
73.339 6.291 72.096 5.424 QT
70.854 4.557 70.854 2.901 QT
70.854 0.76 L
70.854 -0.428 70.018 -1.287 QT
69.182 -2.146 67.979 -2.146 QT
65.089 -2.146 L
65.089 4.151 L
65.089 4.916 67.573 4.916 QT
67.573 5.76 L
60.464 5.76 L
cp
65.089 -2.756 M
67.667 -2.756 L
69.651 -2.756 70.698 -3.56 QT
71.745 -4.365 71.745 -6.287 QT
71.745 -8.193 70.714 -8.99 QT
69.682 -9.787 67.667 -9.787 QT
66.307 -9.787 L
65.885 -9.787 65.643 -9.756 QT
65.401 -9.724 65.245 -9.553 QT
65.089 -9.381 65.089 -9.037 QT
65.089 -2.756 L
cp}def
f1344707165
f
GR
GS
[0.75 0 0 0.75 0 0] CT
0 0.447 0.741 RC
1 LJ
1.333 LW
N
702 63.328 M
742 63.328 L
S
GR
GS
[0.75 0 0 0.75 558.74995 69.375] CT
N
/f-2015056922{0.797 5.76 M
0.797 4.916 L
3.266 4.916 3.266 4.151 QT
3.266 -9.037 L
3.266 -9.787 0.797 -9.787 QT
0.797 -10.631 L
9.641 -10.631 L
11.281 -10.631 12.641 -9.928 QT
14 -9.224 14.961 -8.037 QT
15.922 -6.849 16.445 -5.349 QT
16.969 -3.849 16.969 -2.287 QT
16.969 -0.756 16.445 0.682 QT
15.922 2.119 14.93 3.268 QT
13.938 4.416 12.586 5.088 QT
11.234 5.76 9.641 5.76 QT
0.797 5.76 L
cp
5.422 4.151 M
5.422 4.666 5.719 4.791 QT
6.016 4.916 6.641 4.916 QT
9.031 4.916 L
10.25 4.916 11.359 4.385 QT
12.469 3.854 13.203 2.901 QT
13.953 1.885 14.211 0.643 QT
14.469 -0.599 14.469 -2.287 QT
14.469 -4.021 14.211 -5.334 QT
13.953 -6.646 13.203 -7.678 QT
12.484 -8.709 11.383 -9.248 QT
10.281 -9.787 9.031 -9.787 QT
6.641 -9.787 L
6.219 -9.787 5.977 -9.756 QT
5.734 -9.724 5.578 -9.553 QT
5.422 -9.381 5.422 -9.037 QT
5.422 4.151 L
cp}def
f-2015056922
f
GR
GS
[0.75 0 0 0.75 558.74995 69.375] CT
N
/f1754494550{19.13 5.76 M
19.13 4.916 L
21.599 4.916 21.599 4.151 QT
21.599 -9.037 L
21.599 -9.787 19.13 -9.787 QT
19.13 -10.631 L
27.974 -10.631 L
29.615 -10.631 30.974 -9.928 QT
32.333 -9.224 33.294 -8.037 QT
34.255 -6.849 34.779 -5.349 QT
35.302 -3.849 35.302 -2.287 QT
35.302 -0.756 34.779 0.682 QT
34.255 2.119 33.263 3.268 QT
32.271 4.416 30.919 5.088 QT
29.568 5.76 27.974 5.76 QT
19.13 5.76 L
cp
23.755 4.151 M
23.755 4.666 24.052 4.791 QT
24.349 4.916 24.974 4.916 QT
27.365 4.916 L
28.583 4.916 29.693 4.385 QT
30.802 3.854 31.536 2.901 QT
32.286 1.885 32.544 0.643 QT
32.802 -0.599 32.802 -2.287 QT
32.802 -4.021 32.544 -5.334 QT
32.286 -6.646 31.536 -7.678 QT
30.818 -8.709 29.716 -9.248 QT
28.615 -9.787 27.365 -9.787 QT
24.974 -9.787 L
24.552 -9.787 24.31 -9.756 QT
24.068 -9.724 23.911 -9.553 QT
23.755 -9.381 23.755 -9.037 QT
23.755 4.151 L
cp}def
f1754494550
f
GR
GS
[0.75 0 0 0.75 558.74995 69.375] CT
N
/f1117690553{37.464 5.76 M
37.464 4.916 L
39.932 4.916 39.932 4.151 QT
39.932 -9.037 L
39.932 -9.787 37.464 -9.787 QT
37.464 -10.631 L
44.995 -10.631 L
46.354 -10.631 47.831 -10.146 QT
49.307 -9.662 50.307 -8.67 QT
51.307 -7.678 51.307 -6.287 QT
51.307 -5.287 50.706 -4.49 QT
50.104 -3.693 49.159 -3.162 QT
48.214 -2.631 47.229 -2.396 QT
48.307 -2.021 49.112 -1.201 QT
49.917 -0.381 50.089 0.666 QT
50.432 2.807 L
50.667 4.244 50.925 4.955 QT
51.182 5.666 52.057 5.666 QT
52.807 5.666 53.175 4.971 QT
53.542 4.276 53.542 3.447 QT
53.542 3.369 53.62 3.307 QT
53.698 3.244 53.776 3.244 QT
53.995 3.244 L
54.229 3.244 54.229 3.557 QT
54.229 4.213 53.971 4.838 QT
53.714 5.463 53.229 5.877 QT
52.745 6.291 52.073 6.291 QT
50.339 6.291 49.096 5.424 QT
47.854 4.557 47.854 2.901 QT
47.854 0.76 L
47.854 -0.428 47.018 -1.287 QT
46.182 -2.146 44.979 -2.146 QT
42.089 -2.146 L
42.089 4.151 L
42.089 4.916 44.573 4.916 QT
44.573 5.76 L
37.464 5.76 L
cp
42.089 -2.756 M
44.667 -2.756 L
46.651 -2.756 47.698 -3.56 QT
48.745 -4.365 48.745 -6.287 QT
48.745 -8.193 47.714 -8.99 QT
46.682 -9.787 44.667 -9.787 QT
43.307 -9.787 L
42.885 -9.787 42.643 -9.756 QT
42.401 -9.724 42.245 -9.553 QT
42.089 -9.381 42.089 -9.037 QT
42.089 -2.756 L
cp}def
f1117690553
f
GR
GS
[0.75 0 0 0.75 0 0] CT
0.851 0.325 0.098 RC
1 LJ
1.333 LW
N
702 92.5 M
742 92.5 L
S
GR
GS
[0.75 0 0 0.75 558.74995 91.25383] CT
N
f-2015056922
f
GR
GS
[0.75 0 0 0.75 558.74995 91.25383] CT
N
f1754494550
f
GR
GS
[0.75 0 0 0.75 558.74995 91.25383] CT
N
f1117690553
f
GR
GS
[0.75 0 0 0.75 558.74995 91.25383] CT
N
/f46879884{54.599 1.322 M
54.599 -0.178 L
60.958 -0.178 L
60.958 1.322 L
54.599 1.322 L
cp}def
f46879884
f
GR
GS
[0.75 0 0 0.75 558.74995 91.25383] CT
N
/f658838208{69.802 6.026 M
64.896 -9.037 L
64.708 -9.537 64.169 -9.662 QT
63.63 -9.787 62.771 -9.787 QT
62.771 -10.631 L
69.208 -10.631 L
69.208 -9.787 L
67.193 -9.787 67.193 -9.146 QT
67.193 -9.037 L
71.021 2.776 L
74.287 -7.318 L
73.74 -9.037 L
73.552 -9.537 73.013 -9.662 QT
72.474 -9.787 71.599 -9.787 QT
71.599 -10.631 L
78.021 -10.631 L
78.021 -9.787 L
75.99 -9.787 75.99 -9.146 QT
75.99 -9.115 76.013 -9.045 QT
76.037 -8.974 76.037 -8.943 QT
79.849 2.776 L
83.458 -8.381 L
83.474 -8.443 83.474 -8.599 QT
83.474 -9.224 82.81 -9.506 QT
82.146 -9.787 81.412 -9.787 QT
81.412 -10.631 L
86.552 -10.631 L
86.552 -9.787 L
84.646 -9.787 84.208 -8.381 QT
79.521 6.026 L
79.427 6.291 79.162 6.291 QT
78.99 6.291 L
78.724 6.291 78.63 6.026 QT
74.677 -6.193 L
70.693 6.026 L
70.615 6.291 70.333 6.291 QT
70.162 6.291 L
69.88 6.291 69.802 6.026 QT
cp}def
f658838208
f
GR
GS
[0.75 0 0 0.75 0 0] CT
0.929 0.694 0.125 RC
1 LJ
1.333 LW
N
702 121.672 M
742 121.672 L
S
GR
GS
[0.75 0 0 0.75 0 0] CT
1 GC
10.0 ML
1.333 LW
N
698 138 M
698 47 L
836 47 L
836 138 L
cp
S
GR
%%Trailer
%%Pages: 1
%%EOF
