%!PS-Adobe-3.0 EPSF-3.0
%%Creator: (MATLAB, The Mathworks, Inc. Version 9.5.0.944444 \(R2018b\). Operating System: Windows 10)
%%Title: (C:/Users/Alex/Documents/PhD Docs/01. GIT/my_phd_thesis/Chapter8/Figures/capsloc_res/binaryProfitability_example.eps)
%%CreationDate: 2019-11-04T11:39:02
%%Pages: (atend)
%%BoundingBox: 0 0 676 333
%%LanguageLevel: 3
%%EndComments
%%BeginProlog
%%BeginResource: procset (Apache XML Graphics Std ProcSet) 1.2 0
%%Version: 1.2 0
%%Copyright: (Copyright 2001-2003,2010 The Apache Software Foundation. License terms: http://www.apache.org/licenses/LICENSE-2.0)
/bd{bind def}bind def
/ld{load def}bd
/GR/grestore ld
/GS/gsave ld
/RM/rmoveto ld
/C/curveto ld
/t/show ld
/L/lineto ld
/ML/setmiterlimit ld
/CT/concat ld
/f/fill ld
/N/newpath ld
/S/stroke ld
/CC/setcmykcolor ld
/A/ashow ld
/cp/closepath ld
/RC/setrgbcolor ld
/LJ/setlinejoin ld
/GC/setgray ld
/LW/setlinewidth ld
/M/moveto ld
/re {4 2 roll M
1 index 0 rlineto
0 exch rlineto
neg 0 rlineto
cp } bd
/_ctm matrix def
/_tm matrix def
/BT { _ctm currentmatrix pop matrix _tm copy pop 0 0 moveto } bd
/ET { _ctm setmatrix } bd
/iTm { _ctm setmatrix _tm concat } bd
/Tm { _tm astore pop iTm 0 0 moveto } bd
/ux 0.0 def
/uy 0.0 def
/F {
  /Tp exch def
  /Tf exch def
  Tf findfont Tp scalefont setfont
  /cf Tf def  /cs Tp def
} bd
/ULS {currentpoint /uy exch def /ux exch def} bd
/ULE {
  /Tcx currentpoint pop def
  gsave
  newpath
  cf findfont cs scalefont dup
  /FontMatrix get 0 get /Ts exch def /FontInfo get dup
  /UnderlinePosition get Ts mul /To exch def
  /UnderlineThickness get Ts mul /Tt exch def
  ux uy To add moveto  Tcx uy To add lineto
  Tt setlinewidth stroke
  grestore
} bd
/OLE {
  /Tcx currentpoint pop def
  gsave
  newpath
  cf findfont cs scalefont dup
  /FontMatrix get 0 get /Ts exch def /FontInfo get dup
  /UnderlinePosition get Ts mul /To exch def
  /UnderlineThickness get Ts mul /Tt exch def
  ux uy To add cs add moveto Tcx uy To add cs add lineto
  Tt setlinewidth stroke
  grestore
} bd
/SOE {
  /Tcx currentpoint pop def
  gsave
  newpath
  cf findfont cs scalefont dup
  /FontMatrix get 0 get /Ts exch def /FontInfo get dup
  /UnderlinePosition get Ts mul /To exch def
  /UnderlineThickness get Ts mul /Tt exch def
  ux uy To add cs 10 mul 26 idiv add moveto Tcx uy To add cs 10 mul 26 idiv add lineto
  Tt setlinewidth stroke
  grestore
} bd
/QT {
/Y22 exch store
/X22 exch store
/Y21 exch store
/X21 exch store
currentpoint
/Y21 load 2 mul add 3 div exch
/X21 load 2 mul add 3 div exch
/X21 load 2 mul /X22 load add 3 div
/Y21 load 2 mul /Y22 load add 3 div
/X22 load /Y22 load curveto
} bd
/SSPD {
dup length /d exch dict def
{
/v exch def
/k exch def
currentpagedevice k known {
/cpdv currentpagedevice k get def
v cpdv ne {
/upd false def
/nullv v type /nulltype eq def
/nullcpdv cpdv type /nulltype eq def
nullv nullcpdv or
{
/upd true def
} {
/sametype v type cpdv type eq def
sametype {
v type /arraytype eq {
/vlen v length def
/cpdvlen cpdv length def
vlen cpdvlen eq {
0 1 vlen 1 sub {
/i exch def
/obj v i get def
/cpdobj cpdv i get def
obj cpdobj ne {
/upd true def
exit
} if
} for
} {
/upd true def
} ifelse
} {
v type /dicttype eq {
v {
/dv exch def
/dk exch def
/cpddv cpdv dk get def
dv cpddv ne {
/upd true def
exit
} if
} forall
} {
/upd true def
} ifelse
} ifelse
} if
} ifelse
upd true eq {
d k v put
} if
} if
} if
} forall
d length 0 gt {
d setpagedevice
} if
} bd
/RE { % /NewFontName [NewEncodingArray] /FontName RE -
  findfont dup length dict begin
  {
    1 index /FID ne
    {def} {pop pop} ifelse
  } forall
  /Encoding exch def
  /FontName 1 index def
  currentdict definefont pop
  end
} bind def
%%EndResource
%%BeginResource: procset (Apache XML Graphics EPS ProcSet) 1.0 0
%%Version: 1.0 0
%%Copyright: (Copyright 2002-2003 The Apache Software Foundation. License terms: http://www.apache.org/licenses/LICENSE-2.0)
/BeginEPSF { %def
/b4_Inc_state save def         % Save state for cleanup
/dict_count countdictstack def % Count objects on dict stack
/op_count count 1 sub def      % Count objects on operand stack
userdict begin                 % Push userdict on dict stack
/showpage { } def              % Redefine showpage, { } = null proc
0 setgray 0 setlinecap         % Prepare graphics state
1 setlinewidth 0 setlinejoin
10 setmiterlimit [ ] 0 setdash newpath
/languagelevel where           % If level not equal to 1 then
{pop languagelevel             % set strokeadjust and
1 ne                           % overprint to their defaults.
{false setstrokeadjust false setoverprint
} if
} if
} bd
/EndEPSF { %def
count op_count sub {pop} repeat            % Clean up stacks
countdictstack dict_count sub {end} repeat
b4_Inc_state restore
} bd
%%EndResource
%FOPBeginFontDict
%%IncludeResource: font Courier-Oblique
%%IncludeResource: font Courier-BoldOblique
%%IncludeResource: font Courier-Bold
%%IncludeResource: font ZapfDingbats
%%IncludeResource: font Symbol
%%IncludeResource: font Helvetica
%%IncludeResource: font Helvetica-Oblique
%%IncludeResource: font Helvetica-Bold
%%IncludeResource: font Helvetica-BoldOblique
%%IncludeResource: font Times-Roman
%%IncludeResource: font Times-Italic
%%IncludeResource: font Times-Bold
%%IncludeResource: font Times-BoldItalic
%%IncludeResource: font Courier
%FOPEndFontDict
%%BeginResource: encoding WinAnsiEncoding
/WinAnsiEncoding [
/.notdef /.notdef /.notdef /.notdef /.notdef
/.notdef /.notdef /.notdef /.notdef /.notdef
/.notdef /.notdef /.notdef /.notdef /.notdef
/.notdef /.notdef /.notdef /.notdef /.notdef
/.notdef /.notdef /.notdef /.notdef /.notdef
/.notdef /.notdef /.notdef /.notdef /.notdef
/.notdef /.notdef /space /exclam /quotedbl
/numbersign /dollar /percent /ampersand /quotesingle
/parenleft /parenright /asterisk /plus /comma
/hyphen /period /slash /zero /one
/two /three /four /five /six
/seven /eight /nine /colon /semicolon
/less /equal /greater /question /at
/A /B /C /D /E
/F /G /H /I /J
/K /L /M /N /O
/P /Q /R /S /T
/U /V /W /X /Y
/Z /bracketleft /backslash /bracketright /asciicircum
/underscore /quoteleft /a /b /c
/d /e /f /g /h
/i /j /k /l /m
/n /o /p /q /r
/s /t /u /v /w
/x /y /z /braceleft /bar
/braceright /asciitilde /bullet /Euro /bullet
/quotesinglbase /florin /quotedblbase /ellipsis /dagger
/daggerdbl /circumflex /perthousand /Scaron /guilsinglleft
/OE /bullet /Zcaron /bullet /bullet
/quoteleft /quoteright /quotedblleft /quotedblright /bullet
/endash /emdash /asciitilde /trademark /scaron
/guilsinglright /oe /bullet /zcaron /Ydieresis
/space /exclamdown /cent /sterling /currency
/yen /brokenbar /section /dieresis /copyright
/ordfeminine /guillemotleft /logicalnot /sfthyphen /registered
/macron /degree /plusminus /twosuperior /threesuperior
/acute /mu /paragraph /middot /cedilla
/onesuperior /ordmasculine /guillemotright /onequarter /onehalf
/threequarters /questiondown /Agrave /Aacute /Acircumflex
/Atilde /Adieresis /Aring /AE /Ccedilla
/Egrave /Eacute /Ecircumflex /Edieresis /Igrave
/Iacute /Icircumflex /Idieresis /Eth /Ntilde
/Ograve /Oacute /Ocircumflex /Otilde /Odieresis
/multiply /Oslash /Ugrave /Uacute /Ucircumflex
/Udieresis /Yacute /Thorn /germandbls /agrave
/aacute /acircumflex /atilde /adieresis /aring
/ae /ccedilla /egrave /eacute /ecircumflex
/edieresis /igrave /iacute /icircumflex /idieresis
/eth /ntilde /ograve /oacute /ocircumflex
/otilde /odieresis /divide /oslash /ugrave
/uacute /ucircumflex /udieresis /yacute /thorn
/ydieresis
] def
%%EndResource
%FOPBeginFontReencode
/Courier-Oblique findfont
dup length dict begin
  {1 index /FID ne {def} {pop pop} ifelse} forall
  /Encoding WinAnsiEncoding def
  currentdict
end
/Courier-Oblique exch definefont pop
/Courier-BoldOblique findfont
dup length dict begin
  {1 index /FID ne {def} {pop pop} ifelse} forall
  /Encoding WinAnsiEncoding def
  currentdict
end
/Courier-BoldOblique exch definefont pop
/Courier-Bold findfont
dup length dict begin
  {1 index /FID ne {def} {pop pop} ifelse} forall
  /Encoding WinAnsiEncoding def
  currentdict
end
/Courier-Bold exch definefont pop
/Helvetica findfont
dup length dict begin
  {1 index /FID ne {def} {pop pop} ifelse} forall
  /Encoding WinAnsiEncoding def
  currentdict
end
/Helvetica exch definefont pop
/Helvetica-Oblique findfont
dup length dict begin
  {1 index /FID ne {def} {pop pop} ifelse} forall
  /Encoding WinAnsiEncoding def
  currentdict
end
/Helvetica-Oblique exch definefont pop
/Helvetica-Bold findfont
dup length dict begin
  {1 index /FID ne {def} {pop pop} ifelse} forall
  /Encoding WinAnsiEncoding def
  currentdict
end
/Helvetica-Bold exch definefont pop
/Helvetica-BoldOblique findfont
dup length dict begin
  {1 index /FID ne {def} {pop pop} ifelse} forall
  /Encoding WinAnsiEncoding def
  currentdict
end
/Helvetica-BoldOblique exch definefont pop
/Times-Roman findfont
dup length dict begin
  {1 index /FID ne {def} {pop pop} ifelse} forall
  /Encoding WinAnsiEncoding def
  currentdict
end
/Times-Roman exch definefont pop
/Times-Italic findfont
dup length dict begin
  {1 index /FID ne {def} {pop pop} ifelse} forall
  /Encoding WinAnsiEncoding def
  currentdict
end
/Times-Italic exch definefont pop
/Times-Bold findfont
dup length dict begin
  {1 index /FID ne {def} {pop pop} ifelse} forall
  /Encoding WinAnsiEncoding def
  currentdict
end
/Times-Bold exch definefont pop
/Times-BoldItalic findfont
dup length dict begin
  {1 index /FID ne {def} {pop pop} ifelse} forall
  /Encoding WinAnsiEncoding def
  currentdict
end
/Times-BoldItalic exch definefont pop
/Courier findfont
dup length dict begin
  {1 index /FID ne {def} {pop pop} ifelse} forall
  /Encoding WinAnsiEncoding def
  currentdict
end
/Courier exch definefont pop
%FOPEndFontReencode
%%EndProlog
%%Page: 1 1
%%PageBoundingBox: 0 0 676 333
%%BeginPageSetup
[1 0 0 -1 0 333] CT
%%EndPageSetup
GS
[0.75 0 0 0.75 0 0] CT
1 GC
N
0 0 901 444 re
f
GR
GS
[0.75 0 0 0.75 0 0] CT
1 GC
N
0 0 901 444 re
f
GR
GS
[0.75 0 0 0.75 0 0] CT
1 GC
N
181 395 M
815 395 L
815 247 L
181 247 L
cp
f
GR
GS
[0.75 0 0 0.75 0 0] CT
0.149 GC
2 setlinecap
1 LJ
0.667 LW
N
181 395 M
181 247 L
S
GR
GS
[0.75 0 0 0.75 0 0] CT
0.149 GC
2 setlinecap
1 LJ
0.667 LW
N
815 395 M
815 247 L
S
GR
GS
[0.75 0 0 0.75 0 0] CT
0.149 GC
2 setlinecap
1 LJ
0.667 LW
N
181 395 M
187.34 395 L
S
GR
GS
[0.75 0 0 0.75 0 0] CT
0.149 GC
2 setlinecap
1 LJ
0.667 LW
N
181 321 M
187.34 321 L
S
GR
GS
[0.75 0 0 0.75 0 0] CT
0.149 GC
2 setlinecap
1 LJ
0.667 LW
N
181 247 M
187.34 247 L
S
GR
GS
[0.75 0 0 0.75 0 0] CT
0.149 GC
2 setlinecap
1 LJ
0.667 LW
N
815 395 M
808.66 395 L
S
GR
GS
[0.75 0 0 0.75 0 0] CT
0.149 GC
2 setlinecap
1 LJ
0.667 LW
N
815 321 M
808.66 321 L
S
GR
GS
[0.75 0 0 0.75 0 0] CT
0.149 GC
2 setlinecap
1 LJ
0.667 LW
N
815 247 M
808.66 247 L
S
GR
GS
[0.75 0 0 0.75 373.50037 181.62669] CT
/Helvetica-Bold 17.6 F
GS
[1 0 0 1 0 0] CT
-23 -4 moveto 
1 -1 scale
(SM02) t 
GR
GR
GS
[0.75 0 0 0.75 0 0] CT
0.149 GC
1 LJ
0.667 LW
N
181 321 M
815 321 L
S
GR
GS
[0.75 0 0 0.75 146.31666 185.25] CT
0.302 0.745 0.933 RC
N
4 0 M
4 -2.209 2.209 -4 0 -4 C
-2.209 -4 -4 -2.209 -4 0 C
-4 2.209 -2.209 4 0 4 C
2.209 4 4 2.209 4 0 C
cp
f
GR
GS
[0.75 0 0 0.75 146.31666 185.25] CT
0.302 0.745 0.933 RC
10.0 ML
N
4 0 M
4 -2.209 2.209 -4 0 -4 C
-2.209 -4 -4 -2.209 -4 0 C
-4 2.209 -2.209 4 0 4 C
2.209 4 4 2.209 4 0 C
cp
S
GR
GS
[0.75 0 0 0.75 275.75832 185.25] CT
0.302 0.745 0.933 RC
N
/f351177404{4 0 M
4 -2.209 2.209 -4 0 -4 C
-2.209 -4 -4 -2.209 -4 0 C
-4 2.209 -2.209 4 0 4 C
2.209 4 4 2.209 4 0 C
cp}def
f351177404
f
GR
GS
[0.75 0 0 0.75 275.75832 185.25] CT
0.302 0.745 0.933 RC
10.0 ML
N
4 0 M
4 -2.209 2.209 -4 0 -4 C
-2.209 -4 -4 -2.209 -4 0 C
-4 2.209 -2.209 4 0 4 C
2.209 4 4 2.209 4 0 C
cp
S
GR
GS
[0.75 0 0 0.75 341.8 185.25] CT
0.302 0.745 0.933 RC
N
f351177404
f
GR
GS
[0.75 0 0 0.75 341.8 185.25] CT
0.302 0.745 0.933 RC
10.0 ML
N
4 0 M
4 -2.209 2.209 -4 0 -4 C
-2.209 -4 -4 -2.209 -4 0 C
-4 2.209 -2.209 4 0 4 C
2.209 4 4 2.209 4 0 C
cp
S
GR
GS
[0.75 0 0 0.75 381.42501 185.25] CT
0.302 0.745 0.933 RC
N
f351177404
f
GR
GS
[0.75 0 0 0.75 381.42501 185.25] CT
0.302 0.745 0.933 RC
10.0 ML
N
4 0 M
4 -2.209 2.209 -4 0 -4 C
-2.209 -4 -4 -2.209 -4 0 C
-4 2.209 -2.209 4 0 4 C
2.209 4 4 2.209 4 0 C
cp
S
GR
GS
[0.75 0 0 0.75 386.70831 185.25] CT
0.302 0.745 0.933 RC
N
f351177404
f
GR
GS
[0.75 0 0 0.75 386.70831 185.25] CT
0.302 0.745 0.933 RC
10.0 ML
N
4 0 M
4 -2.209 2.209 -4 0 -4 C
-2.209 -4 -4 -2.209 -4 0 C
-4 2.209 -2.209 4 0 4 C
2.209 4 4 2.209 4 0 C
cp
S
GR
GS
[0.75 0 0 0.75 394.63335 185.25] CT
0.302 0.745 0.933 RC
N
f351177404
f
GR
GS
[0.75 0 0 0.75 394.63335 185.25] CT
0.302 0.745 0.933 RC
10.0 ML
N
4 0 M
4 -2.209 2.209 -4 0 -4 C
-2.209 -4 -4 -2.209 -4 0 C
-4 2.209 -2.209 4 0 4 C
2.209 4 4 2.209 4 0 C
cp
S
GR
GS
[0.75 0 0 0.75 399.91667 185.25] CT
0.302 0.745 0.933 RC
N
f351177404
f
GR
GS
[0.75 0 0 0.75 399.91667 185.25] CT
0.302 0.745 0.933 RC
10.0 ML
N
4 0 M
4 -2.209 2.209 -4 0 -4 C
-2.209 -4 -4 -2.209 -4 0 C
-4 2.209 -2.209 4 0 4 C
2.209 4 4 2.209 4 0 C
cp
S
GR
GS
[0.75 0 0 0.75 421.05002 185.25] CT
0.302 0.745 0.933 RC
N
f351177404
f
GR
GS
[0.75 0 0 0.75 421.05002 185.25] CT
0.302 0.745 0.933 RC
10.0 ML
N
4 0 M
4 -2.209 2.209 -4 0 -4 C
-2.209 -4 -4 -2.209 -4 0 C
-4 2.209 -2.209 4 0 4 C
2.209 4 4 2.209 4 0 C
cp
S
GR
GS
[0.75 0 0 0.75 423.69168 185.25] CT
0.302 0.745 0.933 RC
N
f351177404
f
GR
GS
[0.75 0 0 0.75 423.69168 185.25] CT
0.302 0.745 0.933 RC
10.0 ML
N
4 0 M
4 -2.209 2.209 -4 0 -4 C
-2.209 -4 -4 -2.209 -4 0 C
-4 2.209 -2.209 4 0 4 C
2.209 4 4 2.209 4 0 C
cp
S
GR
GS
[0.75 0 0 0.75 473.88332 185.25] CT
0.302 0.745 0.933 RC
N
f351177404
f
GR
GS
[0.75 0 0 0.75 473.88332 185.25] CT
0.302 0.745 0.933 RC
10.0 ML
N
4 0 M
4 -2.209 2.209 -4 0 -4 C
-2.209 -4 -4 -2.209 -4 0 C
-4 2.209 -2.209 4 0 4 C
2.209 4 4 2.209 4 0 C
cp
S
GR
GS
[0.75 0 0 0.75 495.01666 185.25] CT
0.302 0.745 0.933 RC
N
f351177404
f
GR
GS
[0.75 0 0 0.75 495.01666 185.25] CT
0.302 0.745 0.933 RC
10.0 ML
N
4 0 M
4 -2.209 2.209 -4 0 -4 C
-2.209 -4 -4 -2.209 -4 0 C
-4 2.209 -2.209 4 0 4 C
2.209 4 4 2.209 4 0 C
cp
S
GR
GS
[0.75 0 0 0.75 497.65833 185.25] CT
0.302 0.745 0.933 RC
N
f351177404
f
GR
GS
[0.75 0 0 0.75 497.65833 185.25] CT
0.302 0.745 0.933 RC
10.0 ML
N
4 0 M
4 -2.209 2.209 -4 0 -4 C
-2.209 -4 -4 -2.209 -4 0 C
-4 2.209 -2.209 4 0 4 C
2.209 4 4 2.209 4 0 C
cp
S
GR
GS
[0.75 0 0 0.75 534.64165 185.25] CT
0.302 0.745 0.933 RC
N
f351177404
f
GR
GS
[0.75 0 0 0.75 534.64165 185.25] CT
0.302 0.745 0.933 RC
10.0 ML
N
4 0 M
4 -2.209 2.209 -4 0 -4 C
-2.209 -4 -4 -2.209 -4 0 C
-4 2.209 -2.209 4 0 4 C
2.209 4 4 2.209 4 0 C
cp
S
GR
GS
[0.75 0 0 0.75 537.28336 185.25] CT
0.302 0.745 0.933 RC
N
f351177404
f
GR
GS
[0.75 0 0 0.75 537.28336 185.25] CT
0.302 0.745 0.933 RC
10.0 ML
N
4 0 M
4 -2.209 2.209 -4 0 -4 C
-2.209 -4 -4 -2.209 -4 0 C
-4 2.209 -2.209 4 0 4 C
2.209 4 4 2.209 4 0 C
cp
S
GR
GS
[0.75 0 0 0.75 539.92502 185.25] CT
0.302 0.745 0.933 RC
N
f351177404
f
GR
GS
[0.75 0 0 0.75 539.92502 185.25] CT
0.302 0.745 0.933 RC
10.0 ML
N
4 0 M
4 -2.209 2.209 -4 0 -4 C
-2.209 -4 -4 -2.209 -4 0 C
-4 2.209 -2.209 4 0 4 C
2.209 4 4 2.209 4 0 C
cp
S
GR
GS
[0.75 0 0 0.75 542.56668 185.25] CT
0.302 0.745 0.933 RC
N
f351177404
f
GR
GS
[0.75 0 0 0.75 542.56668 185.25] CT
0.302 0.745 0.933 RC
10.0 ML
N
4 0 M
4 -2.209 2.209 -4 0 -4 C
-2.209 -4 -4 -2.209 -4 0 C
-4 2.209 -2.209 4 0 4 C
2.209 4 4 2.209 4 0 C
cp
S
GR
GS
[0.75 0 0 0.75 545.20834 185.25] CT
0.302 0.745 0.933 RC
N
f351177404
f
GR
GS
[0.75 0 0 0.75 545.20834 185.25] CT
0.302 0.745 0.933 RC
10.0 ML
N
4 0 M
4 -2.209 2.209 -4 0 -4 C
-2.209 -4 -4 -2.209 -4 0 C
-4 2.209 -2.209 4 0 4 C
2.209 4 4 2.209 4 0 C
cp
S
GR
GS
[0.75 0 0 0.75 547.85001 185.25] CT
0.302 0.745 0.933 RC
N
f351177404
f
GR
GS
[0.75 0 0 0.75 547.85001 185.25] CT
0.302 0.745 0.933 RC
10.0 ML
N
4 0 M
4 -2.209 2.209 -4 0 -4 C
-2.209 -4 -4 -2.209 -4 0 C
-4 2.209 -2.209 4 0 4 C
2.209 4 4 2.209 4 0 C
cp
S
GR
GS
[0.75 0 0 0.75 555.77499 185.25] CT
0.302 0.745 0.933 RC
N
f351177404
f
GR
GS
[0.75 0 0 0.75 555.77499 185.25] CT
0.302 0.745 0.933 RC
10.0 ML
N
4 0 M
4 -2.209 2.209 -4 0 -4 C
-2.209 -4 -4 -2.209 -4 0 C
-4 2.209 -2.209 4 0 4 C
2.209 4 4 2.209 4 0 C
cp
S
GR
GS
[0.75 0 0 0.75 561.05832 185.25] CT
0.302 0.745 0.933 RC
N
f351177404
f
GR
GS
[0.75 0 0 0.75 561.05832 185.25] CT
0.302 0.745 0.933 RC
10.0 ML
N
4 0 M
4 -2.209 2.209 -4 0 -4 C
-2.209 -4 -4 -2.209 -4 0 C
-4 2.209 -2.209 4 0 4 C
2.209 4 4 2.209 4 0 C
cp
S
GR
GS
[0.75 0 0 0.75 563.69998 185.25] CT
0.302 0.745 0.933 RC
N
f351177404
f
GR
GS
[0.75 0 0 0.75 563.69998 185.25] CT
0.302 0.745 0.933 RC
10.0 ML
N
4 0 M
4 -2.209 2.209 -4 0 -4 C
-2.209 -4 -4 -2.209 -4 0 C
-4 2.209 -2.209 4 0 4 C
2.209 4 4 2.209 4 0 C
cp
S
GR
GS
[0.75 0 0 0.75 566.34164 185.25] CT
0.302 0.745 0.933 RC
N
f351177404
f
GR
GS
[0.75 0 0 0.75 566.34164 185.25] CT
0.302 0.745 0.933 RC
10.0 ML
N
4 0 M
4 -2.209 2.209 -4 0 -4 C
-2.209 -4 -4 -2.209 -4 0 C
-4 2.209 -2.209 4 0 4 C
2.209 4 4 2.209 4 0 C
cp
S
GR
GS
[0.75 0 0 0.75 571.62502 185.25] CT
0.302 0.745 0.933 RC
N
f351177404
f
GR
GS
[0.75 0 0 0.75 571.62502 185.25] CT
0.302 0.745 0.933 RC
10.0 ML
N
4 0 M
4 -2.209 2.209 -4 0 -4 C
-2.209 -4 -4 -2.209 -4 0 C
-4 2.209 -2.209 4 0 4 C
2.209 4 4 2.209 4 0 C
cp
S
GR
GS
[0.75 0 0 0.75 0 0] CT
0.302 0.745 0.933 RC
1 LJ
0.667 LW
N
195.089 321 M
195.089 247 L
S
GR
GS
[0.75 0 0 0.75 0 0] CT
0.302 0.745 0.933 RC
1 LJ
0.667 LW
N
367.678 321 M
367.678 247 L
S
GR
GS
[0.75 0 0 0.75 0 0] CT
0.302 0.745 0.933 RC
1 LJ
0.667 LW
N
455.733 321 M
455.733 247 L
S
GR
GS
[0.75 0 0 0.75 0 0] CT
0.302 0.745 0.933 RC
1 LJ
0.667 LW
N
508.567 321 M
508.567 247 L
S
GR
GS
[0.75 0 0 0.75 0 0] CT
0.302 0.745 0.933 RC
1 LJ
0.667 LW
N
515.611 321 M
515.611 247 L
S
GR
GS
[0.75 0 0 0.75 0 0] CT
0.302 0.745 0.933 RC
1 LJ
0.667 LW
N
526.178 321 M
526.178 247 L
S
GR
GS
[0.75 0 0 0.75 0 0] CT
0.302 0.745 0.933 RC
1 LJ
0.667 LW
N
533.222 321 M
533.222 247 L
S
GR
GS
[0.75 0 0 0.75 0 0] CT
0.302 0.745 0.933 RC
1 LJ
0.667 LW
N
561.4 321 M
561.4 247 L
S
GR
GS
[0.75 0 0 0.75 0 0] CT
0.302 0.745 0.933 RC
1 LJ
0.667 LW
N
564.922 321 M
564.922 247 L
S
GR
GS
[0.75 0 0 0.75 0 0] CT
0.302 0.745 0.933 RC
1 LJ
0.667 LW
N
631.844 321 M
631.844 247 L
S
GR
GS
[0.75 0 0 0.75 0 0] CT
0.302 0.745 0.933 RC
1 LJ
0.667 LW
N
660.022 321 M
660.022 247 L
S
GR
GS
[0.75 0 0 0.75 0 0] CT
0.302 0.745 0.933 RC
1 LJ
0.667 LW
N
663.544 321 M
663.544 247 L
S
GR
GS
[0.75 0 0 0.75 0 0] CT
0.302 0.745 0.933 RC
1 LJ
0.667 LW
N
712.856 321 M
712.856 247 L
S
GR
GS
[0.75 0 0 0.75 0 0] CT
0.302 0.745 0.933 RC
1 LJ
0.667 LW
N
716.378 321 M
716.378 247 L
S
GR
GS
[0.75 0 0 0.75 0 0] CT
0.302 0.745 0.933 RC
1 LJ
0.667 LW
N
719.9 321 M
719.9 247 L
S
GR
GS
[0.75 0 0 0.75 0 0] CT
0.302 0.745 0.933 RC
1 LJ
0.667 LW
N
723.422 321 M
723.422 247 L
S
GR
GS
[0.75 0 0 0.75 0 0] CT
0.302 0.745 0.933 RC
1 LJ
0.667 LW
N
726.944 321 M
726.944 247 L
S
GR
GS
[0.75 0 0 0.75 0 0] CT
0.302 0.745 0.933 RC
1 LJ
0.667 LW
N
730.467 321 M
730.467 247 L
S
GR
GS
[0.75 0 0 0.75 0 0] CT
0.302 0.745 0.933 RC
1 LJ
0.667 LW
N
741.033 321 M
741.033 247 L
S
GR
GS
[0.75 0 0 0.75 0 0] CT
0.302 0.745 0.933 RC
1 LJ
0.667 LW
N
748.078 321 M
748.078 247 L
S
GR
GS
[0.75 0 0 0.75 0 0] CT
0.302 0.745 0.933 RC
1 LJ
0.667 LW
N
751.6 321 M
751.6 247 L
S
GR
GS
[0.75 0 0 0.75 0 0] CT
0.302 0.745 0.933 RC
1 LJ
0.667 LW
N
755.122 321 M
755.122 247 L
S
GR
GS
[0.75 0 0 0.75 0 0] CT
0.302 0.745 0.933 RC
1 LJ
0.667 LW
N
762.167 321 M
762.167 247 L
S
GR
GS
[0.75 0 0 0.75 138.39166 296.25] CT
0 0.447 0.741 RC
N
f351177404
f
GR
GS
[0.75 0 0 0.75 138.39166 296.25] CT
0 0.447 0.741 RC
10.0 ML
N
4 0 M
4 -2.209 2.209 -4 0 -4 C
-2.209 -4 -4 -2.209 -4 0 C
-4 2.209 -2.209 4 0 4 C
2.209 4 4 2.209 4 0 C
cp
S
GR
GS
[0.75 0 0 0.75 141.03334 296.25] CT
0 0.447 0.741 RC
N
f351177404
f
GR
GS
[0.75 0 0 0.75 141.03334 296.25] CT
0 0.447 0.741 RC
10.0 ML
N
4 0 M
4 -2.209 2.209 -4 0 -4 C
-2.209 -4 -4 -2.209 -4 0 C
-4 2.209 -2.209 4 0 4 C
2.209 4 4 2.209 4 0 C
cp
S
GR
GS
[0.75 0 0 0.75 148.95834 296.25] CT
0 0.447 0.741 RC
N
f351177404
f
GR
GS
[0.75 0 0 0.75 148.95834 296.25] CT
0 0.447 0.741 RC
10.0 ML
N
4 0 M
4 -2.209 2.209 -4 0 -4 C
-2.209 -4 -4 -2.209 -4 0 C
-4 2.209 -2.209 4 0 4 C
2.209 4 4 2.209 4 0 C
cp
S
GR
GS
[0.75 0 0 0.75 151.6 296.25] CT
0 0.447 0.741 RC
N
f351177404
f
GR
GS
[0.75 0 0 0.75 151.6 296.25] CT
0 0.447 0.741 RC
10.0 ML
N
4 0 M
4 -2.209 2.209 -4 0 -4 C
-2.209 -4 -4 -2.209 -4 0 C
-4 2.209 -2.209 4 0 4 C
2.209 4 4 2.209 4 0 C
cp
S
GR
GS
[0.75 0 0 0.75 154.24166 296.25] CT
0 0.447 0.741 RC
N
f351177404
f
GR
GS
[0.75 0 0 0.75 154.24166 296.25] CT
0 0.447 0.741 RC
10.0 ML
N
4 0 M
4 -2.209 2.209 -4 0 -4 C
-2.209 -4 -4 -2.209 -4 0 C
-4 2.209 -2.209 4 0 4 C
2.209 4 4 2.209 4 0 C
cp
S
GR
GS
[0.75 0 0 0.75 156.88334 296.25] CT
0 0.447 0.741 RC
N
f351177404
f
GR
GS
[0.75 0 0 0.75 156.88334 296.25] CT
0 0.447 0.741 RC
10.0 ML
N
4 0 M
4 -2.209 2.209 -4 0 -4 C
-2.209 -4 -4 -2.209 -4 0 C
-4 2.209 -2.209 4 0 4 C
2.209 4 4 2.209 4 0 C
cp
S
GR
GS
[0.75 0 0 0.75 159.525 296.25] CT
0 0.447 0.741 RC
N
f351177404
f
GR
GS
[0.75 0 0 0.75 159.525 296.25] CT
0 0.447 0.741 RC
10.0 ML
N
4 0 M
4 -2.209 2.209 -4 0 -4 C
-2.209 -4 -4 -2.209 -4 0 C
-4 2.209 -2.209 4 0 4 C
2.209 4 4 2.209 4 0 C
cp
S
GR
GS
[0.75 0 0 0.75 162.16667 296.25] CT
0 0.447 0.741 RC
N
f351177404
f
GR
GS
[0.75 0 0 0.75 162.16667 296.25] CT
0 0.447 0.741 RC
10.0 ML
N
4 0 M
4 -2.209 2.209 -4 0 -4 C
-2.209 -4 -4 -2.209 -4 0 C
-4 2.209 -2.209 4 0 4 C
2.209 4 4 2.209 4 0 C
cp
S
GR
GS
[0.75 0 0 0.75 164.80833 296.25] CT
0 0.447 0.741 RC
N
f351177404
f
GR
GS
[0.75 0 0 0.75 164.80833 296.25] CT
0 0.447 0.741 RC
10.0 ML
N
4 0 M
4 -2.209 2.209 -4 0 -4 C
-2.209 -4 -4 -2.209 -4 0 C
-4 2.209 -2.209 4 0 4 C
2.209 4 4 2.209 4 0 C
cp
S
GR
GS
[0.75 0 0 0.75 167.45 296.25] CT
0 0.447 0.741 RC
N
f351177404
f
GR
GS
[0.75 0 0 0.75 167.45 296.25] CT
0 0.447 0.741 RC
10.0 ML
N
4 0 M
4 -2.209 2.209 -4 0 -4 C
-2.209 -4 -4 -2.209 -4 0 C
-4 2.209 -2.209 4 0 4 C
2.209 4 4 2.209 4 0 C
cp
S
GR
GS
[0.75 0 0 0.75 170.09167 296.25] CT
0 0.447 0.741 RC
N
f351177404
f
GR
GS
[0.75 0 0 0.75 170.09167 296.25] CT
0 0.447 0.741 RC
10.0 ML
N
4 0 M
4 -2.209 2.209 -4 0 -4 C
-2.209 -4 -4 -2.209 -4 0 C
-4 2.209 -2.209 4 0 4 C
2.209 4 4 2.209 4 0 C
cp
S
GR
GS
[0.75 0 0 0.75 172.73333 296.25] CT
0 0.447 0.741 RC
N
f351177404
f
GR
GS
[0.75 0 0 0.75 172.73333 296.25] CT
0 0.447 0.741 RC
10.0 ML
N
4 0 M
4 -2.209 2.209 -4 0 -4 C
-2.209 -4 -4 -2.209 -4 0 C
-4 2.209 -2.209 4 0 4 C
2.209 4 4 2.209 4 0 C
cp
S
GR
GS
[0.75 0 0 0.75 175.375 296.25] CT
0 0.447 0.741 RC
N
f351177404
f
GR
GS
[0.75 0 0 0.75 175.375 296.25] CT
0 0.447 0.741 RC
10.0 ML
N
4 0 M
4 -2.209 2.209 -4 0 -4 C
-2.209 -4 -4 -2.209 -4 0 C
-4 2.209 -2.209 4 0 4 C
2.209 4 4 2.209 4 0 C
cp
S
GR
GS
[0.75 0 0 0.75 178.01667 296.25] CT
0 0.447 0.741 RC
N
f351177404
f
GR
GS
[0.75 0 0 0.75 178.01667 296.25] CT
0 0.447 0.741 RC
10.0 ML
N
4 0 M
4 -2.209 2.209 -4 0 -4 C
-2.209 -4 -4 -2.209 -4 0 C
-4 2.209 -2.209 4 0 4 C
2.209 4 4 2.209 4 0 C
cp
S
GR
GS
[0.75 0 0 0.75 201.79166 296.25] CT
0 0.447 0.741 RC
N
f351177404
f
GR
GS
[0.75 0 0 0.75 201.79166 296.25] CT
0 0.447 0.741 RC
10.0 ML
N
4 0 M
4 -2.209 2.209 -4 0 -4 C
-2.209 -4 -4 -2.209 -4 0 C
-4 2.209 -2.209 4 0 4 C
2.209 4 4 2.209 4 0 C
cp
S
GR
GS
[0.75 0 0 0.75 246.69999 296.25] CT
0 0.447 0.741 RC
N
f351177404
f
GR
GS
[0.75 0 0 0.75 246.69999 296.25] CT
0 0.447 0.741 RC
10.0 ML
N
4 0 M
4 -2.209 2.209 -4 0 -4 C
-2.209 -4 -4 -2.209 -4 0 C
-4 2.209 -2.209 4 0 4 C
2.209 4 4 2.209 4 0 C
cp
S
GR
GS
[0.75 0 0 0.75 249.34167 296.25] CT
0 0.447 0.741 RC
N
f351177404
f
GR
GS
[0.75 0 0 0.75 249.34167 296.25] CT
0 0.447 0.741 RC
10.0 ML
N
4 0 M
4 -2.209 2.209 -4 0 -4 C
-2.209 -4 -4 -2.209 -4 0 C
-4 2.209 -2.209 4 0 4 C
2.209 4 4 2.209 4 0 C
cp
S
GR
GS
[0.75 0 0 0.75 251.98334 296.25] CT
0 0.447 0.741 RC
N
f351177404
f
GR
GS
[0.75 0 0 0.75 251.98334 296.25] CT
0 0.447 0.741 RC
10.0 ML
N
4 0 M
4 -2.209 2.209 -4 0 -4 C
-2.209 -4 -4 -2.209 -4 0 C
-4 2.209 -2.209 4 0 4 C
2.209 4 4 2.209 4 0 C
cp
S
GR
GS
[0.75 0 0 0.75 257.26666 296.25] CT
0 0.447 0.741 RC
N
f351177404
f
GR
GS
[0.75 0 0 0.75 257.26666 296.25] CT
0 0.447 0.741 RC
10.0 ML
N
4 0 M
4 -2.209 2.209 -4 0 -4 C
-2.209 -4 -4 -2.209 -4 0 C
-4 2.209 -2.209 4 0 4 C
2.209 4 4 2.209 4 0 C
cp
S
GR
GS
[0.75 0 0 0.75 259.90833 296.25] CT
0 0.447 0.741 RC
N
f351177404
f
GR
GS
[0.75 0 0 0.75 259.90833 296.25] CT
0 0.447 0.741 RC
10.0 ML
N
4 0 M
4 -2.209 2.209 -4 0 -4 C
-2.209 -4 -4 -2.209 -4 0 C
-4 2.209 -2.209 4 0 4 C
2.209 4 4 2.209 4 0 C
cp
S
GR
GS
[0.75 0 0 0.75 262.55001 296.25] CT
0 0.447 0.741 RC
N
f351177404
f
GR
GS
[0.75 0 0 0.75 262.55001 296.25] CT
0 0.447 0.741 RC
10.0 ML
N
4 0 M
4 -2.209 2.209 -4 0 -4 C
-2.209 -4 -4 -2.209 -4 0 C
-4 2.209 -2.209 4 0 4 C
2.209 4 4 2.209 4 0 C
cp
S
GR
GS
[0.75 0 0 0.75 265.19167 296.25] CT
0 0.447 0.741 RC
N
f351177404
f
GR
GS
[0.75 0 0 0.75 265.19167 296.25] CT
0 0.447 0.741 RC
10.0 ML
N
4 0 M
4 -2.209 2.209 -4 0 -4 C
-2.209 -4 -4 -2.209 -4 0 C
-4 2.209 -2.209 4 0 4 C
2.209 4 4 2.209 4 0 C
cp
S
GR
GS
[0.75 0 0 0.75 267.83334 296.25] CT
0 0.447 0.741 RC
N
f351177404
f
GR
GS
[0.75 0 0 0.75 267.83334 296.25] CT
0 0.447 0.741 RC
10.0 ML
N
4 0 M
4 -2.209 2.209 -4 0 -4 C
-2.209 -4 -4 -2.209 -4 0 C
-4 2.209 -2.209 4 0 4 C
2.209 4 4 2.209 4 0 C
cp
S
GR
GS
[0.75 0 0 0.75 273.11666 296.25] CT
0 0.447 0.741 RC
N
f351177404
f
GR
GS
[0.75 0 0 0.75 273.11666 296.25] CT
0 0.447 0.741 RC
10.0 ML
N
4 0 M
4 -2.209 2.209 -4 0 -4 C
-2.209 -4 -4 -2.209 -4 0 C
-4 2.209 -2.209 4 0 4 C
2.209 4 4 2.209 4 0 C
cp
S
GR
GS
[0.75 0 0 0.75 278.40001 296.25] CT
0 0.447 0.741 RC
N
f351177404
f
GR
GS
[0.75 0 0 0.75 278.40001 296.25] CT
0 0.447 0.741 RC
10.0 ML
N
4 0 M
4 -2.209 2.209 -4 0 -4 C
-2.209 -4 -4 -2.209 -4 0 C
-4 2.209 -2.209 4 0 4 C
2.209 4 4 2.209 4 0 C
cp
S
GR
GS
[0.75 0 0 0.75 281.04167 296.25] CT
0 0.447 0.741 RC
N
f351177404
f
GR
GS
[0.75 0 0 0.75 281.04167 296.25] CT
0 0.447 0.741 RC
10.0 ML
N
4 0 M
4 -2.209 2.209 -4 0 -4 C
-2.209 -4 -4 -2.209 -4 0 C
-4 2.209 -2.209 4 0 4 C
2.209 4 4 2.209 4 0 C
cp
S
GR
GS
[0.75 0 0 0.75 283.68333 296.25] CT
0 0.447 0.741 RC
N
f351177404
f
GR
GS
[0.75 0 0 0.75 283.68333 296.25] CT
0 0.447 0.741 RC
10.0 ML
N
4 0 M
4 -2.209 2.209 -4 0 -4 C
-2.209 -4 -4 -2.209 -4 0 C
-4 2.209 -2.209 4 0 4 C
2.209 4 4 2.209 4 0 C
cp
S
GR
GS
[0.75 0 0 0.75 286.325 296.25] CT
0 0.447 0.741 RC
N
f351177404
f
GR
GS
[0.75 0 0 0.75 286.325 296.25] CT
0 0.447 0.741 RC
10.0 ML
N
4 0 M
4 -2.209 2.209 -4 0 -4 C
-2.209 -4 -4 -2.209 -4 0 C
-4 2.209 -2.209 4 0 4 C
2.209 4 4 2.209 4 0 C
cp
S
GR
GS
[0.75 0 0 0.75 288.96666 296.25] CT
0 0.447 0.741 RC
N
f351177404
f
GR
GS
[0.75 0 0 0.75 288.96666 296.25] CT
0 0.447 0.741 RC
10.0 ML
N
4 0 M
4 -2.209 2.209 -4 0 -4 C
-2.209 -4 -4 -2.209 -4 0 C
-4 2.209 -2.209 4 0 4 C
2.209 4 4 2.209 4 0 C
cp
S
GR
GS
[0.75 0 0 0.75 296.89167 296.25] CT
0 0.447 0.741 RC
N
f351177404
f
GR
GS
[0.75 0 0 0.75 296.89167 296.25] CT
0 0.447 0.741 RC
10.0 ML
N
4 0 M
4 -2.209 2.209 -4 0 -4 C
-2.209 -4 -4 -2.209 -4 0 C
-4 2.209 -2.209 4 0 4 C
2.209 4 4 2.209 4 0 C
cp
S
GR
GS
[0.75 0 0 0.75 299.53333 296.25] CT
0 0.447 0.741 RC
N
f351177404
f
GR
GS
[0.75 0 0 0.75 299.53333 296.25] CT
0 0.447 0.741 RC
10.0 ML
N
4 0 M
4 -2.209 2.209 -4 0 -4 C
-2.209 -4 -4 -2.209 -4 0 C
-4 2.209 -2.209 4 0 4 C
2.209 4 4 2.209 4 0 C
cp
S
GR
GS
[0.75 0 0 0.75 302.175 296.25] CT
0 0.447 0.741 RC
N
f351177404
f
GR
GS
[0.75 0 0 0.75 302.175 296.25] CT
0 0.447 0.741 RC
10.0 ML
N
4 0 M
4 -2.209 2.209 -4 0 -4 C
-2.209 -4 -4 -2.209 -4 0 C
-4 2.209 -2.209 4 0 4 C
2.209 4 4 2.209 4 0 C
cp
S
GR
GS
[0.75 0 0 0.75 304.81666 296.25] CT
0 0.447 0.741 RC
N
f351177404
f
GR
GS
[0.75 0 0 0.75 304.81666 296.25] CT
0 0.447 0.741 RC
10.0 ML
N
4 0 M
4 -2.209 2.209 -4 0 -4 C
-2.209 -4 -4 -2.209 -4 0 C
-4 2.209 -2.209 4 0 4 C
2.209 4 4 2.209 4 0 C
cp
S
GR
GS
[0.75 0 0 0.75 307.45834 296.25] CT
0 0.447 0.741 RC
N
f351177404
f
GR
GS
[0.75 0 0 0.75 307.45834 296.25] CT
0 0.447 0.741 RC
10.0 ML
N
4 0 M
4 -2.209 2.209 -4 0 -4 C
-2.209 -4 -4 -2.209 -4 0 C
-4 2.209 -2.209 4 0 4 C
2.209 4 4 2.209 4 0 C
cp
S
GR
GS
[0.75 0 0 0.75 315.38333 296.25] CT
0 0.447 0.741 RC
N
f351177404
f
GR
GS
[0.75 0 0 0.75 315.38333 296.25] CT
0 0.447 0.741 RC
10.0 ML
N
4 0 M
4 -2.209 2.209 -4 0 -4 C
-2.209 -4 -4 -2.209 -4 0 C
-4 2.209 -2.209 4 0 4 C
2.209 4 4 2.209 4 0 C
cp
S
GR
GS
[0.75 0 0 0.75 318.02499 296.25] CT
0 0.447 0.741 RC
N
f351177404
f
GR
GS
[0.75 0 0 0.75 318.02499 296.25] CT
0 0.447 0.741 RC
10.0 ML
N
4 0 M
4 -2.209 2.209 -4 0 -4 C
-2.209 -4 -4 -2.209 -4 0 C
-4 2.209 -2.209 4 0 4 C
2.209 4 4 2.209 4 0 C
cp
S
GR
GS
[0.75 0 0 0.75 320.66666 296.25] CT
0 0.447 0.741 RC
N
f351177404
f
GR
GS
[0.75 0 0 0.75 320.66666 296.25] CT
0 0.447 0.741 RC
10.0 ML
N
4 0 M
4 -2.209 2.209 -4 0 -4 C
-2.209 -4 -4 -2.209 -4 0 C
-4 2.209 -2.209 4 0 4 C
2.209 4 4 2.209 4 0 C
cp
S
GR
GS
[0.75 0 0 0.75 323.30834 296.25] CT
0 0.447 0.741 RC
N
f351177404
f
GR
GS
[0.75 0 0 0.75 323.30834 296.25] CT
0 0.447 0.741 RC
10.0 ML
N
4 0 M
4 -2.209 2.209 -4 0 -4 C
-2.209 -4 -4 -2.209 -4 0 C
-4 2.209 -2.209 4 0 4 C
2.209 4 4 2.209 4 0 C
cp
S
GR
GS
[0.75 0 0 0.75 325.95 296.25] CT
0 0.447 0.741 RC
N
f351177404
f
GR
GS
[0.75 0 0 0.75 325.95 296.25] CT
0 0.447 0.741 RC
10.0 ML
N
4 0 M
4 -2.209 2.209 -4 0 -4 C
-2.209 -4 -4 -2.209 -4 0 C
-4 2.209 -2.209 4 0 4 C
2.209 4 4 2.209 4 0 C
cp
S
GR
GS
[0.75 0 0 0.75 328.59167 296.25] CT
0 0.447 0.741 RC
N
f351177404
f
GR
GS
[0.75 0 0 0.75 328.59167 296.25] CT
0 0.447 0.741 RC
10.0 ML
N
4 0 M
4 -2.209 2.209 -4 0 -4 C
-2.209 -4 -4 -2.209 -4 0 C
-4 2.209 -2.209 4 0 4 C
2.209 4 4 2.209 4 0 C
cp
S
GR
GS
[0.75 0 0 0.75 336.51668 296.25] CT
0 0.447 0.741 RC
N
f351177404
f
GR
GS
[0.75 0 0 0.75 336.51668 296.25] CT
0 0.447 0.741 RC
10.0 ML
N
4 0 M
4 -2.209 2.209 -4 0 -4 C
-2.209 -4 -4 -2.209 -4 0 C
-4 2.209 -2.209 4 0 4 C
2.209 4 4 2.209 4 0 C
cp
S
GR
GS
[0.75 0 0 0.75 339.15834 296.25] CT
0 0.447 0.741 RC
N
f351177404
f
GR
GS
[0.75 0 0 0.75 339.15834 296.25] CT
0 0.447 0.741 RC
10.0 ML
N
4 0 M
4 -2.209 2.209 -4 0 -4 C
-2.209 -4 -4 -2.209 -4 0 C
-4 2.209 -2.209 4 0 4 C
2.209 4 4 2.209 4 0 C
cp
S
GR
GS
[0.75 0 0 0.75 344.44167 296.25] CT
0 0.447 0.741 RC
N
f351177404
f
GR
GS
[0.75 0 0 0.75 344.44167 296.25] CT
0 0.447 0.741 RC
10.0 ML
N
4 0 M
4 -2.209 2.209 -4 0 -4 C
-2.209 -4 -4 -2.209 -4 0 C
-4 2.209 -2.209 4 0 4 C
2.209 4 4 2.209 4 0 C
cp
S
GR
GS
[0.75 0 0 0.75 347.08333 296.25] CT
0 0.447 0.741 RC
N
f351177404
f
GR
GS
[0.75 0 0 0.75 347.08333 296.25] CT
0 0.447 0.741 RC
10.0 ML
N
4 0 M
4 -2.209 2.209 -4 0 -4 C
-2.209 -4 -4 -2.209 -4 0 C
-4 2.209 -2.209 4 0 4 C
2.209 4 4 2.209 4 0 C
cp
S
GR
GS
[0.75 0 0 0.75 349.72499 296.25] CT
0 0.447 0.741 RC
N
f351177404
f
GR
GS
[0.75 0 0 0.75 349.72499 296.25] CT
0 0.447 0.741 RC
10.0 ML
N
4 0 M
4 -2.209 2.209 -4 0 -4 C
-2.209 -4 -4 -2.209 -4 0 C
-4 2.209 -2.209 4 0 4 C
2.209 4 4 2.209 4 0 C
cp
S
GR
GS
[0.75 0 0 0.75 352.36668 296.25] CT
0 0.447 0.741 RC
N
f351177404
f
GR
GS
[0.75 0 0 0.75 352.36668 296.25] CT
0 0.447 0.741 RC
10.0 ML
N
4 0 M
4 -2.209 2.209 -4 0 -4 C
-2.209 -4 -4 -2.209 -4 0 C
-4 2.209 -2.209 4 0 4 C
2.209 4 4 2.209 4 0 C
cp
S
GR
GS
[0.75 0 0 0.75 355.00834 296.25] CT
0 0.447 0.741 RC
N
f351177404
f
GR
GS
[0.75 0 0 0.75 355.00834 296.25] CT
0 0.447 0.741 RC
10.0 ML
N
4 0 M
4 -2.209 2.209 -4 0 -4 C
-2.209 -4 -4 -2.209 -4 0 C
-4 2.209 -2.209 4 0 4 C
2.209 4 4 2.209 4 0 C
cp
S
GR
GS
[0.75 0 0 0.75 357.65 296.25] CT
0 0.447 0.741 RC
N
f351177404
f
GR
GS
[0.75 0 0 0.75 357.65 296.25] CT
0 0.447 0.741 RC
10.0 ML
N
4 0 M
4 -2.209 2.209 -4 0 -4 C
-2.209 -4 -4 -2.209 -4 0 C
-4 2.209 -2.209 4 0 4 C
2.209 4 4 2.209 4 0 C
cp
S
GR
GS
[0.75 0 0 0.75 362.93333 296.25] CT
0 0.447 0.741 RC
N
f351177404
f
GR
GS
[0.75 0 0 0.75 362.93333 296.25] CT
0 0.447 0.741 RC
10.0 ML
N
4 0 M
4 -2.209 2.209 -4 0 -4 C
-2.209 -4 -4 -2.209 -4 0 C
-4 2.209 -2.209 4 0 4 C
2.209 4 4 2.209 4 0 C
cp
S
GR
GS
[0.75 0 0 0.75 368.21667 296.25] CT
0 0.447 0.741 RC
N
f351177404
f
GR
GS
[0.75 0 0 0.75 368.21667 296.25] CT
0 0.447 0.741 RC
10.0 ML
N
4 0 M
4 -2.209 2.209 -4 0 -4 C
-2.209 -4 -4 -2.209 -4 0 C
-4 2.209 -2.209 4 0 4 C
2.209 4 4 2.209 4 0 C
cp
S
GR
GS
[0.75 0 0 0.75 370.85834 296.25] CT
0 0.447 0.741 RC
N
f351177404
f
GR
GS
[0.75 0 0 0.75 370.85834 296.25] CT
0 0.447 0.741 RC
10.0 ML
N
4 0 M
4 -2.209 2.209 -4 0 -4 C
-2.209 -4 -4 -2.209 -4 0 C
-4 2.209 -2.209 4 0 4 C
2.209 4 4 2.209 4 0 C
cp
S
GR
GS
[0.75 0 0 0.75 373.5 296.25] CT
0 0.447 0.741 RC
N
f351177404
f
GR
GS
[0.75 0 0 0.75 373.5 296.25] CT
0 0.447 0.741 RC
10.0 ML
N
4 0 M
4 -2.209 2.209 -4 0 -4 C
-2.209 -4 -4 -2.209 -4 0 C
-4 2.209 -2.209 4 0 4 C
2.209 4 4 2.209 4 0 C
cp
S
GR
GS
[0.75 0 0 0.75 376.14166 296.25] CT
0 0.447 0.741 RC
N
f351177404
f
GR
GS
[0.75 0 0 0.75 376.14166 296.25] CT
0 0.447 0.741 RC
10.0 ML
N
4 0 M
4 -2.209 2.209 -4 0 -4 C
-2.209 -4 -4 -2.209 -4 0 C
-4 2.209 -2.209 4 0 4 C
2.209 4 4 2.209 4 0 C
cp
S
GR
GS
[0.75 0 0 0.75 397.27501 296.25] CT
0 0.447 0.741 RC
N
f351177404
f
GR
GS
[0.75 0 0 0.75 397.27501 296.25] CT
0 0.447 0.741 RC
10.0 ML
N
4 0 M
4 -2.209 2.209 -4 0 -4 C
-2.209 -4 -4 -2.209 -4 0 C
-4 2.209 -2.209 4 0 4 C
2.209 4 4 2.209 4 0 C
cp
S
GR
GS
[0.75 0 0 0.75 402.55833 296.25] CT
0 0.447 0.741 RC
N
f351177404
f
GR
GS
[0.75 0 0 0.75 402.55833 296.25] CT
0 0.447 0.741 RC
10.0 ML
N
4 0 M
4 -2.209 2.209 -4 0 -4 C
-2.209 -4 -4 -2.209 -4 0 C
-4 2.209 -2.209 4 0 4 C
2.209 4 4 2.209 4 0 C
cp
S
GR
GS
[0.75 0 0 0.75 405.2 296.25] CT
0 0.447 0.741 RC
N
f351177404
f
GR
GS
[0.75 0 0 0.75 405.2 296.25] CT
0 0.447 0.741 RC
10.0 ML
N
4 0 M
4 -2.209 2.209 -4 0 -4 C
-2.209 -4 -4 -2.209 -4 0 C
-4 2.209 -2.209 4 0 4 C
2.209 4 4 2.209 4 0 C
cp
S
GR
GS
[0.75 0 0 0.75 418.40836 296.25] CT
0 0.447 0.741 RC
N
f351177404
f
GR
GS
[0.75 0 0 0.75 418.40836 296.25] CT
0 0.447 0.741 RC
10.0 ML
N
4 0 M
4 -2.209 2.209 -4 0 -4 C
-2.209 -4 -4 -2.209 -4 0 C
-4 2.209 -2.209 4 0 4 C
2.209 4 4 2.209 4 0 C
cp
S
GR
GS
[0.75 0 0 0.75 426.33334 296.25] CT
0 0.447 0.741 RC
N
f351177404
f
GR
GS
[0.75 0 0 0.75 426.33334 296.25] CT
0 0.447 0.741 RC
10.0 ML
N
4 0 M
4 -2.209 2.209 -4 0 -4 C
-2.209 -4 -4 -2.209 -4 0 C
-4 2.209 -2.209 4 0 4 C
2.209 4 4 2.209 4 0 C
cp
S
GR
GS
[0.75 0 0 0.75 434.25833 296.25] CT
0 0.447 0.741 RC
N
f351177404
f
GR
GS
[0.75 0 0 0.75 434.25833 296.25] CT
0 0.447 0.741 RC
10.0 ML
N
4 0 M
4 -2.209 2.209 -4 0 -4 C
-2.209 -4 -4 -2.209 -4 0 C
-4 2.209 -2.209 4 0 4 C
2.209 4 4 2.209 4 0 C
cp
S
GR
GS
[0.75 0 0 0.75 436.89999 296.25] CT
0 0.447 0.741 RC
N
f351177404
f
GR
GS
[0.75 0 0 0.75 436.89999 296.25] CT
0 0.447 0.741 RC
10.0 ML
N
4 0 M
4 -2.209 2.209 -4 0 -4 C
-2.209 -4 -4 -2.209 -4 0 C
-4 2.209 -2.209 4 0 4 C
2.209 4 4 2.209 4 0 C
cp
S
GR
GS
[0.75 0 0 0.75 439.54166 296.25] CT
0 0.447 0.741 RC
N
f351177404
f
GR
GS
[0.75 0 0 0.75 439.54166 296.25] CT
0 0.447 0.741 RC
10.0 ML
N
4 0 M
4 -2.209 2.209 -4 0 -4 C
-2.209 -4 -4 -2.209 -4 0 C
-4 2.209 -2.209 4 0 4 C
2.209 4 4 2.209 4 0 C
cp
S
GR
GS
[0.75 0 0 0.75 444.82498 296.25] CT
0 0.447 0.741 RC
N
f351177404
f
GR
GS
[0.75 0 0 0.75 444.82498 296.25] CT
0 0.447 0.741 RC
10.0 ML
N
4 0 M
4 -2.209 2.209 -4 0 -4 C
-2.209 -4 -4 -2.209 -4 0 C
-4 2.209 -2.209 4 0 4 C
2.209 4 4 2.209 4 0 C
cp
S
GR
GS
[0.75 0 0 0.75 450.10835 296.25] CT
0 0.447 0.741 RC
N
f351177404
f
GR
GS
[0.75 0 0 0.75 450.10835 296.25] CT
0 0.447 0.741 RC
10.0 ML
N
4 0 M
4 -2.209 2.209 -4 0 -4 C
-2.209 -4 -4 -2.209 -4 0 C
-4 2.209 -2.209 4 0 4 C
2.209 4 4 2.209 4 0 C
cp
S
GR
GS
[0.75 0 0 0.75 452.75002 296.25] CT
0 0.447 0.741 RC
N
f351177404
f
GR
GS
[0.75 0 0 0.75 452.75002 296.25] CT
0 0.447 0.741 RC
10.0 ML
N
4 0 M
4 -2.209 2.209 -4 0 -4 C
-2.209 -4 -4 -2.209 -4 0 C
-4 2.209 -2.209 4 0 4 C
2.209 4 4 2.209 4 0 C
cp
S
GR
GS
[0.75 0 0 0.75 455.39168 296.25] CT
0 0.447 0.741 RC
N
f351177404
f
GR
GS
[0.75 0 0 0.75 455.39168 296.25] CT
0 0.447 0.741 RC
10.0 ML
N
4 0 M
4 -2.209 2.209 -4 0 -4 C
-2.209 -4 -4 -2.209 -4 0 C
-4 2.209 -2.209 4 0 4 C
2.209 4 4 2.209 4 0 C
cp
S
GR
GS
[0.75 0 0 0.75 458.03334 296.25] CT
0 0.447 0.741 RC
N
f351177404
f
GR
GS
[0.75 0 0 0.75 458.03334 296.25] CT
0 0.447 0.741 RC
10.0 ML
N
4 0 M
4 -2.209 2.209 -4 0 -4 C
-2.209 -4 -4 -2.209 -4 0 C
-4 2.209 -2.209 4 0 4 C
2.209 4 4 2.209 4 0 C
cp
S
GR
GS
[0.75 0 0 0.75 460.675 296.25] CT
0 0.447 0.741 RC
N
f351177404
f
GR
GS
[0.75 0 0 0.75 460.675 296.25] CT
0 0.447 0.741 RC
10.0 ML
N
4 0 M
4 -2.209 2.209 -4 0 -4 C
-2.209 -4 -4 -2.209 -4 0 C
-4 2.209 -2.209 4 0 4 C
2.209 4 4 2.209 4 0 C
cp
S
GR
GS
[0.75 0 0 0.75 463.31667 296.25] CT
0 0.447 0.741 RC
N
f351177404
f
GR
GS
[0.75 0 0 0.75 463.31667 296.25] CT
0 0.447 0.741 RC
10.0 ML
N
4 0 M
4 -2.209 2.209 -4 0 -4 C
-2.209 -4 -4 -2.209 -4 0 C
-4 2.209 -2.209 4 0 4 C
2.209 4 4 2.209 4 0 C
cp
S
GR
GS
[0.75 0 0 0.75 468.59999 296.25] CT
0 0.447 0.741 RC
N
f351177404
f
GR
GS
[0.75 0 0 0.75 468.59999 296.25] CT
0 0.447 0.741 RC
10.0 ML
N
4 0 M
4 -2.209 2.209 -4 0 -4 C
-2.209 -4 -4 -2.209 -4 0 C
-4 2.209 -2.209 4 0 4 C
2.209 4 4 2.209 4 0 C
cp
S
GR
GS
[0.75 0 0 0.75 471.24165 296.25] CT
0 0.447 0.741 RC
N
f351177404
f
GR
GS
[0.75 0 0 0.75 471.24165 296.25] CT
0 0.447 0.741 RC
10.0 ML
N
4 0 M
4 -2.209 2.209 -4 0 -4 C
-2.209 -4 -4 -2.209 -4 0 C
-4 2.209 -2.209 4 0 4 C
2.209 4 4 2.209 4 0 C
cp
S
GR
GS
[0.75 0 0 0.75 476.52498 296.25] CT
0 0.447 0.741 RC
N
f351177404
f
GR
GS
[0.75 0 0 0.75 476.52498 296.25] CT
0 0.447 0.741 RC
10.0 ML
N
4 0 M
4 -2.209 2.209 -4 0 -4 C
-2.209 -4 -4 -2.209 -4 0 C
-4 2.209 -2.209 4 0 4 C
2.209 4 4 2.209 4 0 C
cp
S
GR
GS
[0.75 0 0 0.75 479.16669 296.25] CT
0 0.447 0.741 RC
N
f351177404
f
GR
GS
[0.75 0 0 0.75 479.16669 296.25] CT
0 0.447 0.741 RC
10.0 ML
N
4 0 M
4 -2.209 2.209 -4 0 -4 C
-2.209 -4 -4 -2.209 -4 0 C
-4 2.209 -2.209 4 0 4 C
2.209 4 4 2.209 4 0 C
cp
S
GR
GS
[0.75 0 0 0.75 481.80835 296.25] CT
0 0.447 0.741 RC
N
f351177404
f
GR
GS
[0.75 0 0 0.75 481.80835 296.25] CT
0 0.447 0.741 RC
10.0 ML
N
4 0 M
4 -2.209 2.209 -4 0 -4 C
-2.209 -4 -4 -2.209 -4 0 C
-4 2.209 -2.209 4 0 4 C
2.209 4 4 2.209 4 0 C
cp
S
GR
GS
[0.75 0 0 0.75 484.45001 296.25] CT
0 0.447 0.741 RC
N
f351177404
f
GR
GS
[0.75 0 0 0.75 484.45001 296.25] CT
0 0.447 0.741 RC
10.0 ML
N
4 0 M
4 -2.209 2.209 -4 0 -4 C
-2.209 -4 -4 -2.209 -4 0 C
-4 2.209 -2.209 4 0 4 C
2.209 4 4 2.209 4 0 C
cp
S
GR
GS
[0.75 0 0 0.75 487.09167 296.25] CT
0 0.447 0.741 RC
N
f351177404
f
GR
GS
[0.75 0 0 0.75 487.09167 296.25] CT
0 0.447 0.741 RC
10.0 ML
N
4 0 M
4 -2.209 2.209 -4 0 -4 C
-2.209 -4 -4 -2.209 -4 0 C
-4 2.209 -2.209 4 0 4 C
2.209 4 4 2.209 4 0 C
cp
S
GR
GS
[0.75 0 0 0.75 489.73334 296.25] CT
0 0.447 0.741 RC
N
f351177404
f
GR
GS
[0.75 0 0 0.75 489.73334 296.25] CT
0 0.447 0.741 RC
10.0 ML
N
4 0 M
4 -2.209 2.209 -4 0 -4 C
-2.209 -4 -4 -2.209 -4 0 C
-4 2.209 -2.209 4 0 4 C
2.209 4 4 2.209 4 0 C
cp
S
GR
GS
[0.75 0 0 0.75 500.29999 296.25] CT
0 0.447 0.741 RC
N
f351177404
f
GR
GS
[0.75 0 0 0.75 500.29999 296.25] CT
0 0.447 0.741 RC
10.0 ML
N
4 0 M
4 -2.209 2.209 -4 0 -4 C
-2.209 -4 -4 -2.209 -4 0 C
-4 2.209 -2.209 4 0 4 C
2.209 4 4 2.209 4 0 C
cp
S
GR
GS
[0.75 0 0 0.75 502.94165 296.25] CT
0 0.447 0.741 RC
N
f351177404
f
GR
GS
[0.75 0 0 0.75 502.94165 296.25] CT
0 0.447 0.741 RC
10.0 ML
N
4 0 M
4 -2.209 2.209 -4 0 -4 C
-2.209 -4 -4 -2.209 -4 0 C
-4 2.209 -2.209 4 0 4 C
2.209 4 4 2.209 4 0 C
cp
S
GR
GS
[0.75 0 0 0.75 505.58331 296.25] CT
0 0.447 0.741 RC
N
f351177404
f
GR
GS
[0.75 0 0 0.75 505.58331 296.25] CT
0 0.447 0.741 RC
10.0 ML
N
4 0 M
4 -2.209 2.209 -4 0 -4 C
-2.209 -4 -4 -2.209 -4 0 C
-4 2.209 -2.209 4 0 4 C
2.209 4 4 2.209 4 0 C
cp
S
GR
GS
[0.75 0 0 0.75 568.98335 296.25] CT
0 0.447 0.741 RC
N
f351177404
f
GR
GS
[0.75 0 0 0.75 568.98335 296.25] CT
0 0.447 0.741 RC
10.0 ML
N
4 0 M
4 -2.209 2.209 -4 0 -4 C
-2.209 -4 -4 -2.209 -4 0 C
-4 2.209 -2.209 4 0 4 C
2.209 4 4 2.209 4 0 C
cp
S
GR
GS
[0.75 0 0 0.75 0 0] CT
0 0.447 0.741 RC
1 LJ
0.667 LW
N
184.522 321 M
184.522 395 L
S
GR
GS
[0.75 0 0 0.75 0 0] CT
0 0.447 0.741 RC
1 LJ
0.667 LW
N
188.044 321 M
188.044 395 L
S
GR
GS
[0.75 0 0 0.75 0 0] CT
0 0.447 0.741 RC
1 LJ
0.667 LW
N
198.611 321 M
198.611 395 L
S
GR
GS
[0.75 0 0 0.75 0 0] CT
0 0.447 0.741 RC
1 LJ
0.667 LW
N
202.133 321 M
202.133 395 L
S
GR
GS
[0.75 0 0 0.75 0 0] CT
0 0.447 0.741 RC
1 LJ
0.667 LW
N
205.656 321 M
205.656 395 L
S
GR
GS
[0.75 0 0 0.75 0 0] CT
0 0.447 0.741 RC
1 LJ
0.667 LW
N
209.178 321 M
209.178 395 L
S
GR
GS
[0.75 0 0 0.75 0 0] CT
0 0.447 0.741 RC
1 LJ
0.667 LW
N
212.7 321 M
212.7 395 L
S
GR
GS
[0.75 0 0 0.75 0 0] CT
0 0.447 0.741 RC
1 LJ
0.667 LW
N
216.222 321 M
216.222 395 L
S
GR
GS
[0.75 0 0 0.75 0 0] CT
0 0.447 0.741 RC
1 LJ
0.667 LW
N
219.744 321 M
219.744 395 L
S
GR
GS
[0.75 0 0 0.75 0 0] CT
0 0.447 0.741 RC
1 LJ
0.667 LW
N
223.267 321 M
223.267 395 L
S
GR
GS
[0.75 0 0 0.75 0 0] CT
0 0.447 0.741 RC
1 LJ
0.667 LW
N
226.789 321 M
226.789 395 L
S
GR
GS
[0.75 0 0 0.75 0 0] CT
0 0.447 0.741 RC
1 LJ
0.667 LW
N
230.311 321 M
230.311 395 L
S
GR
GS
[0.75 0 0 0.75 0 0] CT
0 0.447 0.741 RC
1 LJ
0.667 LW
N
233.833 321 M
233.833 395 L
S
GR
GS
[0.75 0 0 0.75 0 0] CT
0 0.447 0.741 RC
1 LJ
0.667 LW
N
237.356 321 M
237.356 395 L
S
GR
GS
[0.75 0 0 0.75 0 0] CT
0 0.447 0.741 RC
1 LJ
0.667 LW
N
269.056 321 M
269.056 395 L
S
GR
GS
[0.75 0 0 0.75 0 0] CT
0 0.447 0.741 RC
1 LJ
0.667 LW
N
328.933 321 M
328.933 395 L
S
GR
GS
[0.75 0 0 0.75 0 0] CT
0 0.447 0.741 RC
1 LJ
0.667 LW
N
332.456 321 M
332.456 395 L
S
GR
GS
[0.75 0 0 0.75 0 0] CT
0 0.447 0.741 RC
1 LJ
0.667 LW
N
335.978 321 M
335.978 395 L
S
GR
GS
[0.75 0 0 0.75 0 0] CT
0 0.447 0.741 RC
1 LJ
0.667 LW
N
343.022 321 M
343.022 395 L
S
GR
GS
[0.75 0 0 0.75 0 0] CT
0 0.447 0.741 RC
1 LJ
0.667 LW
N
346.544 321 M
346.544 395 L
S
GR
GS
[0.75 0 0 0.75 0 0] CT
0 0.447 0.741 RC
1 LJ
0.667 LW
N
350.067 321 M
350.067 395 L
S
GR
GS
[0.75 0 0 0.75 0 0] CT
0 0.447 0.741 RC
1 LJ
0.667 LW
N
353.589 321 M
353.589 395 L
S
GR
GS
[0.75 0 0 0.75 0 0] CT
0 0.447 0.741 RC
1 LJ
0.667 LW
N
357.111 321 M
357.111 395 L
S
GR
GS
[0.75 0 0 0.75 0 0] CT
0 0.447 0.741 RC
1 LJ
0.667 LW
N
364.156 321 M
364.156 395 L
S
GR
GS
[0.75 0 0 0.75 0 0] CT
0 0.447 0.741 RC
1 LJ
0.667 LW
N
371.2 321 M
371.2 395 L
S
GR
GS
[0.75 0 0 0.75 0 0] CT
0 0.447 0.741 RC
1 LJ
0.667 LW
N
374.722 321 M
374.722 395 L
S
GR
GS
[0.75 0 0 0.75 0 0] CT
0 0.447 0.741 RC
1 LJ
0.667 LW
N
378.244 321 M
378.244 395 L
S
GR
GS
[0.75 0 0 0.75 0 0] CT
0 0.447 0.741 RC
1 LJ
0.667 LW
N
381.767 321 M
381.767 395 L
S
GR
GS
[0.75 0 0 0.75 0 0] CT
0 0.447 0.741 RC
1 LJ
0.667 LW
N
385.289 321 M
385.289 395 L
S
GR
GS
[0.75 0 0 0.75 0 0] CT
0 0.447 0.741 RC
1 LJ
0.667 LW
N
395.856 321 M
395.856 395 L
S
GR
GS
[0.75 0 0 0.75 0 0] CT
0 0.447 0.741 RC
1 LJ
0.667 LW
N
399.378 321 M
399.378 395 L
S
GR
GS
[0.75 0 0 0.75 0 0] CT
0 0.447 0.741 RC
1 LJ
0.667 LW
N
402.9 321 M
402.9 395 L
S
GR
GS
[0.75 0 0 0.75 0 0] CT
0 0.447 0.741 RC
1 LJ
0.667 LW
N
406.422 321 M
406.422 395 L
S
GR
GS
[0.75 0 0 0.75 0 0] CT
0 0.447 0.741 RC
1 LJ
0.667 LW
N
409.944 321 M
409.944 395 L
S
GR
GS
[0.75 0 0 0.75 0 0] CT
0 0.447 0.741 RC
1 LJ
0.667 LW
N
420.511 321 M
420.511 395 L
S
GR
GS
[0.75 0 0 0.75 0 0] CT
0 0.447 0.741 RC
1 LJ
0.667 LW
N
424.033 321 M
424.033 395 L
S
GR
GS
[0.75 0 0 0.75 0 0] CT
0 0.447 0.741 RC
1 LJ
0.667 LW
N
427.556 321 M
427.556 395 L
S
GR
GS
[0.75 0 0 0.75 0 0] CT
0 0.447 0.741 RC
1 LJ
0.667 LW
N
431.078 321 M
431.078 395 L
S
GR
GS
[0.75 0 0 0.75 0 0] CT
0 0.447 0.741 RC
1 LJ
0.667 LW
N
434.6 321 M
434.6 395 L
S
GR
GS
[0.75 0 0 0.75 0 0] CT
0 0.447 0.741 RC
1 LJ
0.667 LW
N
438.122 321 M
438.122 395 L
S
GR
GS
[0.75 0 0 0.75 0 0] CT
0 0.447 0.741 RC
1 LJ
0.667 LW
N
448.689 321 M
448.689 395 L
S
GR
GS
[0.75 0 0 0.75 0 0] CT
0 0.447 0.741 RC
1 LJ
0.667 LW
N
452.211 321 M
452.211 395 L
S
GR
GS
[0.75 0 0 0.75 0 0] CT
0 0.447 0.741 RC
1 LJ
0.667 LW
N
459.256 321 M
459.256 395 L
S
GR
GS
[0.75 0 0 0.75 0 0] CT
0 0.447 0.741 RC
1 LJ
0.667 LW
N
462.778 321 M
462.778 395 L
S
GR
GS
[0.75 0 0 0.75 0 0] CT
0 0.447 0.741 RC
1 LJ
0.667 LW
N
466.3 321 M
466.3 395 L
S
GR
GS
[0.75 0 0 0.75 0 0] CT
0 0.447 0.741 RC
1 LJ
0.667 LW
N
469.822 321 M
469.822 395 L
S
GR
GS
[0.75 0 0 0.75 0 0] CT
0 0.447 0.741 RC
1 LJ
0.667 LW
N
473.344 321 M
473.344 395 L
S
GR
GS
[0.75 0 0 0.75 0 0] CT
0 0.447 0.741 RC
1 LJ
0.667 LW
N
476.867 321 M
476.867 395 L
S
GR
GS
[0.75 0 0 0.75 0 0] CT
0 0.447 0.741 RC
1 LJ
0.667 LW
N
483.911 321 M
483.911 395 L
S
GR
GS
[0.75 0 0 0.75 0 0] CT
0 0.447 0.741 RC
1 LJ
0.667 LW
N
490.956 321 M
490.956 395 L
S
GR
GS
[0.75 0 0 0.75 0 0] CT
0 0.447 0.741 RC
1 LJ
0.667 LW
N
494.478 321 M
494.478 395 L
S
GR
GS
[0.75 0 0 0.75 0 0] CT
0 0.447 0.741 RC
1 LJ
0.667 LW
N
498 321 M
498 395 L
S
GR
GS
[0.75 0 0 0.75 0 0] CT
0 0.447 0.741 RC
1 LJ
0.667 LW
N
501.522 321 M
501.522 395 L
S
GR
GS
[0.75 0 0 0.75 0 0] CT
0 0.447 0.741 RC
1 LJ
0.667 LW
N
529.7 321 M
529.7 395 L
S
GR
GS
[0.75 0 0 0.75 0 0] CT
0 0.447 0.741 RC
1 LJ
0.667 LW
N
536.744 321 M
536.744 395 L
S
GR
GS
[0.75 0 0 0.75 0 0] CT
0 0.447 0.741 RC
1 LJ
0.667 LW
N
540.267 321 M
540.267 395 L
S
GR
GS
[0.75 0 0 0.75 0 0] CT
0 0.447 0.741 RC
1 LJ
0.667 LW
N
557.878 321 M
557.878 395 L
S
GR
GS
[0.75 0 0 0.75 0 0] CT
0 0.447 0.741 RC
1 LJ
0.667 LW
N
568.444 321 M
568.444 395 L
S
GR
GS
[0.75 0 0 0.75 0 0] CT
0 0.447 0.741 RC
1 LJ
0.667 LW
N
579.011 321 M
579.011 395 L
S
GR
GS
[0.75 0 0 0.75 0 0] CT
0 0.447 0.741 RC
1 LJ
0.667 LW
N
582.533 321 M
582.533 395 L
S
GR
GS
[0.75 0 0 0.75 0 0] CT
0 0.447 0.741 RC
1 LJ
0.667 LW
N
586.056 321 M
586.056 395 L
S
GR
GS
[0.75 0 0 0.75 0 0] CT
0 0.447 0.741 RC
1 LJ
0.667 LW
N
593.1 321 M
593.1 395 L
S
GR
GS
[0.75 0 0 0.75 0 0] CT
0 0.447 0.741 RC
1 LJ
0.667 LW
N
600.144 321 M
600.144 395 L
S
GR
GS
[0.75 0 0 0.75 0 0] CT
0 0.447 0.741 RC
1 LJ
0.667 LW
N
603.667 321 M
603.667 395 L
S
GR
GS
[0.75 0 0 0.75 0 0] CT
0 0.447 0.741 RC
1 LJ
0.667 LW
N
607.189 321 M
607.189 395 L
S
GR
GS
[0.75 0 0 0.75 0 0] CT
0 0.447 0.741 RC
1 LJ
0.667 LW
N
610.711 321 M
610.711 395 L
S
GR
GS
[0.75 0 0 0.75 0 0] CT
0 0.447 0.741 RC
1 LJ
0.667 LW
N
614.233 321 M
614.233 395 L
S
GR
GS
[0.75 0 0 0.75 0 0] CT
0 0.447 0.741 RC
1 LJ
0.667 LW
N
617.756 321 M
617.756 395 L
S
GR
GS
[0.75 0 0 0.75 0 0] CT
0 0.447 0.741 RC
1 LJ
0.667 LW
N
624.8 321 M
624.8 395 L
S
GR
GS
[0.75 0 0 0.75 0 0] CT
0 0.447 0.741 RC
1 LJ
0.667 LW
N
628.322 321 M
628.322 395 L
S
GR
GS
[0.75 0 0 0.75 0 0] CT
0 0.447 0.741 RC
1 LJ
0.667 LW
N
635.367 321 M
635.367 395 L
S
GR
GS
[0.75 0 0 0.75 0 0] CT
0 0.447 0.741 RC
1 LJ
0.667 LW
N
638.889 321 M
638.889 395 L
S
GR
GS
[0.75 0 0 0.75 0 0] CT
0 0.447 0.741 RC
1 LJ
0.667 LW
N
642.411 321 M
642.411 395 L
S
GR
GS
[0.75 0 0 0.75 0 0] CT
0 0.447 0.741 RC
1 LJ
0.667 LW
N
645.933 321 M
645.933 395 L
S
GR
GS
[0.75 0 0 0.75 0 0] CT
0 0.447 0.741 RC
1 LJ
0.667 LW
N
649.456 321 M
649.456 395 L
S
GR
GS
[0.75 0 0 0.75 0 0] CT
0 0.447 0.741 RC
1 LJ
0.667 LW
N
652.978 321 M
652.978 395 L
S
GR
GS
[0.75 0 0 0.75 0 0] CT
0 0.447 0.741 RC
1 LJ
0.667 LW
N
667.067 321 M
667.067 395 L
S
GR
GS
[0.75 0 0 0.75 0 0] CT
0 0.447 0.741 RC
1 LJ
0.667 LW
N
670.589 321 M
670.589 395 L
S
GR
GS
[0.75 0 0 0.75 0 0] CT
0 0.447 0.741 RC
1 LJ
0.667 LW
N
674.111 321 M
674.111 395 L
S
GR
GS
[0.75 0 0 0.75 0 0] CT
0 0.447 0.741 RC
1 LJ
0.667 LW
N
758.644 321 M
758.644 395 L
S
GR
GS
[0.75 0 0 0.75 0 0] CT
0.149 GC
2 setlinecap
1 LJ
0.667 LW
N
181 395 M
815 395 L
S
GR
GS
[0.75 0 0 0.75 0 0] CT
0.149 GC
2 setlinecap
1 LJ
0.667 LW
N
181 247 M
815 247 L
S
GR
GS
[0.75 0 0 0.75 0 0] CT
0.149 GC
2 setlinecap
1 LJ
0.667 LW
N
181 395 M
181 388.66 L
S
GR
GS
[0.75 0 0 0.75 0 0] CT
0.149 GC
2 setlinecap
1 LJ
0.667 LW
N
251.444 395 M
251.444 388.66 L
S
GR
GS
[0.75 0 0 0.75 0 0] CT
0.149 GC
2 setlinecap
1 LJ
0.667 LW
N
321.889 395 M
321.889 388.66 L
S
GR
GS
[0.75 0 0 0.75 0 0] CT
0.149 GC
2 setlinecap
1 LJ
0.667 LW
N
392.333 395 M
392.333 388.66 L
S
GR
GS
[0.75 0 0 0.75 0 0] CT
0.149 GC
2 setlinecap
1 LJ
0.667 LW
N
462.778 395 M
462.778 388.66 L
S
GR
GS
[0.75 0 0 0.75 0 0] CT
0.149 GC
2 setlinecap
1 LJ
0.667 LW
N
533.222 395 M
533.222 388.66 L
S
GR
GS
[0.75 0 0 0.75 0 0] CT
0.149 GC
2 setlinecap
1 LJ
0.667 LW
N
603.667 395 M
603.667 388.66 L
S
GR
GS
[0.75 0 0 0.75 0 0] CT
0.149 GC
2 setlinecap
1 LJ
0.667 LW
N
674.111 395 M
674.111 388.66 L
S
GR
GS
[0.75 0 0 0.75 0 0] CT
0.149 GC
2 setlinecap
1 LJ
0.667 LW
N
744.556 395 M
744.556 388.66 L
S
GR
GS
[0.75 0 0 0.75 0 0] CT
0.149 GC
2 setlinecap
1 LJ
0.667 LW
N
815 395 M
815 388.66 L
S
GR
GS
[0.75 0 0 0.75 0 0] CT
0.149 GC
2 setlinecap
1 LJ
0.667 LW
N
181 247 M
181 253.34 L
S
GR
GS
[0.75 0 0 0.75 0 0] CT
0.149 GC
2 setlinecap
1 LJ
0.667 LW
N
251.444 247 M
251.444 253.34 L
S
GR
GS
[0.75 0 0 0.75 0 0] CT
0.149 GC
2 setlinecap
1 LJ
0.667 LW
N
321.889 247 M
321.889 253.34 L
S
GR
GS
[0.75 0 0 0.75 0 0] CT
0.149 GC
2 setlinecap
1 LJ
0.667 LW
N
392.333 247 M
392.333 253.34 L
S
GR
GS
[0.75 0 0 0.75 0 0] CT
0.149 GC
2 setlinecap
1 LJ
0.667 LW
N
462.778 247 M
462.778 253.34 L
S
GR
GS
[0.75 0 0 0.75 0 0] CT
0.149 GC
2 setlinecap
1 LJ
0.667 LW
N
533.222 247 M
533.222 253.34 L
S
GR
GS
[0.75 0 0 0.75 0 0] CT
0.149 GC
2 setlinecap
1 LJ
0.667 LW
N
603.667 247 M
603.667 253.34 L
S
GR
GS
[0.75 0 0 0.75 0 0] CT
0.149 GC
2 setlinecap
1 LJ
0.667 LW
N
674.111 247 M
674.111 253.34 L
S
GR
GS
[0.75 0 0 0.75 0 0] CT
0.149 GC
2 setlinecap
1 LJ
0.667 LW
N
744.556 247 M
744.556 253.34 L
S
GR
GS
[0.75 0 0 0.75 0 0] CT
0.149 GC
2 setlinecap
1 LJ
0.667 LW
N
815 247 M
815 253.34 L
S
GR
GS
[0.75 0 0 0.75 135.75 300.65] CT
0.149 GC
/Helvetica 16 F
GS
[1 0 0 1 0 0] CT
-4.5 17 moveto 
1 -1 scale
(0) t 
GR
GR
GS
[0.75 0 0 0.75 188.58333 300.65] CT
0.149 GC
/Helvetica 16 F
GS
[1 0 0 1 0 0] CT
-9 17 moveto 
1 -1 scale
(20) t 
GR
GR
GS
[0.75 0 0 0.75 241.41666 300.65] CT
0.149 GC
/Helvetica 16 F
GS
[1 0 0 1 0 0] CT
-9 17 moveto 
1 -1 scale
(40) t 
GR
GR
GS
[0.75 0 0 0.75 294.25001 300.65] CT
0.149 GC
/Helvetica 16 F
GS
[1 0 0 1 0 0] CT
-9 17 moveto 
1 -1 scale
(60) t 
GR
GR
GS
[0.75 0 0 0.75 347.08333 300.65] CT
0.149 GC
/Helvetica 16 F
GS
[1 0 0 1 0 0] CT
-9 17 moveto 
1 -1 scale
(80) t 
GR
GR
GS
[0.75 0 0 0.75 399.91667 300.65] CT
0.149 GC
/Helvetica 16 F
GS
[1 0 0 1 0 0] CT
-13.5 17 moveto 
1 -1 scale
(100) t 
GR
GR
GS
[0.75 0 0 0.75 452.75002 300.65] CT
0.149 GC
/Helvetica 16 F
GS
[1 0 0 1 0 0] CT
-13.5 17 moveto 
1 -1 scale
(120) t 
GR
GR
GS
[0.75 0 0 0.75 505.58331 300.65] CT
0.149 GC
/Helvetica 16 F
GS
[1 0 0 1 0 0] CT
-13.5 17 moveto 
1 -1 scale
(140) t 
GR
GR
GS
[0.75 0 0 0.75 558.41666 300.65] CT
0.149 GC
/Helvetica 16 F
GS
[1 0 0 1 0 0] CT
-13.5 17 moveto 
1 -1 scale
(160) t 
GR
GR
GS
[0.75 0 0 0.75 611.25 300.65] CT
0.149 GC
/Helvetica 16 F
GS
[1 0 0 1 0 0] CT
-13.5 17 moveto 
1 -1 scale
(180) t 
GR
GR
GS
[0.75 0 0 0.75 0 0] CT
1 GC
N
/f-1485274776{181 202 M
815 202 L
815 46 L
181 46 L
cp}def
f-1485274776
f
GR
GS
[0.75 0 0 0.75 0 0] CT
0.149 GC
2 setlinecap
1 LJ
0.667 LW
N
181 202 M
181 46 L
S
GR
GS
[0.75 0 0 0.75 0 0] CT
0.149 GC
2 setlinecap
1 LJ
0.667 LW
N
815 202 M
815 46 L
S
GR
GS
[0.75 0 0 0.75 0 0] CT
0.149 GC
2 setlinecap
1 LJ
0.667 LW
N
181 202 M
187.34 202 L
S
GR
GS
[0.75 0 0 0.75 0 0] CT
0.149 GC
2 setlinecap
1 LJ
0.667 LW
N
181 163 M
187.34 163 L
S
GR
GS
[0.75 0 0 0.75 0 0] CT
0.149 GC
2 setlinecap
1 LJ
0.667 LW
N
181 124 M
187.34 124 L
S
GR
GS
[0.75 0 0 0.75 0 0] CT
0.149 GC
2 setlinecap
1 LJ
0.667 LW
N
181 85 M
187.34 85 L
S
GR
GS
[0.75 0 0 0.75 0 0] CT
0.149 GC
2 setlinecap
1 LJ
0.667 LW
N
181 46 M
187.34 46 L
S
GR
GS
[0.75 0 0 0.75 0 0] CT
0.149 GC
2 setlinecap
1 LJ
0.667 LW
N
815 202 M
808.66 202 L
S
GR
GS
[0.75 0 0 0.75 0 0] CT
0.149 GC
2 setlinecap
1 LJ
0.667 LW
N
815 163 M
808.66 163 L
S
GR
GS
[0.75 0 0 0.75 0 0] CT
0.149 GC
2 setlinecap
1 LJ
0.667 LW
N
815 124 M
808.66 124 L
S
GR
GS
[0.75 0 0 0.75 0 0] CT
0.149 GC
2 setlinecap
1 LJ
0.667 LW
N
815 85 M
808.66 85 L
S
GR
GS
[0.75 0 0 0.75 0 0] CT
0.149 GC
2 setlinecap
1 LJ
0.667 LW
N
815 46 M
808.66 46 L
S
GR
GS
[0.75 0 0 0.75 373.50037 21.71029] CT
/Helvetica-Bold 17.6 F
GS
[1 0 0 1 0 0] CT
-23 -4 moveto 
1 -1 scale
(SM01) t 
GR
GR
GS
[0.75 0 0 0.75 0 0] CT
0.149 GC
1 LJ
0.667 LW
N
181 124 M
815 124 L
S
GR
GS
[0.75 0 0 0.75 172.73333 34.5] CT
0.302 0.745 0.933 RC
N
f351177404
f
GR
GS
[0.75 0 0 0.75 172.73333 34.5] CT
0.302 0.745 0.933 RC
10.0 ML
N
4 0 M
4 -2.209 2.209 -4 0 -4 C
-2.209 -4 -4 -2.209 -4 0 C
-4 2.209 -2.209 4 0 4 C
2.209 4 4 2.209 4 0 C
cp
S
GR
GS
[0.75 0 0 0.75 196.50833 34.5] CT
0.302 0.745 0.933 RC
N
f351177404
f
GR
GS
[0.75 0 0 0.75 196.50833 34.5] CT
0.302 0.745 0.933 RC
10.0 ML
N
4 0 M
4 -2.209 2.209 -4 0 -4 C
-2.209 -4 -4 -2.209 -4 0 C
-4 2.209 -2.209 4 0 4 C
2.209 4 4 2.209 4 0 C
cp
S
GR
GS
[0.75 0 0 0.75 199.14999 34.5] CT
0.302 0.745 0.933 RC
N
f351177404
f
GR
GS
[0.75 0 0 0.75 199.14999 34.5] CT
0.302 0.745 0.933 RC
10.0 ML
N
4 0 M
4 -2.209 2.209 -4 0 -4 C
-2.209 -4 -4 -2.209 -4 0 C
-4 2.209 -2.209 4 0 4 C
2.209 4 4 2.209 4 0 C
cp
S
GR
GS
[0.75 0 0 0.75 246.69999 34.5] CT
0.302 0.745 0.933 RC
N
f351177404
f
GR
GS
[0.75 0 0 0.75 246.69999 34.5] CT
0.302 0.745 0.933 RC
10.0 ML
N
4 0 M
4 -2.209 2.209 -4 0 -4 C
-2.209 -4 -4 -2.209 -4 0 C
-4 2.209 -2.209 4 0 4 C
2.209 4 4 2.209 4 0 C
cp
S
GR
GS
[0.75 0 0 0.75 249.34167 34.5] CT
0.302 0.745 0.933 RC
N
f351177404
f
GR
GS
[0.75 0 0 0.75 249.34167 34.5] CT
0.302 0.745 0.933 RC
10.0 ML
N
4 0 M
4 -2.209 2.209 -4 0 -4 C
-2.209 -4 -4 -2.209 -4 0 C
-4 2.209 -2.209 4 0 4 C
2.209 4 4 2.209 4 0 C
cp
S
GR
GS
[0.75 0 0 0.75 251.98334 34.5] CT
0.302 0.745 0.933 RC
N
f351177404
f
GR
GS
[0.75 0 0 0.75 251.98334 34.5] CT
0.302 0.745 0.933 RC
10.0 ML
N
4 0 M
4 -2.209 2.209 -4 0 -4 C
-2.209 -4 -4 -2.209 -4 0 C
-4 2.209 -2.209 4 0 4 C
2.209 4 4 2.209 4 0 C
cp
S
GR
GS
[0.75 0 0 0.75 254.625 34.5] CT
0.302 0.745 0.933 RC
N
f351177404
f
GR
GS
[0.75 0 0 0.75 254.625 34.5] CT
0.302 0.745 0.933 RC
10.0 ML
N
4 0 M
4 -2.209 2.209 -4 0 -4 C
-2.209 -4 -4 -2.209 -4 0 C
-4 2.209 -2.209 4 0 4 C
2.209 4 4 2.209 4 0 C
cp
S
GR
GS
[0.75 0 0 0.75 257.26666 34.5] CT
0.302 0.745 0.933 RC
N
f351177404
f
GR
GS
[0.75 0 0 0.75 257.26666 34.5] CT
0.302 0.745 0.933 RC
10.0 ML
N
4 0 M
4 -2.209 2.209 -4 0 -4 C
-2.209 -4 -4 -2.209 -4 0 C
-4 2.209 -2.209 4 0 4 C
2.209 4 4 2.209 4 0 C
cp
S
GR
GS
[0.75 0 0 0.75 259.90833 34.5] CT
0.302 0.745 0.933 RC
N
f351177404
f
GR
GS
[0.75 0 0 0.75 259.90833 34.5] CT
0.302 0.745 0.933 RC
10.0 ML
N
4 0 M
4 -2.209 2.209 -4 0 -4 C
-2.209 -4 -4 -2.209 -4 0 C
-4 2.209 -2.209 4 0 4 C
2.209 4 4 2.209 4 0 C
cp
S
GR
GS
[0.75 0 0 0.75 265.19167 34.5] CT
0.302 0.745 0.933 RC
N
f351177404
f
GR
GS
[0.75 0 0 0.75 265.19167 34.5] CT
0.302 0.745 0.933 RC
10.0 ML
N
4 0 M
4 -2.209 2.209 -4 0 -4 C
-2.209 -4 -4 -2.209 -4 0 C
-4 2.209 -2.209 4 0 4 C
2.209 4 4 2.209 4 0 C
cp
S
GR
GS
[0.75 0 0 0.75 267.83334 34.5] CT
0.302 0.745 0.933 RC
N
f351177404
f
GR
GS
[0.75 0 0 0.75 267.83334 34.5] CT
0.302 0.745 0.933 RC
10.0 ML
N
4 0 M
4 -2.209 2.209 -4 0 -4 C
-2.209 -4 -4 -2.209 -4 0 C
-4 2.209 -2.209 4 0 4 C
2.209 4 4 2.209 4 0 C
cp
S
GR
GS
[0.75 0 0 0.75 273.11666 34.5] CT
0.302 0.745 0.933 RC
N
f351177404
f
GR
GS
[0.75 0 0 0.75 273.11666 34.5] CT
0.302 0.745 0.933 RC
10.0 ML
N
4 0 M
4 -2.209 2.209 -4 0 -4 C
-2.209 -4 -4 -2.209 -4 0 C
-4 2.209 -2.209 4 0 4 C
2.209 4 4 2.209 4 0 C
cp
S
GR
GS
[0.75 0 0 0.75 275.75832 34.5] CT
0.302 0.745 0.933 RC
N
f351177404
f
GR
GS
[0.75 0 0 0.75 275.75832 34.5] CT
0.302 0.745 0.933 RC
10.0 ML
N
4 0 M
4 -2.209 2.209 -4 0 -4 C
-2.209 -4 -4 -2.209 -4 0 C
-4 2.209 -2.209 4 0 4 C
2.209 4 4 2.209 4 0 C
cp
S
GR
GS
[0.75 0 0 0.75 278.40001 34.5] CT
0.302 0.745 0.933 RC
N
f351177404
f
GR
GS
[0.75 0 0 0.75 278.40001 34.5] CT
0.302 0.745 0.933 RC
10.0 ML
N
4 0 M
4 -2.209 2.209 -4 0 -4 C
-2.209 -4 -4 -2.209 -4 0 C
-4 2.209 -2.209 4 0 4 C
2.209 4 4 2.209 4 0 C
cp
S
GR
GS
[0.75 0 0 0.75 281.04167 34.5] CT
0.302 0.745 0.933 RC
N
f351177404
f
GR
GS
[0.75 0 0 0.75 281.04167 34.5] CT
0.302 0.745 0.933 RC
10.0 ML
N
4 0 M
4 -2.209 2.209 -4 0 -4 C
-2.209 -4 -4 -2.209 -4 0 C
-4 2.209 -2.209 4 0 4 C
2.209 4 4 2.209 4 0 C
cp
S
GR
GS
[0.75 0 0 0.75 283.68333 34.5] CT
0.302 0.745 0.933 RC
N
f351177404
f
GR
GS
[0.75 0 0 0.75 283.68333 34.5] CT
0.302 0.745 0.933 RC
10.0 ML
N
4 0 M
4 -2.209 2.209 -4 0 -4 C
-2.209 -4 -4 -2.209 -4 0 C
-4 2.209 -2.209 4 0 4 C
2.209 4 4 2.209 4 0 C
cp
S
GR
GS
[0.75 0 0 0.75 288.96666 34.5] CT
0.302 0.745 0.933 RC
N
f351177404
f
GR
GS
[0.75 0 0 0.75 288.96666 34.5] CT
0.302 0.745 0.933 RC
10.0 ML
N
4 0 M
4 -2.209 2.209 -4 0 -4 C
-2.209 -4 -4 -2.209 -4 0 C
-4 2.209 -2.209 4 0 4 C
2.209 4 4 2.209 4 0 C
cp
S
GR
GS
[0.75 0 0 0.75 291.60832 34.5] CT
0.302 0.745 0.933 RC
N
f351177404
f
GR
GS
[0.75 0 0 0.75 291.60832 34.5] CT
0.302 0.745 0.933 RC
10.0 ML
N
4 0 M
4 -2.209 2.209 -4 0 -4 C
-2.209 -4 -4 -2.209 -4 0 C
-4 2.209 -2.209 4 0 4 C
2.209 4 4 2.209 4 0 C
cp
S
GR
GS
[0.75 0 0 0.75 294.25001 34.5] CT
0.302 0.745 0.933 RC
N
f351177404
f
GR
GS
[0.75 0 0 0.75 294.25001 34.5] CT
0.302 0.745 0.933 RC
10.0 ML
N
4 0 M
4 -2.209 2.209 -4 0 -4 C
-2.209 -4 -4 -2.209 -4 0 C
-4 2.209 -2.209 4 0 4 C
2.209 4 4 2.209 4 0 C
cp
S
GR
GS
[0.75 0 0 0.75 296.89167 34.5] CT
0.302 0.745 0.933 RC
N
f351177404
f
GR
GS
[0.75 0 0 0.75 296.89167 34.5] CT
0.302 0.745 0.933 RC
10.0 ML
N
4 0 M
4 -2.209 2.209 -4 0 -4 C
-2.209 -4 -4 -2.209 -4 0 C
-4 2.209 -2.209 4 0 4 C
2.209 4 4 2.209 4 0 C
cp
S
GR
GS
[0.75 0 0 0.75 299.53333 34.5] CT
0.302 0.745 0.933 RC
N
f351177404
f
GR
GS
[0.75 0 0 0.75 299.53333 34.5] CT
0.302 0.745 0.933 RC
10.0 ML
N
4 0 M
4 -2.209 2.209 -4 0 -4 C
-2.209 -4 -4 -2.209 -4 0 C
-4 2.209 -2.209 4 0 4 C
2.209 4 4 2.209 4 0 C
cp
S
GR
GS
[0.75 0 0 0.75 302.175 34.5] CT
0.302 0.745 0.933 RC
N
f351177404
f
GR
GS
[0.75 0 0 0.75 302.175 34.5] CT
0.302 0.745 0.933 RC
10.0 ML
N
4 0 M
4 -2.209 2.209 -4 0 -4 C
-2.209 -4 -4 -2.209 -4 0 C
-4 2.209 -2.209 4 0 4 C
2.209 4 4 2.209 4 0 C
cp
S
GR
GS
[0.75 0 0 0.75 304.81666 34.5] CT
0.302 0.745 0.933 RC
N
f351177404
f
GR
GS
[0.75 0 0 0.75 304.81666 34.5] CT
0.302 0.745 0.933 RC
10.0 ML
N
4 0 M
4 -2.209 2.209 -4 0 -4 C
-2.209 -4 -4 -2.209 -4 0 C
-4 2.209 -2.209 4 0 4 C
2.209 4 4 2.209 4 0 C
cp
S
GR
GS
[0.75 0 0 0.75 307.45834 34.5] CT
0.302 0.745 0.933 RC
N
f351177404
f
GR
GS
[0.75 0 0 0.75 307.45834 34.5] CT
0.302 0.745 0.933 RC
10.0 ML
N
4 0 M
4 -2.209 2.209 -4 0 -4 C
-2.209 -4 -4 -2.209 -4 0 C
-4 2.209 -2.209 4 0 4 C
2.209 4 4 2.209 4 0 C
cp
S
GR
GS
[0.75 0 0 0.75 310.10001 34.5] CT
0.302 0.745 0.933 RC
N
f351177404
f
GR
GS
[0.75 0 0 0.75 310.10001 34.5] CT
0.302 0.745 0.933 RC
10.0 ML
N
4 0 M
4 -2.209 2.209 -4 0 -4 C
-2.209 -4 -4 -2.209 -4 0 C
-4 2.209 -2.209 4 0 4 C
2.209 4 4 2.209 4 0 C
cp
S
GR
GS
[0.75 0 0 0.75 312.74167 34.5] CT
0.302 0.745 0.933 RC
N
f351177404
f
GR
GS
[0.75 0 0 0.75 312.74167 34.5] CT
0.302 0.745 0.933 RC
10.0 ML
N
4 0 M
4 -2.209 2.209 -4 0 -4 C
-2.209 -4 -4 -2.209 -4 0 C
-4 2.209 -2.209 4 0 4 C
2.209 4 4 2.209 4 0 C
cp
S
GR
GS
[0.75 0 0 0.75 315.38333 34.5] CT
0.302 0.745 0.933 RC
N
f351177404
f
GR
GS
[0.75 0 0 0.75 315.38333 34.5] CT
0.302 0.745 0.933 RC
10.0 ML
N
4 0 M
4 -2.209 2.209 -4 0 -4 C
-2.209 -4 -4 -2.209 -4 0 C
-4 2.209 -2.209 4 0 4 C
2.209 4 4 2.209 4 0 C
cp
S
GR
GS
[0.75 0 0 0.75 325.95 34.5] CT
0.302 0.745 0.933 RC
N
f351177404
f
GR
GS
[0.75 0 0 0.75 325.95 34.5] CT
0.302 0.745 0.933 RC
10.0 ML
N
4 0 M
4 -2.209 2.209 -4 0 -4 C
-2.209 -4 -4 -2.209 -4 0 C
-4 2.209 -2.209 4 0 4 C
2.209 4 4 2.209 4 0 C
cp
S
GR
GS
[0.75 0 0 0.75 331.23333 34.5] CT
0.302 0.745 0.933 RC
N
f351177404
f
GR
GS
[0.75 0 0 0.75 331.23333 34.5] CT
0.302 0.745 0.933 RC
10.0 ML
N
4 0 M
4 -2.209 2.209 -4 0 -4 C
-2.209 -4 -4 -2.209 -4 0 C
-4 2.209 -2.209 4 0 4 C
2.209 4 4 2.209 4 0 C
cp
S
GR
GS
[0.75 0 0 0.75 333.87499 34.5] CT
0.302 0.745 0.933 RC
N
f351177404
f
GR
GS
[0.75 0 0 0.75 333.87499 34.5] CT
0.302 0.745 0.933 RC
10.0 ML
N
4 0 M
4 -2.209 2.209 -4 0 -4 C
-2.209 -4 -4 -2.209 -4 0 C
-4 2.209 -2.209 4 0 4 C
2.209 4 4 2.209 4 0 C
cp
S
GR
GS
[0.75 0 0 0.75 336.51668 34.5] CT
0.302 0.745 0.933 RC
N
f351177404
f
GR
GS
[0.75 0 0 0.75 336.51668 34.5] CT
0.302 0.745 0.933 RC
10.0 ML
N
4 0 M
4 -2.209 2.209 -4 0 -4 C
-2.209 -4 -4 -2.209 -4 0 C
-4 2.209 -2.209 4 0 4 C
2.209 4 4 2.209 4 0 C
cp
S
GR
GS
[0.75 0 0 0.75 339.15834 34.5] CT
0.302 0.745 0.933 RC
N
f351177404
f
GR
GS
[0.75 0 0 0.75 339.15834 34.5] CT
0.302 0.745 0.933 RC
10.0 ML
N
4 0 M
4 -2.209 2.209 -4 0 -4 C
-2.209 -4 -4 -2.209 -4 0 C
-4 2.209 -2.209 4 0 4 C
2.209 4 4 2.209 4 0 C
cp
S
GR
GS
[0.75 0 0 0.75 341.8 34.5] CT
0.302 0.745 0.933 RC
N
f351177404
f
GR
GS
[0.75 0 0 0.75 341.8 34.5] CT
0.302 0.745 0.933 RC
10.0 ML
N
4 0 M
4 -2.209 2.209 -4 0 -4 C
-2.209 -4 -4 -2.209 -4 0 C
-4 2.209 -2.209 4 0 4 C
2.209 4 4 2.209 4 0 C
cp
S
GR
GS
[0.75 0 0 0.75 344.44167 34.5] CT
0.302 0.745 0.933 RC
N
f351177404
f
GR
GS
[0.75 0 0 0.75 344.44167 34.5] CT
0.302 0.745 0.933 RC
10.0 ML
N
4 0 M
4 -2.209 2.209 -4 0 -4 C
-2.209 -4 -4 -2.209 -4 0 C
-4 2.209 -2.209 4 0 4 C
2.209 4 4 2.209 4 0 C
cp
S
GR
GS
[0.75 0 0 0.75 349.72499 34.5] CT
0.302 0.745 0.933 RC
N
f351177404
f
GR
GS
[0.75 0 0 0.75 349.72499 34.5] CT
0.302 0.745 0.933 RC
10.0 ML
N
4 0 M
4 -2.209 2.209 -4 0 -4 C
-2.209 -4 -4 -2.209 -4 0 C
-4 2.209 -2.209 4 0 4 C
2.209 4 4 2.209 4 0 C
cp
S
GR
GS
[0.75 0 0 0.75 352.36668 34.5] CT
0.302 0.745 0.933 RC
N
f351177404
f
GR
GS
[0.75 0 0 0.75 352.36668 34.5] CT
0.302 0.745 0.933 RC
10.0 ML
N
4 0 M
4 -2.209 2.209 -4 0 -4 C
-2.209 -4 -4 -2.209 -4 0 C
-4 2.209 -2.209 4 0 4 C
2.209 4 4 2.209 4 0 C
cp
S
GR
GS
[0.75 0 0 0.75 355.00834 34.5] CT
0.302 0.745 0.933 RC
N
f351177404
f
GR
GS
[0.75 0 0 0.75 355.00834 34.5] CT
0.302 0.745 0.933 RC
10.0 ML
N
4 0 M
4 -2.209 2.209 -4 0 -4 C
-2.209 -4 -4 -2.209 -4 0 C
-4 2.209 -2.209 4 0 4 C
2.209 4 4 2.209 4 0 C
cp
S
GR
GS
[0.75 0 0 0.75 362.93333 34.5] CT
0.302 0.745 0.933 RC
N
f351177404
f
GR
GS
[0.75 0 0 0.75 362.93333 34.5] CT
0.302 0.745 0.933 RC
10.0 ML
N
4 0 M
4 -2.209 2.209 -4 0 -4 C
-2.209 -4 -4 -2.209 -4 0 C
-4 2.209 -2.209 4 0 4 C
2.209 4 4 2.209 4 0 C
cp
S
GR
GS
[0.75 0 0 0.75 365.57499 34.5] CT
0.302 0.745 0.933 RC
N
f351177404
f
GR
GS
[0.75 0 0 0.75 365.57499 34.5] CT
0.302 0.745 0.933 RC
10.0 ML
N
4 0 M
4 -2.209 2.209 -4 0 -4 C
-2.209 -4 -4 -2.209 -4 0 C
-4 2.209 -2.209 4 0 4 C
2.209 4 4 2.209 4 0 C
cp
S
GR
GS
[0.75 0 0 0.75 368.21667 34.5] CT
0.302 0.745 0.933 RC
N
f351177404
f
GR
GS
[0.75 0 0 0.75 368.21667 34.5] CT
0.302 0.745 0.933 RC
10.0 ML
N
4 0 M
4 -2.209 2.209 -4 0 -4 C
-2.209 -4 -4 -2.209 -4 0 C
-4 2.209 -2.209 4 0 4 C
2.209 4 4 2.209 4 0 C
cp
S
GR
GS
[0.75 0 0 0.75 370.85834 34.5] CT
0.302 0.745 0.933 RC
N
f351177404
f
GR
GS
[0.75 0 0 0.75 370.85834 34.5] CT
0.302 0.745 0.933 RC
10.0 ML
N
4 0 M
4 -2.209 2.209 -4 0 -4 C
-2.209 -4 -4 -2.209 -4 0 C
-4 2.209 -2.209 4 0 4 C
2.209 4 4 2.209 4 0 C
cp
S
GR
GS
[0.75 0 0 0.75 373.5 34.5] CT
0.302 0.745 0.933 RC
N
f351177404
f
GR
GS
[0.75 0 0 0.75 373.5 34.5] CT
0.302 0.745 0.933 RC
10.0 ML
N
4 0 M
4 -2.209 2.209 -4 0 -4 C
-2.209 -4 -4 -2.209 -4 0 C
-4 2.209 -2.209 4 0 4 C
2.209 4 4 2.209 4 0 C
cp
S
GR
GS
[0.75 0 0 0.75 381.42501 34.5] CT
0.302 0.745 0.933 RC
N
f351177404
f
GR
GS
[0.75 0 0 0.75 381.42501 34.5] CT
0.302 0.745 0.933 RC
10.0 ML
N
4 0 M
4 -2.209 2.209 -4 0 -4 C
-2.209 -4 -4 -2.209 -4 0 C
-4 2.209 -2.209 4 0 4 C
2.209 4 4 2.209 4 0 C
cp
S
GR
GS
[0.75 0 0 0.75 384.06665 34.5] CT
0.302 0.745 0.933 RC
N
f351177404
f
GR
GS
[0.75 0 0 0.75 384.06665 34.5] CT
0.302 0.745 0.933 RC
10.0 ML
N
4 0 M
4 -2.209 2.209 -4 0 -4 C
-2.209 -4 -4 -2.209 -4 0 C
-4 2.209 -2.209 4 0 4 C
2.209 4 4 2.209 4 0 C
cp
S
GR
GS
[0.75 0 0 0.75 386.70831 34.5] CT
0.302 0.745 0.933 RC
N
f351177404
f
GR
GS
[0.75 0 0 0.75 386.70831 34.5] CT
0.302 0.745 0.933 RC
10.0 ML
N
4 0 M
4 -2.209 2.209 -4 0 -4 C
-2.209 -4 -4 -2.209 -4 0 C
-4 2.209 -2.209 4 0 4 C
2.209 4 4 2.209 4 0 C
cp
S
GR
GS
[0.75 0 0 0.75 389.35002 34.5] CT
0.302 0.745 0.933 RC
N
f351177404
f
GR
GS
[0.75 0 0 0.75 389.35002 34.5] CT
0.302 0.745 0.933 RC
10.0 ML
N
4 0 M
4 -2.209 2.209 -4 0 -4 C
-2.209 -4 -4 -2.209 -4 0 C
-4 2.209 -2.209 4 0 4 C
2.209 4 4 2.209 4 0 C
cp
S
GR
GS
[0.75 0 0 0.75 391.99168 34.5] CT
0.302 0.745 0.933 RC
N
f351177404
f
GR
GS
[0.75 0 0 0.75 391.99168 34.5] CT
0.302 0.745 0.933 RC
10.0 ML
N
4 0 M
4 -2.209 2.209 -4 0 -4 C
-2.209 -4 -4 -2.209 -4 0 C
-4 2.209 -2.209 4 0 4 C
2.209 4 4 2.209 4 0 C
cp
S
GR
GS
[0.75 0 0 0.75 394.63335 34.5] CT
0.302 0.745 0.933 RC
N
f351177404
f
GR
GS
[0.75 0 0 0.75 394.63335 34.5] CT
0.302 0.745 0.933 RC
10.0 ML
N
4 0 M
4 -2.209 2.209 -4 0 -4 C
-2.209 -4 -4 -2.209 -4 0 C
-4 2.209 -2.209 4 0 4 C
2.209 4 4 2.209 4 0 C
cp
S
GR
GS
[0.75 0 0 0.75 397.27501 34.5] CT
0.302 0.745 0.933 RC
N
f351177404
f
GR
GS
[0.75 0 0 0.75 397.27501 34.5] CT
0.302 0.745 0.933 RC
10.0 ML
N
4 0 M
4 -2.209 2.209 -4 0 -4 C
-2.209 -4 -4 -2.209 -4 0 C
-4 2.209 -2.209 4 0 4 C
2.209 4 4 2.209 4 0 C
cp
S
GR
GS
[0.75 0 0 0.75 407.84166 34.5] CT
0.302 0.745 0.933 RC
N
f351177404
f
GR
GS
[0.75 0 0 0.75 407.84166 34.5] CT
0.302 0.745 0.933 RC
10.0 ML
N
4 0 M
4 -2.209 2.209 -4 0 -4 C
-2.209 -4 -4 -2.209 -4 0 C
-4 2.209 -2.209 4 0 4 C
2.209 4 4 2.209 4 0 C
cp
S
GR
GS
[0.75 0 0 0.75 410.48332 34.5] CT
0.302 0.745 0.933 RC
N
f351177404
f
GR
GS
[0.75 0 0 0.75 410.48332 34.5] CT
0.302 0.745 0.933 RC
10.0 ML
N
4 0 M
4 -2.209 2.209 -4 0 -4 C
-2.209 -4 -4 -2.209 -4 0 C
-4 2.209 -2.209 4 0 4 C
2.209 4 4 2.209 4 0 C
cp
S
GR
GS
[0.75 0 0 0.75 413.12498 34.5] CT
0.302 0.745 0.933 RC
N
f351177404
f
GR
GS
[0.75 0 0 0.75 413.12498 34.5] CT
0.302 0.745 0.933 RC
10.0 ML
N
4 0 M
4 -2.209 2.209 -4 0 -4 C
-2.209 -4 -4 -2.209 -4 0 C
-4 2.209 -2.209 4 0 4 C
2.209 4 4 2.209 4 0 C
cp
S
GR
GS
[0.75 0 0 0.75 415.76665 34.5] CT
0.302 0.745 0.933 RC
N
f351177404
f
GR
GS
[0.75 0 0 0.75 415.76665 34.5] CT
0.302 0.745 0.933 RC
10.0 ML
N
4 0 M
4 -2.209 2.209 -4 0 -4 C
-2.209 -4 -4 -2.209 -4 0 C
-4 2.209 -2.209 4 0 4 C
2.209 4 4 2.209 4 0 C
cp
S
GR
GS
[0.75 0 0 0.75 418.40836 34.5] CT
0.302 0.745 0.933 RC
N
f351177404
f
GR
GS
[0.75 0 0 0.75 418.40836 34.5] CT
0.302 0.745 0.933 RC
10.0 ML
N
4 0 M
4 -2.209 2.209 -4 0 -4 C
-2.209 -4 -4 -2.209 -4 0 C
-4 2.209 -2.209 4 0 4 C
2.209 4 4 2.209 4 0 C
cp
S
GR
GS
[0.75 0 0 0.75 421.05002 34.5] CT
0.302 0.745 0.933 RC
N
f351177404
f
GR
GS
[0.75 0 0 0.75 421.05002 34.5] CT
0.302 0.745 0.933 RC
10.0 ML
N
4 0 M
4 -2.209 2.209 -4 0 -4 C
-2.209 -4 -4 -2.209 -4 0 C
-4 2.209 -2.209 4 0 4 C
2.209 4 4 2.209 4 0 C
cp
S
GR
GS
[0.75 0 0 0.75 426.33334 34.5] CT
0.302 0.745 0.933 RC
N
f351177404
f
GR
GS
[0.75 0 0 0.75 426.33334 34.5] CT
0.302 0.745 0.933 RC
10.0 ML
N
4 0 M
4 -2.209 2.209 -4 0 -4 C
-2.209 -4 -4 -2.209 -4 0 C
-4 2.209 -2.209 4 0 4 C
2.209 4 4 2.209 4 0 C
cp
S
GR
GS
[0.75 0 0 0.75 428.97501 34.5] CT
0.302 0.745 0.933 RC
N
f351177404
f
GR
GS
[0.75 0 0 0.75 428.97501 34.5] CT
0.302 0.745 0.933 RC
10.0 ML
N
4 0 M
4 -2.209 2.209 -4 0 -4 C
-2.209 -4 -4 -2.209 -4 0 C
-4 2.209 -2.209 4 0 4 C
2.209 4 4 2.209 4 0 C
cp
S
GR
GS
[0.75 0 0 0.75 434.25833 34.5] CT
0.302 0.745 0.933 RC
N
f351177404
f
GR
GS
[0.75 0 0 0.75 434.25833 34.5] CT
0.302 0.745 0.933 RC
10.0 ML
N
4 0 M
4 -2.209 2.209 -4 0 -4 C
-2.209 -4 -4 -2.209 -4 0 C
-4 2.209 -2.209 4 0 4 C
2.209 4 4 2.209 4 0 C
cp
S
GR
GS
[0.75 0 0 0.75 458.03334 34.5] CT
0.302 0.745 0.933 RC
N
f351177404
f
GR
GS
[0.75 0 0 0.75 458.03334 34.5] CT
0.302 0.745 0.933 RC
10.0 ML
N
4 0 M
4 -2.209 2.209 -4 0 -4 C
-2.209 -4 -4 -2.209 -4 0 C
-4 2.209 -2.209 4 0 4 C
2.209 4 4 2.209 4 0 C
cp
S
GR
GS
[0.75 0 0 0.75 460.675 34.5] CT
0.302 0.745 0.933 RC
N
f351177404
f
GR
GS
[0.75 0 0 0.75 460.675 34.5] CT
0.302 0.745 0.933 RC
10.0 ML
N
4 0 M
4 -2.209 2.209 -4 0 -4 C
-2.209 -4 -4 -2.209 -4 0 C
-4 2.209 -2.209 4 0 4 C
2.209 4 4 2.209 4 0 C
cp
S
GR
GS
[0.75 0 0 0.75 468.59999 34.5] CT
0.302 0.745 0.933 RC
N
f351177404
f
GR
GS
[0.75 0 0 0.75 468.59999 34.5] CT
0.302 0.745 0.933 RC
10.0 ML
N
4 0 M
4 -2.209 2.209 -4 0 -4 C
-2.209 -4 -4 -2.209 -4 0 C
-4 2.209 -2.209 4 0 4 C
2.209 4 4 2.209 4 0 C
cp
S
GR
GS
[0.75 0 0 0.75 471.24165 34.5] CT
0.302 0.745 0.933 RC
N
f351177404
f
GR
GS
[0.75 0 0 0.75 471.24165 34.5] CT
0.302 0.745 0.933 RC
10.0 ML
N
4 0 M
4 -2.209 2.209 -4 0 -4 C
-2.209 -4 -4 -2.209 -4 0 C
-4 2.209 -2.209 4 0 4 C
2.209 4 4 2.209 4 0 C
cp
S
GR
GS
[0.75 0 0 0.75 473.88332 34.5] CT
0.302 0.745 0.933 RC
N
f351177404
f
GR
GS
[0.75 0 0 0.75 473.88332 34.5] CT
0.302 0.745 0.933 RC
10.0 ML
N
4 0 M
4 -2.209 2.209 -4 0 -4 C
-2.209 -4 -4 -2.209 -4 0 C
-4 2.209 -2.209 4 0 4 C
2.209 4 4 2.209 4 0 C
cp
S
GR
GS
[0.75 0 0 0.75 476.52498 34.5] CT
0.302 0.745 0.933 RC
N
f351177404
f
GR
GS
[0.75 0 0 0.75 476.52498 34.5] CT
0.302 0.745 0.933 RC
10.0 ML
N
4 0 M
4 -2.209 2.209 -4 0 -4 C
-2.209 -4 -4 -2.209 -4 0 C
-4 2.209 -2.209 4 0 4 C
2.209 4 4 2.209 4 0 C
cp
S
GR
GS
[0.75 0 0 0.75 489.73334 34.5] CT
0.302 0.745 0.933 RC
N
f351177404
f
GR
GS
[0.75 0 0 0.75 489.73334 34.5] CT
0.302 0.745 0.933 RC
10.0 ML
N
4 0 M
4 -2.209 2.209 -4 0 -4 C
-2.209 -4 -4 -2.209 -4 0 C
-4 2.209 -2.209 4 0 4 C
2.209 4 4 2.209 4 0 C
cp
S
GR
GS
[0.75 0 0 0.75 492.375 34.5] CT
0.302 0.745 0.933 RC
N
f351177404
f
GR
GS
[0.75 0 0 0.75 492.375 34.5] CT
0.302 0.745 0.933 RC
10.0 ML
N
4 0 M
4 -2.209 2.209 -4 0 -4 C
-2.209 -4 -4 -2.209 -4 0 C
-4 2.209 -2.209 4 0 4 C
2.209 4 4 2.209 4 0 C
cp
S
GR
GS
[0.75 0 0 0.75 526.71666 34.5] CT
0.302 0.745 0.933 RC
N
f351177404
f
GR
GS
[0.75 0 0 0.75 526.71666 34.5] CT
0.302 0.745 0.933 RC
10.0 ML
N
4 0 M
4 -2.209 2.209 -4 0 -4 C
-2.209 -4 -4 -2.209 -4 0 C
-4 2.209 -2.209 4 0 4 C
2.209 4 4 2.209 4 0 C
cp
S
GR
GS
[0.75 0 0 0.75 547.85001 34.5] CT
0.302 0.745 0.933 RC
N
f351177404
f
GR
GS
[0.75 0 0 0.75 547.85001 34.5] CT
0.302 0.745 0.933 RC
10.0 ML
N
4 0 M
4 -2.209 2.209 -4 0 -4 C
-2.209 -4 -4 -2.209 -4 0 C
-4 2.209 -2.209 4 0 4 C
2.209 4 4 2.209 4 0 C
cp
S
GR
GS
[0.75 0 0 0.75 550.49167 34.5] CT
0.302 0.745 0.933 RC
N
f351177404
f
GR
GS
[0.75 0 0 0.75 550.49167 34.5] CT
0.302 0.745 0.933 RC
10.0 ML
N
4 0 M
4 -2.209 2.209 -4 0 -4 C
-2.209 -4 -4 -2.209 -4 0 C
-4 2.209 -2.209 4 0 4 C
2.209 4 4 2.209 4 0 C
cp
S
GR
GS
[0.75 0 0 0.75 555.77499 34.5] CT
0.302 0.745 0.933 RC
N
f351177404
f
GR
GS
[0.75 0 0 0.75 555.77499 34.5] CT
0.302 0.745 0.933 RC
10.0 ML
N
4 0 M
4 -2.209 2.209 -4 0 -4 C
-2.209 -4 -4 -2.209 -4 0 C
-4 2.209 -2.209 4 0 4 C
2.209 4 4 2.209 4 0 C
cp
S
GR
GS
[0.75 0 0 0.75 563.69998 34.5] CT
0.302 0.745 0.933 RC
N
f351177404
f
GR
GS
[0.75 0 0 0.75 563.69998 34.5] CT
0.302 0.745 0.933 RC
10.0 ML
N
4 0 M
4 -2.209 2.209 -4 0 -4 C
-2.209 -4 -4 -2.209 -4 0 C
-4 2.209 -2.209 4 0 4 C
2.209 4 4 2.209 4 0 C
cp
S
GR
GS
[0.75 0 0 0.75 566.34164 34.5] CT
0.302 0.745 0.933 RC
N
f351177404
f
GR
GS
[0.75 0 0 0.75 566.34164 34.5] CT
0.302 0.745 0.933 RC
10.0 ML
N
4 0 M
4 -2.209 2.209 -4 0 -4 C
-2.209 -4 -4 -2.209 -4 0 C
-4 2.209 -2.209 4 0 4 C
2.209 4 4 2.209 4 0 C
cp
S
GR
GS
[0.75 0 0 0.75 568.98335 34.5] CT
0.302 0.745 0.933 RC
N
f351177404
f
GR
GS
[0.75 0 0 0.75 568.98335 34.5] CT
0.302 0.745 0.933 RC
10.0 ML
N
4 0 M
4 -2.209 2.209 -4 0 -4 C
-2.209 -4 -4 -2.209 -4 0 C
-4 2.209 -2.209 4 0 4 C
2.209 4 4 2.209 4 0 C
cp
S
GR
GS
[0.75 0 0 0.75 0 0] CT
0.302 0.745 0.933 RC
1 LJ
0.667 LW
N
230.311 124 M
230.311 46 L
S
GR
GS
[0.75 0 0 0.75 0 0] CT
0.302 0.745 0.933 RC
1 LJ
0.667 LW
N
262.011 124 M
262.011 46 L
S
GR
GS
[0.75 0 0 0.75 0 0] CT
0.302 0.745 0.933 RC
1 LJ
0.667 LW
N
265.533 124 M
265.533 46 L
S
GR
GS
[0.75 0 0 0.75 0 0] CT
0.302 0.745 0.933 RC
1 LJ
0.667 LW
N
328.933 124 M
328.933 46 L
S
GR
GS
[0.75 0 0 0.75 0 0] CT
0.302 0.745 0.933 RC
1 LJ
0.667 LW
N
332.456 124 M
332.456 46 L
S
GR
GS
[0.75 0 0 0.75 0 0] CT
0.302 0.745 0.933 RC
1 LJ
0.667 LW
N
335.978 124 M
335.978 46 L
S
GR
GS
[0.75 0 0 0.75 0 0] CT
0.302 0.745 0.933 RC
1 LJ
0.667 LW
N
339.5 124 M
339.5 46 L
S
GR
GS
[0.75 0 0 0.75 0 0] CT
0.302 0.745 0.933 RC
1 LJ
0.667 LW
N
343.022 124 M
343.022 46 L
S
GR
GS
[0.75 0 0 0.75 0 0] CT
0.302 0.745 0.933 RC
1 LJ
0.667 LW
N
346.544 124 M
346.544 46 L
S
GR
GS
[0.75 0 0 0.75 0 0] CT
0.302 0.745 0.933 RC
1 LJ
0.667 LW
N
353.589 124 M
353.589 46 L
S
GR
GS
[0.75 0 0 0.75 0 0] CT
0.302 0.745 0.933 RC
1 LJ
0.667 LW
N
357.111 124 M
357.111 46 L
S
GR
GS
[0.75 0 0 0.75 0 0] CT
0.302 0.745 0.933 RC
1 LJ
0.667 LW
N
364.156 124 M
364.156 46 L
S
GR
GS
[0.75 0 0 0.75 0 0] CT
0.302 0.745 0.933 RC
1 LJ
0.667 LW
N
367.678 124 M
367.678 46 L
S
GR
GS
[0.75 0 0 0.75 0 0] CT
0.302 0.745 0.933 RC
1 LJ
0.667 LW
N
371.2 124 M
371.2 46 L
S
GR
GS
[0.75 0 0 0.75 0 0] CT
0.302 0.745 0.933 RC
1 LJ
0.667 LW
N
374.722 124 M
374.722 46 L
S
GR
GS
[0.75 0 0 0.75 0 0] CT
0.302 0.745 0.933 RC
1 LJ
0.667 LW
N
378.244 124 M
378.244 46 L
S
GR
GS
[0.75 0 0 0.75 0 0] CT
0.302 0.745 0.933 RC
1 LJ
0.667 LW
N
385.289 124 M
385.289 46 L
S
GR
GS
[0.75 0 0 0.75 0 0] CT
0.302 0.745 0.933 RC
1 LJ
0.667 LW
N
388.811 124 M
388.811 46 L
S
GR
GS
[0.75 0 0 0.75 0 0] CT
0.302 0.745 0.933 RC
1 LJ
0.667 LW
N
392.333 124 M
392.333 46 L
S
GR
GS
[0.75 0 0 0.75 0 0] CT
0.302 0.745 0.933 RC
1 LJ
0.667 LW
N
395.856 124 M
395.856 46 L
S
GR
GS
[0.75 0 0 0.75 0 0] CT
0.302 0.745 0.933 RC
1 LJ
0.667 LW
N
399.378 124 M
399.378 46 L
S
GR
GS
[0.75 0 0 0.75 0 0] CT
0.302 0.745 0.933 RC
1 LJ
0.667 LW
N
402.9 124 M
402.9 46 L
S
GR
GS
[0.75 0 0 0.75 0 0] CT
0.302 0.745 0.933 RC
1 LJ
0.667 LW
N
406.422 124 M
406.422 46 L
S
GR
GS
[0.75 0 0 0.75 0 0] CT
0.302 0.745 0.933 RC
1 LJ
0.667 LW
N
409.944 124 M
409.944 46 L
S
GR
GS
[0.75 0 0 0.75 0 0] CT
0.302 0.745 0.933 RC
1 LJ
0.667 LW
N
413.467 124 M
413.467 46 L
S
GR
GS
[0.75 0 0 0.75 0 0] CT
0.302 0.745 0.933 RC
1 LJ
0.667 LW
N
416.989 124 M
416.989 46 L
S
GR
GS
[0.75 0 0 0.75 0 0] CT
0.302 0.745 0.933 RC
1 LJ
0.667 LW
N
420.511 124 M
420.511 46 L
S
GR
GS
[0.75 0 0 0.75 0 0] CT
0.302 0.745 0.933 RC
1 LJ
0.667 LW
N
434.6 124 M
434.6 46 L
S
GR
GS
[0.75 0 0 0.75 0 0] CT
0.302 0.745 0.933 RC
1 LJ
0.667 LW
N
441.644 124 M
441.644 46 L
S
GR
GS
[0.75 0 0 0.75 0 0] CT
0.302 0.745 0.933 RC
1 LJ
0.667 LW
N
445.167 124 M
445.167 46 L
S
GR
GS
[0.75 0 0 0.75 0 0] CT
0.302 0.745 0.933 RC
1 LJ
0.667 LW
N
448.689 124 M
448.689 46 L
S
GR
GS
[0.75 0 0 0.75 0 0] CT
0.302 0.745 0.933 RC
1 LJ
0.667 LW
N
452.211 124 M
452.211 46 L
S
GR
GS
[0.75 0 0 0.75 0 0] CT
0.302 0.745 0.933 RC
1 LJ
0.667 LW
N
455.733 124 M
455.733 46 L
S
GR
GS
[0.75 0 0 0.75 0 0] CT
0.302 0.745 0.933 RC
1 LJ
0.667 LW
N
459.256 124 M
459.256 46 L
S
GR
GS
[0.75 0 0 0.75 0 0] CT
0.302 0.745 0.933 RC
1 LJ
0.667 LW
N
466.3 124 M
466.3 46 L
S
GR
GS
[0.75 0 0 0.75 0 0] CT
0.302 0.745 0.933 RC
1 LJ
0.667 LW
N
469.822 124 M
469.822 46 L
S
GR
GS
[0.75 0 0 0.75 0 0] CT
0.302 0.745 0.933 RC
1 LJ
0.667 LW
N
473.344 124 M
473.344 46 L
S
GR
GS
[0.75 0 0 0.75 0 0] CT
0.302 0.745 0.933 RC
1 LJ
0.667 LW
N
483.911 124 M
483.911 46 L
S
GR
GS
[0.75 0 0 0.75 0 0] CT
0.302 0.745 0.933 RC
1 LJ
0.667 LW
N
487.433 124 M
487.433 46 L
S
GR
GS
[0.75 0 0 0.75 0 0] CT
0.302 0.745 0.933 RC
1 LJ
0.667 LW
N
490.956 124 M
490.956 46 L
S
GR
GS
[0.75 0 0 0.75 0 0] CT
0.302 0.745 0.933 RC
1 LJ
0.667 LW
N
494.478 124 M
494.478 46 L
S
GR
GS
[0.75 0 0 0.75 0 0] CT
0.302 0.745 0.933 RC
1 LJ
0.667 LW
N
498 124 M
498 46 L
S
GR
GS
[0.75 0 0 0.75 0 0] CT
0.302 0.745 0.933 RC
1 LJ
0.667 LW
N
508.567 124 M
508.567 46 L
S
GR
GS
[0.75 0 0 0.75 0 0] CT
0.302 0.745 0.933 RC
1 LJ
0.667 LW
N
512.089 124 M
512.089 46 L
S
GR
GS
[0.75 0 0 0.75 0 0] CT
0.302 0.745 0.933 RC
1 LJ
0.667 LW
N
515.611 124 M
515.611 46 L
S
GR
GS
[0.75 0 0 0.75 0 0] CT
0.302 0.745 0.933 RC
1 LJ
0.667 LW
N
519.133 124 M
519.133 46 L
S
GR
GS
[0.75 0 0 0.75 0 0] CT
0.302 0.745 0.933 RC
1 LJ
0.667 LW
N
522.656 124 M
522.656 46 L
S
GR
GS
[0.75 0 0 0.75 0 0] CT
0.302 0.745 0.933 RC
1 LJ
0.667 LW
N
526.178 124 M
526.178 46 L
S
GR
GS
[0.75 0 0 0.75 0 0] CT
0.302 0.745 0.933 RC
1 LJ
0.667 LW
N
529.7 124 M
529.7 46 L
S
GR
GS
[0.75 0 0 0.75 0 0] CT
0.302 0.745 0.933 RC
1 LJ
0.667 LW
N
543.789 124 M
543.789 46 L
S
GR
GS
[0.75 0 0 0.75 0 0] CT
0.302 0.745 0.933 RC
1 LJ
0.667 LW
N
547.311 124 M
547.311 46 L
S
GR
GS
[0.75 0 0 0.75 0 0] CT
0.302 0.745 0.933 RC
1 LJ
0.667 LW
N
550.833 124 M
550.833 46 L
S
GR
GS
[0.75 0 0 0.75 0 0] CT
0.302 0.745 0.933 RC
1 LJ
0.667 LW
N
554.356 124 M
554.356 46 L
S
GR
GS
[0.75 0 0 0.75 0 0] CT
0.302 0.745 0.933 RC
1 LJ
0.667 LW
N
557.878 124 M
557.878 46 L
S
GR
GS
[0.75 0 0 0.75 0 0] CT
0.302 0.745 0.933 RC
1 LJ
0.667 LW
N
561.4 124 M
561.4 46 L
S
GR
GS
[0.75 0 0 0.75 0 0] CT
0.302 0.745 0.933 RC
1 LJ
0.667 LW
N
568.444 124 M
568.444 46 L
S
GR
GS
[0.75 0 0 0.75 0 0] CT
0.302 0.745 0.933 RC
1 LJ
0.667 LW
N
571.967 124 M
571.967 46 L
S
GR
GS
[0.75 0 0 0.75 0 0] CT
0.302 0.745 0.933 RC
1 LJ
0.667 LW
N
579.011 124 M
579.011 46 L
S
GR
GS
[0.75 0 0 0.75 0 0] CT
0.302 0.745 0.933 RC
1 LJ
0.667 LW
N
610.711 124 M
610.711 46 L
S
GR
GS
[0.75 0 0 0.75 0 0] CT
0.302 0.745 0.933 RC
1 LJ
0.667 LW
N
614.233 124 M
614.233 46 L
S
GR
GS
[0.75 0 0 0.75 0 0] CT
0.302 0.745 0.933 RC
1 LJ
0.667 LW
N
624.8 124 M
624.8 46 L
S
GR
GS
[0.75 0 0 0.75 0 0] CT
0.302 0.745 0.933 RC
1 LJ
0.667 LW
N
628.322 124 M
628.322 46 L
S
GR
GS
[0.75 0 0 0.75 0 0] CT
0.302 0.745 0.933 RC
1 LJ
0.667 LW
N
631.844 124 M
631.844 46 L
S
GR
GS
[0.75 0 0 0.75 0 0] CT
0.302 0.745 0.933 RC
1 LJ
0.667 LW
N
635.367 124 M
635.367 46 L
S
GR
GS
[0.75 0 0 0.75 0 0] CT
0.302 0.745 0.933 RC
1 LJ
0.667 LW
N
652.978 124 M
652.978 46 L
S
GR
GS
[0.75 0 0 0.75 0 0] CT
0.302 0.745 0.933 RC
1 LJ
0.667 LW
N
656.5 124 M
656.5 46 L
S
GR
GS
[0.75 0 0 0.75 0 0] CT
0.302 0.745 0.933 RC
1 LJ
0.667 LW
N
702.289 124 M
702.289 46 L
S
GR
GS
[0.75 0 0 0.75 0 0] CT
0.302 0.745 0.933 RC
1 LJ
0.667 LW
N
730.467 124 M
730.467 46 L
S
GR
GS
[0.75 0 0 0.75 0 0] CT
0.302 0.745 0.933 RC
1 LJ
0.667 LW
N
733.989 124 M
733.989 46 L
S
GR
GS
[0.75 0 0 0.75 0 0] CT
0.302 0.745 0.933 RC
1 LJ
0.667 LW
N
741.033 124 M
741.033 46 L
S
GR
GS
[0.75 0 0 0.75 0 0] CT
0.302 0.745 0.933 RC
1 LJ
0.667 LW
N
751.6 124 M
751.6 46 L
S
GR
GS
[0.75 0 0 0.75 0 0] CT
0.302 0.745 0.933 RC
1 LJ
0.667 LW
N
755.122 124 M
755.122 46 L
S
GR
GS
[0.75 0 0 0.75 0 0] CT
0.302 0.745 0.933 RC
1 LJ
0.667 LW
N
758.644 124 M
758.644 46 L
S
GR
GS
[0.75 0 0 0.75 141.03334 151.5] CT
0 0.447 0.741 RC
N
f351177404
f
GR
GS
[0.75 0 0 0.75 141.03334 151.5] CT
0 0.447 0.741 RC
10.0 ML
N
4 0 M
4 -2.209 2.209 -4 0 -4 C
-2.209 -4 -4 -2.209 -4 0 C
-4 2.209 -2.209 4 0 4 C
2.209 4 4 2.209 4 0 C
cp
S
GR
GS
[0.75 0 0 0.75 143.675 151.5] CT
0 0.447 0.741 RC
N
f351177404
f
GR
GS
[0.75 0 0 0.75 143.675 151.5] CT
0 0.447 0.741 RC
10.0 ML
N
4 0 M
4 -2.209 2.209 -4 0 -4 C
-2.209 -4 -4 -2.209 -4 0 C
-4 2.209 -2.209 4 0 4 C
2.209 4 4 2.209 4 0 C
cp
S
GR
GS
[0.75 0 0 0.75 151.6 151.5] CT
0 0.447 0.741 RC
N
f351177404
f
GR
GS
[0.75 0 0 0.75 151.6 151.5] CT
0 0.447 0.741 RC
10.0 ML
N
4 0 M
4 -2.209 2.209 -4 0 -4 C
-2.209 -4 -4 -2.209 -4 0 C
-4 2.209 -2.209 4 0 4 C
2.209 4 4 2.209 4 0 C
cp
S
GR
GS
[0.75 0 0 0.75 154.24166 151.5] CT
0 0.447 0.741 RC
N
f351177404
f
GR
GS
[0.75 0 0 0.75 154.24166 151.5] CT
0 0.447 0.741 RC
10.0 ML
N
4 0 M
4 -2.209 2.209 -4 0 -4 C
-2.209 -4 -4 -2.209 -4 0 C
-4 2.209 -2.209 4 0 4 C
2.209 4 4 2.209 4 0 C
cp
S
GR
GS
[0.75 0 0 0.75 156.88334 151.5] CT
0 0.447 0.741 RC
N
f351177404
f
GR
GS
[0.75 0 0 0.75 156.88334 151.5] CT
0 0.447 0.741 RC
10.0 ML
N
4 0 M
4 -2.209 2.209 -4 0 -4 C
-2.209 -4 -4 -2.209 -4 0 C
-4 2.209 -2.209 4 0 4 C
2.209 4 4 2.209 4 0 C
cp
S
GR
GS
[0.75 0 0 0.75 159.525 151.5] CT
0 0.447 0.741 RC
N
f351177404
f
GR
GS
[0.75 0 0 0.75 159.525 151.5] CT
0 0.447 0.741 RC
10.0 ML
N
4 0 M
4 -2.209 2.209 -4 0 -4 C
-2.209 -4 -4 -2.209 -4 0 C
-4 2.209 -2.209 4 0 4 C
2.209 4 4 2.209 4 0 C
cp
S
GR
GS
[0.75 0 0 0.75 162.16667 151.5] CT
0 0.447 0.741 RC
N
f351177404
f
GR
GS
[0.75 0 0 0.75 162.16667 151.5] CT
0 0.447 0.741 RC
10.0 ML
N
4 0 M
4 -2.209 2.209 -4 0 -4 C
-2.209 -4 -4 -2.209 -4 0 C
-4 2.209 -2.209 4 0 4 C
2.209 4 4 2.209 4 0 C
cp
S
GR
GS
[0.75 0 0 0.75 164.80833 151.5] CT
0 0.447 0.741 RC
N
f351177404
f
GR
GS
[0.75 0 0 0.75 164.80833 151.5] CT
0 0.447 0.741 RC
10.0 ML
N
4 0 M
4 -2.209 2.209 -4 0 -4 C
-2.209 -4 -4 -2.209 -4 0 C
-4 2.209 -2.209 4 0 4 C
2.209 4 4 2.209 4 0 C
cp
S
GR
GS
[0.75 0 0 0.75 167.45 151.5] CT
0 0.447 0.741 RC
N
f351177404
f
GR
GS
[0.75 0 0 0.75 167.45 151.5] CT
0 0.447 0.741 RC
10.0 ML
N
4 0 M
4 -2.209 2.209 -4 0 -4 C
-2.209 -4 -4 -2.209 -4 0 C
-4 2.209 -2.209 4 0 4 C
2.209 4 4 2.209 4 0 C
cp
S
GR
GS
[0.75 0 0 0.75 170.09167 151.5] CT
0 0.447 0.741 RC
N
f351177404
f
GR
GS
[0.75 0 0 0.75 170.09167 151.5] CT
0 0.447 0.741 RC
10.0 ML
N
4 0 M
4 -2.209 2.209 -4 0 -4 C
-2.209 -4 -4 -2.209 -4 0 C
-4 2.209 -2.209 4 0 4 C
2.209 4 4 2.209 4 0 C
cp
S
GR
GS
[0.75 0 0 0.75 318.02499 151.5] CT
0 0.447 0.741 RC
N
f351177404
f
GR
GS
[0.75 0 0 0.75 318.02499 151.5] CT
0 0.447 0.741 RC
10.0 ML
N
4 0 M
4 -2.209 2.209 -4 0 -4 C
-2.209 -4 -4 -2.209 -4 0 C
-4 2.209 -2.209 4 0 4 C
2.209 4 4 2.209 4 0 C
cp
S
GR
GS
[0.75 0 0 0.75 320.66666 151.5] CT
0 0.447 0.741 RC
N
f351177404
f
GR
GS
[0.75 0 0 0.75 320.66666 151.5] CT
0 0.447 0.741 RC
10.0 ML
N
4 0 M
4 -2.209 2.209 -4 0 -4 C
-2.209 -4 -4 -2.209 -4 0 C
-4 2.209 -2.209 4 0 4 C
2.209 4 4 2.209 4 0 C
cp
S
GR
GS
[0.75 0 0 0.75 323.30834 151.5] CT
0 0.447 0.741 RC
N
f351177404
f
GR
GS
[0.75 0 0 0.75 323.30834 151.5] CT
0 0.447 0.741 RC
10.0 ML
N
4 0 M
4 -2.209 2.209 -4 0 -4 C
-2.209 -4 -4 -2.209 -4 0 C
-4 2.209 -2.209 4 0 4 C
2.209 4 4 2.209 4 0 C
cp
S
GR
GS
[0.75 0 0 0.75 347.08333 151.5] CT
0 0.447 0.741 RC
N
f351177404
f
GR
GS
[0.75 0 0 0.75 347.08333 151.5] CT
0 0.447 0.741 RC
10.0 ML
N
4 0 M
4 -2.209 2.209 -4 0 -4 C
-2.209 -4 -4 -2.209 -4 0 C
-4 2.209 -2.209 4 0 4 C
2.209 4 4 2.209 4 0 C
cp
S
GR
GS
[0.75 0 0 0.75 357.65 151.5] CT
0 0.447 0.741 RC
N
f351177404
f
GR
GS
[0.75 0 0 0.75 357.65 151.5] CT
0 0.447 0.741 RC
10.0 ML
N
4 0 M
4 -2.209 2.209 -4 0 -4 C
-2.209 -4 -4 -2.209 -4 0 C
-4 2.209 -2.209 4 0 4 C
2.209 4 4 2.209 4 0 C
cp
S
GR
GS
[0.75 0 0 0.75 360.29166 151.5] CT
0 0.447 0.741 RC
N
f351177404
f
GR
GS
[0.75 0 0 0.75 360.29166 151.5] CT
0 0.447 0.741 RC
10.0 ML
N
4 0 M
4 -2.209 2.209 -4 0 -4 C
-2.209 -4 -4 -2.209 -4 0 C
-4 2.209 -2.209 4 0 4 C
2.209 4 4 2.209 4 0 C
cp
S
GR
GS
[0.75 0 0 0.75 431.61667 151.5] CT
0 0.447 0.741 RC
N
f351177404
f
GR
GS
[0.75 0 0 0.75 431.61667 151.5] CT
0 0.447 0.741 RC
10.0 ML
N
4 0 M
4 -2.209 2.209 -4 0 -4 C
-2.209 -4 -4 -2.209 -4 0 C
-4 2.209 -2.209 4 0 4 C
2.209 4 4 2.209 4 0 C
cp
S
GR
GS
[0.75 0 0 0.75 439.54166 151.5] CT
0 0.447 0.741 RC
N
f351177404
f
GR
GS
[0.75 0 0 0.75 439.54166 151.5] CT
0 0.447 0.741 RC
10.0 ML
N
4 0 M
4 -2.209 2.209 -4 0 -4 C
-2.209 -4 -4 -2.209 -4 0 C
-4 2.209 -2.209 4 0 4 C
2.209 4 4 2.209 4 0 C
cp
S
GR
GS
[0.75 0 0 0.75 442.18332 151.5] CT
0 0.447 0.741 RC
N
f351177404
f
GR
GS
[0.75 0 0 0.75 442.18332 151.5] CT
0 0.447 0.741 RC
10.0 ML
N
4 0 M
4 -2.209 2.209 -4 0 -4 C
-2.209 -4 -4 -2.209 -4 0 C
-4 2.209 -2.209 4 0 4 C
2.209 4 4 2.209 4 0 C
cp
S
GR
GS
[0.75 0 0 0.75 444.82498 151.5] CT
0 0.447 0.741 RC
N
f351177404
f
GR
GS
[0.75 0 0 0.75 444.82498 151.5] CT
0 0.447 0.741 RC
10.0 ML
N
4 0 M
4 -2.209 2.209 -4 0 -4 C
-2.209 -4 -4 -2.209 -4 0 C
-4 2.209 -2.209 4 0 4 C
2.209 4 4 2.209 4 0 C
cp
S
GR
GS
[0.75 0 0 0.75 450.10835 151.5] CT
0 0.447 0.741 RC
N
f351177404
f
GR
GS
[0.75 0 0 0.75 450.10835 151.5] CT
0 0.447 0.741 RC
10.0 ML
N
4 0 M
4 -2.209 2.209 -4 0 -4 C
-2.209 -4 -4 -2.209 -4 0 C
-4 2.209 -2.209 4 0 4 C
2.209 4 4 2.209 4 0 C
cp
S
GR
GS
[0.75 0 0 0.75 452.75002 151.5] CT
0 0.447 0.741 RC
N
f351177404
f
GR
GS
[0.75 0 0 0.75 452.75002 151.5] CT
0 0.447 0.741 RC
10.0 ML
N
4 0 M
4 -2.209 2.209 -4 0 -4 C
-2.209 -4 -4 -2.209 -4 0 C
-4 2.209 -2.209 4 0 4 C
2.209 4 4 2.209 4 0 C
cp
S
GR
GS
[0.75 0 0 0.75 455.39168 151.5] CT
0 0.447 0.741 RC
N
f351177404
f
GR
GS
[0.75 0 0 0.75 455.39168 151.5] CT
0 0.447 0.741 RC
10.0 ML
N
4 0 M
4 -2.209 2.209 -4 0 -4 C
-2.209 -4 -4 -2.209 -4 0 C
-4 2.209 -2.209 4 0 4 C
2.209 4 4 2.209 4 0 C
cp
S
GR
GS
[0.75 0 0 0.75 463.31667 151.5] CT
0 0.447 0.741 RC
N
f351177404
f
GR
GS
[0.75 0 0 0.75 463.31667 151.5] CT
0 0.447 0.741 RC
10.0 ML
N
4 0 M
4 -2.209 2.209 -4 0 -4 C
-2.209 -4 -4 -2.209 -4 0 C
-4 2.209 -2.209 4 0 4 C
2.209 4 4 2.209 4 0 C
cp
S
GR
GS
[0.75 0 0 0.75 495.01666 151.5] CT
0 0.447 0.741 RC
N
f351177404
f
GR
GS
[0.75 0 0 0.75 495.01666 151.5] CT
0 0.447 0.741 RC
10.0 ML
N
4 0 M
4 -2.209 2.209 -4 0 -4 C
-2.209 -4 -4 -2.209 -4 0 C
-4 2.209 -2.209 4 0 4 C
2.209 4 4 2.209 4 0 C
cp
S
GR
GS
[0.75 0 0 0.75 497.65833 151.5] CT
0 0.447 0.741 RC
N
f351177404
f
GR
GS
[0.75 0 0 0.75 497.65833 151.5] CT
0 0.447 0.741 RC
10.0 ML
N
4 0 M
4 -2.209 2.209 -4 0 -4 C
-2.209 -4 -4 -2.209 -4 0 C
-4 2.209 -2.209 4 0 4 C
2.209 4 4 2.209 4 0 C
cp
S
GR
GS
[0.75 0 0 0.75 508.22502 151.5] CT
0 0.447 0.741 RC
N
f351177404
f
GR
GS
[0.75 0 0 0.75 508.22502 151.5] CT
0 0.447 0.741 RC
10.0 ML
N
4 0 M
4 -2.209 2.209 -4 0 -4 C
-2.209 -4 -4 -2.209 -4 0 C
-4 2.209 -2.209 4 0 4 C
2.209 4 4 2.209 4 0 C
cp
S
GR
GS
[0.75 0 0 0.75 510.86668 151.5] CT
0 0.447 0.741 RC
N
f351177404
f
GR
GS
[0.75 0 0 0.75 510.86668 151.5] CT
0 0.447 0.741 RC
10.0 ML
N
4 0 M
4 -2.209 2.209 -4 0 -4 C
-2.209 -4 -4 -2.209 -4 0 C
-4 2.209 -2.209 4 0 4 C
2.209 4 4 2.209 4 0 C
cp
S
GR
GS
[0.75 0 0 0.75 513.50835 151.5] CT
0 0.447 0.741 RC
N
f351177404
f
GR
GS
[0.75 0 0 0.75 513.50835 151.5] CT
0 0.447 0.741 RC
10.0 ML
N
4 0 M
4 -2.209 2.209 -4 0 -4 C
-2.209 -4 -4 -2.209 -4 0 C
-4 2.209 -2.209 4 0 4 C
2.209 4 4 2.209 4 0 C
cp
S
GR
GS
[0.75 0 0 0.75 516.15001 151.5] CT
0 0.447 0.741 RC
N
f351177404
f
GR
GS
[0.75 0 0 0.75 516.15001 151.5] CT
0 0.447 0.741 RC
10.0 ML
N
4 0 M
4 -2.209 2.209 -4 0 -4 C
-2.209 -4 -4 -2.209 -4 0 C
-4 2.209 -2.209 4 0 4 C
2.209 4 4 2.209 4 0 C
cp
S
GR
GS
[0.75 0 0 0.75 518.79167 151.5] CT
0 0.447 0.741 RC
N
f351177404
f
GR
GS
[0.75 0 0 0.75 518.79167 151.5] CT
0 0.447 0.741 RC
10.0 ML
N
4 0 M
4 -2.209 2.209 -4 0 -4 C
-2.209 -4 -4 -2.209 -4 0 C
-4 2.209 -2.209 4 0 4 C
2.209 4 4 2.209 4 0 C
cp
S
GR
GS
[0.75 0 0 0.75 0 0] CT
0 0.447 0.741 RC
1 LJ
0.667 LW
N
188.044 124 M
188.044 202 L
S
GR
GS
[0.75 0 0 0.75 0 0] CT
0 0.447 0.741 RC
1 LJ
0.667 LW
N
191.567 124 M
191.567 202 L
S
GR
GS
[0.75 0 0 0.75 0 0] CT
0 0.447 0.741 RC
1 LJ
0.667 LW
N
202.133 124 M
202.133 202 L
S
GR
GS
[0.75 0 0 0.75 0 0] CT
0 0.447 0.741 RC
1 LJ
0.667 LW
N
205.656 124 M
205.656 202 L
S
GR
GS
[0.75 0 0 0.75 0 0] CT
0 0.447 0.741 RC
1 LJ
0.667 LW
N
209.178 124 M
209.178 202 L
S
GR
GS
[0.75 0 0 0.75 0 0] CT
0 0.447 0.741 RC
1 LJ
0.667 LW
N
212.7 124 M
212.7 202 L
S
GR
GS
[0.75 0 0 0.75 0 0] CT
0 0.447 0.741 RC
1 LJ
0.667 LW
N
216.222 124 M
216.222 202 L
S
GR
GS
[0.75 0 0 0.75 0 0] CT
0 0.447 0.741 RC
1 LJ
0.667 LW
N
219.744 124 M
219.744 202 L
S
GR
GS
[0.75 0 0 0.75 0 0] CT
0 0.447 0.741 RC
1 LJ
0.667 LW
N
223.267 124 M
223.267 202 L
S
GR
GS
[0.75 0 0 0.75 0 0] CT
0 0.447 0.741 RC
1 LJ
0.667 LW
N
226.789 124 M
226.789 202 L
S
GR
GS
[0.75 0 0 0.75 0 0] CT
0 0.447 0.741 RC
1 LJ
0.667 LW
N
424.033 124 M
424.033 202 L
S
GR
GS
[0.75 0 0 0.75 0 0] CT
0 0.447 0.741 RC
1 LJ
0.667 LW
N
427.556 124 M
427.556 202 L
S
GR
GS
[0.75 0 0 0.75 0 0] CT
0 0.447 0.741 RC
1 LJ
0.667 LW
N
431.078 124 M
431.078 202 L
S
GR
GS
[0.75 0 0 0.75 0 0] CT
0 0.447 0.741 RC
1 LJ
0.667 LW
N
462.778 124 M
462.778 202 L
S
GR
GS
[0.75 0 0 0.75 0 0] CT
0 0.447 0.741 RC
1 LJ
0.667 LW
N
476.867 124 M
476.867 202 L
S
GR
GS
[0.75 0 0 0.75 0 0] CT
0 0.447 0.741 RC
1 LJ
0.667 LW
N
480.389 124 M
480.389 202 L
S
GR
GS
[0.75 0 0 0.75 0 0] CT
0 0.447 0.741 RC
1 LJ
0.667 LW
N
575.489 124 M
575.489 202 L
S
GR
GS
[0.75 0 0 0.75 0 0] CT
0 0.447 0.741 RC
1 LJ
0.667 LW
N
586.056 124 M
586.056 202 L
S
GR
GS
[0.75 0 0 0.75 0 0] CT
0 0.447 0.741 RC
1 LJ
0.667 LW
N
589.578 124 M
589.578 202 L
S
GR
GS
[0.75 0 0 0.75 0 0] CT
0 0.447 0.741 RC
1 LJ
0.667 LW
N
593.1 124 M
593.1 202 L
S
GR
GS
[0.75 0 0 0.75 0 0] CT
0 0.447 0.741 RC
1 LJ
0.667 LW
N
600.144 124 M
600.144 202 L
S
GR
GS
[0.75 0 0 0.75 0 0] CT
0 0.447 0.741 RC
1 LJ
0.667 LW
N
603.667 124 M
603.667 202 L
S
GR
GS
[0.75 0 0 0.75 0 0] CT
0 0.447 0.741 RC
1 LJ
0.667 LW
N
607.189 124 M
607.189 202 L
S
GR
GS
[0.75 0 0 0.75 0 0] CT
0 0.447 0.741 RC
1 LJ
0.667 LW
N
617.756 124 M
617.756 202 L
S
GR
GS
[0.75 0 0 0.75 0 0] CT
0 0.447 0.741 RC
1 LJ
0.667 LW
N
660.022 124 M
660.022 202 L
S
GR
GS
[0.75 0 0 0.75 0 0] CT
0 0.447 0.741 RC
1 LJ
0.667 LW
N
663.544 124 M
663.544 202 L
S
GR
GS
[0.75 0 0 0.75 0 0] CT
0 0.447 0.741 RC
1 LJ
0.667 LW
N
677.633 124 M
677.633 202 L
S
GR
GS
[0.75 0 0 0.75 0 0] CT
0 0.447 0.741 RC
1 LJ
0.667 LW
N
681.156 124 M
681.156 202 L
S
GR
GS
[0.75 0 0 0.75 0 0] CT
0 0.447 0.741 RC
1 LJ
0.667 LW
N
684.678 124 M
684.678 202 L
S
GR
GS
[0.75 0 0 0.75 0 0] CT
0 0.447 0.741 RC
1 LJ
0.667 LW
N
688.2 124 M
688.2 202 L
S
GR
GS
[0.75 0 0 0.75 0 0] CT
0 0.447 0.741 RC
1 LJ
0.667 LW
N
691.722 124 M
691.722 202 L
S
GR
GS
[0.75 0 0 0.75 0 0] CT
0.149 GC
2 setlinecap
1 LJ
0.667 LW
N
181 202 M
815 202 L
S
GR
GS
[0.75 0 0 0.75 0 0] CT
0.149 GC
2 setlinecap
1 LJ
0.667 LW
N
181 46 M
815 46 L
S
GR
GS
[0.75 0 0 0.75 0 0] CT
0.149 GC
2 setlinecap
1 LJ
0.667 LW
N
181 202 M
181 195.66 L
S
GR
GS
[0.75 0 0 0.75 0 0] CT
0.149 GC
2 setlinecap
1 LJ
0.667 LW
N
251.444 202 M
251.444 195.66 L
S
GR
GS
[0.75 0 0 0.75 0 0] CT
0.149 GC
2 setlinecap
1 LJ
0.667 LW
N
321.889 202 M
321.889 195.66 L
S
GR
GS
[0.75 0 0 0.75 0 0] CT
0.149 GC
2 setlinecap
1 LJ
0.667 LW
N
392.333 202 M
392.333 195.66 L
S
GR
GS
[0.75 0 0 0.75 0 0] CT
0.149 GC
2 setlinecap
1 LJ
0.667 LW
N
462.778 202 M
462.778 195.66 L
S
GR
GS
[0.75 0 0 0.75 0 0] CT
0.149 GC
2 setlinecap
1 LJ
0.667 LW
N
533.222 202 M
533.222 195.66 L
S
GR
GS
[0.75 0 0 0.75 0 0] CT
0.149 GC
2 setlinecap
1 LJ
0.667 LW
N
603.667 202 M
603.667 195.66 L
S
GR
GS
[0.75 0 0 0.75 0 0] CT
0.149 GC
2 setlinecap
1 LJ
0.667 LW
N
674.111 202 M
674.111 195.66 L
S
GR
GS
[0.75 0 0 0.75 0 0] CT
0.149 GC
2 setlinecap
1 LJ
0.667 LW
N
744.556 202 M
744.556 195.66 L
S
GR
GS
[0.75 0 0 0.75 0 0] CT
0.149 GC
2 setlinecap
1 LJ
0.667 LW
N
815 202 M
815 195.66 L
S
GR
GS
[0.75 0 0 0.75 0 0] CT
0.149 GC
2 setlinecap
1 LJ
0.667 LW
N
181 46 M
181 52.34 L
S
GR
GS
[0.75 0 0 0.75 0 0] CT
0.149 GC
2 setlinecap
1 LJ
0.667 LW
N
251.444 46 M
251.444 52.34 L
S
GR
GS
[0.75 0 0 0.75 0 0] CT
0.149 GC
2 setlinecap
1 LJ
0.667 LW
N
321.889 46 M
321.889 52.34 L
S
GR
GS
[0.75 0 0 0.75 0 0] CT
0.149 GC
2 setlinecap
1 LJ
0.667 LW
N
392.333 46 M
392.333 52.34 L
S
GR
GS
[0.75 0 0 0.75 0 0] CT
0.149 GC
2 setlinecap
1 LJ
0.667 LW
N
462.778 46 M
462.778 52.34 L
S
GR
GS
[0.75 0 0 0.75 0 0] CT
0.149 GC
2 setlinecap
1 LJ
0.667 LW
N
533.222 46 M
533.222 52.34 L
S
GR
GS
[0.75 0 0 0.75 0 0] CT
0.149 GC
2 setlinecap
1 LJ
0.667 LW
N
603.667 46 M
603.667 52.34 L
S
GR
GS
[0.75 0 0 0.75 0 0] CT
0.149 GC
2 setlinecap
1 LJ
0.667 LW
N
674.111 46 M
674.111 52.34 L
S
GR
GS
[0.75 0 0 0.75 0 0] CT
0.149 GC
2 setlinecap
1 LJ
0.667 LW
N
744.556 46 M
744.556 52.34 L
S
GR
GS
[0.75 0 0 0.75 0 0] CT
0.149 GC
2 setlinecap
1 LJ
0.667 LW
N
815 46 M
815 52.34 L
S
GR
GS
[0.75 0 0 0.75 135.75 155.9] CT
0.149 GC
/Helvetica 16 F
GS
[1 0 0 1 0 0] CT
-4.5 17 moveto 
1 -1 scale
(0) t 
GR
GR
GS
[0.75 0 0 0.75 188.58333 155.9] CT
0.149 GC
/Helvetica 16 F
GS
[1 0 0 1 0 0] CT
-9 17 moveto 
1 -1 scale
(20) t 
GR
GR
GS
[0.75 0 0 0.75 241.41666 155.9] CT
0.149 GC
/Helvetica 16 F
GS
[1 0 0 1 0 0] CT
-9 17 moveto 
1 -1 scale
(40) t 
GR
GR
GS
[0.75 0 0 0.75 294.25001 155.9] CT
0.149 GC
/Helvetica 16 F
GS
[1 0 0 1 0 0] CT
-9 17 moveto 
1 -1 scale
(60) t 
GR
GR
GS
[0.75 0 0 0.75 347.08333 155.9] CT
0.149 GC
/Helvetica 16 F
GS
[1 0 0 1 0 0] CT
-9 17 moveto 
1 -1 scale
(80) t 
GR
GR
GS
[0.75 0 0 0.75 399.91667 155.9] CT
0.149 GC
/Helvetica 16 F
GS
[1 0 0 1 0 0] CT
-13.5 17 moveto 
1 -1 scale
(100) t 
GR
GR
GS
[0.75 0 0 0.75 452.75002 155.9] CT
0.149 GC
/Helvetica 16 F
GS
[1 0 0 1 0 0] CT
-13.5 17 moveto 
1 -1 scale
(120) t 
GR
GR
GS
[0.75 0 0 0.75 505.58331 155.9] CT
0.149 GC
/Helvetica 16 F
GS
[1 0 0 1 0 0] CT
-13.5 17 moveto 
1 -1 scale
(140) t 
GR
GR
GS
[0.75 0 0 0.75 558.41666 155.9] CT
0.149 GC
/Helvetica 16 F
GS
[1 0 0 1 0 0] CT
-13.5 17 moveto 
1 -1 scale
(160) t 
GR
GR
GS
[0.75 0 0 0.75 611.25 155.9] CT
0.149 GC
/Helvetica 16 F
GS
[1 0 0 1 0 0] CT
-13.5 17 moveto 
1 -1 scale
(180) t 
GR
GR
GS
[0.75 0 0 0.75 0 0] CT
0.502 GC
10.0 ML
2.667 LW
N
312.111 135.197 M
312.111 34.567 L
686.644 34.567 L
686.644 135.197 L
cp
S
GR
GS
[0.75 0 0 0.75 126.61666 56.00346] CT
/Helvetica 18.667 F
GS
[1 0 0 1 0 0] CT
-79 19 moveto 
1 -1 scale
(Profitable) t 
GR
GR
GS
[0.75 0 0 0.75 128.38334 207.52423] CT
/Helvetica 18.667 F
GS
[1 0 0 1 0 0] CT
-79 19 moveto 
1 -1 scale
(Profitable) t 
GR
GR
GS
[0.75 0 0 0.75 128.38334 116.49654] CT
/Helvetica 18.667 F
GS
[1 0 0 1 0 0] CT
-101 19 moveto 
1 -1 scale
(Unprofitable) t 
GR
GR
GS
[0.75 0 0 0.75 135.45 260.52768] CT
/Helvetica 18.667 F
GS
[1 0 0 1 0 0] CT
-101 19 moveto 
1 -1 scale
(Unprofitable) t 
GR
GR
GS
[0.75 0 0 0.75 0 0] CT
0.502 GC
10.0 ML
2.667 LW
N
310.933 430 M
310.933 314.948 L
690.178 314.948 L
690.178 430 L
cp
S
GR
%%Trailer
%%Pages: 1
%%EOF
