\relax 
\providecommand\hyper@newdestlabel[2]{}
\@writefile{toc}{\contentsline {chapter}{\numberline {1}Introduction}{1}{chapter.1}\protected@file@percent }
\@writefile{lof}{\addvspace {10\p@ }}
\@writefile{lot}{\addvspace {10\p@ }}
\newlabel{ch:introduction}{{1}{1}{Introduction}{chapter.1}{}}
\AC@undonewlabel{acro:LBS}
\newlabel{acro:LBS}{{1}{1}{Introduction}{chapter.1}{}}
\acronymused{LBS}
\acronymused{GNSS}
\acronymused{LBS}
\AC@undonewlabel{acro:UAV}
\newlabel{acro:UAV}{{1}{1}{Introduction}{chapter.1}{}}
\acronymused{UAV}
\acronymused{GNSS}
\AC@undonewlabel{acro:INS}
\newlabel{acro:INS}{{1}{1}{Introduction}{chapter.1}{}}
\acronymused{INS}
\acronymused{GNSS}
\acronymused{INS}
\acronymused{INS}
\acronymused{GNSS}
\acronymused{GNSS}
\acronymused{GNSS}
\acronymused{INS}
\acronymused{GNSS}
\acronymused{INS}
\AC@undonewlabel{acro:UWB}
\newlabel{acro:UWB}{{1}{1}{Introduction}{chapter.1}{}}
\acronymused{UWB}
\AC@undonewlabel{acro:CCD}
\newlabel{acro:CCD}{{1}{1}{Introduction}{chapter.1}{}}
\acronymused{CCD}
\AC@undonewlabel{acro:CMOS}
\newlabel{acro:CMOS}{{1}{1}{Introduction}{chapter.1}{}}
\acronymused{CMOS}
\acronymused{GNSS}
\AC@undonewlabel{acro:RTK}
\newlabel{acro:RTK}{{1}{2}{Introduction}{chapter.1}{}}
\acronymused{RTK}
\AC@undonewlabel{acro:DGNSS}
\newlabel{acro:DGNSS}{{1}{2}{Introduction}{chapter.1}{}}
\acronymused{DGNSS}
\acronymused{GNSS}
\acronymused{CP}
\acronymused{CP}
\acronymused{CP}
\acronymused{CP}
\acronymused{GNSS}
\acronymused{GNSS}
\AC@undonewlabel{acro:AGNSS}
\newlabel{acro:AGNSS}{{1}{2}{Introduction}{chapter.1}{}}
\acronymused{AGNSS}
\acronymused{CP}
\acronymused{CP}
\AC@undonewlabel{acro:MLE}
\newlabel{acro:MLE}{{1}{2}{Introduction}{chapter.1}{}}
\acronymused{MLE}
\acronymused{GPS}
\acronymused{DGNSS}
\acronymused{GNSS}
\acronymused{GNSS}
\acronymused{GNSS}
\acronymused{DGPS}
\acronymused{INS}
\AC@undonewlabel{acro:EKF}
\newlabel{acro:EKF}{{1}{2}{Introduction}{chapter.1}{}}
\acronymused{EKF}
\acronymused{GPS}
\acronymused{GNSS}
\AC@undonewlabel{acro:ML}
\newlabel{acro:ML}{{1}{2}{Introduction}{chapter.1}{}}
\acronymused{ML}
\acronymused{CP}
\acronymused{GNSS}
\@writefile{lof}{\contentsline {figure}{\numberline {1.1}{\ignorespaces {\relax \fontsize  {10}{12}\selectfont  \abovedisplayskip 10\p@ plus2\p@ minus5\p@ \abovedisplayshortskip \z@ plus3\p@ \belowdisplayshortskip 6\p@ plus3\p@ minus3\p@ \def \leftmargin \leftmargini \parsep 4.5\p@ plus2\p@ minus\p@ \topsep 9\p@ plus3\p@ minus5\p@ \itemsep 4.5\p@ plus2\p@ minus\p@ {\leftmargin \leftmargini \topsep 6\p@ plus2\p@ minus2\p@ \parsep 3\p@ plus2\p@ minus\p@ \itemsep \parsep }\belowdisplayskip \abovedisplayskip Reference architecture of a modern positioning system providing data channel for positioning applications.}\relax }}{3}{figure.caption.6}\protected@file@percent }
\providecommand*\caption@xref[2]{\@setref\relax\@undefined{#1}}
\newlabel{fig:refArchi}{{1.1}{3}{{\small Reference architecture of a modern positioning system providing data channel for positioning applications.}\relax }{figure.caption.6}{}}
\@writefile{toc}{\contentsline {section}{\numberline {1.1}Research motivation and objectives}{3}{section.1.1}\protected@file@percent }
\acronymused{GNSS}
\acronymused{GNSS}
\acronymused{CP}
\acronymused{GNSS}
\acronymused{GNSS}
\AC@undonewlabel{acro:PNT}
\newlabel{acro:PNT}{{1.1}{3}{Research motivation and objectives}{section.1.1}{}}
\acronymused{PNT}
\acronymused{GNSS}
\acronymused{GNSS}
\acronymused{GNSS}
\acronymused{GNSS}
\acronymused{GNSS}
\@writefile{toc}{\contentsline {section}{\numberline {1.2}Main Contributions}{4}{section.1.2}\protected@file@percent }
\acronymused{GNSS}
\acronymused{GNSS}
\acronymused{GNSS}
\acronymused{PoC}
\acronymused{GNSS}
\acronymused{CP}
\acronymused{GNSS}
\AC@undonewlabel{acro:ESA}
\newlabel{acro:ESA}{{1.2}{4}{Main Contributions}{section.1.2}{}}
\acronymused{ESA}
\acronymused{GNSS}
\acronymused{GNSS}
\@writefile{toc}{\contentsline {section}{\numberline {1.3}Outline of the thesis}{4}{section.1.3}\protected@file@percent }
\acronymused{GNSS}
\acronymused{GNSS}
\acronymused{GNSS}
\acronymused{GNSS}
\acronymused{CP}
\acronymused{GNSS}
\acronymused{GNSS}
\acronymused{IAR}
\acronymused{IAR}
\acronymused{GNSS}
\acronymused{GNSS}
\acronymused{GNSS}
\acronymused{CP}
\acronymused{PoC}
\acronymused{GNSS}
\@setckpt{Chapter0/chapter0}{
\setcounter{page}{6}
\setcounter{equation}{0}
\setcounter{enumi}{0}
\setcounter{enumii}{0}
\setcounter{enumiii}{0}
\setcounter{enumiv}{0}
\setcounter{footnote}{0}
\setcounter{mpfootnote}{0}
\setcounter{part}{0}
\setcounter{chapter}{1}
\setcounter{section}{3}
\setcounter{subsection}{0}
\setcounter{subsubsection}{0}
\setcounter{paragraph}{0}
\setcounter{subparagraph}{0}
\setcounter{figure}{1}
\setcounter{table}{0}
\setcounter{SDpage}{0}
\setcounter{NumberSD}{0}
\setcounter{tomo}{0}
\setcounter{parentequation}{0}
\setcounter{caption@flags}{0}
\setcounter{ContinuedFloat}{0}
\setcounter{subfigure}{0}
\setcounter{subtable}{0}
\setcounter{float@type}{16}
\setcounter{tabx@nest}{0}
\setcounter{listtotal}{0}
\setcounter{listcount}{0}
\setcounter{liststart}{0}
\setcounter{liststop}{0}
\setcounter{citecount}{0}
\setcounter{citetotal}{0}
\setcounter{multicitecount}{0}
\setcounter{multicitetotal}{0}
\setcounter{instcount}{83}
\setcounter{maxnames}{3}
\setcounter{minnames}{1}
\setcounter{maxitems}{3}
\setcounter{minitems}{1}
\setcounter{citecounter}{0}
\setcounter{maxcitecounter}{0}
\setcounter{savedcitecounter}{0}
\setcounter{uniquelist}{0}
\setcounter{uniquename}{0}
\setcounter{refsection}{0}
\setcounter{refsegment}{0}
\setcounter{maxextratitle}{0}
\setcounter{maxextratitleyear}{0}
\setcounter{maxextraname}{5}
\setcounter{maxextradate}{0}
\setcounter{maxextraalpha}{0}
\setcounter{abbrvpenalty}{50}
\setcounter{highnamepenalty}{50}
\setcounter{lownamepenalty}{25}
\setcounter{maxparens}{3}
\setcounter{parenlevel}{0}
\setcounter{mincomprange}{10}
\setcounter{maxcomprange}{100000}
\setcounter{mincompwidth}{1}
\setcounter{afterword}{0}
\setcounter{savedafterword}{0}
\setcounter{annotator}{0}
\setcounter{savedannotator}{0}
\setcounter{author}{0}
\setcounter{savedauthor}{0}
\setcounter{bookauthor}{0}
\setcounter{savedbookauthor}{0}
\setcounter{commentator}{0}
\setcounter{savedcommentator}{0}
\setcounter{editor}{0}
\setcounter{savededitor}{0}
\setcounter{editora}{0}
\setcounter{savededitora}{0}
\setcounter{editorb}{0}
\setcounter{savededitorb}{0}
\setcounter{editorc}{0}
\setcounter{savededitorc}{0}
\setcounter{foreword}{0}
\setcounter{savedforeword}{0}
\setcounter{holder}{0}
\setcounter{savedholder}{0}
\setcounter{introduction}{0}
\setcounter{savedintroduction}{0}
\setcounter{namea}{0}
\setcounter{savednamea}{0}
\setcounter{nameb}{0}
\setcounter{savednameb}{0}
\setcounter{namec}{0}
\setcounter{savednamec}{0}
\setcounter{translator}{0}
\setcounter{savedtranslator}{0}
\setcounter{shortauthor}{0}
\setcounter{savedshortauthor}{0}
\setcounter{shorteditor}{0}
\setcounter{savedshorteditor}{0}
\setcounter{labelname}{0}
\setcounter{savedlabelname}{0}
\setcounter{institution}{0}
\setcounter{savedinstitution}{0}
\setcounter{lista}{0}
\setcounter{savedlista}{0}
\setcounter{listb}{0}
\setcounter{savedlistb}{0}
\setcounter{listc}{0}
\setcounter{savedlistc}{0}
\setcounter{listd}{0}
\setcounter{savedlistd}{0}
\setcounter{liste}{0}
\setcounter{savedliste}{0}
\setcounter{listf}{0}
\setcounter{savedlistf}{0}
\setcounter{location}{0}
\setcounter{savedlocation}{0}
\setcounter{organization}{0}
\setcounter{savedorganization}{0}
\setcounter{origlocation}{0}
\setcounter{savedoriglocation}{0}
\setcounter{origpublisher}{0}
\setcounter{savedorigpublisher}{0}
\setcounter{publisher}{0}
\setcounter{savedpublisher}{0}
\setcounter{language}{0}
\setcounter{savedlanguage}{0}
\setcounter{origlanguage}{0}
\setcounter{savedoriglanguage}{0}
\setcounter{pageref}{0}
\setcounter{savedpageref}{0}
\setcounter{textcitecount}{0}
\setcounter{textcitetotal}{0}
\setcounter{textcitemaxnames}{0}
\setcounter{biburlnumpenalty}{0}
\setcounter{biburlucpenalty}{0}
\setcounter{biburllcpenalty}{0}
\setcounter{smartand}{1}
\setcounter{bbx:relatedcount}{0}
\setcounter{bbx:relatedtotal}{0}
\setcounter{Item}{0}
\setcounter{Hfootnote}{0}
\setcounter{bookmark@seq@number}{6}
\setcounter{nlinenum}{0}
\setcounter{algorithm}{0}
\setcounter{ALC@unique}{0}
\setcounter{ALC@line}{0}
\setcounter{ALC@rem}{0}
\setcounter{ALC@depth}{0}
\setcounter{@todonotes@numberoftodonotes}{0}
\setcounter{Changes@AuthorCount}{2}
\setcounter{Changes@Author}{2}
\setcounter{Changes@addedCount}{0}
\setcounter{Changes@deletedCount}{0}
\setcounter{Changes@replacedCount}{0}
\setcounter{Changes@highlightCount}{0}
\setcounter{Changes@commentCount}{0}
\setcounter{authorcommentcount}{0}
\setcounter{Changes@addedCount1}{2}
\setcounter{Changes@deletedCount1}{0}
\setcounter{Changes@replacedCount1}{0}
\setcounter{Changes@highlightCount1}{0}
\setcounter{Changes@commentCount1}{0}
\setcounter{lstnumber}{1}
\setcounter{FancyVerbLine}{0}
\setcounter{section@level}{0}
\setcounter{lstlisting}{0}
}
