%!PS-Adobe-3.0 EPSF-3.0
%%Creator: (MATLAB, The Mathworks, Inc. Version 9.5.0.944444 \(R2018b\). Operating System: Windows 10)
%%Title: (C:/Users/Alex/Documents/PhD Docs/01. GIT/my_phd_thesis/Chapter8/Figures/capsloc_res/11102019_exp03_SM02_trajAndProfit.eps)
%%CreationDate: 2019-10-31T16:03:51
%%Pages: (atend)
%%BoundingBox: 0 0 510 438
%%LanguageLevel: 3
%%EndComments
%%BeginProlog
%%BeginResource: procset (Apache XML Graphics Std ProcSet) 1.2 0
%%Version: 1.2 0
%%Copyright: (Copyright 2001-2003,2010 The Apache Software Foundation. License terms: http://www.apache.org/licenses/LICENSE-2.0)
/bd{bind def}bind def
/ld{load def}bd
/GR/grestore ld
/GS/gsave ld
/RM/rmoveto ld
/C/curveto ld
/t/show ld
/L/lineto ld
/ML/setmiterlimit ld
/CT/concat ld
/f/fill ld
/N/newpath ld
/S/stroke ld
/CC/setcmykcolor ld
/A/ashow ld
/cp/closepath ld
/RC/setrgbcolor ld
/LJ/setlinejoin ld
/GC/setgray ld
/LW/setlinewidth ld
/M/moveto ld
/re {4 2 roll M
1 index 0 rlineto
0 exch rlineto
neg 0 rlineto
cp } bd
/_ctm matrix def
/_tm matrix def
/BT { _ctm currentmatrix pop matrix _tm copy pop 0 0 moveto } bd
/ET { _ctm setmatrix } bd
/iTm { _ctm setmatrix _tm concat } bd
/Tm { _tm astore pop iTm 0 0 moveto } bd
/ux 0.0 def
/uy 0.0 def
/F {
  /Tp exch def
  /Tf exch def
  Tf findfont Tp scalefont setfont
  /cf Tf def  /cs Tp def
} bd
/ULS {currentpoint /uy exch def /ux exch def} bd
/ULE {
  /Tcx currentpoint pop def
  gsave
  newpath
  cf findfont cs scalefont dup
  /FontMatrix get 0 get /Ts exch def /FontInfo get dup
  /UnderlinePosition get Ts mul /To exch def
  /UnderlineThickness get Ts mul /Tt exch def
  ux uy To add moveto  Tcx uy To add lineto
  Tt setlinewidth stroke
  grestore
} bd
/OLE {
  /Tcx currentpoint pop def
  gsave
  newpath
  cf findfont cs scalefont dup
  /FontMatrix get 0 get /Ts exch def /FontInfo get dup
  /UnderlinePosition get Ts mul /To exch def
  /UnderlineThickness get Ts mul /Tt exch def
  ux uy To add cs add moveto Tcx uy To add cs add lineto
  Tt setlinewidth stroke
  grestore
} bd
/SOE {
  /Tcx currentpoint pop def
  gsave
  newpath
  cf findfont cs scalefont dup
  /FontMatrix get 0 get /Ts exch def /FontInfo get dup
  /UnderlinePosition get Ts mul /To exch def
  /UnderlineThickness get Ts mul /Tt exch def
  ux uy To add cs 10 mul 26 idiv add moveto Tcx uy To add cs 10 mul 26 idiv add lineto
  Tt setlinewidth stroke
  grestore
} bd
/QT {
/Y22 exch store
/X22 exch store
/Y21 exch store
/X21 exch store
currentpoint
/Y21 load 2 mul add 3 div exch
/X21 load 2 mul add 3 div exch
/X21 load 2 mul /X22 load add 3 div
/Y21 load 2 mul /Y22 load add 3 div
/X22 load /Y22 load curveto
} bd
/SSPD {
dup length /d exch dict def
{
/v exch def
/k exch def
currentpagedevice k known {
/cpdv currentpagedevice k get def
v cpdv ne {
/upd false def
/nullv v type /nulltype eq def
/nullcpdv cpdv type /nulltype eq def
nullv nullcpdv or
{
/upd true def
} {
/sametype v type cpdv type eq def
sametype {
v type /arraytype eq {
/vlen v length def
/cpdvlen cpdv length def
vlen cpdvlen eq {
0 1 vlen 1 sub {
/i exch def
/obj v i get def
/cpdobj cpdv i get def
obj cpdobj ne {
/upd true def
exit
} if
} for
} {
/upd true def
} ifelse
} {
v type /dicttype eq {
v {
/dv exch def
/dk exch def
/cpddv cpdv dk get def
dv cpddv ne {
/upd true def
exit
} if
} forall
} {
/upd true def
} ifelse
} ifelse
} if
} ifelse
upd true eq {
d k v put
} if
} if
} if
} forall
d length 0 gt {
d setpagedevice
} if
} bd
/RE { % /NewFontName [NewEncodingArray] /FontName RE -
  findfont dup length dict begin
  {
    1 index /FID ne
    {def} {pop pop} ifelse
  } forall
  /Encoding exch def
  /FontName 1 index def
  currentdict definefont pop
  end
} bind def
%%EndResource
%%BeginResource: procset (Apache XML Graphics EPS ProcSet) 1.0 0
%%Version: 1.0 0
%%Copyright: (Copyright 2002-2003 The Apache Software Foundation. License terms: http://www.apache.org/licenses/LICENSE-2.0)
/BeginEPSF { %def
/b4_Inc_state save def         % Save state for cleanup
/dict_count countdictstack def % Count objects on dict stack
/op_count count 1 sub def      % Count objects on operand stack
userdict begin                 % Push userdict on dict stack
/showpage { } def              % Redefine showpage, { } = null proc
0 setgray 0 setlinecap         % Prepare graphics state
1 setlinewidth 0 setlinejoin
10 setmiterlimit [ ] 0 setdash newpath
/languagelevel where           % If level not equal to 1 then
{pop languagelevel             % set strokeadjust and
1 ne                           % overprint to their defaults.
{false setstrokeadjust false setoverprint
} if
} if
} bd
/EndEPSF { %def
count op_count sub {pop} repeat            % Clean up stacks
countdictstack dict_count sub {end} repeat
b4_Inc_state restore
} bd
%%EndResource
%FOPBeginFontDict
%%IncludeResource: font Courier-Oblique
%%IncludeResource: font Courier-BoldOblique
%%IncludeResource: font Courier-Bold
%%IncludeResource: font ZapfDingbats
%%IncludeResource: font Symbol
%%IncludeResource: font Helvetica
%%IncludeResource: font Helvetica-Oblique
%%IncludeResource: font Helvetica-Bold
%%IncludeResource: font Helvetica-BoldOblique
%%IncludeResource: font Times-Roman
%%IncludeResource: font Times-Italic
%%IncludeResource: font Times-Bold
%%IncludeResource: font Times-BoldItalic
%%IncludeResource: font Courier
%FOPEndFontDict
%%BeginResource: encoding WinAnsiEncoding
/WinAnsiEncoding [
/.notdef /.notdef /.notdef /.notdef /.notdef
/.notdef /.notdef /.notdef /.notdef /.notdef
/.notdef /.notdef /.notdef /.notdef /.notdef
/.notdef /.notdef /.notdef /.notdef /.notdef
/.notdef /.notdef /.notdef /.notdef /.notdef
/.notdef /.notdef /.notdef /.notdef /.notdef
/.notdef /.notdef /space /exclam /quotedbl
/numbersign /dollar /percent /ampersand /quotesingle
/parenleft /parenright /asterisk /plus /comma
/hyphen /period /slash /zero /one
/two /three /four /five /six
/seven /eight /nine /colon /semicolon
/less /equal /greater /question /at
/A /B /C /D /E
/F /G /H /I /J
/K /L /M /N /O
/P /Q /R /S /T
/U /V /W /X /Y
/Z /bracketleft /backslash /bracketright /asciicircum
/underscore /quoteleft /a /b /c
/d /e /f /g /h
/i /j /k /l /m
/n /o /p /q /r
/s /t /u /v /w
/x /y /z /braceleft /bar
/braceright /asciitilde /bullet /Euro /bullet
/quotesinglbase /florin /quotedblbase /ellipsis /dagger
/daggerdbl /circumflex /perthousand /Scaron /guilsinglleft
/OE /bullet /Zcaron /bullet /bullet
/quoteleft /quoteright /quotedblleft /quotedblright /bullet
/endash /emdash /asciitilde /trademark /scaron
/guilsinglright /oe /bullet /zcaron /Ydieresis
/space /exclamdown /cent /sterling /currency
/yen /brokenbar /section /dieresis /copyright
/ordfeminine /guillemotleft /logicalnot /sfthyphen /registered
/macron /degree /plusminus /twosuperior /threesuperior
/acute /mu /paragraph /middot /cedilla
/onesuperior /ordmasculine /guillemotright /onequarter /onehalf
/threequarters /questiondown /Agrave /Aacute /Acircumflex
/Atilde /Adieresis /Aring /AE /Ccedilla
/Egrave /Eacute /Ecircumflex /Edieresis /Igrave
/Iacute /Icircumflex /Idieresis /Eth /Ntilde
/Ograve /Oacute /Ocircumflex /Otilde /Odieresis
/multiply /Oslash /Ugrave /Uacute /Ucircumflex
/Udieresis /Yacute /Thorn /germandbls /agrave
/aacute /acircumflex /atilde /adieresis /aring
/ae /ccedilla /egrave /eacute /ecircumflex
/edieresis /igrave /iacute /icircumflex /idieresis
/eth /ntilde /ograve /oacute /ocircumflex
/otilde /odieresis /divide /oslash /ugrave
/uacute /ucircumflex /udieresis /yacute /thorn
/ydieresis
] def
%%EndResource
%FOPBeginFontReencode
/Courier-Oblique findfont
dup length dict begin
  {1 index /FID ne {def} {pop pop} ifelse} forall
  /Encoding WinAnsiEncoding def
  currentdict
end
/Courier-Oblique exch definefont pop
/Courier-BoldOblique findfont
dup length dict begin
  {1 index /FID ne {def} {pop pop} ifelse} forall
  /Encoding WinAnsiEncoding def
  currentdict
end
/Courier-BoldOblique exch definefont pop
/Courier-Bold findfont
dup length dict begin
  {1 index /FID ne {def} {pop pop} ifelse} forall
  /Encoding WinAnsiEncoding def
  currentdict
end
/Courier-Bold exch definefont pop
/Helvetica findfont
dup length dict begin
  {1 index /FID ne {def} {pop pop} ifelse} forall
  /Encoding WinAnsiEncoding def
  currentdict
end
/Helvetica exch definefont pop
/Helvetica-Oblique findfont
dup length dict begin
  {1 index /FID ne {def} {pop pop} ifelse} forall
  /Encoding WinAnsiEncoding def
  currentdict
end
/Helvetica-Oblique exch definefont pop
/Helvetica-Bold findfont
dup length dict begin
  {1 index /FID ne {def} {pop pop} ifelse} forall
  /Encoding WinAnsiEncoding def
  currentdict
end
/Helvetica-Bold exch definefont pop
/Helvetica-BoldOblique findfont
dup length dict begin
  {1 index /FID ne {def} {pop pop} ifelse} forall
  /Encoding WinAnsiEncoding def
  currentdict
end
/Helvetica-BoldOblique exch definefont pop
/Times-Roman findfont
dup length dict begin
  {1 index /FID ne {def} {pop pop} ifelse} forall
  /Encoding WinAnsiEncoding def
  currentdict
end
/Times-Roman exch definefont pop
/Times-Italic findfont
dup length dict begin
  {1 index /FID ne {def} {pop pop} ifelse} forall
  /Encoding WinAnsiEncoding def
  currentdict
end
/Times-Italic exch definefont pop
/Times-Bold findfont
dup length dict begin
  {1 index /FID ne {def} {pop pop} ifelse} forall
  /Encoding WinAnsiEncoding def
  currentdict
end
/Times-Bold exch definefont pop
/Times-BoldItalic findfont
dup length dict begin
  {1 index /FID ne {def} {pop pop} ifelse} forall
  /Encoding WinAnsiEncoding def
  currentdict
end
/Times-BoldItalic exch definefont pop
/Courier findfont
dup length dict begin
  {1 index /FID ne {def} {pop pop} ifelse} forall
  /Encoding WinAnsiEncoding def
  currentdict
end
/Courier exch definefont pop
%FOPEndFontReencode
%%EndProlog
%%Page: 1 1
%%PageBoundingBox: 0 0 510 438
%%BeginPageSetup
[1 0 0 -1 0 438] CT
%%EndPageSetup
GS
[0.75 0 0 0.75 0 0] CT
1 GC
N
0 0 680 584 re
f
GR
GS
[0.75 0 0 0.75 0 0] CT
1 GC
N
0 0 680 584 re
f
GR
GS
[0.75 0 0 0.75 0 0] CT
1 GC
N
88 520 M
615 520 L
615 44 L
88 44 L
cp
f
GR
GS
[0.75 0 0 0.75 0 0] CT
0.149 GC
2 setlinecap
1 LJ
0.667 LW
N
88 520 M
615 520 L
S
GR
GS
[0.75 0 0 0.75 0 0] CT
0.149 GC
2 setlinecap
1 LJ
0.667 LW
N
88 44 M
615 44 L
S
GR
GS
[0.75 0 0 0.75 0 0] CT
0.149 GC
2 setlinecap
1 LJ
0.667 LW
N
88 520 M
88 514.73 L
S
GR
GS
[0.75 0 0 0.75 0 0] CT
0.149 GC
2 setlinecap
1 LJ
0.667 LW
N
219.75 520 M
219.75 514.73 L
S
GR
GS
[0.75 0 0 0.75 0 0] CT
0.149 GC
2 setlinecap
1 LJ
0.667 LW
N
351.5 520 M
351.5 514.73 L
S
GR
GS
[0.75 0 0 0.75 0 0] CT
0.149 GC
2 setlinecap
1 LJ
0.667 LW
N
483.25 520 M
483.25 514.73 L
S
GR
GS
[0.75 0 0 0.75 0 0] CT
0.149 GC
2 setlinecap
1 LJ
0.667 LW
N
615 520 M
615 514.73 L
S
GR
GS
[0.75 0 0 0.75 0 0] CT
0.149 GC
2 setlinecap
1 LJ
0.667 LW
N
88 44 M
88 49.27 L
S
GR
GS
[0.75 0 0 0.75 0 0] CT
0.149 GC
2 setlinecap
1 LJ
0.667 LW
N
219.75 44 M
219.75 49.27 L
S
GR
GS
[0.75 0 0 0.75 0 0] CT
0.149 GC
2 setlinecap
1 LJ
0.667 LW
N
351.5 44 M
351.5 49.27 L
S
GR
GS
[0.75 0 0 0.75 0 0] CT
0.149 GC
2 setlinecap
1 LJ
0.667 LW
N
483.25 44 M
483.25 49.27 L
S
GR
GS
[0.75 0 0 0.75 0 0] CT
0.149 GC
2 setlinecap
1 LJ
0.667 LW
N
615 44 M
615 49.27 L
S
GR
GS
[0.75 0 0 0.75 66 394.80002] CT
0.149 GC
/Helvetica 18.667 F
GS
[1 0 0 1 0 0] CT
-13.5 19 moveto 
1 -1 scale
(-20) t 
GR
GR
GS
[0.75 0 0 0.75 164.8125 394.80002] CT
0.149 GC
/Helvetica 18.667 F
GS
[1 0 0 1 0 0] CT
-13.5 19 moveto 
1 -1 scale
(-10) t 
GR
GR
GS
[0.75 0 0 0.75 263.625 394.80002] CT
0.149 GC
/Helvetica 18.667 F
GS
[1 0 0 1 0 0] CT
-5.5 19 moveto 
1 -1 scale
(0) t 
GR
GR
GS
[0.75 0 0 0.75 362.4375 394.80002] CT
0.149 GC
/Helvetica 18.667 F
GS
[1 0 0 1 0 0] CT
-10.5 19 moveto 
1 -1 scale
(10) t 
GR
GR
GS
[0.75 0 0 0.75 461.25 394.80002] CT
0.149 GC
/Helvetica 18.667 F
GS
[1 0 0 1 0 0] CT
-10.5 19 moveto 
1 -1 scale
(20) t 
GR
GR
GS
[0.75 0 0 0.75 263.62518 413.8] CT
0.149 GC
/Helvetica 20.533 F
GS
[1 0 0 1 0 0] CT
-25.5 21 moveto 
1 -1 scale
(E \(m\)) t 
GR
GR
GS
[0.75 0 0 0.75 0 0] CT
0.149 GC
2 setlinecap
1 LJ
0.667 LW
N
88 520 M
88 44 L
S
GR
GS
[0.75 0 0 0.75 0 0] CT
0.149 GC
2 setlinecap
1 LJ
0.667 LW
N
615 520 M
615 44 L
S
GR
GS
[0.75 0 0 0.75 0 0] CT
0.149 GC
2 setlinecap
1 LJ
0.667 LW
N
88 520 M
93.27 520 L
S
GR
GS
[0.75 0 0 0.75 0 0] CT
0.149 GC
2 setlinecap
1 LJ
0.667 LW
N
88 460.5 M
93.27 460.5 L
S
GR
GS
[0.75 0 0 0.75 0 0] CT
0.149 GC
2 setlinecap
1 LJ
0.667 LW
N
88 401 M
93.27 401 L
S
GR
GS
[0.75 0 0 0.75 0 0] CT
0.149 GC
2 setlinecap
1 LJ
0.667 LW
N
88 341.5 M
93.27 341.5 L
S
GR
GS
[0.75 0 0 0.75 0 0] CT
0.149 GC
2 setlinecap
1 LJ
0.667 LW
N
88 282 M
93.27 282 L
S
GR
GS
[0.75 0 0 0.75 0 0] CT
0.149 GC
2 setlinecap
1 LJ
0.667 LW
N
88 222.5 M
93.27 222.5 L
S
GR
GS
[0.75 0 0 0.75 0 0] CT
0.149 GC
2 setlinecap
1 LJ
0.667 LW
N
88 163 M
93.27 163 L
S
GR
GS
[0.75 0 0 0.75 0 0] CT
0.149 GC
2 setlinecap
1 LJ
0.667 LW
N
88 103.5 M
93.27 103.5 L
S
GR
GS
[0.75 0 0 0.75 0 0] CT
0.149 GC
2 setlinecap
1 LJ
0.667 LW
N
88 44 M
93.27 44 L
S
GR
GS
[0.75 0 0 0.75 0 0] CT
0.149 GC
2 setlinecap
1 LJ
0.667 LW
N
615 520 M
609.73 520 L
S
GR
GS
[0.75 0 0 0.75 0 0] CT
0.149 GC
2 setlinecap
1 LJ
0.667 LW
N
615 460.5 M
609.73 460.5 L
S
GR
GS
[0.75 0 0 0.75 0 0] CT
0.149 GC
2 setlinecap
1 LJ
0.667 LW
N
615 401 M
609.73 401 L
S
GR
GS
[0.75 0 0 0.75 0 0] CT
0.149 GC
2 setlinecap
1 LJ
0.667 LW
N
615 341.5 M
609.73 341.5 L
S
GR
GS
[0.75 0 0 0.75 0 0] CT
0.149 GC
2 setlinecap
1 LJ
0.667 LW
N
615 282 M
609.73 282 L
S
GR
GS
[0.75 0 0 0.75 0 0] CT
0.149 GC
2 setlinecap
1 LJ
0.667 LW
N
615 222.5 M
609.73 222.5 L
S
GR
GS
[0.75 0 0 0.75 0 0] CT
0.149 GC
2 setlinecap
1 LJ
0.667 LW
N
615 163 M
609.73 163 L
S
GR
GS
[0.75 0 0 0.75 0 0] CT
0.149 GC
2 setlinecap
1 LJ
0.667 LW
N
615 103.5 M
609.73 103.5 L
S
GR
GS
[0.75 0 0 0.75 0 0] CT
0.149 GC
2 setlinecap
1 LJ
0.667 LW
N
615 44 M
609.73 44 L
S
GR
GS
[0.75 0 0 0.75 61.19999 390] CT
0.149 GC
/Helvetica 18.667 F
GS
[1 0 0 1 0 0] CT
-27 7 moveto 
1 -1 scale
(-20) t 
GR
GR
GS
[0.75 0 0 0.75 61.19999 345.375] CT
0.149 GC
/Helvetica 18.667 F
GS
[1 0 0 1 0 0] CT
-27 7 moveto 
1 -1 scale
(-15) t 
GR
GR
GS
[0.75 0 0 0.75 61.19999 300.75] CT
0.149 GC
/Helvetica 18.667 F
GS
[1 0 0 1 0 0] CT
-27 7 moveto 
1 -1 scale
(-10) t 
GR
GR
GS
[0.75 0 0 0.75 61.19999 256.125] CT
0.149 GC
/Helvetica 18.667 F
GS
[1 0 0 1 0 0] CT
-17 7 moveto 
1 -1 scale
(-5) t 
GR
GR
GS
[0.75 0 0 0.75 61.19999 211.5] CT
0.149 GC
/Helvetica 18.667 F
GS
[1 0 0 1 0 0] CT
-11 7 moveto 
1 -1 scale
(0) t 
GR
GR
GS
[0.75 0 0 0.75 61.19999 166.875] CT
0.149 GC
/Helvetica 18.667 F
GS
[1 0 0 1 0 0] CT
-11 7 moveto 
1 -1 scale
(5) t 
GR
GR
GS
[0.75 0 0 0.75 61.19999 122.25] CT
0.149 GC
/Helvetica 18.667 F
GS
[1 0 0 1 0 0] CT
-21 7 moveto 
1 -1 scale
(10) t 
GR
GR
GS
[0.75 0 0 0.75 61.19999 77.625] CT
0.149 GC
/Helvetica 18.667 F
GS
[1 0 0 1 0 0] CT
-21 7 moveto 
1 -1 scale
(15) t 
GR
GR
GS
[0.75 0 0 0.75 61.19999 33] CT
0.149 GC
/Helvetica 18.667 F
GS
[1 0 0 1 0 0] CT
-21 7 moveto 
1 -1 scale
(20) t 
GR
GR
GS
[0 -0.75 0.75 0 37.95001 211.49984] CT
0.149 GC
/Helvetica 20.533 F
GS
[1 0 0 1 0 0] CT
-26 -5 moveto 
1 -1 scale
(N \(m\)) t 
GR
GR
GS
[0.75 0 0 0.75 297.72613 122.97691] CT
0 0.447 0.741 RC
N
1.333 0 M
1.333 0.736 0.736 1.333 0 1.333 C
-0.736 1.333 -1.333 0.736 -1.333 0 C
-1.333 -0.736 -0.736 -1.333 0 -1.333 C
0.736 -1.333 1.333 -0.736 1.333 0 C
cp
f
GR
GS
[0.75 0 0 0.75 312.44073 63.12819] CT
0 0.447 0.741 RC
N
/f-1057828618{1.333 0 M
1.333 0.736 0.736 1.333 0 1.333 C
-0.736 1.333 -1.333 0.736 -1.333 0 C
-1.333 -0.736 -0.736 -1.333 0 -1.333 C
0.736 -1.333 1.333 -0.736 1.333 0 C
cp}def
f-1057828618
f
GR
GS
[0.75 0 0 0.75 262.02933 132.7007] CT
0 0.447 0.741 RC
N
f-1057828618
f
GR
GS
[0.75 0 0 0.75 264.03394 107.79607] CT
0 0.447 0.741 RC
N
f-1057828618
f
GR
GS
[0.75 0 0 0.75 241.01981 93.47357] CT
0 0.447 0.741 RC
N
f-1057828618
f
GR
GS
[0.75 0 0 0.75 248.47204 102.17491] CT
0 0.447 0.741 RC
N
f-1057828618
f
GR
GS
[0.75 0 0 0.75 277.47457 162.20918] CT
0 0.447 0.741 RC
N
f-1057828618
f
GR
GS
[0.75 0 0 0.75 247.54468 79.0026] CT
0 0.447 0.741 RC
N
f-1057828618
f
GR
GS
[0.75 0 0 0.75 257.47863 190.34517] CT
0 0.447 0.741 RC
N
f-1057828618
f
GR
GS
[0.75 0 0 0.75 287.68936 177.58852] CT
0 0.447 0.741 RC
N
f-1057828618
f
GR
GS
[0.75 0 0 0.75 270.27296 150.37216] CT
0 0.447 0.741 RC
N
f-1057828618
f
GR
GS
[0.75 0 0 0.75 264.79555 120.92302] CT
0 0.447 0.741 RC
N
f-1057828618
f
GR
GS
[0.75 0 0 0.75 285.06004 139.62028] CT
0 0.447 0.741 RC
N
f-1057828618
f
GR
GS
[0.75 0 0 0.75 226.77003 46.10255] CT
0 0.447 0.741 RC
N
f-1057828618
f
GR
GS
[0.75 0 0 0.75 271.00099 255.14401] CT
0 0.447 0.741 RC
N
f-1057828618
f
GR
GS
[0.75 0 0 0.75 283.66019 214.28563] CT
0 0.447 0.741 RC
N
f-1057828618
f
GR
GS
[0.75 0 0 0.75 280.84186 187.31581] CT
0 0.447 0.741 RC
N
f-1057828618
f
GR
GS
[0.75 0 0 0.75 269.18195 237.87062] CT
0 0.447 0.741 RC
N
f-1057828618
f
GR
GS
[0.75 0 0 0.75 281.83683 223.07204] CT
0 0.447 0.741 RC
N
f-1057828618
f
GR
GS
[0.75 0 0 0.75 292.07201 258.5451] CT
0 0.447 0.741 RC
N
f-1057828618
f
GR
GS
[0.75 0 0 0.75 306.71443 274.26544] CT
0 0.447 0.741 RC
N
f-1057828618
f
GR
GS
[0.75 0 0 0.75 251.93095 243.75854] CT
0 0.447 0.741 RC
N
f-1057828618
f
GR
GS
[0.75 0 0 0.75 276.82226 163.11338] CT
0 0.447 0.741 RC
N
f-1057828618
f
GR
GS
[0.75 0 0 0.75 258.37493 242.21889] CT
0 0.447 0.741 RC
N
f-1057828618
f
GR
GS
[0.75 0 0 0.75 268.84115 225.51677] CT
0 0.447 0.741 RC
N
f-1057828618
f
GR
GS
[0.75 0 0 0.75 247.33731 145.53476] CT
0 0.447 0.741 RC
N
f-1057828618
f
GR
GS
[0.75 0 0 0.75 243.90138 99.71673] CT
0 0.447 0.741 RC
N
f-1057828618
f
GR
GS
[0.75 0 0 0.75 259.46974 139.9143] CT
0 0.447 0.741 RC
N
f-1057828618
f
GR
GS
[0.75 0 0 0.75 229.52206 86.71215] CT
0 0.447 0.741 RC
N
f-1057828618
f
GR
GS
[0.75 0 0 0.75 234.11655 139.84782] CT
0 0.447 0.741 RC
N
f-1057828618
f
GR
GS
[0.75 0 0 0.75 265.16512 110.60434] CT
0 0.447 0.741 RC
N
f-1057828618
f
GR
GS
[0.75 0 0 0.75 231.52867 214.79885] CT
0 0.447 0.741 RC
N
f-1057828618
f
GR
GS
[0.75 0 0 0.75 254.96759 210.83762] CT
0 0.447 0.741 RC
N
f-1057828618
f
GR
GS
[0.75 0 0 0.75 251.33121 174.46734] CT
0 0.447 0.741 RC
N
f-1057828618
f
GR
GS
[0.75 0 0 0.75 259.52408 193.12138] CT
0 0.447 0.741 RC
N
f-1057828618
f
GR
GS
[0.75 0 0 0.75 278.87054 282.46925] CT
0 0.447 0.741 RC
N
f-1057828618
f
GR
GS
[0.75 0 0 0.75 265.07018 194.87265] CT
0 0.447 0.741 RC
N
f-1057828618
f
GR
GS
[0.75 0 0 0.75 279.92789 340.91334] CT
0 0.447 0.741 RC
N
f-1057828618
f
GR
GS
[0.75 0 0 0.75 275.444 267.11298] CT
0 0.447 0.741 RC
N
f-1057828618
f
GR
GS
[0.75 0 0 0.75 306.62249 270.78225] CT
0 0.447 0.741 RC
N
f-1057828618
f
GR
GS
[0.75 0 0 0.75 261.39887 217.18872] CT
0 0.447 0.741 RC
N
f-1057828618
f
GR
GS
[0.75 0 0 0.75 283.08483 258.53703] CT
0 0.447 0.741 RC
N
f-1057828618
f
GR
GS
[0.75 0 0 0.75 253.37764 152.06787] CT
0 0.447 0.741 RC
N
f-1057828618
f
GR
GS
[0.75 0 0 0.75 255.34092 210.87595] CT
0 0.447 0.741 RC
N
f-1057828618
f
GR
GS
[0.75 0 0 0.75 292.2066 296.95649] CT
0 0.447 0.741 RC
N
f-1057828618
f
GR
GS
[0.75 0 0 0.75 243.22913 201.48738] CT
0 0.447 0.741 RC
N
f-1057828618
f
GR
GS
[0.75 0 0 0.75 223.092 177.46151] CT
0 0.447 0.741 RC
N
f-1057828618
f
GR
GS
[0.75 0 0 0.75 238.56935 237.35577] CT
0 0.447 0.741 RC
N
f-1057828618
f
GR
GS
[0.75 0 0 0.75 240.61402 213.50562] CT
0 0.447 0.741 RC
N
f-1057828618
f
GR
GS
[0.75 0 0 0.75 252.49434 224.58799] CT
0 0.447 0.741 RC
N
f-1057828618
f
GR
GS
[0.75 0 0 0.75 236.9217 240.68461] CT
0 0.447 0.741 RC
N
f-1057828618
f
GR
GS
[0.75 0 0 0.75 251.96716 269.81859] CT
0 0.447 0.741 RC
N
f-1057828618
f
GR
GS
[0.75 0 0 0.75 252.35726 246.41643] CT
0 0.447 0.741 RC
N
f-1057828618
f
GR
GS
[0.75 0 0 0.75 238.06821 294.03255] CT
0 0.447 0.741 RC
N
f-1057828618
f
GR
GS
[0.75 0 0 0.75 246.02511 322.64053] CT
0 0.447 0.741 RC
N
f-1057828618
f
GR
GS
[0.75 0 0 0.75 272.49918 344.41791] CT
0 0.447 0.741 RC
N
f-1057828618
f
GR
GS
[0.75 0 0 0.75 283.65914 339.05763] CT
0 0.447 0.741 RC
N
f-1057828618
f
GR
GS
[0.75 0 0 0.75 278.91167 160.77882] CT
0 0.447 0.741 RC
N
f-1057828618
f
GR
GS
[0.75 0 0 0.75 254.0414 146.97451] CT
0 0.447 0.741 RC
N
f-1057828618
f
GR
GS
[0.75 0 0 0.75 248.48742 376.29939] CT
0 0.447 0.741 RC
N
f-1057828618
f
GR
GS
[0.75 0 0 0.75 217.6908 335.75343] CT
0 0.447 0.741 RC
N
f-1057828618
f
GR
GS
[0.75 0 0 0.75 224.5648 334.51101] CT
0 0.447 0.741 RC
N
f-1057828618
f
GR
GS
[0.75 0 0 0.75 341.00784 360.13895] CT
0 0.447 0.741 RC
N
f-1057828618
f
GR
GS
[0.75 0 0 0.75 319.57095 148.20295] CT
0 0.447 0.741 RC
N
f-1057828618
f
GR
GS
[0.75 0 0 0.75 304.0153 148.75716] CT
0 0.447 0.741 RC
N
f-1057828618
f
GR
GS
[0.75 0 0 0.75 278.53377 135.30453] CT
0 0.447 0.741 RC
N
f-1057828618
f
GR
GS
[0.75 0 0 0.75 330.64417 150.75858] CT
0 0.447 0.741 RC
N
f-1057828618
f
GR
GS
[0.75 0 0 0.75 323.69801 101.51397] CT
0 0.447 0.741 RC
N
f-1057828618
f
GR
GS
[0.75 0 0 0.75 298.21454 217.32983] CT
0 0.447 0.741 RC
N
f-1057828618
f
GR
GS
[0.75 0 0 0.75 283.58052 258.74025] CT
0 0.447 0.741 RC
N
f-1057828618
f
GR
GS
[0.75 0 0 0.75 266.69387 298.29094] CT
0 0.447 0.741 RC
N
f-1057828618
f
GR
GS
[0.75 0 0 0.75 253.18545 272.1582] CT
0 0.447 0.741 RC
N
f-1057828618
f
GR
GS
[0.75 0 0 0.75 351.97469 279.38255] CT
0 0.447 0.741 RC
N
f-1057828618
f
GR
GS
[0.75 0 0 0.75 283.72488 318.07169] CT
0 0.447 0.741 RC
N
f-1057828618
f
GR
GS
[0.75 0 0 0.75 265.87251 309.42318] CT
0 0.447 0.741 RC
N
f-1057828618
f
GR
GS
[0.75 0 0 0.75 322.58826 335.65936] CT
0 0.447 0.741 RC
N
f-1057828618
f
GR
GS
[0.75 0 0 0.75 343.38098 332.50047] CT
0 0.447 0.741 RC
N
f-1057828618
f
GR
GS
[0.75 0 0 0.75 392.29729 286.43644] CT
0 0.447 0.741 RC
N
f-1057828618
f
GR
GS
[0.75 0 0 0.75 339.68788 348.26564] CT
0 0.447 0.741 RC
N
f-1057828618
f
GR
GS
[0.75 0 0 0.75 304.16714 357.42748] CT
0 0.447 0.741 RC
N
f-1057828618
f
GR
GS
[0.75 0 0 0.75 333.4154 353.10168] CT
0 0.447 0.741 RC
N
f-1057828618
f
GR
GS
[0.75 0 0 0.75 300.86442 307.31829] CT
0 0.447 0.741 RC
N
f-1057828618
f
GR
GS
[0.75 0 0 0.75 265.0394 329.44022] CT
0 0.447 0.741 RC
N
f-1057828618
f
GR
GS
[0.75 0 0 0.75 266.29742 336.26344] CT
0 0.447 0.741 RC
N
f-1057828618
f
GR
GS
[0.75 0 0 0.75 254.74759 296.61793] CT
0 0.447 0.741 RC
N
f-1057828618
f
GR
GS
[0.75 0 0 0.75 269.11377 268.90526] CT
0 0.447 0.741 RC
N
f-1057828618
f
GR
GS
[0.75 0 0 0.75 235.88965 283.41831] CT
0 0.447 0.741 RC
N
f-1057828618
f
GR
GS
[0.75 0 0 0.75 223.35219 268.77093] CT
0 0.447 0.741 RC
N
f-1057828618
f
GR
GS
[0.75 0 0 0.75 326.16195 307.63515] CT
0 0.447 0.741 RC
N
f-1057828618
f
GR
GS
[0.75 0 0 0.75 290.22423 248.88512] CT
0 0.447 0.741 RC
N
f-1057828618
f
GR
GS
[0.75 0 0 0.75 300.06457 305.005] CT
0 0.447 0.741 RC
N
f-1057828618
f
GR
GS
[0.75 0 0 0.75 316.20273 355.56365] CT
0 0.447 0.741 RC
N
f-1057828618
f
GR
GS
[0.75 0 0 0.75 266.68948 235.23189] CT
0 0.447 0.741 RC
N
f-1057828618
f
GR
GS
[0.75 0 0 0.75 290.42107 239.42812] CT
0 0.447 0.741 RC
N
f-1057828618
f
GR
GS
[0.75 0 0 0.75 273.11536 239.47211] CT
0 0.447 0.741 RC
N
f-1057828618
f
GR
GS
[0.75 0 0 0.75 321.91521 355.03226] CT
0 0.447 0.741 RC
N
f-1057828618
f
GR
GS
[0.75 0 0 0.75 297.14767 267.70171] CT
0 0.447 0.741 RC
N
f-1057828618
f
GR
GS
[0.75 0 0 0.75 302.38323 386.17781] CT
0 0.447 0.741 RC
N
f-1057828618
f
GR
GS
[0.75 0 0 0.75 302.33196 230.27193] CT
0 0.447 0.741 RC
N
f-1057828618
f
GR
GS
[0.75 0 0 0.75 308.6933 307.78276] CT
0 0.447 0.741 RC
N
f-1057828618
f
GR
GS
[0.75 0 0 0.75 317.88224 214.81089] CT
0 0.447 0.741 RC
N
f-1057828618
f
GR
GS
[0.75 0 0 0.75 304.30611 279.91425] CT
0 0.447 0.741 RC
N
f-1057828618
f
GR
GS
[0.75 0 0 0.75 301.81622 249.95045] CT
0 0.447 0.741 RC
N
f-1057828618
f
GR
GS
[0.75 0 0 0.75 294.94341 274.17888] CT
0 0.447 0.741 RC
N
f-1057828618
f
GR
GS
[0.75 0 0 0.75 313.33637 378.52936] CT
0 0.447 0.741 RC
N
f-1057828618
f
GR
GS
[0.75 0 0 0.75 298.06492 304.91375] CT
0 0.447 0.741 RC
N
f-1057828618
f
GR
GS
[0.75 0 0 0.75 281.53244 310.40261] CT
0 0.447 0.741 RC
N
f-1057828618
f
GR
GS
[0.75 0 0 0.75 275.45526 355.25089] CT
0 0.447 0.741 RC
N
f-1057828618
f
GR
GS
[0.75 0 0 0.75 276.68074 294.2352] CT
0 0.447 0.741 RC
N
f-1057828618
f
GR
GS
[0.75 0 0 0.75 264.04493 235.10049] CT
0 0.447 0.741 RC
N
f-1057828618
f
GR
GS
[0.75 0 0 0.75 283.56432 264.29368] CT
0 0.447 0.741 RC
N
f-1057828618
f
GR
GS
[0.75 0 0 0.75 284.57442 306.75545] CT
0 0.447 0.741 RC
N
f-1057828618
f
GR
GS
[0.75 0 0 0.75 271.10385 155.98717] CT
0 0.447 0.741 RC
N
f-1057828618
f
GR
GS
[0.75 0 0 0.75 292.7842 130.99377] CT
0 0.447 0.741 RC
N
f-1057828618
f
GR
GS
[0.75 0 0 0.75 300.85197 281.59495] CT
0 0.447 0.741 RC
N
f-1057828618
f
GR
GS
[0.75 0 0 0.75 278.51392 232.55965] CT
0 0.447 0.741 RC
N
f-1057828618
f
GR
GS
[0.75 0 0 0.75 266.11011 218.30871] CT
0 0.447 0.741 RC
N
f-1057828618
f
GR
GS
[0.75 0 0 0.75 287.69646 240.33996] CT
0 0.447 0.741 RC
N
f-1057828618
f
GR
GS
[0.75 0 0 0.75 296.12226 280.08591] CT
0 0.447 0.741 RC
N
f-1057828618
f
GR
GS
[0.75 0 0 0.75 302.52429 280.80038] CT
0 0.447 0.741 RC
N
f-1057828618
f
GR
GS
[0.75 0 0 0.75 286.53477 245.2774] CT
0 0.447 0.741 RC
N
f-1057828618
f
GR
GS
[0.75 0 0 0.75 297.32359 216.82741] CT
0 0.447 0.741 RC
N
f-1057828618
f
GR
GS
[0.75 0 0 0.75 270.41137 243.5549] CT
0 0.447 0.741 RC
N
f-1057828618
f
GR
GS
[0.75 0 0 0.75 293.38149 212.26309] CT
0 0.447 0.741 RC
N
f-1057828618
f
GR
GS
[0.75 0 0 0.75 255.0566 204.6904] CT
0 0.447 0.741 RC
N
f-1057828618
f
GR
GS
[0.75 0 0 0.75 276.57504 235.71133] CT
0 0.447 0.741 RC
N
f-1057828618
f
GR
GS
[0.75 0 0 0.75 270.2439 177.654] CT
0 0.447 0.741 RC
N
f-1057828618
f
GR
GS
[0.75 0 0 0.75 273.75149 239.61637] CT
0 0.447 0.741 RC
N
f-1057828618
f
GR
GS
[0.75 0 0 0.75 251.69204 255.36752] CT
0 0.447 0.741 RC
N
f-1057828618
f
GR
GS
[0.75 0 0 0.75 222.43401 207.66884] CT
0 0.447 0.741 RC
N
f-1057828618
f
GR
GS
[0.75 0 0 0.75 297.99683 281.8624] CT
0 0.447 0.741 RC
N
f-1057828618
f
GR
GS
[0.75 0 0 0.75 266.5562 195.46337] CT
0 0.447 0.741 RC
N
f-1057828618
f
GR
GS
[0.75 0 0 0.75 233.97672 213.11156] CT
0 0.447 0.741 RC
N
f-1057828618
f
GR
GS
[0.75 0 0 0.75 288.9819 215.28811] CT
0 0.447 0.741 RC
N
f-1057828618
f
GR
GS
[0.75 0 0 0.75 211.51041 170.85509] CT
0 0.447 0.741 RC
N
f-1057828618
f
GR
GS
[0.75 0 0 0.75 247.50579 174.01561] CT
0 0.447 0.741 RC
N
f-1057828618
f
GR
GS
[0.75 0 0 0.75 272.25089 198.40665] CT
0 0.447 0.741 RC
N
f-1057828618
f
GR
GS
[0.75 0 0 0.75 231.63311 221.58076] CT
0 0.447 0.741 RC
N
f-1057828618
f
GR
GS
[0.75 0 0 0.75 280.28334 220.01072] CT
0 0.447 0.741 RC
N
f-1057828618
f
GR
GS
[0.75 0 0 0.75 298.89251 222.84158] CT
0 0.447 0.741 RC
N
f-1057828618
f
GR
GS
[0.75 0 0 0.75 285.88582 199.95456] CT
0 0.447 0.741 RC
N
f-1057828618
f
GR
GS
[0.75 0 0 0.75 250.9189 172.26693] CT
0 0.447 0.741 RC
N
f-1057828618
f
GR
GS
[0.75 0 0 0.75 262.27872 220.95747] CT
0 0.447 0.741 RC
N
f-1057828618
f
GR
GS
[0.75 0 0 0.75 318.90211 230.99558] CT
0 0.447 0.741 RC
N
f-1057828618
f
GR
GS
[0.75 0 0 0.75 263.22954 204.38692] CT
0 0.447 0.741 RC
N
f-1057828618
f
GR
GS
[0.75 0 0 0.75 318.64513 297.49631] CT
0 0.447 0.741 RC
N
f-1057828618
f
GR
GS
[0.75 0 0 0.75 269.4743 246.37811] CT
0 0.447 0.741 RC
N
f-1057828618
f
GR
GS
[0.75 0 0 0.75 282.24442 197.09138] CT
0 0.447 0.741 RC
N
f-1057828618
f
GR
GS
[0.75 0 0 0.75 259.18401 186.32224] CT
0 0.447 0.741 RC
N
f-1057828618
f
GR
GS
[0.75 0 0 0.75 250.97573 102.29011] CT
0 0.447 0.741 RC
N
f-1057828618
f
GR
GS
[0.75 0 0 0.75 255.61517 96.75485] CT
0 0.447 0.741 RC
N
f-1057828618
f
GR
GS
[0.75 0 0 0.75 263.30125 98.08264] CT
0 0.447 0.741 RC
N
f-1057828618
f
GR
GS
[0.75 0 0 0.75 265.99649 160.21171] CT
0 0.447 0.741 RC
N
f-1057828618
f
GR
GS
[0.75 0 0 0.75 256.73149 143.96288] CT
0 0.447 0.741 RC
N
f-1057828618
f
GR
GS
[0.75 0 0 0.75 287.80321 154.09391] CT
0 0.447 0.741 RC
N
f-1057828618
f
GR
GS
[0.75 0 0 0.75 282.20288 166.9371] CT
0 0.447 0.741 RC
N
f-1057828618
f
GR
GS
[0.75 0 0 0.75 269.13295 95.943] CT
0 0.447 0.741 RC
N
f-1057828618
f
GR
GS
[0.75 0 0 0.75 267.20979 74.99867] CT
0 0.447 0.741 RC
N
f-1057828618
f
GR
GS
[0.75 0 0 0.75 269.22915 48.39522] CT
0 0.447 0.741 RC
N
f-1057828618
f
GR
GS
[0.75 0 0 0.75 291.19407 225.68475] CT
0.851 0.325 0.098 RC
N
f-1057828618
f
GR
GS
[0.75 0 0 0.75 291.14875 225.69903] CT
0.851 0.325 0.098 RC
N
f-1057828618
f
GR
GS
[0.75 0 0 0.75 291.25816 224.10336] CT
0.851 0.325 0.098 RC
N
f-1057828618
f
GR
GS
[0.75 0 0 0.75 291.23735 224.12933] CT
0.851 0.325 0.098 RC
N
f-1057828618
f
GR
GS
[0.75 0 0 0.75 291.70221 226.56557] CT
0.851 0.325 0.098 RC
N
f-1057828618
f
GR
GS
[0.75 0 0 0.75 287.05698 231.35371] CT
0.851 0.325 0.098 RC
N
f-1057828618
f
GR
GS
[0.75 0 0 0.75 286.85504 231.66978] CT
0.851 0.325 0.098 RC
N
f-1057828618
f
GR
GS
[0.75 0 0 0.75 284.3229 233.47861] CT
0.851 0.325 0.098 RC
N
f-1057828618
f
GR
GS
[0.75 0 0 0.75 279.60775 238.95525] CT
0.851 0.325 0.098 RC
N
f-1057828618
f
GR
GS
[0.75 0 0 0.75 279.60775 238.95525] CT
0.851 0.325 0.098 RC
N
f-1057828618
f
GR
GS
[0.75 0 0 0.75 280.17009 239.92392] CT
0.851 0.325 0.098 RC
N
f-1057828618
f
GR
GS
[0.75 0 0 0.75 276.48848 235.48927] CT
0.851 0.325 0.098 RC
N
f-1057828618
f
GR
GS
[0.75 0 0 0.75 276.48848 235.48927] CT
0.851 0.325 0.098 RC
N
f-1057828618
f
GR
GS
[0.75 0 0 0.75 274.97736 233.07504] CT
0.851 0.325 0.098 RC
N
f-1057828618
f
GR
GS
[0.75 0 0 0.75 271.21303 229.39778] CT
0.851 0.325 0.098 RC
N
f-1057828618
f
GR
GS
[0.75 0 0 0.75 268.71611 226.80551] CT
0.851 0.325 0.098 RC
N
f-1057828618
f
GR
GS
[0.75 0 0 0.75 267.6568 225.48322] CT
0.851 0.325 0.098 RC
N
f-1057828618
f
GR
GS
[0.75 0 0 0.75 266.75116 224.99654] CT
0.851 0.325 0.098 RC
N
f-1057828618
f
GR
GS
[0.75 0 0 0.75 265.70419 224.69881] CT
0.851 0.325 0.098 RC
N
f-1057828618
f
GR
GS
[0.75 0 0 0.75 264.84675 223.67757] CT
0.851 0.325 0.098 RC
N
f-1057828618
f
GR
GS
[0.75 0 0 0.75 264.13527 223.19884] CT
0.851 0.325 0.098 RC
N
f-1057828618
f
GR
GS
[0.75 0 0 0.75 264.38853 222.60862] CT
0.851 0.325 0.098 RC
N
f-1057828618
f
GR
GS
[0.75 0 0 0.75 264.08514 221.40452] CT
0.851 0.325 0.098 RC
N
f-1057828618
f
GR
GS
[0.75 0 0 0.75 262.91718 220.53886] CT
0.851 0.325 0.098 RC
N
f-1057828618
f
GR
GS
[0.75 0 0 0.75 262.4539 219.42059] CT
0.851 0.325 0.098 RC
N
f-1057828618
f
GR
GS
[0.75 0 0 0.75 261.34252 219.75208] CT
0.851 0.325 0.098 RC
N
f-1057828618
f
GR
GS
[0.75 0 0 0.75 260.14595 219.34893] CT
0.851 0.325 0.098 RC
N
f-1057828618
f
GR
GS
[0.75 0 0 0.75 256.55731 217.69647] CT
0.851 0.325 0.098 RC
N
f-1057828618
f
GR
GS
[0.75 0 0 0.75 254.49639 217.04279] CT
0.851 0.325 0.098 RC
N
f-1057828618
f
GR
GS
[0.75 0 0 0.75 254.49639 217.04279] CT
0.851 0.325 0.098 RC
N
f-1057828618
f
GR
GS
[0.75 0 0 0.75 252.71496 216.47083] CT
0.851 0.325 0.098 RC
N
f-1057828618
f
GR
GS
[0.75 0 0 0.75 253.43472 215.35565] CT
0.851 0.325 0.098 RC
N
f-1057828618
f
GR
GS
[0.75 0 0 0.75 251.37472 214.35883] CT
0.851 0.325 0.098 RC
N
f-1057828618
f
GR
GS
[0.75 0 0 0.75 249.96357 213.26337] CT
0.851 0.325 0.098 RC
N
f-1057828618
f
GR
GS
[0.75 0 0 0.75 250.50643 212.06602] CT
0.851 0.325 0.098 RC
N
f-1057828618
f
GR
GS
[0.75 0 0 0.75 251.31976 211.0919] CT
0.851 0.325 0.098 RC
N
f-1057828618
f
GR
GS
[0.75 0 0 0.75 253.24667 210.09572] CT
0.851 0.325 0.098 RC
N
f-1057828618
f
GR
GS
[0.75 0 0 0.75 254.82655 209.48154] CT
0.851 0.325 0.098 RC
N
f-1057828618
f
GR
GS
[0.75 0 0 0.75 255.77715 209.47295] CT
0.851 0.325 0.098 RC
N
f-1057828618
f
GR
GS
[0.75 0 0 0.75 256.27336 208.8758] CT
0.851 0.325 0.098 RC
N
f-1057828618
f
GR
GS
[0.75 0 0 0.75 258.60903 208.24608] CT
0.851 0.325 0.098 RC
N
f-1057828618
f
GR
GS
[0.75 0 0 0.75 258.58697 208.2326] CT
0.851 0.325 0.098 RC
N
f-1057828618
f
GR
GS
[0.75 0 0 0.75 258.24944 208.57871] CT
0.851 0.325 0.098 RC
N
f-1057828618
f
GR
GS
[0.75 0 0 0.75 258.74144 208.6338] CT
0.851 0.325 0.098 RC
N
f-1057828618
f
GR
GS
[0.75 0 0 0.75 258.98914 208.41884] CT
0.851 0.325 0.098 RC
N
f-1057828618
f
GR
GS
[0.75 0 0 0.75 258.98914 208.41884] CT
0.851 0.325 0.098 RC
N
f-1057828618
f
GR
GS
[0.75 0 0 0.75 259.26144 208.07453] CT
0.851 0.325 0.098 RC
N
f-1057828618
f
GR
GS
[0.75 0 0 0.75 258.82647 207.53888] CT
0.851 0.325 0.098 RC
N
f-1057828618
f
GR
GS
[0.75 0 0 0.75 258.43607 206.84212] CT
0.851 0.325 0.098 RC
N
f-1057828618
f
GR
GS
[0.75 0 0 0.75 258.05134 206.20775] CT
0.851 0.325 0.098 RC
N
f-1057828618
f
GR
GS
[0.75 0 0 0.75 257.68861 205.76367] CT
0.851 0.325 0.098 RC
N
f-1057828618
f
GR
GS
[0.75 0 0 0.75 257.18596 205.24969] CT
0.851 0.325 0.098 RC
N
f-1057828618
f
GR
GS
[0.75 0 0 0.75 256.67594 205.49705] CT
0.851 0.325 0.098 RC
N
f-1057828618
f
GR
GS
[0.75 0 0 0.75 256.86875 205.12273] CT
0.851 0.325 0.098 RC
N
f-1057828618
f
GR
GS
[0.75 0 0 0.75 256.13177 205.74525] CT
0.851 0.325 0.098 RC
N
f-1057828618
f
GR
GS
[0.75 0 0 0.75 256.13177 205.74525] CT
0.851 0.325 0.098 RC
N
f-1057828618
f
GR
GS
[0.75 0 0 0.75 255.70731 206.06648] CT
0.851 0.325 0.098 RC
N
f-1057828618
f
GR
GS
[0.75 0 0 0.75 255.82546 205.853] CT
0.851 0.325 0.098 RC
N
f-1057828618
f
GR
GS
[0.75 0 0 0.75 255.79649 206.32544] CT
0.851 0.325 0.098 RC
N
f-1057828618
f
GR
GS
[0.75 0 0 0.75 255.93022 206.24245] CT
0.851 0.325 0.098 RC
N
f-1057828618
f
GR
GS
[0.75 0 0 0.75 255.90331 206.54523] CT
0.851 0.325 0.098 RC
N
f-1057828618
f
GR
GS
[0.75 0 0 0.75 256.07023 206.34029] CT
0.851 0.325 0.098 RC
N
f-1057828618
f
GR
GS
[0.75 0 0 0.75 255.83208 206.67167] CT
0.851 0.325 0.098 RC
N
f-1057828618
f
GR
GS
[0.75 0 0 0.75 255.66479 206.93987] CT
0.851 0.325 0.098 RC
N
f-1057828618
f
GR
GS
[0.75 0 0 0.75 255.51787 206.74734] CT
0.851 0.325 0.098 RC
N
f-1057828618
f
GR
GS
[0.75 0 0 0.75 256.51678 206.2944] CT
0.851 0.325 0.098 RC
N
f-1057828618
f
GR
GS
[0.75 0 0 0.75 256.51678 206.2944] CT
0.851 0.325 0.098 RC
N
f-1057828618
f
GR
GS
[0.75 0 0 0.75 257.10851 206.37167] CT
0.851 0.325 0.098 RC
N
f-1057828618
f
GR
GS
[0.75 0 0 0.75 257.31157 206.23421] CT
0.851 0.325 0.098 RC
N
f-1057828618
f
GR
GS
[0.75 0 0 0.75 257.89888 206.09031] CT
0.851 0.325 0.098 RC
N
f-1057828618
f
GR
GS
[0.75 0 0 0.75 258.48811 206.13732] CT
0.851 0.325 0.098 RC
N
f-1057828618
f
GR
GS
[0.75 0 0 0.75 258.77236 205.80519] CT
0.851 0.325 0.098 RC
N
f-1057828618
f
GR
GS
[0.75 0 0 0.75 259.0681 205.81094] CT
0.851 0.325 0.098 RC
N
f-1057828618
f
GR
GS
[0.75 0 0 0.75 259.35004 206.0568] CT
0.851 0.325 0.098 RC
N
f-1057828618
f
GR
GS
[0.75 0 0 0.75 259.45898 206.31008] CT
0.851 0.325 0.098 RC
N
f-1057828618
f
GR
GS
[0.75 0 0 0.75 259.79732 206.53988] CT
0.851 0.325 0.098 RC
N
f-1057828618
f
GR
GS
[0.75 0 0 0.75 260.22427 206.78973] CT
0.851 0.325 0.098 RC
N
f-1057828618
f
GR
GS
[0.75 0 0 0.75 260.63658 207.04431] CT
0.851 0.325 0.098 RC
N
f-1057828618
f
GR
GS
[0.75 0 0 0.75 261.12923 207.2967] CT
0.851 0.325 0.098 RC
N
f-1057828618
f
GR
GS
[0.75 0 0 0.75 261.71635 207.50789] CT
0.851 0.325 0.098 RC
N
f-1057828618
f
GR
GS
[0.75 0 0 0.75 262.34509 207.6289] CT
0.851 0.325 0.098 RC
N
f-1057828618
f
GR
GS
[0.75 0 0 0.75 262.85932 208.04778] CT
0.851 0.325 0.098 RC
N
f-1057828618
f
GR
GS
[0.75 0 0 0.75 263.40408 208.53447] CT
0.851 0.325 0.098 RC
N
f-1057828618
f
GR
GS
[0.75 0 0 0.75 263.96434 208.90512] CT
0.851 0.325 0.098 RC
N
f-1057828618
f
GR
GS
[0.75 0 0 0.75 264.43158 208.8059] CT
0.851 0.325 0.098 RC
N
f-1057828618
f
GR
GS
[0.75 0 0 0.75 264.80672 209.11604] CT
0.851 0.325 0.098 RC
N
f-1057828618
f
GR
GS
[0.75 0 0 0.75 265.43644 209.19878] CT
0.851 0.325 0.098 RC
N
f-1057828618
f
GR
GS
[0.75 0 0 0.75 265.43644 209.19878] CT
0.851 0.325 0.098 RC
N
f-1057828618
f
GR
GS
[0.75 0 0 0.75 265.79949 209.0202] CT
0.851 0.325 0.098 RC
N
f-1057828618
f
GR
GS
[0.75 0 0 0.75 266.43622 208.83138] CT
0.851 0.325 0.098 RC
N
f-1057828618
f
GR
GS
[0.75 0 0 0.75 266.43622 208.83138] CT
0.851 0.325 0.098 RC
N
f-1057828618
f
GR
GS
[0.75 0 0 0.75 266.96638 208.63621] CT
0.851 0.325 0.098 RC
N
f-1057828618
f
GR
GS
[0.75 0 0 0.75 266.96638 208.63621] CT
0.851 0.325 0.098 RC
N
f-1057828618
f
GR
GS
[0.75 0 0 0.75 266.95187 208.57162] CT
0.851 0.325 0.098 RC
N
f-1057828618
f
GR
GS
[0.75 0 0 0.75 267.10487 208.57185] CT
0.851 0.325 0.098 RC
N
f-1057828618
f
GR
GS
[0.75 0 0 0.75 266.98105 208.45635] CT
0.851 0.325 0.098 RC
N
f-1057828618
f
GR
GS
[0.75 0 0 0.75 267.12341 208.48895] CT
0.851 0.325 0.098 RC
N
f-1057828618
f
GR
GS
[0.75 0 0 0.75 266.90476 208.38357] CT
0.851 0.325 0.098 RC
N
f-1057828618
f
GR
GS
[0.75 0 0 0.75 266.92312 208.20932] CT
0.851 0.325 0.098 RC
N
f-1057828618
f
GR
GS
[0.75 0 0 0.75 266.81754 208.20914] CT
0.851 0.325 0.098 RC
N
f-1057828618
f
GR
GS
[0.75 0 0 0.75 266.57607 207.92695] CT
0.851 0.325 0.098 RC
N
f-1057828618
f
GR
GS
[0.75 0 0 0.75 266.57607 207.92695] CT
0.851 0.325 0.098 RC
N
f-1057828618
f
GR
GS
[0.75 0 0 0.75 266.39328 207.97263] CT
0.851 0.325 0.098 RC
N
f-1057828618
f
GR
GS
[0.75 0 0 0.75 266.35854 207.66199] CT
0.851 0.325 0.098 RC
N
f-1057828618
f
GR
GS
[0.75 0 0 0.75 266.17502 207.7056] CT
0.851 0.325 0.098 RC
N
f-1057828618
f
GR
GS
[0.75 0 0 0.75 266.06715 207.73835] CT
0.851 0.325 0.098 RC
N
f-1057828618
f
GR
GS
[0.75 0 0 0.75 265.93021 207.61118] CT
0.851 0.325 0.098 RC
N
f-1057828618
f
GR
GS
[0.75 0 0 0.75 265.57832 208.05434] CT
0.851 0.325 0.098 RC
N
f-1057828618
f
GR
GS
[0.75 0 0 0.75 265.52813 208.0876] CT
0.851 0.325 0.098 RC
N
f-1057828618
f
GR
GS
[0.75 0 0 0.75 265.35599 207.92956] CT
0.851 0.325 0.098 RC
N
f-1057828618
f
GR
GS
[0.75 0 0 0.75 265.15833 207.84396] CT
0.851 0.325 0.098 RC
N
f-1057828618
f
GR
GS
[0.75 0 0 0.75 264.82201 207.79067] CT
0.851 0.325 0.098 RC
N
f-1057828618
f
GR
GS
[0.75 0 0 0.75 264.82201 207.79067] CT
0.851 0.325 0.098 RC
N
f-1057828618
f
GR
GS
[0.75 0 0 0.75 264.61633 207.90042] CT
0.851 0.325 0.098 RC
N
f-1057828618
f
GR
GS
[0.75 0 0 0.75 264.4693 207.94741] CT
0.851 0.325 0.098 RC
N
f-1057828618
f
GR
GS
[0.75 0 0 0.75 264.19231 207.90303] CT
0.851 0.325 0.098 RC
N
f-1057828618
f
GR
GS
[0.75 0 0 0.75 264.04127 207.78124] CT
0.851 0.325 0.098 RC
N
f-1057828618
f
GR
GS
[0.75 0 0 0.75 263.66018 207.69408] CT
0.851 0.325 0.098 RC
N
f-1057828618
f
GR
GS
[0.75 0 0 0.75 263.66018 207.69408] CT
0.851 0.325 0.098 RC
N
f-1057828618
f
GR
GS
[0.75 0 0 0.75 263.54913 207.49983] CT
0.851 0.325 0.098 RC
N
f-1057828618
f
GR
GS
[0.75 0 0 0.75 263.43098 207.40025] CT
0.851 0.325 0.098 RC
N
f-1057828618
f
GR
GS
[0.75 0 0 0.75 263.36726 207.30892] CT
0.851 0.325 0.098 RC
N
f-1057828618
f
GR
GS
[0.75 0 0 0.75 263.22361 207.15472] CT
0.851 0.325 0.098 RC
N
f-1057828618
f
GR
GS
[0.75 0 0 0.75 263.26932 207.21945] CT
0.851 0.325 0.098 RC
N
f-1057828618
f
GR
GS
[0.75 0 0 0.75 263.26932 207.21945] CT
0.851 0.325 0.098 RC
N
f-1057828618
f
GR
GS
[0.75 0 0 0.75 263.12981 207.34392] CT
0.851 0.325 0.098 RC
N
f-1057828618
f
GR
GS
[0.75 0 0 0.75 263.12196 207.57994] CT
0.851 0.325 0.098 RC
N
f-1057828618
f
GR
GS
[0.75 0 0 0.75 263.09626 207.71132] CT
0.851 0.325 0.098 RC
N
f-1057828618
f
GR
GS
[0.75 0 0 0.75 263.07587 207.84885] CT
0.851 0.325 0.098 RC
N
f-1057828618
f
GR
GS
[0.75 0 0 0.75 262.99125 207.85027] CT
0.851 0.325 0.098 RC
N
f-1057828618
f
GR
GS
[0.75 0 0 0.75 262.92906 208.02464] CT
0.851 0.325 0.098 RC
N
f-1057828618
f
GR
GS
[0.75 0 0 0.75 262.84245 208.12965] CT
0.851 0.325 0.098 RC
N
f-1057828618
f
GR
GS
[0.75 0 0 0.75 262.59224 208.23141] CT
0.851 0.325 0.098 RC
N
f-1057828618
f
GR
GS
[0.75 0 0 0.75 262.66573 208.42007] CT
0.851 0.325 0.098 RC
N
f-1057828618
f
GR
GS
[0.75 0 0 0.75 262.66541 208.55857] CT
0.851 0.325 0.098 RC
N
f-1057828618
f
GR
GS
[0.75 0 0 0.75 262.74314 208.65308] CT
0.851 0.325 0.098 RC
N
f-1057828618
f
GR
GS
[0.75 0 0 0.75 262.78148 208.70171] CT
0.851 0.325 0.098 RC
N
f-1057828618
f
GR
GS
[0.75 0 0 0.75 262.81462 208.57178] CT
0.851 0.325 0.098 RC
N
f-1057828618
f
GR
GS
[0.75 0 0 0.75 263.01009 208.83808] CT
0.851 0.325 0.098 RC
N
f-1057828618
f
GR
GS
[0.75 0 0 0.75 263.01009 208.83808] CT
0.851 0.325 0.098 RC
N
f-1057828618
f
GR
GS
[0.75 0 0 0.75 262.91579 208.7753] CT
0.851 0.325 0.098 RC
N
f-1057828618
f
GR
GS
[0.75 0 0 0.75 263.03584 208.74266] CT
0.851 0.325 0.098 RC
N
f-1057828618
f
GR
GS
[0.75 0 0 0.75 263.11345 208.56541] CT
0.851 0.325 0.098 RC
N
f-1057828618
f
GR
GS
[0.75 0 0 0.75 263.2546 208.50252] CT
0.851 0.325 0.098 RC
N
f-1057828618
f
GR
GS
[0.75 0 0 0.75 263.38792 208.46848] CT
0.851 0.325 0.098 RC
N
f-1057828618
f
GR
GS
[0.75 0 0 0.75 263.49509 208.39153] CT
0.851 0.325 0.098 RC
N
f-1057828618
f
GR
GS
[0.75 0 0 0.75 263.6006 208.39712] CT
0.851 0.325 0.098 RC
N
f-1057828618
f
GR
GS
[0.75 0 0 0.75 263.70992 208.3746] CT
0.851 0.325 0.098 RC
N
f-1057828618
f
GR
GS
[0.75 0 0 0.75 263.84237 208.38668] CT
0.851 0.325 0.098 RC
N
f-1057828618
f
GR
GS
[0.75 0 0 0.75 263.7545 208.50735] CT
0.851 0.325 0.098 RC
N
f-1057828618
f
GR
GS
[0.75 0 0 0.75 263.75171 208.62399] CT
0.851 0.325 0.098 RC
N
f-1057828618
f
GR
GS
[0.75 0 0 0.75 263.64088 208.59233] CT
0.851 0.325 0.098 RC
N
f-1057828618
f
GR
GS
[0.75 0 0 0.75 263.60351 208.70872] CT
0.851 0.325 0.098 RC
N
f-1057828618
f
GR
GS
[0.75 0 0 0.75 263.46581 208.57123] CT
0.851 0.325 0.098 RC
N
f-1057828618
f
GR
GS
[0.75 0 0 0.75 263.45835 208.58933] CT
0.851 0.325 0.098 RC
N
f-1057828618
f
GR
GS
[0.75 0 0 0.75 263.36874 208.52893] CT
0.851 0.325 0.098 RC
N
f-1057828618
f
GR
GS
[0.75 0 0 0.75 263.25904 208.45356] CT
0.851 0.325 0.098 RC
N
f-1057828618
f
GR
GS
[0.75 0 0 0.75 263.07623 208.44349] CT
0.851 0.325 0.098 RC
N
f-1057828618
f
GR
GS
[0.75 0 0 0.75 263.02171 208.30108] CT
0.851 0.325 0.098 RC
N
f-1057828618
f
GR
GS
[0.75 0 0 0.75 263.0438 208.31069] CT
0.851 0.325 0.098 RC
N
f-1057828618
f
GR
GS
[0.75 0 0 0.75 263.04501 208.06794] CT
0.851 0.325 0.098 RC
N
f-1057828618
f
GR
GS
[0.75 0 0 0.75 266.33968 185.90234] CT
0.929 0.694 0.125 RC
N
f-1057828618
f
GR
GS
[0.75 0 0 0.75 270.55856 133.24627] CT
0.929 0.694 0.125 RC
N
f-1057828618
f
GR
GS
[0.75 0 0 0.75 282.90134 229.97207] CT
0.929 0.694 0.125 RC
N
f-1057828618
f
GR
GS
[0.75 0 0 0.75 292.24173 239.31844] CT
0.929 0.694 0.125 RC
N
f-1057828618
f
GR
GS
[0.75 0 0 0.75 271.01109 233.38964] CT
0.929 0.694 0.125 RC
N
f-1057828618
f
GR
GS
[0.75 0 0 0.75 279.36971 246.51533] CT
0.929 0.694 0.125 RC
N
f-1057828618
f
GR
GS
[0.75 0 0 0.75 291.00227 225.45829] CT
0.929 0.694 0.125 RC
N
f-1057828618
f
GR
GS
[0.75 0 0 0.75 247.54468 79.0026] CT
0.929 0.694 0.125 RC
N
f-1057828618
f
GR
GS
[0.75 0 0 0.75 261.03264 206.81937] CT
0.929 0.694 0.125 RC
N
f-1057828618
f
GR
GS
[0.75 0 0 0.75 287.68936 177.58852] CT
0.929 0.694 0.125 RC
N
f-1057828618
f
GR
GS
[0.75 0 0 0.75 270.27296 150.37216] CT
0.929 0.694 0.125 RC
N
f-1057828618
f
GR
GS
[0.75 0 0 0.75 264.79555 120.92302] CT
0.929 0.694 0.125 RC
N
f-1057828618
f
GR
GS
[0.75 0 0 0.75 285.06004 139.62028] CT
0.929 0.694 0.125 RC
N
f-1057828618
f
GR
GS
[0.75 0 0 0.75 226.77003 46.10255] CT
0.929 0.694 0.125 RC
N
f-1057828618
f
GR
GS
[0.75 0 0 0.75 244.58926 135.8946] CT
0.929 0.694 0.125 RC
N
f-1057828618
f
GR
GS
[0.75 0 0 0.75 272.30024 161.32022] CT
0.929 0.694 0.125 RC
N
f-1057828618
f
GR
GS
[0.75 0 0 0.75 278.07612 174.37501] CT
0.929 0.694 0.125 RC
N
f-1057828618
f
GR
GS
[0.75 0 0 0.75 249.76719 147.04432] CT
0.929 0.694 0.125 RC
N
f-1057828618
f
GR
GS
[0.75 0 0 0.75 267.82066 157.56854] CT
0.929 0.694 0.125 RC
N
f-1057828618
f
GR
GS
[0.75 0 0 0.75 275.31901 181.86328] CT
0.929 0.694 0.125 RC
N
f-1057828618
f
GR
GS
[0.75 0 0 0.75 286.60069 180.04922] CT
0.929 0.694 0.125 RC
N
f-1057828618
f
GR
GS
[0.75 0 0 0.75 282.8719 170.80569] CT
0.929 0.694 0.125 RC
N
f-1057828618
f
GR
GS
[0.75 0 0 0.75 276.97771 162.80875] CT
0.929 0.694 0.125 RC
N
f-1057828618
f
GR
GS
[0.75 0 0 0.75 290.82188 165.68461] CT
0.929 0.694 0.125 RC
N
f-1057828618
f
GR
GS
[0.75 0 0 0.75 267.5934 227.82463] CT
0.929 0.694 0.125 RC
N
f-1057828618
f
GR
GS
[0.75 0 0 0.75 259.28286 199.8124] CT
0.929 0.694 0.125 RC
N
f-1057828618
f
GR
GS
[0.75 0 0 0.75 257.73647 162.59687] CT
0.929 0.694 0.125 RC
N
f-1057828618
f
GR
GS
[0.75 0 0 0.75 267.13969 174.74478] CT
0.929 0.694 0.125 RC
N
f-1057828618
f
GR
GS
[0.75 0 0 0.75 247.70977 166.82811] CT
0.929 0.694 0.125 RC
N
f-1057828618
f
GR
GS
[0.75 0 0 0.75 241.6382 174.01101] CT
0.929 0.694 0.125 RC
N
f-1057828618
f
GR
GS
[0.75 0 0 0.75 274.4556 151.52324] CT
0.929 0.694 0.125 RC
N
f-1057828618
f
GR
GS
[0.75 0 0 0.75 223.26849 178.28071] CT
0.929 0.694 0.125 RC
N
f-1057828618
f
GR
GS
[0.75 0 0 0.75 233.11933 114.5679] CT
0.929 0.694 0.125 RC
N
f-1057828618
f
GR
GS
[0.75 0 0 0.75 243.64666 140.57145] CT
0.929 0.694 0.125 RC
N
f-1057828618
f
GR
GS
[0.75 0 0 0.75 250.30639 152.42124] CT
0.929 0.694 0.125 RC
N
f-1057828618
f
GR
GS
[0.75 0 0 0.75 258.49216 192.3652] CT
0.929 0.694 0.125 RC
N
f-1057828618
f
GR
GS
[0.75 0 0 0.75 267.25994 204.62098] CT
0.929 0.694 0.125 RC
N
f-1057828618
f
GR
GS
[0.75 0 0 0.75 260.3595 258.36649] CT
0.929 0.694 0.125 RC
N
f-1057828618
f
GR
GS
[0.75 0 0 0.75 272.08106 253.03148] CT
0.929 0.694 0.125 RC
N
f-1057828618
f
GR
GS
[0.75 0 0 0.75 296.16307 226.68201] CT
0.929 0.694 0.125 RC
N
f-1057828618
f
GR
GS
[0.75 0 0 0.75 261.40079 217.21717] CT
0.929 0.694 0.125 RC
N
f-1057828618
f
GR
GS
[0.75 0 0 0.75 266.45334 188.3376] CT
0.929 0.694 0.125 RC
N
f-1057828618
f
GR
GS
[0.75 0 0 0.75 264.5062 198.25358] CT
0.929 0.694 0.125 RC
N
f-1057828618
f
GR
GS
[0.75 0 0 0.75 256.44031 215.33814] CT
0.929 0.694 0.125 RC
N
f-1057828618
f
GR
GS
[0.75 0 0 0.75 267.65751 197.08349] CT
0.929 0.694 0.125 RC
N
f-1057828618
f
GR
GS
[0.75 0 0 0.75 243.86856 203.98075] CT
0.929 0.694 0.125 RC
N
f-1057828618
f
GR
GS
[0.75 0 0 0.75 227.30173 194.62184] CT
0.929 0.694 0.125 RC
N
f-1057828618
f
GR
GS
[0.75 0 0 0.75 218.23842 157.82346] CT
0.929 0.694 0.125 RC
N
f-1057828618
f
GR
GS
[0.75 0 0 0.75 231.47749 176.2785] CT
0.929 0.694 0.125 RC
N
f-1057828618
f
GR
GS
[0.75 0 0 0.75 219.47264 84.53701] CT
0.929 0.694 0.125 RC
N
f-1057828618
f
GR
GS
[0.75 0 0 0.75 224.89826 191.55989] CT
0.929 0.694 0.125 RC
N
f-1057828618
f
GR
GS
[0.75 0 0 0.75 236.12343 201.02332] CT
0.929 0.694 0.125 RC
N
f-1057828618
f
GR
GS
[0.75 0 0 0.75 245.1587 213.82352] CT
0.929 0.694 0.125 RC
N
f-1057828618
f
GR
GS
[0.75 0 0 0.75 235.73872 283.64559] CT
0.929 0.694 0.125 RC
N
f-1057828618
f
GR
GS
[0.75 0 0 0.75 229.31332 248.41805] CT
0.929 0.694 0.125 RC
N
f-1057828618
f
GR
GS
[0.75 0 0 0.75 227.92591 295.85699] CT
0.929 0.694 0.125 RC
N
f-1057828618
f
GR
GS
[0.75 0 0 0.75 247.1402 230.44904] CT
0.929 0.694 0.125 RC
N
f-1057828618
f
GR
GS
[0.75 0 0 0.75 264.9575 254.17717] CT
0.929 0.694 0.125 RC
N
f-1057828618
f
GR
GS
[0.75 0 0 0.75 278.91167 160.77882] CT
0.929 0.694 0.125 RC
N
f-1057828618
f
GR
GS
[0.75 0 0 0.75 254.0414 146.97451] CT
0.929 0.694 0.125 RC
N
f-1057828618
f
GR
GS
[0.75 0 0 0.75 242.98068 350.51614] CT
0.929 0.694 0.125 RC
N
f-1057828618
f
GR
GS
[0.75 0 0 0.75 253.85474 283.13292] CT
0.929 0.694 0.125 RC
N
f-1057828618
f
GR
GS
[0.75 0 0 0.75 261.54826 279.03886] CT
0.929 0.694 0.125 RC
N
f-1057828618
f
GR
GS
[0.75 0 0 0.75 281.305 253.66862] CT
0.929 0.694 0.125 RC
N
f-1057828618
f
GR
GS
[0.75 0 0 0.75 284.87155 121.12129] CT
0.929 0.694 0.125 RC
N
f-1057828618
f
GR
GS
[0.75 0 0 0.75 319.57095 148.20295] CT
0.929 0.694 0.125 RC
N
f-1057828618
f
GR
GS
[0.75 0 0 0.75 304.0153 148.75716] CT
0.929 0.694 0.125 RC
N
f-1057828618
f
GR
GS
[0.75 0 0 0.75 278.53377 135.30453] CT
0.929 0.694 0.125 RC
N
f-1057828618
f
GR
GS
[0.75 0 0 0.75 330.64417 150.75858] CT
0.929 0.694 0.125 RC
N
f-1057828618
f
GR
GS
[0.75 0 0 0.75 323.69801 101.51397] CT
0.929 0.694 0.125 RC
N
f-1057828618
f
GR
GS
[0.75 0 0 0.75 285.73093 126.74704] CT
0.929 0.694 0.125 RC
N
f-1057828618
f
GR
GS
[0.75 0 0 0.75 279.62608 243.66591] CT
0.929 0.694 0.125 RC
N
f-1057828618
f
GR
GS
[0.75 0 0 0.75 272.10207 272.91236] CT
0.929 0.694 0.125 RC
N
f-1057828618
f
GR
GS
[0.75 0 0 0.75 265.93632 272.72271] CT
0.929 0.694 0.125 RC
N
f-1057828618
f
GR
GS
[0.75 0 0 0.75 276.64931 272.33205] CT
0.929 0.694 0.125 RC
N
f-1057828618
f
GR
GS
[0.75 0 0 0.75 283.78706 318.0694] CT
0.929 0.694 0.125 RC
N
f-1057828618
f
GR
GS
[0.75 0 0 0.75 269.31095 292.29817] CT
0.929 0.694 0.125 RC
N
f-1057828618
f
GR
GS
[0.75 0 0 0.75 276.80202 330.64034] CT
0.929 0.694 0.125 RC
N
f-1057828618
f
GR
GS
[0.75 0 0 0.75 293.91046 327.12456] CT
0.929 0.694 0.125 RC
N
f-1057828618
f
GR
GS
[0.75 0 0 0.75 293.63116 275.61266] CT
0.929 0.694 0.125 RC
N
f-1057828618
f
GR
GS
[0.75 0 0 0.75 292.88454 343.0678] CT
0.929 0.694 0.125 RC
N
f-1057828618
f
GR
GS
[0.75 0 0 0.75 279.52558 354.72505] CT
0.929 0.694 0.125 RC
N
f-1057828618
f
GR
GS
[0.75 0 0 0.75 306.16921 350.09015] CT
0.929 0.694 0.125 RC
N
f-1057828618
f
GR
GS
[0.75 0 0 0.75 309.05688 308.31557] CT
0.929 0.694 0.125 RC
N
f-1057828618
f
GR
GS
[0.75 0 0 0.75 294.06175 331.6347] CT
0.929 0.694 0.125 RC
N
f-1057828618
f
GR
GS
[0.75 0 0 0.75 287.32068 337.83943] CT
0.929 0.694 0.125 RC
N
f-1057828618
f
GR
GS
[0.75 0 0 0.75 309.42281 299.84933] CT
0.929 0.694 0.125 RC
N
f-1057828618
f
GR
GS
[0.75 0 0 0.75 312.16477 271.42815] CT
0.929 0.694 0.125 RC
N
f-1057828618
f
GR
GS
[0.75 0 0 0.75 308.0064 284.4508] CT
0.929 0.694 0.125 RC
N
f-1057828618
f
GR
GS
[0.75 0 0 0.75 309.19453 270.0423] CT
0.929 0.694 0.125 RC
N
f-1057828618
f
GR
GS
[0.75 0 0 0.75 309.78891 235.18799] CT
0.929 0.694 0.125 RC
N
f-1057828618
f
GR
GS
[0.75 0 0 0.75 322.13338 249.47246] CT
0.929 0.694 0.125 RC
N
f-1057828618
f
GR
GS
[0.75 0 0 0.75 289.39291 259.03104] CT
0.929 0.694 0.125 RC
N
f-1057828618
f
GR
GS
[0.75 0 0 0.75 294.20096 261.38658] CT
0.929 0.694 0.125 RC
N
f-1057828618
f
GR
GS
[0.75 0 0 0.75 266.03572 232.45155] CT
0.929 0.694 0.125 RC
N
f-1057828618
f
GR
GS
[0.75 0 0 0.75 291.28789 243.1526] CT
0.929 0.694 0.125 RC
N
f-1057828618
f
GR
GS
[0.75 0 0 0.75 257.0555 168.93974] CT
0.929 0.694 0.125 RC
N
f-1057828618
f
GR
GS
[0.75 0 0 0.75 284.75766 195.48663] CT
0.929 0.694 0.125 RC
N
f-1057828618
f
GR
GS
[0.75 0 0 0.75 276.86847 183.23341] CT
0.929 0.694 0.125 RC
N
f-1057828618
f
GR
GS
[0.75 0 0 0.75 248.07422 144.1265] CT
0.929 0.694 0.125 RC
N
f-1057828618
f
GR
GS
[0.75 0 0 0.75 272.61699 102.00406] CT
0.929 0.694 0.125 RC
N
f-1057828618
f
GR
GS
[0.75 0 0 0.75 264.50365 123.18354] CT
0.929 0.694 0.125 RC
N
f-1057828618
f
GR
GS
[0.75 0 0 0.75 276.669 42.76306] CT
0.929 0.694 0.125 RC
N
f-1057828618
f
GR
GS
[0.75 0 0 0.75 264.92645 109.28594] CT
0.929 0.694 0.125 RC
N
f-1057828618
f
GR
GS
[0.75 0 0 0.75 277.82776 149.66405] CT
0.929 0.694 0.125 RC
N
f-1057828618
f
GR
GS
[0.75 0 0 0.75 261.01085 132.12304] CT
0.929 0.694 0.125 RC
N
f-1057828618
f
GR
GS
[0.75 0 0 0.75 274.6927 216.6205] CT
0.929 0.694 0.125 RC
N
f-1057828618
f
GR
GS
[0.75 0 0 0.75 259.12111 141.6766] CT
0.929 0.694 0.125 RC
N
f-1057828618
f
GR
GS
[0.75 0 0 0.75 250.17293 174.97651] CT
0.929 0.694 0.125 RC
N
f-1057828618
f
GR
GS
[0.75 0 0 0.75 244.84442 217.97871] CT
0.929 0.694 0.125 RC
N
f-1057828618
f
GR
GS
[0.75 0 0 0.75 250.32019 176.04758] CT
0.929 0.694 0.125 RC
N
f-1057828618
f
GR
GS
[0.75 0 0 0.75 255.1642 196.71618] CT
0.929 0.694 0.125 RC
N
f-1057828618
f
GR
GS
[0.75 0 0 0.75 260.54121 164.64669] CT
0.929 0.694 0.125 RC
N
f-1057828618
f
GR
GS
[0.75 0 0 0.75 253.84829 168.6166] CT
0.929 0.694 0.125 RC
N
f-1057828618
f
GR
GS
[0.75 0 0 0.75 258.34227 98.70383] CT
0.929 0.694 0.125 RC
N
f-1057828618
f
GR
GS
[0.75 0 0 0.75 279.08997 69.34363] CT
0.929 0.694 0.125 RC
N
f-1057828618
f
GR
GS
[0.75 0 0 0.75 277.12532 177.85957] CT
0.929 0.694 0.125 RC
N
f-1057828618
f
GR
GS
[0.75 0 0 0.75 253.7606 124.50752] CT
0.929 0.694 0.125 RC
N
f-1057828618
f
GR
GS
[0.75 0 0 0.75 259.50268 189.42835] CT
0.929 0.694 0.125 RC
N
f-1057828618
f
GR
GS
[0.75 0 0 0.75 265.49565 140.9046] CT
0.929 0.694 0.125 RC
N
f-1057828618
f
GR
GS
[0.75 0 0 0.75 271.92277 171.60158] CT
0.929 0.694 0.125 RC
N
f-1057828618
f
GR
GS
[0.75 0 0 0.75 280.82611 178.53942] CT
0.929 0.694 0.125 RC
N
f-1057828618
f
GR
GS
[0.75 0 0 0.75 277.43415 202.31087] CT
0.929 0.694 0.125 RC
N
f-1057828618
f
GR
GS
[0.75 0 0 0.75 292.1578 193.30788] CT
0.929 0.694 0.125 RC
N
f-1057828618
f
GR
GS
[0.75 0 0 0.75 268.62545 235.33463] CT
0.929 0.694 0.125 RC
N
f-1057828618
f
GR
GS
[0.75 0 0 0.75 285.21281 225.23568] CT
0.929 0.694 0.125 RC
N
f-1057828618
f
GR
GS
[0.75 0 0 0.75 262.11887 236.92316] CT
0.929 0.694 0.125 RC
N
f-1057828618
f
GR
GS
[0.75 0 0 0.75 265.24313 254.02764] CT
0.929 0.694 0.125 RC
N
f-1057828618
f
GR
GS
[0.75 0 0 0.75 261.14232 192.52503] CT
0.929 0.694 0.125 RC
N
f-1057828618
f
GR
GS
[0.75 0 0 0.75 254.38232 268.76202] CT
0.929 0.694 0.125 RC
N
f-1057828618
f
GR
GS
[0.75 0 0 0.75 250.46475 249.54174] CT
0.929 0.694 0.125 RC
N
f-1057828618
f
GR
GS
[0.75 0 0 0.75 262.65633 207.73222] CT
0.929 0.694 0.125 RC
N
f-1057828618
f
GR
GS
[0.75 0 0 0.75 284.36229 217.671] CT
0.929 0.694 0.125 RC
N
f-1057828618
f
GR
GS
[0.75 0 0 0.75 266.89547 195.62359] CT
0.929 0.694 0.125 RC
N
f-1057828618
f
GR
GS
[0.75 0 0 0.75 291.45115 213.10286] CT
0.929 0.694 0.125 RC
N
f-1057828618
f
GR
GS
[0.75 0 0 0.75 282.81017 186.24141] CT
0.929 0.694 0.125 RC
N
f-1057828618
f
GR
GS
[0.75 0 0 0.75 280.48581 168.05347] CT
0.929 0.694 0.125 RC
N
f-1057828618
f
GR
GS
[0.75 0 0 0.75 304.46848 174.06872] CT
0.929 0.694 0.125 RC
N
f-1057828618
f
GR
GS
[0.75 0 0 0.75 307.98141 198.40105] CT
0.929 0.694 0.125 RC
N
f-1057828618
f
GR
GS
[0.75 0 0 0.75 297.91985 221.7006] CT
0.929 0.694 0.125 RC
N
f-1057828618
f
GR
GS
[0.75 0 0 0.75 339.86201 220.1307] CT
0.929 0.694 0.125 RC
N
f-1057828618
f
GR
GS
[0.75 0 0 0.75 299.6095 189.75179] CT
0.929 0.694 0.125 RC
N
f-1057828618
f
GR
GS
[0.75 0 0 0.75 286.04981 198.4671] CT
0.929 0.694 0.125 RC
N
f-1057828618
f
GR
GS
[0.75 0 0 0.75 250.75864 190.92939] CT
0.929 0.694 0.125 RC
N
f-1057828618
f
GR
GS
[0.75 0 0 0.75 320.08353 218.58261] CT
0.929 0.694 0.125 RC
N
f-1057828618
f
GR
GS
[0.75 0 0 0.75 335.14389 230.32423] CT
0.929 0.694 0.125 RC
N
f-1057828618
f
GR
GS
[0.75 0 0 0.75 307.34134 204.06782] CT
0.929 0.694 0.125 RC
N
f-1057828618
f
GR
GS
[0.75 0 0 0.75 304.40369 228.47745] CT
0.929 0.694 0.125 RC
N
f-1057828618
f
GR
GS
[0.75 0 0 0.75 269.57597 246.87646] CT
0.929 0.694 0.125 RC
N
f-1057828618
f
GR
GS
[0.75 0 0 0.75 281.93177 195.66959] CT
0.929 0.694 0.125 RC
N
f-1057828618
f
GR
GS
[0.75 0 0 0.75 253.26189 157.57346] CT
0.929 0.694 0.125 RC
N
f-1057828618
f
GR
GS
[0.75 0 0 0.75 258.55245 139.17176] CT
0.929 0.694 0.125 RC
N
f-1057828618
f
GR
GS
[0.75 0 0 0.75 246.80152 53.96298] CT
0.929 0.694 0.125 RC
N
f-1057828618
f
GR
GS
[0.75 0 0 0.75 257.9509 73.04106] CT
0.929 0.694 0.125 RC
N
f-1057828618
f
GR
GS
[0.75 0 0 0.75 268.43866 214.38991] CT
0.929 0.694 0.125 RC
N
f-1057828618
f
GR
GS
[0.75 0 0 0.75 258.36873 175.61873] CT
0.929 0.694 0.125 RC
N
f-1057828618
f
GR
GS
[0.75 0 0 0.75 290.76524 220.01969] CT
0.929 0.694 0.125 RC
N
f-1057828618
f
GR
GS
[0.75 0 0 0.75 283.81636 204.46243] CT
0.929 0.694 0.125 RC
N
f-1057828618
f
GR
GS
[0.75 0 0 0.75 272.79337 180.44506] CT
0.929 0.694 0.125 RC
N
f-1057828618
f
GR
GS
[0.75 0 0 0.75 270.62302 154.72682] CT
0.929 0.694 0.125 RC
N
f-1057828618
f
GR
GS
[0.75 0 0 0.75 273.50212 148.25518] CT
0.929 0.694 0.125 RC
N
f-1057828618
f
GR
GS
[0.75 0 0 0.75 271.00099 255.14401] CT
0 1 0 RC
N
4 0 M
4 -2.209 2.209 -4 0 -4 C
-2.209 -4 -4 -2.209 -4 0 C
-4 2.209 -2.209 4 0 4 C
2.209 4 4 2.209 4 0 C
cp
f
GR
GS
[0.75 0 0 0.75 271.00099 255.14401] CT
0 0.498 0 RC
10.0 ML
N
4 0 M
4 -2.209 2.209 -4 0 -4 C
-2.209 -4 -4 -2.209 -4 0 C
-4 2.209 -2.209 4 0 4 C
2.209 4 4 2.209 4 0 C
cp
S
GR
GS
[0.75 0 0 0.75 283.66019 214.28563] CT
0 1 0 RC
N
/f351177404{4 0 M
4 -2.209 2.209 -4 0 -4 C
-2.209 -4 -4 -2.209 -4 0 C
-4 2.209 -2.209 4 0 4 C
2.209 4 4 2.209 4 0 C
cp}def
f351177404
f
GR
GS
[0.75 0 0 0.75 283.66019 214.28563] CT
0 0.498 0 RC
10.0 ML
N
4 0 M
4 -2.209 2.209 -4 0 -4 C
-2.209 -4 -4 -2.209 -4 0 C
-4 2.209 -2.209 4 0 4 C
2.209 4 4 2.209 4 0 C
cp
S
GR
GS
[0.75 0 0 0.75 280.84186 187.31581] CT
0 1 0 RC
N
f351177404
f
GR
GS
[0.75 0 0 0.75 280.84186 187.31581] CT
0 0.498 0 RC
10.0 ML
N
4 0 M
4 -2.209 2.209 -4 0 -4 C
-2.209 -4 -4 -2.209 -4 0 C
-4 2.209 -2.209 4 0 4 C
2.209 4 4 2.209 4 0 C
cp
S
GR
GS
[0.75 0 0 0.75 269.18195 237.87062] CT
0 1 0 RC
N
f351177404
f
GR
GS
[0.75 0 0 0.75 269.18195 237.87062] CT
0 0.498 0 RC
10.0 ML
N
4 0 M
4 -2.209 2.209 -4 0 -4 C
-2.209 -4 -4 -2.209 -4 0 C
-4 2.209 -2.209 4 0 4 C
2.209 4 4 2.209 4 0 C
cp
S
GR
GS
[0.75 0 0 0.75 281.83683 223.07204] CT
0 1 0 RC
N
f351177404
f
GR
GS
[0.75 0 0 0.75 281.83683 223.07204] CT
0 0.498 0 RC
10.0 ML
N
4 0 M
4 -2.209 2.209 -4 0 -4 C
-2.209 -4 -4 -2.209 -4 0 C
-4 2.209 -2.209 4 0 4 C
2.209 4 4 2.209 4 0 C
cp
S
GR
GS
[0.75 0 0 0.75 251.93095 243.75854] CT
0 1 0 RC
N
f351177404
f
GR
GS
[0.75 0 0 0.75 251.93095 243.75854] CT
0 0.498 0 RC
10.0 ML
N
4 0 M
4 -2.209 2.209 -4 0 -4 C
-2.209 -4 -4 -2.209 -4 0 C
-4 2.209 -2.209 4 0 4 C
2.209 4 4 2.209 4 0 C
cp
S
GR
GS
[0.75 0 0 0.75 258.37493 242.21889] CT
0 1 0 RC
N
f351177404
f
GR
GS
[0.75 0 0 0.75 258.37493 242.21889] CT
0 0.498 0 RC
10.0 ML
N
4 0 M
4 -2.209 2.209 -4 0 -4 C
-2.209 -4 -4 -2.209 -4 0 C
-4 2.209 -2.209 4 0 4 C
2.209 4 4 2.209 4 0 C
cp
S
GR
GS
[0.75 0 0 0.75 268.84115 225.51677] CT
0 1 0 RC
N
f351177404
f
GR
GS
[0.75 0 0 0.75 268.84115 225.51677] CT
0 0.498 0 RC
10.0 ML
N
4 0 M
4 -2.209 2.209 -4 0 -4 C
-2.209 -4 -4 -2.209 -4 0 C
-4 2.209 -2.209 4 0 4 C
2.209 4 4 2.209 4 0 C
cp
S
GR
GS
[0.75 0 0 0.75 231.52867 214.79885] CT
0 1 0 RC
N
f351177404
f
GR
GS
[0.75 0 0 0.75 231.52867 214.79885] CT
0 0.498 0 RC
10.0 ML
N
4 0 M
4 -2.209 2.209 -4 0 -4 C
-2.209 -4 -4 -2.209 -4 0 C
-4 2.209 -2.209 4 0 4 C
2.209 4 4 2.209 4 0 C
cp
S
GR
GS
[0.75 0 0 0.75 254.96759 210.83762] CT
0 1 0 RC
N
f351177404
f
GR
GS
[0.75 0 0 0.75 254.96759 210.83762] CT
0 0.498 0 RC
10.0 ML
N
4 0 M
4 -2.209 2.209 -4 0 -4 C
-2.209 -4 -4 -2.209 -4 0 C
-4 2.209 -2.209 4 0 4 C
2.209 4 4 2.209 4 0 C
cp
S
GR
GS
[0.75 0 0 0.75 251.33121 174.46734] CT
0 1 0 RC
N
f351177404
f
GR
GS
[0.75 0 0 0.75 251.33121 174.46734] CT
0 0.498 0 RC
10.0 ML
N
4 0 M
4 -2.209 2.209 -4 0 -4 C
-2.209 -4 -4 -2.209 -4 0 C
-4 2.209 -2.209 4 0 4 C
2.209 4 4 2.209 4 0 C
cp
S
GR
GS
[0.75 0 0 0.75 259.52408 193.12138] CT
0 1 0 RC
N
f351177404
f
GR
GS
[0.75 0 0 0.75 259.52408 193.12138] CT
0 0.498 0 RC
10.0 ML
N
4 0 M
4 -2.209 2.209 -4 0 -4 C
-2.209 -4 -4 -2.209 -4 0 C
-4 2.209 -2.209 4 0 4 C
2.209 4 4 2.209 4 0 C
cp
S
GR
GS
[0.75 0 0 0.75 255.34092 210.87595] CT
0 1 0 RC
N
f351177404
f
GR
GS
[0.75 0 0 0.75 255.34092 210.87595] CT
0 0.498 0 RC
10.0 ML
N
4 0 M
4 -2.209 2.209 -4 0 -4 C
-2.209 -4 -4 -2.209 -4 0 C
-4 2.209 -2.209 4 0 4 C
2.209 4 4 2.209 4 0 C
cp
S
GR
GS
[0.75 0 0 0.75 238.56935 237.35577] CT
0 1 0 RC
N
f351177404
f
GR
GS
[0.75 0 0 0.75 238.56935 237.35577] CT
0 0.498 0 RC
10.0 ML
N
4 0 M
4 -2.209 2.209 -4 0 -4 C
-2.209 -4 -4 -2.209 -4 0 C
-4 2.209 -2.209 4 0 4 C
2.209 4 4 2.209 4 0 C
cp
S
GR
GS
[0.75 0 0 0.75 240.61402 213.50562] CT
0 1 0 RC
N
f351177404
f
GR
GS
[0.75 0 0 0.75 240.61402 213.50562] CT
0 0.498 0 RC
10.0 ML
N
4 0 M
4 -2.209 2.209 -4 0 -4 C
-2.209 -4 -4 -2.209 -4 0 C
-4 2.209 -2.209 4 0 4 C
2.209 4 4 2.209 4 0 C
cp
S
GR
GS
[0.75 0 0 0.75 252.49434 224.58799] CT
0 1 0 RC
N
f351177404
f
GR
GS
[0.75 0 0 0.75 252.49434 224.58799] CT
0 0.498 0 RC
10.0 ML
N
4 0 M
4 -2.209 2.209 -4 0 -4 C
-2.209 -4 -4 -2.209 -4 0 C
-4 2.209 -2.209 4 0 4 C
2.209 4 4 2.209 4 0 C
cp
S
GR
GS
[0.75 0 0 0.75 298.21454 217.32983] CT
0 1 0 RC
N
f351177404
f
GR
GS
[0.75 0 0 0.75 298.21454 217.32983] CT
0 0.498 0 RC
10.0 ML
N
4 0 M
4 -2.209 2.209 -4 0 -4 C
-2.209 -4 -4 -2.209 -4 0 C
-4 2.209 -2.209 4 0 4 C
2.209 4 4 2.209 4 0 C
cp
S
GR
GS
[0.75 0 0 0.75 253.18545 272.1582] CT
0 1 0 RC
N
f351177404
f
GR
GS
[0.75 0 0 0.75 253.18545 272.1582] CT
0 0.498 0 RC
10.0 ML
N
4 0 M
4 -2.209 2.209 -4 0 -4 C
-2.209 -4 -4 -2.209 -4 0 C
-4 2.209 -2.209 4 0 4 C
2.209 4 4 2.209 4 0 C
cp
S
GR
GS
[0.75 0 0 0.75 300.86442 307.31829] CT
0 1 0 RC
N
f351177404
f
GR
GS
[0.75 0 0 0.75 300.86442 307.31829] CT
0 0.498 0 RC
10.0 ML
N
4 0 M
4 -2.209 2.209 -4 0 -4 C
-2.209 -4 -4 -2.209 -4 0 C
-4 2.209 -2.209 4 0 4 C
2.209 4 4 2.209 4 0 C
cp
S
GR
GS
[0.75 0 0 0.75 265.0394 329.44022] CT
0 1 0 RC
N
f351177404
f
GR
GS
[0.75 0 0 0.75 265.0394 329.44022] CT
0 0.498 0 RC
10.0 ML
N
4 0 M
4 -2.209 2.209 -4 0 -4 C
-2.209 -4 -4 -2.209 -4 0 C
-4 2.209 -2.209 4 0 4 C
2.209 4 4 2.209 4 0 C
cp
S
GR
GS
[0.75 0 0 0.75 266.29742 336.26344] CT
0 1 0 RC
N
f351177404
f
GR
GS
[0.75 0 0 0.75 266.29742 336.26344] CT
0 0.498 0 RC
10.0 ML
N
4 0 M
4 -2.209 2.209 -4 0 -4 C
-2.209 -4 -4 -2.209 -4 0 C
-4 2.209 -2.209 4 0 4 C
2.209 4 4 2.209 4 0 C
cp
S
GR
GS
[0.75 0 0 0.75 254.74759 296.61793] CT
0 1 0 RC
N
f351177404
f
GR
GS
[0.75 0 0 0.75 254.74759 296.61793] CT
0 0.498 0 RC
10.0 ML
N
4 0 M
4 -2.209 2.209 -4 0 -4 C
-2.209 -4 -4 -2.209 -4 0 C
-4 2.209 -2.209 4 0 4 C
2.209 4 4 2.209 4 0 C
cp
S
GR
GS
[0.75 0 0 0.75 269.11377 268.90526] CT
0 1 0 RC
N
f351177404
f
GR
GS
[0.75 0 0 0.75 269.11377 268.90526] CT
0 0.498 0 RC
10.0 ML
N
4 0 M
4 -2.209 2.209 -4 0 -4 C
-2.209 -4 -4 -2.209 -4 0 C
-4 2.209 -2.209 4 0 4 C
2.209 4 4 2.209 4 0 C
cp
S
GR
GS
[0.75 0 0 0.75 235.88965 283.41831] CT
0 1 0 RC
N
f351177404
f
GR
GS
[0.75 0 0 0.75 235.88965 283.41831] CT
0 0.498 0 RC
10.0 ML
N
4 0 M
4 -2.209 2.209 -4 0 -4 C
-2.209 -4 -4 -2.209 -4 0 C
-4 2.209 -2.209 4 0 4 C
2.209 4 4 2.209 4 0 C
cp
S
GR
GS
[0.75 0 0 0.75 223.35219 268.77093] CT
0 1 0 RC
N
f351177404
f
GR
GS
[0.75 0 0 0.75 223.35219 268.77093] CT
0 0.498 0 RC
10.0 ML
N
4 0 M
4 -2.209 2.209 -4 0 -4 C
-2.209 -4 -4 -2.209 -4 0 C
-4 2.209 -2.209 4 0 4 C
2.209 4 4 2.209 4 0 C
cp
S
GR
GS
[0.75 0 0 0.75 290.22423 248.88512] CT
0 1 0 RC
N
f351177404
f
GR
GS
[0.75 0 0 0.75 290.22423 248.88512] CT
0 0.498 0 RC
10.0 ML
N
4 0 M
4 -2.209 2.209 -4 0 -4 C
-2.209 -4 -4 -2.209 -4 0 C
-4 2.209 -2.209 4 0 4 C
2.209 4 4 2.209 4 0 C
cp
S
GR
GS
[0.75 0 0 0.75 290.42107 239.42812] CT
0 1 0 RC
N
f351177404
f
GR
GS
[0.75 0 0 0.75 290.42107 239.42812] CT
0 0.498 0 RC
10.0 ML
N
4 0 M
4 -2.209 2.209 -4 0 -4 C
-2.209 -4 -4 -2.209 -4 0 C
-4 2.209 -2.209 4 0 4 C
2.209 4 4 2.209 4 0 C
cp
S
GR
GS
[0.75 0 0 0.75 273.11536 239.47211] CT
0 1 0 RC
N
f351177404
f
GR
GS
[0.75 0 0 0.75 273.11536 239.47211] CT
0 0.498 0 RC
10.0 ML
N
4 0 M
4 -2.209 2.209 -4 0 -4 C
-2.209 -4 -4 -2.209 -4 0 C
-4 2.209 -2.209 4 0 4 C
2.209 4 4 2.209 4 0 C
cp
S
GR
GS
[0.75 0 0 0.75 302.33196 230.27193] CT
0 1 0 RC
N
f351177404
f
GR
GS
[0.75 0 0 0.75 302.33196 230.27193] CT
0 0.498 0 RC
10.0 ML
N
4 0 M
4 -2.209 2.209 -4 0 -4 C
-2.209 -4 -4 -2.209 -4 0 C
-4 2.209 -2.209 4 0 4 C
2.209 4 4 2.209 4 0 C
cp
S
GR
GS
[0.75 0 0 0.75 317.88224 214.81089] CT
0 1 0 RC
N
f351177404
f
GR
GS
[0.75 0 0 0.75 317.88224 214.81089] CT
0 0.498 0 RC
10.0 ML
N
4 0 M
4 -2.209 2.209 -4 0 -4 C
-2.209 -4 -4 -2.209 -4 0 C
-4 2.209 -2.209 4 0 4 C
2.209 4 4 2.209 4 0 C
cp
S
GR
GS
[0.75 0 0 0.75 304.30611 279.91425] CT
0 1 0 RC
N
f351177404
f
GR
GS
[0.75 0 0 0.75 304.30611 279.91425] CT
0 0.498 0 RC
10.0 ML
N
4 0 M
4 -2.209 2.209 -4 0 -4 C
-2.209 -4 -4 -2.209 -4 0 C
-4 2.209 -2.209 4 0 4 C
2.209 4 4 2.209 4 0 C
cp
S
GR
GS
[0.75 0 0 0.75 301.81622 249.95045] CT
0 1 0 RC
N
f351177404
f
GR
GS
[0.75 0 0 0.75 301.81622 249.95045] CT
0 0.498 0 RC
10.0 ML
N
4 0 M
4 -2.209 2.209 -4 0 -4 C
-2.209 -4 -4 -2.209 -4 0 C
-4 2.209 -2.209 4 0 4 C
2.209 4 4 2.209 4 0 C
cp
S
GR
GS
[0.75 0 0 0.75 294.94341 274.17888] CT
0 1 0 RC
N
f351177404
f
GR
GS
[0.75 0 0 0.75 294.94341 274.17888] CT
0 0.498 0 RC
10.0 ML
N
4 0 M
4 -2.209 2.209 -4 0 -4 C
-2.209 -4 -4 -2.209 -4 0 C
-4 2.209 -2.209 4 0 4 C
2.209 4 4 2.209 4 0 C
cp
S
GR
GS
[0.75 0 0 0.75 271.10385 155.98717] CT
0 1 0 RC
N
f351177404
f
GR
GS
[0.75 0 0 0.75 271.10385 155.98717] CT
0 0.498 0 RC
10.0 ML
N
4 0 M
4 -2.209 2.209 -4 0 -4 C
-2.209 -4 -4 -2.209 -4 0 C
-4 2.209 -2.209 4 0 4 C
2.209 4 4 2.209 4 0 C
cp
S
GR
GS
[0.75 0 0 0.75 292.7842 130.99377] CT
0 1 0 RC
N
f351177404
f
GR
GS
[0.75 0 0 0.75 292.7842 130.99377] CT
0 0.498 0 RC
10.0 ML
N
4 0 M
4 -2.209 2.209 -4 0 -4 C
-2.209 -4 -4 -2.209 -4 0 C
-4 2.209 -2.209 4 0 4 C
2.209 4 4 2.209 4 0 C
cp
S
GR
GS
[0.75 0 0 0.75 278.51392 232.55965] CT
0 1 0 RC
N
f351177404
f
GR
GS
[0.75 0 0 0.75 278.51392 232.55965] CT
0 0.498 0 RC
10.0 ML
N
4 0 M
4 -2.209 2.209 -4 0 -4 C
-2.209 -4 -4 -2.209 -4 0 C
-4 2.209 -2.209 4 0 4 C
2.209 4 4 2.209 4 0 C
cp
S
GR
GS
[0.75 0 0 0.75 266.11011 218.30871] CT
0 1 0 RC
N
f351177404
f
GR
GS
[0.75 0 0 0.75 266.11011 218.30871] CT
0 0.498 0 RC
10.0 ML
N
4 0 M
4 -2.209 2.209 -4 0 -4 C
-2.209 -4 -4 -2.209 -4 0 C
-4 2.209 -2.209 4 0 4 C
2.209 4 4 2.209 4 0 C
cp
S
GR
GS
[0.75 0 0 0.75 287.69646 240.33996] CT
0 1 0 RC
N
f351177404
f
GR
GS
[0.75 0 0 0.75 287.69646 240.33996] CT
0 0.498 0 RC
10.0 ML
N
4 0 M
4 -2.209 2.209 -4 0 -4 C
-2.209 -4 -4 -2.209 -4 0 C
-4 2.209 -2.209 4 0 4 C
2.209 4 4 2.209 4 0 C
cp
S
GR
GS
[0.75 0 0 0.75 255.0566 204.6904] CT
0 1 0 RC
N
f351177404
f
GR
GS
[0.75 0 0 0.75 255.0566 204.6904] CT
0 0.498 0 RC
10.0 ML
N
4 0 M
4 -2.209 2.209 -4 0 -4 C
-2.209 -4 -4 -2.209 -4 0 C
-4 2.209 -2.209 4 0 4 C
2.209 4 4 2.209 4 0 C
cp
S
GR
GS
[0.75 0 0 0.75 276.57504 235.71133] CT
0 1 0 RC
N
f351177404
f
GR
GS
[0.75 0 0 0.75 276.57504 235.71133] CT
0 0.498 0 RC
10.0 ML
N
4 0 M
4 -2.209 2.209 -4 0 -4 C
-2.209 -4 -4 -2.209 -4 0 C
-4 2.209 -2.209 4 0 4 C
2.209 4 4 2.209 4 0 C
cp
S
GR
GS
[0.75 0 0 0.75 273.75149 239.61637] CT
0 1 0 RC
N
f351177404
f
GR
GS
[0.75 0 0 0.75 273.75149 239.61637] CT
0 0.498 0 RC
10.0 ML
N
4 0 M
4 -2.209 2.209 -4 0 -4 C
-2.209 -4 -4 -2.209 -4 0 C
-4 2.209 -2.209 4 0 4 C
2.209 4 4 2.209 4 0 C
cp
S
GR
GS
[0.75 0 0 0.75 288.9819 215.28811] CT
0 1 0 RC
N
f351177404
f
GR
GS
[0.75 0 0 0.75 288.9819 215.28811] CT
0 0.498 0 RC
10.0 ML
N
4 0 M
4 -2.209 2.209 -4 0 -4 C
-2.209 -4 -4 -2.209 -4 0 C
-4 2.209 -2.209 4 0 4 C
2.209 4 4 2.209 4 0 C
cp
S
GR
GS
[0.75 0 0 0.75 247.50579 174.01561] CT
0 1 0 RC
N
f351177404
f
GR
GS
[0.75 0 0 0.75 247.50579 174.01561] CT
0 0.498 0 RC
10.0 ML
N
4 0 M
4 -2.209 2.209 -4 0 -4 C
-2.209 -4 -4 -2.209 -4 0 C
-4 2.209 -2.209 4 0 4 C
2.209 4 4 2.209 4 0 C
cp
S
GR
GS
[0.75 0 0 0.75 272.25089 198.40665] CT
0 1 0 RC
N
f351177404
f
GR
GS
[0.75 0 0 0.75 272.25089 198.40665] CT
0 0.498 0 RC
10.0 ML
N
4 0 M
4 -2.209 2.209 -4 0 -4 C
-2.209 -4 -4 -2.209 -4 0 C
-4 2.209 -2.209 4 0 4 C
2.209 4 4 2.209 4 0 C
cp
S
GR
GS
[0.75 0 0 0.75 231.63311 221.58076] CT
0 1 0 RC
N
f351177404
f
GR
GS
[0.75 0 0 0.75 231.63311 221.58076] CT
0 0.498 0 RC
10.0 ML
N
4 0 M
4 -2.209 2.209 -4 0 -4 C
-2.209 -4 -4 -2.209 -4 0 C
-4 2.209 -2.209 4 0 4 C
2.209 4 4 2.209 4 0 C
cp
S
GR
GS
[0.75 0 0 0.75 280.28334 220.01072] CT
0 1 0 RC
N
f351177404
f
GR
GS
[0.75 0 0 0.75 280.28334 220.01072] CT
0 0.498 0 RC
10.0 ML
N
4 0 M
4 -2.209 2.209 -4 0 -4 C
-2.209 -4 -4 -2.209 -4 0 C
-4 2.209 -2.209 4 0 4 C
2.209 4 4 2.209 4 0 C
cp
S
GR
GS
[0.75 0 0 0.75 298.89251 222.84158] CT
0 1 0 RC
N
f351177404
f
GR
GS
[0.75 0 0 0.75 298.89251 222.84158] CT
0 0.498 0 RC
10.0 ML
N
4 0 M
4 -2.209 2.209 -4 0 -4 C
-2.209 -4 -4 -2.209 -4 0 C
-4 2.209 -2.209 4 0 4 C
2.209 4 4 2.209 4 0 C
cp
S
GR
GS
[0.75 0 0 0.75 285.88582 199.95456] CT
0 1 0 RC
N
f351177404
f
GR
GS
[0.75 0 0 0.75 285.88582 199.95456] CT
0 0.498 0 RC
10.0 ML
N
4 0 M
4 -2.209 2.209 -4 0 -4 C
-2.209 -4 -4 -2.209 -4 0 C
-4 2.209 -2.209 4 0 4 C
2.209 4 4 2.209 4 0 C
cp
S
GR
GS
[0.75 0 0 0.75 262.27872 220.95747] CT
0 1 0 RC
N
f351177404
f
GR
GS
[0.75 0 0 0.75 262.27872 220.95747] CT
0 0.498 0 RC
10.0 ML
N
4 0 M
4 -2.209 2.209 -4 0 -4 C
-2.209 -4 -4 -2.209 -4 0 C
-4 2.209 -2.209 4 0 4 C
2.209 4 4 2.209 4 0 C
cp
S
GR
GS
[0.75 0 0 0.75 318.90211 230.99558] CT
0 1 0 RC
N
f351177404
f
GR
GS
[0.75 0 0 0.75 318.90211 230.99558] CT
0 0.498 0 RC
10.0 ML
N
4 0 M
4 -2.209 2.209 -4 0 -4 C
-2.209 -4 -4 -2.209 -4 0 C
-4 2.209 -2.209 4 0 4 C
2.209 4 4 2.209 4 0 C
cp
S
GR
GS
[0.75 0 0 0.75 263.22954 204.38692] CT
0 1 0 RC
N
f351177404
f
GR
GS
[0.75 0 0 0.75 263.22954 204.38692] CT
0 0.498 0 RC
10.0 ML
N
4 0 M
4 -2.209 2.209 -4 0 -4 C
-2.209 -4 -4 -2.209 -4 0 C
-4 2.209 -2.209 4 0 4 C
2.209 4 4 2.209 4 0 C
cp
S
GR
GS
[0.75 0 0 0.75 269.4743 246.37811] CT
0 1 0 RC
N
f351177404
f
GR
GS
[0.75 0 0 0.75 269.4743 246.37811] CT
0 0.498 0 RC
10.0 ML
N
4 0 M
4 -2.209 2.209 -4 0 -4 C
-2.209 -4 -4 -2.209 -4 0 C
-4 2.209 -2.209 4 0 4 C
2.209 4 4 2.209 4 0 C
cp
S
GR
GS
[0.75 0 0 0.75 282.24442 197.09138] CT
0 1 0 RC
N
f351177404
f
GR
GS
[0.75 0 0 0.75 282.24442 197.09138] CT
0 0.498 0 RC
10.0 ML
N
4 0 M
4 -2.209 2.209 -4 0 -4 C
-2.209 -4 -4 -2.209 -4 0 C
-4 2.209 -2.209 4 0 4 C
2.209 4 4 2.209 4 0 C
cp
S
GR
GS
[0.75 0 0 0.75 259.18401 186.32224] CT
0 1 0 RC
N
f351177404
f
GR
GS
[0.75 0 0 0.75 259.18401 186.32224] CT
0 0.498 0 RC
10.0 ML
N
4 0 M
4 -2.209 2.209 -4 0 -4 C
-2.209 -4 -4 -2.209 -4 0 C
-4 2.209 -2.209 4 0 4 C
2.209 4 4 2.209 4 0 C
cp
S
GR
GS
[0.75 0 0 0.75 255.61517 96.75485] CT
0 1 0 RC
N
f351177404
f
GR
GS
[0.75 0 0 0.75 255.61517 96.75485] CT
0 0.498 0 RC
10.0 ML
N
4 0 M
4 -2.209 2.209 -4 0 -4 C
-2.209 -4 -4 -2.209 -4 0 C
-4 2.209 -2.209 4 0 4 C
2.209 4 4 2.209 4 0 C
cp
S
GR
GS
[0.75 0 0 0.75 263.30125 98.08264] CT
0 1 0 RC
N
f351177404
f
GR
GS
[0.75 0 0 0.75 263.30125 98.08264] CT
0 0.498 0 RC
10.0 ML
N
4 0 M
4 -2.209 2.209 -4 0 -4 C
-2.209 -4 -4 -2.209 -4 0 C
-4 2.209 -2.209 4 0 4 C
2.209 4 4 2.209 4 0 C
cp
S
GR
GS
[0.75 0 0 0.75 263.625 211.5] CT
0.494 0.184 0.557 RC
10.0 ML
N
0 -4 M
0 4 L
-4 0 M
4 0 L
S
GR
GS
[0.75 0 0 0.75 0 0] CT
1 GC
N
/f-720625744{604 156 M
604 55 L
464 55 L
464 156 L
cp}def
f-720625744
f
GR
GS
[0.75 0 0 0.75 383.25 51.69828] CT
/Helvetica 18.667 F
GS
[1 0 0 1 0 0] CT
0 7 moveto 
1 -1 scale
(CP) t 
GR
GR
GS
[0.75 0 0 0.75 366 51.69828] CT
0 0.447 0.741 RC
N
f-1057828618
f
GR
GS
[0.75 0 0 0.75 383.25 69.98276] CT
/Helvetica 18.667 F
GS
[1 0 0 1 0 0] CT
0 7 moveto 
1 -1 scale
(Google LP) t 
GR
GR
GS
[0.75 0 0 0.75 366 69.98276] CT
0.851 0.325 0.098 RC
N
f-1057828618
f
GR
GS
[0.75 0 0 0.75 383.25 88.26724] CT
/Helvetica 18.667 F
GS
[1 0 0 1 0 0] CT
0 7 moveto 
1 -1 scale
(GPS) t 
GR
GR
GS
[0.75 0 0 0.75 366 88.26724] CT
0.929 0.694 0.125 RC
N
f-1057828618
f
GR
GS
[0.75 0 0 0.75 383.25 106.55173] CT
/Helvetica 18.667 F
GS
[1 0 0 1 0 0] CT
0 7 moveto 
1 -1 scale
(Profit) t 
GR
GR
GS
[0.75 0 0 0.75 366 106.55173] CT
0 1 0 RC
N
f351177404
f
GR
GS
[0.75 0 0 0.75 366 106.55173] CT
0 0.498 0 RC
10.0 ML
N
4 0 M
4 -2.209 2.209 -4 0 -4 C
-2.209 -4 -4 -2.209 -4 0 C
-4 2.209 -2.209 4 0 4 C
2.209 4 4 2.209 4 0 C
cp
S
GR
GS
[0.75 0 0 0.75 0 0] CT
0.149 GC
10.0 ML
0.667 LW
N
464 156 M
464 55 L
604 55 L
604 156 L
cp
S
GR
%%Trailer
%%Pages: 1
%%EOF
