\relax 
\providecommand\hyper@newdestlabel[2]{}
\@writefile{toc}{\contentsline {chapter}{\numberline {C}CPS message fields}{181}{appendix.C}\protected@file@percent }
\@writefile{lof}{\addvspace {10\p@ }}
\@writefile{lot}{\addvspace {10\p@ }}
\newlabel{appendix:fields}{{C}{181}{CPS message fields}{appendix.C}{}}
\@writefile{toc}{\contentsline {section}{\numberline {C.1}Data fields description}{181}{section.C.1}\protected@file@percent }
\acronymused{PVT}
\acronymused{PVT}
\acronymused{PVT}
\@writefile{lot}{\contentsline {table}{\numberline {C.1}{\ignorespaces Database structure. Raw measurements collection entry}}{181}{table.caption.145}\protected@file@percent }
\newlabel{tab:db_raw_tab}{{C.1}{181}{Database structure. Raw measurements collection entry}{table.caption.145}{}}
\newlabel{tab:db_CRMfields}{{C.1}{181}{Database structure. Raw measurements collection entry}{table.caption.145}{}}
\@writefile{lot}{\contentsline {table}{\numberline {C.2}{\ignorespaces Database structure. Agent collection entry}}{182}{table.caption.146}\protected@file@percent }
\newlabel{tab:db_agent_fields}{{C.2}{182}{Database structure. Agent collection entry}{table.caption.146}{}}
\@writefile{toc}{\contentsline {section}{\numberline {C.2}APIs}{182}{section.C.2}\protected@file@percent }
\acronymused{CPS}
\acronymused{API}
\acronymused{CPS}
\@writefile{toc}{\contentsline {subsubsection}{Registration/Unregistration of a the agents}{182}{section.C.2}\protected@file@percent }
\acronymused{CAPS.loc}
\@writefile{lot}{\contentsline {table}{\numberline {C.3}{\ignorespaces API description. Agent subscription}}{183}{table.caption.147}\protected@file@percent }
\newlabel{tab:api_ag_sub}{{C.3}{183}{API description. Agent subscription}{table.caption.147}{}}
\@writefile{lot}{\contentsline {table}{\numberline {C.4}{\ignorespaces API description. Agent unsubscription}}{183}{table.caption.148}\protected@file@percent }
\newlabel{tab:api_ag_unsub}{{C.4}{183}{API description. Agent unsubscription}{table.caption.148}{}}
\@writefile{lot}{\contentsline {table}{\numberline {C.5}{\ignorespaces API description. All agents unsubscription}}{183}{table.caption.149}\protected@file@percent }
\newlabel{tab:api_all_unsub}{{C.5}{183}{API description. All agents unsubscription}{table.caption.149}{}}
\@writefile{toc}{\contentsline {subsubsection}{Database Upkeep API}{183}{table.caption.149}\protected@file@percent }
\@writefile{toc}{\contentsline {subsubsection}{Raw measurements and status}{183}{table.caption.150}\protected@file@percent }
\acronymused{CPS}
\acronymused{CPS}
\@writefile{lot}{\contentsline {table}{\numberline {C.6}{\ignorespaces API description. Database refresh time}}{184}{table.caption.150}\protected@file@percent }
\newlabel{tab:api_db_up}{{C.6}{184}{API description. Database refresh time}{table.caption.150}{}}
\@writefile{lot}{\contentsline {table}{\numberline {C.7}{\ignorespaces API description. Agent information}}{184}{table.caption.151}\protected@file@percent }
\newlabel{tab:api_ag_fix}{{C.7}{184}{API description. Agent information}{table.caption.151}{}}
\newlabel{lst:agent_fix}{{C.1}{184}{\small Example of data retrieved through agent\_fix}{lstlisting.C.1}{}}
\@writefile{lol}{\contentsline {lstlisting}{\numberline {C.1}\relax \fontsize  {10}{12}\selectfont  \abovedisplayskip 10\p@ plus2\p@ minus5\p@ \abovedisplayshortskip \z@ plus3\p@ \belowdisplayshortskip 6\p@ plus3\p@ minus3\p@ \def \leftmargin \leftmargini \parsep 4.5\p@ plus2\p@ minus\p@ \topsep 9\p@ plus3\p@ minus5\p@ \itemsep 4.5\p@ plus2\p@ minus\p@ {\leftmargin \leftmargini \topsep 6\p@ plus2\p@ minus2\p@ \parsep 3\p@ plus2\p@ minus\p@ \itemsep \parsep }\belowdisplayskip \abovedisplayskip Example of data retrieved through agent\_fix}{184}{lstlisting.C.1}\protected@file@percent }
\@writefile{toc}{\contentsline {subsubsection}{Visibility configuration}{184}{lstnumber.C.1.16}\protected@file@percent }
\newlabel{lst:agent_visibility}{{C.2}{184}{Example of data retrieved through agent\_visibility}{lstlisting.C.2}{}}
\@writefile{lol}{\contentsline {lstlisting}{\numberline {C.2}Example of data retrieved through agent\_visibility}{184}{lstlisting.C.2}\protected@file@percent }
\@writefile{lot}{\contentsline {table}{\numberline {C.8}{\ignorespaces API description. Agent entry update}}{185}{table.caption.152}\protected@file@percent }
\newlabel{tab:api_ag_v}{{C.8}{185}{API description. Agent entry update}{table.caption.152}{}}
\@writefile{toc}{\contentsline {subsubsection}{Registered agents}{185}{lstnumber.C.2.4}\protected@file@percent }
\acronymused{CPS}
\@writefile{lot}{\contentsline {table}{\numberline {C.9}{\ignorespaces API description. Agent listing}}{185}{table.caption.153}\protected@file@percent }
\newlabel{tab:api_ag_id}{{C.9}{185}{API description. Agent listing}{table.caption.153}{}}
\newlabel{lst:agents_id}{{C.3}{185}{Example of data retrieved through agent\_id}{lstlisting.C.3}{}}
\@writefile{lol}{\contentsline {lstlisting}{\numberline {C.3}Example of data retrieved through agent\_id}{185}{lstlisting.C.3}\protected@file@percent }
\@writefile{toc}{\contentsline {subsubsection}{Raw measurements upload}{185}{lstnumber.C.3.3}\protected@file@percent }
\newlabel{lst:raw_up}{{C.4}{185}{Example of data downloaded uploaded to the \ac {CPS}}{lstlisting.C.4}{}}
\@writefile{lol}{\contentsline {lstlisting}{\numberline {C.4}Example of data downloaded uploaded to the \ac {CPS}}{185}{lstlisting.C.4}\protected@file@percent }
\acronymused{CPS}
\@writefile{toc}{\contentsline {subsubsection}{Raw measurements download}{186}{lstnumber.C.4.22}\protected@file@percent }
\acronymused{CRM}
\@writefile{lot}{\contentsline {table}{\numberline {C.10}{\ignorespaces API description. Agent last measurements information}}{186}{table.caption.154}\protected@file@percent }
\newlabel{tab:api_ag_meas}{{C.10}{186}{API description. Agent last measurements information}{table.caption.154}{}}
\newlabel{lst:raw_down}{{C.5}{186}{Example of data downloaded from the \ac {CPS}}{lstlisting.C.5}{}}
\@writefile{lol}{\contentsline {lstlisting}{\numberline {C.5}Example of data downloaded from the \ac {CPS}}{186}{lstlisting.C.5}\protected@file@percent }
\acronymused{CPS}
\@writefile{toc}{\contentsline {subsubsection}{Database Download API}{187}{lstnumber.C.5.11}\protected@file@percent }
\@writefile{lot}{\contentsline {table}{\numberline {C.11}{\ignorespaces API description. Database download}}{187}{table.caption.155}\protected@file@percent }
\newlabel{tab:api_db_dw}{{C.11}{187}{API description. Database download}{table.caption.155}{}}
\@setckpt{Appendix4/appendix4}{
\setcounter{page}{188}
\setcounter{equation}{0}
\setcounter{enumi}{2}
\setcounter{enumii}{0}
\setcounter{enumiii}{0}
\setcounter{enumiv}{0}
\setcounter{footnote}{0}
\setcounter{mpfootnote}{0}
\setcounter{part}{0}
\setcounter{chapter}{3}
\setcounter{section}{2}
\setcounter{subsection}{0}
\setcounter{subsubsection}{0}
\setcounter{paragraph}{0}
\setcounter{subparagraph}{0}
\setcounter{figure}{0}
\setcounter{table}{11}
\setcounter{SDpage}{0}
\setcounter{NumberSD}{0}
\setcounter{tomo}{0}
\setcounter{parentequation}{0}
\setcounter{caption@flags}{0}
\setcounter{ContinuedFloat}{0}
\setcounter{subfigure}{0}
\setcounter{subtable}{0}
\setcounter{float@type}{16}
\setcounter{tabx@nest}{0}
\setcounter{listtotal}{0}
\setcounter{listcount}{0}
\setcounter{liststart}{0}
\setcounter{liststop}{0}
\setcounter{citecount}{0}
\setcounter{citetotal}{0}
\setcounter{multicitecount}{0}
\setcounter{multicitetotal}{0}
\setcounter{instcount}{403}
\setcounter{maxnames}{3}
\setcounter{minnames}{1}
\setcounter{maxitems}{3}
\setcounter{minitems}{1}
\setcounter{citecounter}{0}
\setcounter{maxcitecounter}{0}
\setcounter{savedcitecounter}{0}
\setcounter{uniquelist}{0}
\setcounter{uniquename}{0}
\setcounter{refsection}{0}
\setcounter{refsegment}{0}
\setcounter{maxextratitle}{0}
\setcounter{maxextratitleyear}{0}
\setcounter{maxextraname}{5}
\setcounter{maxextradate}{0}
\setcounter{maxextraalpha}{0}
\setcounter{abbrvpenalty}{50}
\setcounter{highnamepenalty}{50}
\setcounter{lownamepenalty}{25}
\setcounter{maxparens}{3}
\setcounter{parenlevel}{0}
\setcounter{mincomprange}{10}
\setcounter{maxcomprange}{100000}
\setcounter{mincompwidth}{1}
\setcounter{afterword}{0}
\setcounter{savedafterword}{0}
\setcounter{annotator}{0}
\setcounter{savedannotator}{0}
\setcounter{author}{0}
\setcounter{savedauthor}{0}
\setcounter{bookauthor}{0}
\setcounter{savedbookauthor}{0}
\setcounter{commentator}{0}
\setcounter{savedcommentator}{0}
\setcounter{editor}{0}
\setcounter{savededitor}{0}
\setcounter{editora}{0}
\setcounter{savededitora}{0}
\setcounter{editorb}{0}
\setcounter{savededitorb}{0}
\setcounter{editorc}{0}
\setcounter{savededitorc}{0}
\setcounter{foreword}{0}
\setcounter{savedforeword}{0}
\setcounter{holder}{0}
\setcounter{savedholder}{0}
\setcounter{introduction}{0}
\setcounter{savedintroduction}{0}
\setcounter{namea}{0}
\setcounter{savednamea}{0}
\setcounter{nameb}{0}
\setcounter{savednameb}{0}
\setcounter{namec}{0}
\setcounter{savednamec}{0}
\setcounter{translator}{0}
\setcounter{savedtranslator}{0}
\setcounter{shortauthor}{0}
\setcounter{savedshortauthor}{0}
\setcounter{shorteditor}{0}
\setcounter{savedshorteditor}{0}
\setcounter{labelname}{0}
\setcounter{savedlabelname}{0}
\setcounter{institution}{0}
\setcounter{savedinstitution}{0}
\setcounter{lista}{0}
\setcounter{savedlista}{0}
\setcounter{listb}{0}
\setcounter{savedlistb}{0}
\setcounter{listc}{0}
\setcounter{savedlistc}{0}
\setcounter{listd}{0}
\setcounter{savedlistd}{0}
\setcounter{liste}{0}
\setcounter{savedliste}{0}
\setcounter{listf}{0}
\setcounter{savedlistf}{0}
\setcounter{location}{0}
\setcounter{savedlocation}{0}
\setcounter{organization}{0}
\setcounter{savedorganization}{0}
\setcounter{origlocation}{0}
\setcounter{savedoriglocation}{0}
\setcounter{origpublisher}{0}
\setcounter{savedorigpublisher}{0}
\setcounter{publisher}{0}
\setcounter{savedpublisher}{0}
\setcounter{language}{0}
\setcounter{savedlanguage}{0}
\setcounter{origlanguage}{0}
\setcounter{savedoriglanguage}{0}
\setcounter{pageref}{0}
\setcounter{savedpageref}{0}
\setcounter{textcitecount}{0}
\setcounter{textcitetotal}{0}
\setcounter{textcitemaxnames}{0}
\setcounter{biburlnumpenalty}{0}
\setcounter{biburlucpenalty}{0}
\setcounter{biburllcpenalty}{0}
\setcounter{smartand}{1}
\setcounter{bbx:relatedcount}{0}
\setcounter{bbx:relatedtotal}{0}
\setcounter{Item}{11}
\setcounter{Hfootnote}{4}
\setcounter{bookmark@seq@number}{131}
\setcounter{nlinenum}{0}
\setcounter{algorithm}{2}
\setcounter{ALC@unique}{12}
\setcounter{ALC@line}{6}
\setcounter{ALC@rem}{0}
\setcounter{ALC@depth}{0}
\setcounter{@todonotes@numberoftodonotes}{0}
\setcounter{Changes@AuthorCount}{2}
\setcounter{Changes@Author}{2}
\setcounter{Changes@addedCount}{1}
\setcounter{Changes@deletedCount}{0}
\setcounter{Changes@replacedCount}{2}
\setcounter{Changes@highlightCount}{0}
\setcounter{Changes@commentCount}{0}
\setcounter{authorcommentcount}{0}
\setcounter{Changes@addedCount1}{41}
\setcounter{Changes@deletedCount1}{3}
\setcounter{Changes@replacedCount1}{9}
\setcounter{Changes@highlightCount1}{0}
\setcounter{Changes@commentCount1}{0}
\setcounter{lstnumber}{12}
\setcounter{FancyVerbLine}{0}
\setcounter{section@level}{0}
\setcounter{lstlisting}{5}
}
