%!PS-Adobe-3.0 EPSF-3.0
%%Creator: (MATLAB, The Mathworks, Inc. Version 9.5.0.944444 \(R2018b\). Operating System: Windows 10)
%%Title: (C:/Users/navsas/Dropbox/ION2019 Student Award/v02_07122018/fig/CRLB_EKF_REGvsHYB.eps)
%%CreationDate: 2019-01-23T14:20:07
%%Pages: (atend)
%%BoundingBox: 0 0 646 271
%%LanguageLevel: 3
%%EndComments
%%BeginProlog
%%BeginResource: procset (Apache XML Graphics Std ProcSet) 1.2 0
%%Version: 1.2 0
%%Copyright: (Copyright 2001-2003,2010 The Apache Software Foundation. License terms: http://www.apache.org/licenses/LICENSE-2.0)
/bd{bind def}bind def
/ld{load def}bd
/GR/grestore ld
/GS/gsave ld
/RM/rmoveto ld
/C/curveto ld
/t/show ld
/L/lineto ld
/ML/setmiterlimit ld
/CT/concat ld
/f/fill ld
/N/newpath ld
/S/stroke ld
/CC/setcmykcolor ld
/A/ashow ld
/cp/closepath ld
/RC/setrgbcolor ld
/LJ/setlinejoin ld
/GC/setgray ld
/LW/setlinewidth ld
/M/moveto ld
/re {4 2 roll M
1 index 0 rlineto
0 exch rlineto
neg 0 rlineto
cp } bd
/_ctm matrix def
/_tm matrix def
/BT { _ctm currentmatrix pop matrix _tm copy pop 0 0 moveto } bd
/ET { _ctm setmatrix } bd
/iTm { _ctm setmatrix _tm concat } bd
/Tm { _tm astore pop iTm 0 0 moveto } bd
/ux 0.0 def
/uy 0.0 def
/F {
  /Tp exch def
  /Tf exch def
  Tf findfont Tp scalefont setfont
  /cf Tf def  /cs Tp def
} bd
/ULS {currentpoint /uy exch def /ux exch def} bd
/ULE {
  /Tcx currentpoint pop def
  gsave
  newpath
  cf findfont cs scalefont dup
  /FontMatrix get 0 get /Ts exch def /FontInfo get dup
  /UnderlinePosition get Ts mul /To exch def
  /UnderlineThickness get Ts mul /Tt exch def
  ux uy To add moveto  Tcx uy To add lineto
  Tt setlinewidth stroke
  grestore
} bd
/OLE {
  /Tcx currentpoint pop def
  gsave
  newpath
  cf findfont cs scalefont dup
  /FontMatrix get 0 get /Ts exch def /FontInfo get dup
  /UnderlinePosition get Ts mul /To exch def
  /UnderlineThickness get Ts mul /Tt exch def
  ux uy To add cs add moveto Tcx uy To add cs add lineto
  Tt setlinewidth stroke
  grestore
} bd
/SOE {
  /Tcx currentpoint pop def
  gsave
  newpath
  cf findfont cs scalefont dup
  /FontMatrix get 0 get /Ts exch def /FontInfo get dup
  /UnderlinePosition get Ts mul /To exch def
  /UnderlineThickness get Ts mul /Tt exch def
  ux uy To add cs 10 mul 26 idiv add moveto Tcx uy To add cs 10 mul 26 idiv add lineto
  Tt setlinewidth stroke
  grestore
} bd
/QT {
/Y22 exch store
/X22 exch store
/Y21 exch store
/X21 exch store
currentpoint
/Y21 load 2 mul add 3 div exch
/X21 load 2 mul add 3 div exch
/X21 load 2 mul /X22 load add 3 div
/Y21 load 2 mul /Y22 load add 3 div
/X22 load /Y22 load curveto
} bd
/SSPD {
dup length /d exch dict def
{
/v exch def
/k exch def
currentpagedevice k known {
/cpdv currentpagedevice k get def
v cpdv ne {
/upd false def
/nullv v type /nulltype eq def
/nullcpdv cpdv type /nulltype eq def
nullv nullcpdv or
{
/upd true def
} {
/sametype v type cpdv type eq def
sametype {
v type /arraytype eq {
/vlen v length def
/cpdvlen cpdv length def
vlen cpdvlen eq {
0 1 vlen 1 sub {
/i exch def
/obj v i get def
/cpdobj cpdv i get def
obj cpdobj ne {
/upd true def
exit
} if
} for
} {
/upd true def
} ifelse
} {
v type /dicttype eq {
v {
/dv exch def
/dk exch def
/cpddv cpdv dk get def
dv cpddv ne {
/upd true def
exit
} if
} forall
} {
/upd true def
} ifelse
} ifelse
} if
} ifelse
upd true eq {
d k v put
} if
} if
} if
} forall
d length 0 gt {
d setpagedevice
} if
} bd
/RE { % /NewFontName [NewEncodingArray] /FontName RE -
  findfont dup length dict begin
  {
    1 index /FID ne
    {def} {pop pop} ifelse
  } forall
  /Encoding exch def
  /FontName 1 index def
  currentdict definefont pop
  end
} bind def
%%EndResource
%%BeginResource: procset (Apache XML Graphics EPS ProcSet) 1.0 0
%%Version: 1.0 0
%%Copyright: (Copyright 2002-2003 The Apache Software Foundation. License terms: http://www.apache.org/licenses/LICENSE-2.0)
/BeginEPSF { %def
/b4_Inc_state save def         % Save state for cleanup
/dict_count countdictstack def % Count objects on dict stack
/op_count count 1 sub def      % Count objects on operand stack
userdict begin                 % Push userdict on dict stack
/showpage { } def              % Redefine showpage, { } = null proc
0 setgray 0 setlinecap         % Prepare graphics state
1 setlinewidth 0 setlinejoin
10 setmiterlimit [ ] 0 setdash newpath
/languagelevel where           % If level not equal to 1 then
{pop languagelevel             % set strokeadjust and
1 ne                           % overprint to their defaults.
{false setstrokeadjust false setoverprint
} if
} if
} bd
/EndEPSF { %def
count op_count sub {pop} repeat            % Clean up stacks
countdictstack dict_count sub {end} repeat
b4_Inc_state restore
} bd
%%EndResource
%FOPBeginFontDict
%%IncludeResource: font Courier-Oblique
%%IncludeResource: font Courier-BoldOblique
%%IncludeResource: font Courier-Bold
%%IncludeResource: font ZapfDingbats
%%IncludeResource: font Symbol
%%IncludeResource: font Helvetica
%%IncludeResource: font Helvetica-Oblique
%%IncludeResource: font Helvetica-Bold
%%IncludeResource: font Helvetica-BoldOblique
%%IncludeResource: font Times-Roman
%%IncludeResource: font Times-Italic
%%IncludeResource: font Times-Bold
%%IncludeResource: font Times-BoldItalic
%%IncludeResource: font Courier
%FOPEndFontDict
%%BeginResource: encoding WinAnsiEncoding
/WinAnsiEncoding [
/.notdef /.notdef /.notdef /.notdef /.notdef
/.notdef /.notdef /.notdef /.notdef /.notdef
/.notdef /.notdef /.notdef /.notdef /.notdef
/.notdef /.notdef /.notdef /.notdef /.notdef
/.notdef /.notdef /.notdef /.notdef /.notdef
/.notdef /.notdef /.notdef /.notdef /.notdef
/.notdef /.notdef /space /exclam /quotedbl
/numbersign /dollar /percent /ampersand /quotesingle
/parenleft /parenright /asterisk /plus /comma
/hyphen /period /slash /zero /one
/two /three /four /five /six
/seven /eight /nine /colon /semicolon
/less /equal /greater /question /at
/A /B /C /D /E
/F /G /H /I /J
/K /L /M /N /O
/P /Q /R /S /T
/U /V /W /X /Y
/Z /bracketleft /backslash /bracketright /asciicircum
/underscore /quoteleft /a /b /c
/d /e /f /g /h
/i /j /k /l /m
/n /o /p /q /r
/s /t /u /v /w
/x /y /z /braceleft /bar
/braceright /asciitilde /bullet /Euro /bullet
/quotesinglbase /florin /quotedblbase /ellipsis /dagger
/daggerdbl /circumflex /perthousand /Scaron /guilsinglleft
/OE /bullet /Zcaron /bullet /bullet
/quoteleft /quoteright /quotedblleft /quotedblright /bullet
/endash /emdash /asciitilde /trademark /scaron
/guilsinglright /oe /bullet /zcaron /Ydieresis
/space /exclamdown /cent /sterling /currency
/yen /brokenbar /section /dieresis /copyright
/ordfeminine /guillemotleft /logicalnot /sfthyphen /registered
/macron /degree /plusminus /twosuperior /threesuperior
/acute /mu /paragraph /middot /cedilla
/onesuperior /ordmasculine /guillemotright /onequarter /onehalf
/threequarters /questiondown /Agrave /Aacute /Acircumflex
/Atilde /Adieresis /Aring /AE /Ccedilla
/Egrave /Eacute /Ecircumflex /Edieresis /Igrave
/Iacute /Icircumflex /Idieresis /Eth /Ntilde
/Ograve /Oacute /Ocircumflex /Otilde /Odieresis
/multiply /Oslash /Ugrave /Uacute /Ucircumflex
/Udieresis /Yacute /Thorn /germandbls /agrave
/aacute /acircumflex /atilde /adieresis /aring
/ae /ccedilla /egrave /eacute /ecircumflex
/edieresis /igrave /iacute /icircumflex /idieresis
/eth /ntilde /ograve /oacute /ocircumflex
/otilde /odieresis /divide /oslash /ugrave
/uacute /ucircumflex /udieresis /yacute /thorn
/ydieresis
] def
%%EndResource
%FOPBeginFontReencode
/Courier-Oblique findfont
dup length dict begin
  {1 index /FID ne {def} {pop pop} ifelse} forall
  /Encoding WinAnsiEncoding def
  currentdict
end
/Courier-Oblique exch definefont pop
/Courier-BoldOblique findfont
dup length dict begin
  {1 index /FID ne {def} {pop pop} ifelse} forall
  /Encoding WinAnsiEncoding def
  currentdict
end
/Courier-BoldOblique exch definefont pop
/Courier-Bold findfont
dup length dict begin
  {1 index /FID ne {def} {pop pop} ifelse} forall
  /Encoding WinAnsiEncoding def
  currentdict
end
/Courier-Bold exch definefont pop
/Helvetica findfont
dup length dict begin
  {1 index /FID ne {def} {pop pop} ifelse} forall
  /Encoding WinAnsiEncoding def
  currentdict
end
/Helvetica exch definefont pop
/Helvetica-Oblique findfont
dup length dict begin
  {1 index /FID ne {def} {pop pop} ifelse} forall
  /Encoding WinAnsiEncoding def
  currentdict
end
/Helvetica-Oblique exch definefont pop
/Helvetica-Bold findfont
dup length dict begin
  {1 index /FID ne {def} {pop pop} ifelse} forall
  /Encoding WinAnsiEncoding def
  currentdict
end
/Helvetica-Bold exch definefont pop
/Helvetica-BoldOblique findfont
dup length dict begin
  {1 index /FID ne {def} {pop pop} ifelse} forall
  /Encoding WinAnsiEncoding def
  currentdict
end
/Helvetica-BoldOblique exch definefont pop
/Times-Roman findfont
dup length dict begin
  {1 index /FID ne {def} {pop pop} ifelse} forall
  /Encoding WinAnsiEncoding def
  currentdict
end
/Times-Roman exch definefont pop
/Times-Italic findfont
dup length dict begin
  {1 index /FID ne {def} {pop pop} ifelse} forall
  /Encoding WinAnsiEncoding def
  currentdict
end
/Times-Italic exch definefont pop
/Times-Bold findfont
dup length dict begin
  {1 index /FID ne {def} {pop pop} ifelse} forall
  /Encoding WinAnsiEncoding def
  currentdict
end
/Times-Bold exch definefont pop
/Times-BoldItalic findfont
dup length dict begin
  {1 index /FID ne {def} {pop pop} ifelse} forall
  /Encoding WinAnsiEncoding def
  currentdict
end
/Times-BoldItalic exch definefont pop
/Courier findfont
dup length dict begin
  {1 index /FID ne {def} {pop pop} ifelse} forall
  /Encoding WinAnsiEncoding def
  currentdict
end
/Courier exch definefont pop
%FOPEndFontReencode
%%EndProlog
%%Page: 1 1
%%PageBoundingBox: 0 0 646 271
%%BeginPageSetup
[1 0 0 -1 0 271] CT
%%EndPageSetup
GS
[0.75 0 0 0.75 0 0.25] CT
1 GC
N
0 0 861 361 re
f
GR
GS
[0.75 0 0 0.75 0 0.25] CT
1 GC
N
0 0 861 361 re
f
GR
GS
[0.75 0 0 0.75 0 0.25] CT
1 GC
N
112 307 M
779 307 L
779 27 L
112 27 L
cp
f
GR
GS
[0.75 0 0 0.75 0 0.25] CT
0.873 GC
1 LJ
0.667 LW
N
112 307 M
112 27 L
S
GR
GS
[0.75 0 0 0.75 0 0.25] CT
0.873 GC
1 LJ
0.667 LW
N
193.54 307 M
193.54 27 L
S
GR
GS
[0.75 0 0 0.75 0 0.25] CT
0.873 GC
1 LJ
0.667 LW
N
275.081 307 M
275.081 27 L
S
GR
GS
[0.75 0 0 0.75 0 0.25] CT
0.873 GC
1 LJ
0.667 LW
N
356.621 307 M
356.621 27 L
S
GR
GS
[0.75 0 0 0.75 0 0.25] CT
0.873 GC
1 LJ
0.667 LW
N
438.161 307 M
438.161 27 L
S
GR
GS
[0.75 0 0 0.75 0 0.25] CT
0.873 GC
1 LJ
0.667 LW
N
519.702 307 M
519.702 27 L
S
GR
GS
[0.75 0 0 0.75 0 0.25] CT
0.873 GC
1 LJ
0.667 LW
N
601.242 307 M
601.242 27 L
S
GR
GS
[0.75 0 0 0.75 0 0.25] CT
0.873 GC
1 LJ
0.667 LW
N
682.782 307 M
682.782 27 L
S
GR
GS
[0.75 0 0 0.75 0 0.25] CT
0.873 GC
1 LJ
0.667 LW
N
764.323 307 M
764.323 27 L
S
GR
GS
[0.75 0 0 0.75 0 0.25] CT
0.775 GC
[1 3] 0 setdash
2 LJ
0.667 LW
N
779 285.512 M
112 285.512 L
S
GR
GS
[0.75 0 0 0.75 0 0.25] CT
0.775 GC
[1 3] 0 setdash
2 LJ
0.667 LW
N
779 264.864 M
112 264.864 L
S
GR
GS
[0.75 0 0 0.75 0 0.25] CT
0.775 GC
[1 3] 0 setdash
2 LJ
0.667 LW
N
779 248.849 M
112 248.849 L
S
GR
GS
[0.75 0 0 0.75 0 0.25] CT
0.775 GC
[1 3] 0 setdash
2 LJ
0.667 LW
N
779 235.764 M
112 235.764 L
S
GR
GS
[0.75 0 0 0.75 0 0.25] CT
0.775 GC
[1 3] 0 setdash
2 LJ
0.667 LW
N
779 224.7 M
112 224.7 L
S
GR
GS
[0.75 0 0 0.75 0 0.25] CT
0.775 GC
[1 3] 0 setdash
2 LJ
0.667 LW
N
779 215.116 M
112 215.116 L
S
GR
GS
[0.75 0 0 0.75 0 0.25] CT
0.775 GC
[1 3] 0 setdash
2 LJ
0.667 LW
N
779 206.663 M
112 206.663 L
S
GR
GS
[0.75 0 0 0.75 0 0.25] CT
0.775 GC
[1 3] 0 setdash
2 LJ
0.667 LW
N
779 149.353 M
112 149.353 L
S
GR
GS
[0.75 0 0 0.75 0 0.25] CT
0.775 GC
[1 3] 0 setdash
2 LJ
0.667 LW
N
779 120.252 M
112 120.252 L
S
GR
GS
[0.75 0 0 0.75 0 0.25] CT
0.775 GC
[1 3] 0 setdash
2 LJ
0.667 LW
N
779 99.604 M
112 99.604 L
S
GR
GS
[0.75 0 0 0.75 0 0.25] CT
0.775 GC
[1 3] 0 setdash
2 LJ
0.667 LW
N
779 83.589 M
112 83.589 L
S
GR
GS
[0.75 0 0 0.75 0 0.25] CT
0.775 GC
[1 3] 0 setdash
2 LJ
0.667 LW
N
779 70.503 M
112 70.503 L
S
GR
GS
[0.75 0 0 0.75 0 0.25] CT
0.775 GC
[1 3] 0 setdash
2 LJ
0.667 LW
N
779 59.44 M
112 59.44 L
S
GR
GS
[0.75 0 0 0.75 0 0.25] CT
0.775 GC
[1 3] 0 setdash
2 LJ
0.667 LW
N
779 49.856 M
112 49.856 L
S
GR
GS
[0.75 0 0 0.75 0 0.25] CT
0.775 GC
[1 3] 0 setdash
2 LJ
0.667 LW
N
779 41.402 M
112 41.402 L
S
GR
GS
[0.75 0 0 0.75 0 0.25] CT
0.873 GC
1 LJ
0.667 LW
N
779 199.101 M
112 199.101 L
S
GR
GS
[0.75 0 0 0.75 0 0.25] CT
0.873 GC
1 LJ
0.667 LW
N
779 33.841 M
112 33.841 L
S
GR
GS
[0.75 0 0 0.75 0 0.25] CT
0.149 GC
2 setlinecap
1 LJ
0.667 LW
N
112 307 M
779 307 L
S
GR
GS
[0.75 0 0 0.75 0 0.25] CT
0.149 GC
2 setlinecap
1 LJ
0.667 LW
N
112 27 M
779 27 L
S
GR
GS
[0.75 0 0 0.75 0 0.25] CT
0.149 GC
2 setlinecap
1 LJ
0.667 LW
N
112 307 M
112 300.33 L
S
GR
GS
[0.75 0 0 0.75 0 0.25] CT
0.149 GC
2 setlinecap
1 LJ
0.667 LW
N
193.54 307 M
193.54 300.33 L
S
GR
GS
[0.75 0 0 0.75 0 0.25] CT
0.149 GC
2 setlinecap
1 LJ
0.667 LW
N
275.081 307 M
275.081 300.33 L
S
GR
GS
[0.75 0 0 0.75 0 0.25] CT
0.149 GC
2 setlinecap
1 LJ
0.667 LW
N
356.621 307 M
356.621 300.33 L
S
GR
GS
[0.75 0 0 0.75 0 0.25] CT
0.149 GC
2 setlinecap
1 LJ
0.667 LW
N
438.161 307 M
438.161 300.33 L
S
GR
GS
[0.75 0 0 0.75 0 0.25] CT
0.149 GC
2 setlinecap
1 LJ
0.667 LW
N
519.702 307 M
519.702 300.33 L
S
GR
GS
[0.75 0 0 0.75 0 0.25] CT
0.149 GC
2 setlinecap
1 LJ
0.667 LW
N
601.242 307 M
601.242 300.33 L
S
GR
GS
[0.75 0 0 0.75 0 0.25] CT
0.149 GC
2 setlinecap
1 LJ
0.667 LW
N
682.782 307 M
682.782 300.33 L
S
GR
GS
[0.75 0 0 0.75 0 0.25] CT
0.149 GC
2 setlinecap
1 LJ
0.667 LW
N
764.323 307 M
764.323 300.33 L
S
GR
GS
[0.75 0 0 0.75 0 0.25] CT
0.149 GC
2 setlinecap
1 LJ
0.667 LW
N
112 27 M
112 33.67 L
S
GR
GS
[0.75 0 0 0.75 0 0.25] CT
0.149 GC
2 setlinecap
1 LJ
0.667 LW
N
193.54 27 M
193.54 33.67 L
S
GR
GS
[0.75 0 0 0.75 0 0.25] CT
0.149 GC
2 setlinecap
1 LJ
0.667 LW
N
275.081 27 M
275.081 33.67 L
S
GR
GS
[0.75 0 0 0.75 0 0.25] CT
0.149 GC
2 setlinecap
1 LJ
0.667 LW
N
356.621 27 M
356.621 33.67 L
S
GR
GS
[0.75 0 0 0.75 0 0.25] CT
0.149 GC
2 setlinecap
1 LJ
0.667 LW
N
438.161 27 M
438.161 33.67 L
S
GR
GS
[0.75 0 0 0.75 0 0.25] CT
0.149 GC
2 setlinecap
1 LJ
0.667 LW
N
519.702 27 M
519.702 33.67 L
S
GR
GS
[0.75 0 0 0.75 0 0.25] CT
0.149 GC
2 setlinecap
1 LJ
0.667 LW
N
601.242 27 M
601.242 33.67 L
S
GR
GS
[0.75 0 0 0.75 0 0.25] CT
0.149 GC
2 setlinecap
1 LJ
0.667 LW
N
682.782 27 M
682.782 33.67 L
S
GR
GS
[0.75 0 0 0.75 0 0.25] CT
0.149 GC
2 setlinecap
1 LJ
0.667 LW
N
764.323 27 M
764.323 33.67 L
S
GR
GS
[0.75 0 0 0.75 84 235.3] CT
0.149 GC
N
0.083 16.102 M
-2.245 16.102 -3.081 14.18 QT
-3.917 12.258 -3.917 9.617 QT
-3.917 7.977 -3.62 6.516 QT
-3.323 5.055 -2.424 4.039 QT
-1.526 3.024 0.083 3.024 QT
1.333 3.024 2.13 3.633 QT
2.927 4.242 3.349 5.219 QT
3.771 6.196 3.919 7.297 QT
4.068 8.399 4.068 9.617 QT
4.068 11.258 3.771 12.68 QT
3.474 14.102 2.591 15.102 QT
1.708 16.102 0.083 16.102 QT
cp
0.083 15.602 M
1.146 15.602 1.661 14.516 QT
2.177 13.43 2.302 12.117 QT
2.427 10.805 2.427 9.321 QT
2.427 7.883 2.302 6.68 QT
2.177 5.477 1.661 4.5 QT
1.146 3.524 0.083 3.524 QT
-0.995 3.524 -1.51 4.5 QT
-2.026 5.477 -2.151 6.68 QT
-2.276 7.883 -2.276 9.321 QT
-2.276 10.367 -2.221 11.305 QT
-2.167 12.242 -1.948 13.242 QT
-1.729 14.242 -1.229 14.922 QT
-0.729 15.602 0.083 15.602 QT
cp
f
GR
GS
[0.75 0 0 0.75 145.15526 235.3] CT
0.149 GC
N
-7.677 13.524 M
-7.49 14.071 -7.083 14.524 QT
-6.677 14.977 -6.13 15.235 QT
-5.583 15.492 -4.99 15.492 QT
-3.615 15.492 -3.091 14.43 QT
-2.568 13.367 -2.568 11.836 QT
-2.568 11.18 -2.591 10.727 QT
-2.615 10.274 -2.724 9.867 QT
-2.896 9.196 -3.333 8.696 QT
-3.771 8.196 -4.411 8.196 QT
-5.052 8.196 -5.513 8.391 QT
-5.974 8.586 -6.263 8.844 QT
-6.552 9.102 -6.771 9.391 QT
-6.99 9.68 -7.052 9.696 QT
-7.271 9.696 L
-7.318 9.696 -7.38 9.633 QT
-7.443 9.571 -7.443 9.524 QT
-7.443 3.18 L
-7.443 3.133 -7.388 3.078 QT
-7.333 3.024 -7.271 3.024 QT
-7.208 3.024 L
-5.927 3.633 -4.49 3.633 QT
-3.083 3.633 -1.771 3.024 QT
-1.724 3.024 L
-1.646 3.024 -1.591 3.071 QT
-1.536 3.117 -1.536 3.18 QT
-1.536 3.352 L
-1.536 3.446 -1.583 3.446 QT
-2.224 4.305 -3.201 4.789 QT
-4.177 5.274 -5.24 5.274 QT
-5.99 5.274 -6.786 5.055 QT
-6.786 8.649 L
-6.161 8.133 -5.661 7.914 QT
-5.161 7.696 -4.396 7.696 QT
-3.349 7.696 -2.521 8.305 QT
-1.693 8.914 -1.247 9.883 QT
-0.802 10.852 -0.802 11.852 QT
-0.802 12.992 -1.365 13.969 QT
-1.927 14.946 -2.888 15.524 QT
-3.849 16.102 -4.99 16.102 QT
-5.911 16.102 -6.701 15.617 QT
-7.49 15.133 -7.935 14.313 QT
-8.38 13.492 -8.38 12.586 QT
-8.38 12.149 -8.107 11.883 QT
-7.833 11.617 -7.411 11.617 QT
-6.99 11.617 -6.708 11.891 QT
-6.427 12.164 -6.427 12.586 QT
-6.427 12.992 -6.708 13.274 QT
-6.99 13.555 -7.411 13.555 QT
-7.474 13.555 -7.56 13.539 QT
-7.646 13.524 -7.677 13.524 QT
cp
f
GR
GS
[0.75 0 0 0.75 145.15526 235.3] CT
0.149 GC
N
4.75 16.102 M
2.422 16.102 1.586 14.18 QT
0.75 12.258 0.75 9.617 QT
0.75 7.977 1.047 6.516 QT
1.344 5.055 2.242 4.039 QT
3.141 3.024 4.75 3.024 QT
6 3.024 6.797 3.633 QT
7.594 4.242 8.016 5.219 QT
8.438 6.196 8.586 7.297 QT
8.734 8.399 8.734 9.617 QT
8.734 11.258 8.438 12.68 QT
8.141 14.102 7.258 15.102 QT
6.375 16.102 4.75 16.102 QT
cp
4.75 15.602 M
5.813 15.602 6.328 14.516 QT
6.844 13.43 6.969 12.117 QT
7.094 10.805 7.094 9.321 QT
7.094 7.883 6.969 6.68 QT
6.844 5.477 6.328 4.5 QT
5.813 3.524 4.75 3.524 QT
3.672 3.524 3.156 4.5 QT
2.641 5.477 2.516 6.68 QT
2.391 7.883 2.391 9.321 QT
2.391 10.367 2.445 11.305 QT
2.5 12.242 2.719 13.242 QT
2.938 14.242 3.438 14.922 QT
3.938 15.602 4.75 15.602 QT
cp
f
GR
GS
[0.75 0 0 0.75 206.31052 235.3] CT
0.149 GC
N
-12.234 15.68 M
-12.234 15.008 L
-9.859 15.008 -9.859 14.414 QT
-9.859 4.43 L
-10.844 4.914 -12.344 4.914 QT
-12.344 4.242 L
-10.016 4.242 -8.828 3.024 QT
-8.563 3.024 L
-8.5 3.024 -8.438 3.078 QT
-8.375 3.133 -8.375 3.196 QT
-8.375 14.414 L
-8.375 15.008 -6 15.008 QT
-6 15.68 L
-12.234 15.68 L
cp
f
GR
GS
[0.75 0 0 0.75 206.31052 235.3] CT
0.149 GC
N
/f-1042494437{0.083 16.102 M
-2.245 16.102 -3.081 14.18 QT
-3.917 12.258 -3.917 9.617 QT
-3.917 7.977 -3.62 6.516 QT
-3.323 5.055 -2.424 4.039 QT
-1.526 3.024 0.083 3.024 QT
1.333 3.024 2.13 3.633 QT
2.927 4.242 3.349 5.219 QT
3.771 6.196 3.919 7.297 QT
4.068 8.399 4.068 9.617 QT
4.068 11.258 3.771 12.68 QT
3.474 14.102 2.591 15.102 QT
1.708 16.102 0.083 16.102 QT
cp
0.083 15.602 M
1.146 15.602 1.661 14.516 QT
2.177 13.43 2.302 12.117 QT
2.427 10.805 2.427 9.321 QT
2.427 7.883 2.302 6.68 QT
2.177 5.477 1.661 4.5 QT
1.146 3.524 0.083 3.524 QT
-0.995 3.524 -1.51 4.5 QT
-2.026 5.477 -2.151 6.68 QT
-2.276 7.883 -2.276 9.321 QT
-2.276 10.367 -2.221 11.305 QT
-2.167 12.242 -1.948 13.242 QT
-1.729 14.242 -1.229 14.922 QT
-0.729 15.602 0.083 15.602 QT
cp}def
f-1042494437
f
GR
GS
[0.75 0 0 0.75 206.31052 235.3] CT
0.149 GC
N
/f1861641624{9.417 16.102 M
7.089 16.102 6.253 14.18 QT
5.417 12.258 5.417 9.617 QT
5.417 7.977 5.714 6.516 QT
6.01 5.055 6.909 4.039 QT
7.807 3.024 9.417 3.024 QT
10.667 3.024 11.464 3.633 QT
12.26 4.242 12.682 5.219 QT
13.104 6.196 13.253 7.297 QT
13.401 8.399 13.401 9.617 QT
13.401 11.258 13.104 12.68 QT
12.807 14.102 11.925 15.102 QT
11.042 16.102 9.417 16.102 QT
cp
9.417 15.602 M
10.479 15.602 10.995 14.516 QT
11.51 13.43 11.635 12.117 QT
11.76 10.805 11.76 9.321 QT
11.76 7.883 11.635 6.68 QT
11.51 5.477 10.995 4.5 QT
10.479 3.524 9.417 3.524 QT
8.339 3.524 7.823 4.5 QT
7.307 5.477 7.182 6.68 QT
7.057 7.883 7.057 9.321 QT
7.057 10.367 7.112 11.305 QT
7.167 12.242 7.385 13.242 QT
7.604 14.242 8.104 14.922 QT
8.604 15.602 9.417 15.602 QT
cp}def
f1861641624
f
GR
GS
[0.75 0 0 0.75 267.46577 235.3] CT
0.149 GC
N
/f1641023337{-12.234 15.68 M
-12.234 15.008 L
-9.859 15.008 -9.859 14.414 QT
-9.859 4.43 L
-10.844 4.914 -12.344 4.914 QT
-12.344 4.242 L
-10.016 4.242 -8.828 3.024 QT
-8.563 3.024 L
-8.5 3.024 -8.438 3.078 QT
-8.375 3.133 -8.375 3.196 QT
-8.375 14.414 L
-8.375 15.008 -6 15.008 QT
-6 15.68 L
-12.234 15.68 L
cp}def
f1641023337
f
GR
GS
[0.75 0 0 0.75 267.46577 235.3] CT
0.149 GC
N
/f-490769743{-3.01 13.524 M
-2.823 14.071 -2.417 14.524 QT
-2.01 14.977 -1.464 15.235 QT
-0.917 15.492 -0.323 15.492 QT
1.052 15.492 1.576 14.43 QT
2.099 13.367 2.099 11.836 QT
2.099 11.18 2.076 10.727 QT
2.052 10.274 1.943 9.867 QT
1.771 9.196 1.333 8.696 QT
0.896 8.196 0.255 8.196 QT
-0.385 8.196 -0.846 8.391 QT
-1.307 8.586 -1.596 8.844 QT
-1.885 9.102 -2.104 9.391 QT
-2.323 9.68 -2.385 9.696 QT
-2.604 9.696 L
-2.651 9.696 -2.714 9.633 QT
-2.776 9.571 -2.776 9.524 QT
-2.776 3.18 L
-2.776 3.133 -2.721 3.078 QT
-2.667 3.024 -2.604 3.024 QT
-2.542 3.024 L
-1.26 3.633 0.177 3.633 QT
1.583 3.633 2.896 3.024 QT
2.943 3.024 L
3.021 3.024 3.076 3.071 QT
3.13 3.117 3.13 3.18 QT
3.13 3.352 L
3.13 3.446 3.083 3.446 QT
2.443 4.305 1.466 4.789 QT
0.49 5.274 -0.573 5.274 QT
-1.323 5.274 -2.12 5.055 QT
-2.12 8.649 L
-1.495 8.133 -0.995 7.914 QT
-0.495 7.696 0.271 7.696 QT
1.318 7.696 2.146 8.305 QT
2.974 8.914 3.419 9.883 QT
3.865 10.852 3.865 11.852 QT
3.865 12.992 3.302 13.969 QT
2.74 14.946 1.779 15.524 QT
0.818 16.102 -0.323 16.102 QT
-1.245 16.102 -2.034 15.617 QT
-2.823 15.133 -3.268 14.313 QT
-3.714 13.492 -3.714 12.586 QT
-3.714 12.149 -3.44 11.883 QT
-3.167 11.617 -2.745 11.617 QT
-2.323 11.617 -2.042 11.891 QT
-1.76 12.164 -1.76 12.586 QT
-1.76 12.992 -2.042 13.274 QT
-2.323 13.555 -2.745 13.555 QT
-2.807 13.555 -2.893 13.539 QT
-2.979 13.524 -3.01 13.524 QT
cp}def
f-490769743
f
GR
GS
[0.75 0 0 0.75 267.46577 235.3] CT
0.149 GC
N
f1861641624
f
GR
GS
[0.75 0 0 0.75 328.62103 235.3] CT
0.149 GC
N
/f-91636092{-13.047 15.68 M
-13.047 15.164 L
-13.047 15.117 -13.016 15.071 QT
-10.063 11.805 L
-9.391 11.071 -8.977 10.586 QT
-8.563 10.102 -8.156 9.461 QT
-7.75 8.821 -7.516 8.156 QT
-7.281 7.492 -7.281 6.742 QT
-7.281 5.961 -7.563 5.25 QT
-7.844 4.539 -8.414 4.117 QT
-8.984 3.696 -9.797 3.696 QT
-10.625 3.696 -11.281 4.188 QT
-11.938 4.68 -12.203 5.477 QT
-12.141 5.461 -12 5.461 QT
-11.578 5.461 -11.273 5.742 QT
-10.969 6.024 -10.969 6.492 QT
-10.969 6.914 -11.273 7.219 QT
-11.578 7.524 -12 7.524 QT
-12.453 7.524 -12.75 7.211 QT
-13.047 6.899 -13.047 6.492 QT
-13.047 5.774 -12.781 5.149 QT
-12.516 4.524 -12.008 4.031 QT
-11.5 3.539 -10.867 3.281 QT
-10.234 3.024 -9.516 3.024 QT
-8.438 3.024 -7.5 3.485 QT
-6.563 3.946 -6.016 4.781 QT
-5.469 5.617 -5.469 6.742 QT
-5.469 7.571 -5.828 8.313 QT
-6.188 9.055 -6.75 9.664 QT
-7.313 10.274 -8.195 11.039 QT
-9.078 11.805 -9.359 12.071 QT
-11.516 14.133 L
-9.688 14.133 L
-8.344 14.133 -7.438 14.11 QT
-6.531 14.086 -6.469 14.039 QT
-6.25 13.805 -6.016 12.289 QT
-5.469 12.289 L
-6 15.68 L
-13.047 15.68 L
cp}def
f-91636092
f
GR
GS
[0.75 0 0 0.75 328.62103 235.3] CT
0.149 GC
N
f-1042494437
f
GR
GS
[0.75 0 0 0.75 328.62103 235.3] CT
0.149 GC
N
f1861641624
f
GR
GS
[0.75 0 0 0.75 389.77629 235.3] CT
0.149 GC
N
f-91636092
f
GR
GS
[0.75 0 0 0.75 389.77629 235.3] CT
0.149 GC
N
f-490769743
f
GR
GS
[0.75 0 0 0.75 389.77629 235.3] CT
0.149 GC
N
f1861641624
f
GR
GS
[0.75 0 0 0.75 450.93155 235.3] CT
0.149 GC
N
/f-1792458872{-12.188 14.211 M
-11.75 14.867 -11 15.18 QT
-10.25 15.492 -9.375 15.492 QT
-8.281 15.492 -7.813 14.555 QT
-7.344 13.617 -7.344 12.414 QT
-7.344 11.883 -7.445 11.344 QT
-7.547 10.805 -7.773 10.336 QT
-8 9.867 -8.406 9.594 QT
-8.813 9.321 -9.391 9.321 QT
-10.656 9.321 L
-10.828 9.321 -10.828 9.133 QT
-10.828 8.977 L
-10.828 8.821 -10.656 8.821 QT
-9.609 8.742 L
-8.938 8.742 -8.5 8.242 QT
-8.063 7.742 -7.859 7.024 QT
-7.656 6.305 -7.656 5.649 QT
-7.656 4.742 -8.078 4.156 QT
-8.5 3.571 -9.375 3.571 QT
-10.109 3.571 -10.766 3.844 QT
-11.422 4.117 -11.813 4.68 QT
-11.766 4.664 -11.742 4.664 QT
-11.719 4.664 -11.688 4.664 QT
-11.25 4.664 -10.961 4.961 QT
-10.672 5.258 -10.672 5.664 QT
-10.672 6.071 -10.961 6.367 QT
-11.25 6.664 -11.688 6.664 QT
-12.094 6.664 -12.391 6.367 QT
-12.688 6.071 -12.688 5.664 QT
-12.688 4.852 -12.195 4.25 QT
-11.703 3.649 -10.93 3.336 QT
-10.156 3.024 -9.375 3.024 QT
-8.797 3.024 -8.164 3.196 QT
-7.531 3.367 -7.008 3.688 QT
-6.484 4.008 -6.156 4.508 QT
-5.828 5.008 -5.828 5.649 QT
-5.828 6.446 -6.188 7.125 QT
-6.547 7.805 -7.164 8.297 QT
-7.781 8.789 -8.531 9.024 QT
-7.703 9.18 -6.961 9.649 QT
-6.219 10.117 -5.766 10.836 QT
-5.313 11.555 -5.313 12.399 QT
-5.313 13.446 -5.891 14.297 QT
-6.469 15.149 -7.406 15.625 QT
-8.344 16.102 -9.375 16.102 QT
-10.266 16.102 -11.164 15.758 QT
-12.063 15.414 -12.633 14.742 QT
-13.203 14.071 -13.203 13.117 QT
-13.203 12.649 -12.891 12.328 QT
-12.578 12.008 -12.094 12.008 QT
-11.797 12.008 -11.539 12.156 QT
-11.281 12.305 -11.141 12.563 QT
-11 12.821 -11 13.117 QT
-11 13.586 -11.32 13.899 QT
-11.641 14.211 -12.094 14.211 QT
-12.188 14.211 L
cp}def
f-1792458872
f
GR
GS
[0.75 0 0 0.75 450.93155 235.3] CT
0.149 GC
N
f-1042494437
f
GR
GS
[0.75 0 0 0.75 450.93155 235.3] CT
0.149 GC
N
f1861641624
f
GR
GS
[0.75 0 0 0.75 512.08681 235.3] CT
0.149 GC
N
f-1792458872
f
GR
GS
[0.75 0 0 0.75 512.08681 235.3] CT
0.149 GC
N
f-490769743
f
GR
GS
[0.75 0 0 0.75 512.08681 235.3] CT
0.149 GC
N
f1861641624
f
GR
GS
[0.75 0 0 0.75 573.24207 235.3] CT
0.149 GC
N
/f-355302530{-13.469 12.539 M
-13.469 11.883 L
-7.594 3.117 L
-7.531 3.024 -7.406 3.024 QT
-7.125 3.024 L
-6.906 3.024 -6.906 3.242 QT
-6.906 11.883 L
-5.047 11.883 L
-5.047 12.539 L
-6.906 12.539 L
-6.906 14.414 L
-6.906 14.805 -6.352 14.906 QT
-5.797 15.008 -5.063 15.008 QT
-5.063 15.68 L
-10.297 15.68 L
-10.297 15.008 L
-9.563 15.008 -9.008 14.906 QT
-8.453 14.805 -8.453 14.414 QT
-8.453 12.539 L
-13.469 12.539 L
cp
-12.844 11.883 M
-8.344 11.883 L
-8.344 5.149 L
-12.844 11.883 L
cp}def
f-355302530
f
GR
GS
[0.75 0 0 0.75 573.24207 235.3] CT
0.149 GC
N
f-1042494437
f
GR
GS
[0.75 0 0 0.75 573.24207 235.3] CT
0.149 GC
N
f1861641624
f
GR
GS
[0.75 0 0 0.75 334.12523 252.35] CT
0.149 GC
N
/f1170163587{-35.295 17.248 M
-35.295 16.514 L
-34.233 16.514 -33.241 16.396 QT
-32.249 16.279 -32.249 15.842 QT
-32.249 4.31 L
-32.249 3.857 -32.499 3.748 QT
-32.749 3.639 -33.311 3.639 QT
-34.202 3.639 L
-35.936 3.639 -36.655 4.404 QT
-37.03 4.779 -37.194 5.615 QT
-37.358 6.451 -37.483 7.717 QT
-38.077 7.717 L
-37.686 2.904 L
-24.858 2.904 L
-24.452 7.717 L
-25.077 7.717 L
-25.202 6.357 -25.35 5.56 QT
-25.499 4.764 -25.874 4.404 QT
-26.624 3.639 -28.342 3.639 QT
-29.217 3.639 L
-29.608 3.639 -29.819 3.67 QT
-30.03 3.701 -30.163 3.849 QT
-30.295 3.998 -30.295 4.31 QT
-30.295 15.842 L
-30.295 16.279 -29.295 16.396 QT
-28.295 16.514 -27.249 16.514 QT
-27.249 17.248 L
-35.295 17.248 L
cp}def
f1170163587
f
GR
GS
[0.75 0 0 0.75 334.12523 252.35] CT
0.149 GC
N
/f1546403335{-23.372 17.248 M
-23.372 16.514 L
-22.653 16.514 -22.192 16.396 QT
-21.731 16.279 -21.731 15.842 QT
-21.731 10.107 L
-21.731 9.295 -22.044 9.115 QT
-22.356 8.935 -23.278 8.935 QT
-23.278 8.201 L
-20.247 7.967 L
-20.247 15.842 L
-20.247 16.279 -19.849 16.396 QT
-19.45 16.514 -18.778 16.514 QT
-18.778 17.248 L
-23.372 17.248 L
cp
-22.481 4.357 M
-22.481 3.904 -22.13 3.553 QT
-21.778 3.201 -21.325 3.201 QT
-21.028 3.201 -20.755 3.357 QT
-20.481 3.514 -20.325 3.787 QT
-20.169 4.06 -20.169 4.357 QT
-20.169 4.81 -20.52 5.162 QT
-20.872 5.514 -21.325 5.514 QT
-21.778 5.514 -22.13 5.162 QT
-22.481 4.81 -22.481 4.357 QT
cp}def
f1546403335
f
GR
GS
[0.75 0 0 0.75 334.12523 252.35] CT
0.149 GC
N
/f-1255559272{-17.684 17.248 M
-17.684 16.514 L
-16.965 16.514 -16.504 16.396 QT
-16.043 16.279 -16.043 15.842 QT
-16.043 10.107 L
-16.043 9.545 -16.215 9.295 QT
-16.387 9.045 -16.7 8.99 QT
-17.012 8.935 -17.684 8.935 QT
-17.684 8.201 L
-14.637 7.967 L
-14.637 10.014 L
-14.215 9.123 -13.387 8.545 QT
-12.559 7.967 -11.59 7.967 QT
-9.168 7.967 -8.746 9.935 QT
-8.325 9.06 -7.52 8.514 QT
-6.715 7.967 -5.746 7.967 QT
-4.793 7.967 -4.145 8.271 QT
-3.496 8.576 -3.168 9.209 QT
-2.84 9.842 -2.84 10.795 QT
-2.84 15.842 L
-2.84 16.279 -2.371 16.396 QT
-1.903 16.514 -1.2 16.514 QT
-1.2 17.248 L
-5.996 17.248 L
-5.996 16.514 L
-5.293 16.514 -4.825 16.396 QT
-4.356 16.279 -4.356 15.842 QT
-4.356 10.857 L
-4.356 9.81 -4.66 9.162 QT
-4.965 8.514 -5.887 8.514 QT
-7.09 8.514 -7.879 9.49 QT
-8.668 10.467 -8.668 11.701 QT
-8.668 15.842 L
-8.668 16.279 -8.207 16.396 QT
-7.746 16.514 -7.028 16.514 QT
-7.028 17.248 L
-11.84 17.248 L
-11.84 16.514 L
-11.121 16.514 -10.66 16.396 QT
-10.2 16.279 -10.2 15.842 QT
-10.2 10.857 L
-10.2 9.842 -10.496 9.178 QT
-10.793 8.514 -11.715 8.514 QT
-12.934 8.514 -13.723 9.49 QT
-14.512 10.467 -14.512 11.701 QT
-14.512 15.842 L
-14.512 16.279 -14.043 16.396 QT
-13.575 16.514 -12.871 16.514 QT
-12.871 17.248 L
-17.684 17.248 L
cp}def
f-1255559272
f
GR
GS
[0.75 0 0 0.75 334.12523 252.35] CT
0.149 GC
N
/f199504142{4.037 17.482 M
2.755 17.482 1.685 16.81 QT
0.615 16.139 -0.002 15.014 QT
-0.62 13.889 -0.62 12.639 QT
-0.62 11.42 -0.057 10.31 QT
0.505 9.201 1.505 8.521 QT
2.505 7.842 3.74 7.842 QT
4.693 7.842 5.412 8.162 QT
6.13 8.482 6.591 9.053 QT
7.052 9.623 7.287 10.404 QT
7.521 11.185 7.521 12.123 QT
7.521 12.404 7.302 12.404 QT
1.224 12.404 L
1.224 12.623 L
1.224 14.373 1.927 15.623 QT
2.63 16.873 4.224 16.873 QT
4.865 16.873 5.412 16.584 QT
5.959 16.295 6.365 15.779 QT
6.771 15.264 6.912 14.685 QT
6.927 14.607 6.99 14.553 QT
7.052 14.498 7.115 14.498 QT
7.302 14.498 L
7.521 14.498 7.521 14.764 QT
7.224 15.951 6.24 16.717 QT
5.255 17.482 4.037 17.482 QT
cp
1.24 11.873 M
6.037 11.873 L
6.037 11.092 5.81 10.279 QT
5.584 9.467 5.076 8.928 QT
4.568 8.389 3.74 8.389 QT
2.552 8.389 1.896 9.498 QT
1.24 10.607 1.24 11.873 QT
cp}def
f199504142
f
GR
GS
[0.75 0 0 0.75 334.12523 252.35] CT
0.149 GC
N
/f747398244{21.288 22.451 M
20.116 21.529 19.273 20.334 QT
18.429 19.139 17.89 17.787 QT
17.351 16.435 17.085 14.959 QT
16.819 13.482 16.819 11.998 QT
16.819 10.498 17.085 9.021 QT
17.351 7.545 17.898 6.178 QT
18.444 4.81 19.296 3.623 QT
20.148 2.435 21.288 1.545 QT
21.288 1.498 21.382 1.498 QT
21.585 1.498 L
21.648 1.498 21.694 1.553 QT
21.741 1.607 21.741 1.685 QT
21.741 1.779 21.71 1.81 QT
20.679 2.826 19.999 3.974 QT
19.319 5.123 18.905 6.42 QT
18.491 7.717 18.304 9.107 QT
18.116 10.498 18.116 11.998 QT
18.116 18.67 21.679 22.139 QT
21.741 22.201 21.741 22.31 QT
21.741 22.357 21.687 22.428 QT
21.632 22.498 21.585 22.498 QT
21.382 22.498 L
21.288 22.498 21.288 22.451 QT
cp}def
f747398244
f
GR
GS
[0.75 0 0 0.75 334.12523 252.35] CT
0.149 GC
N
/f1993350971{23.461 17.31 M
23.461 13.889 L
23.461 13.717 23.633 13.717 QT
23.898 13.717 L
24.023 13.717 24.055 13.889 QT
24.648 16.935 26.883 16.935 QT
27.883 16.935 28.555 16.482 QT
29.227 16.029 29.227 15.092 QT
29.227 14.404 28.703 13.928 QT
28.18 13.451 27.461 13.279 QT
26.055 12.998 L
25.352 12.842 24.773 12.529 QT
24.195 12.217 23.828 11.685 QT
23.461 11.154 23.461 10.467 QT
23.461 9.529 23.945 8.943 QT
24.43 8.357 25.211 8.099 QT
25.992 7.842 26.883 7.842 QT
27.961 7.842 28.773 8.404 QT
29.367 7.889 L
29.367 7.842 29.477 7.842 QT
29.633 7.842 L
29.695 7.842 29.742 7.896 QT
29.789 7.951 29.789 8.014 QT
29.789 10.764 L
29.789 10.951 29.633 10.951 QT
29.367 10.951 L
29.18 10.951 29.18 10.764 QT
29.18 9.654 28.57 8.99 QT
27.961 8.326 26.867 8.326 QT
25.93 8.326 25.234 8.678 QT
24.539 9.029 24.539 9.873 QT
24.539 10.467 25.039 10.834 QT
25.539 11.201 26.211 11.373 QT
27.633 11.639 L
28.352 11.81 28.969 12.193 QT
29.586 12.576 29.953 13.178 QT
30.32 13.779 30.32 14.514 QT
30.32 15.279 30.055 15.842 QT
29.789 16.404 29.32 16.771 QT
28.852 17.139 28.219 17.31 QT
27.586 17.482 26.883 17.482 QT
25.57 17.482 24.648 16.607 QT
23.883 17.435 L
23.883 17.482 23.758 17.482 QT
23.633 17.482 L
23.461 17.482 23.461 17.31 QT
cp}def
f1993350971
f
GR
GS
[0.75 0 0 0.75 334.12523 252.35] CT
0.149 GC
N
/f1737697257{32.216 22.498 M
32.029 22.498 32.029 22.31 QT
32.029 22.217 32.076 22.185 QT
35.67 18.67 35.67 11.998 QT
35.67 5.326 32.123 1.857 QT
32.029 1.81 32.029 1.685 QT
32.029 1.607 32.091 1.553 QT
32.154 1.498 32.216 1.498 QT
32.42 1.498 L
32.482 1.498 32.513 1.545 QT
34.029 2.732 35.029 4.435 QT
36.029 6.139 36.498 8.06 QT
36.966 9.982 36.966 11.998 QT
36.966 13.482 36.716 14.928 QT
36.466 16.373 35.92 17.771 QT
35.373 19.17 34.529 20.349 QT
33.685 21.529 32.513 22.451 QT
32.482 22.498 32.42 22.498 QT
32.216 22.498 L
cp}def
f1737697257
f
GR
GS
[0.75 0 0 0.75 0 0.25] CT
0.149 GC
2 setlinecap
1 LJ
0.667 LW
N
112 307 M
112 27 L
S
GR
GS
[0.75 0 0 0.75 0 0.25] CT
0.149 GC
2 setlinecap
1 LJ
0.667 LW
N
779 307 M
779 27 L
S
GR
GS
[0.75 0 0 0.75 0 0.25] CT
0.149 GC
2 setlinecap
1 LJ
0.667 LW
N
112 199.101 M
118.67 199.101 L
S
GR
GS
[0.75 0 0 0.75 0 0.25] CT
0.149 GC
2 setlinecap
1 LJ
0.667 LW
N
112 33.841 M
118.67 33.841 L
S
GR
GS
[0.75 0 0 0.75 0 0.25] CT
0.149 GC
2 setlinecap
1 LJ
0.667 LW
N
779 199.101 M
772.33 199.101 L
S
GR
GS
[0.75 0 0 0.75 0 0.25] CT
0.149 GC
2 setlinecap
1 LJ
0.667 LW
N
779 33.841 M
772.33 33.841 L
S
GR
GS
[0.75 0 0 0.75 0 0.25] CT
0.149 GC
2 setlinecap
1 LJ
0.667 LW
N
112 285.512 M
115.335 285.512 L
S
GR
GS
[0.75 0 0 0.75 0 0.25] CT
0.149 GC
2 setlinecap
1 LJ
0.667 LW
N
112 264.864 M
115.335 264.864 L
S
GR
GS
[0.75 0 0 0.75 0 0.25] CT
0.149 GC
2 setlinecap
1 LJ
0.667 LW
N
112 248.849 M
115.335 248.849 L
S
GR
GS
[0.75 0 0 0.75 0 0.25] CT
0.149 GC
2 setlinecap
1 LJ
0.667 LW
N
112 235.764 M
115.335 235.764 L
S
GR
GS
[0.75 0 0 0.75 0 0.25] CT
0.149 GC
2 setlinecap
1 LJ
0.667 LW
N
112 224.7 M
115.335 224.7 L
S
GR
GS
[0.75 0 0 0.75 0 0.25] CT
0.149 GC
2 setlinecap
1 LJ
0.667 LW
N
112 215.116 M
115.335 215.116 L
S
GR
GS
[0.75 0 0 0.75 0 0.25] CT
0.149 GC
2 setlinecap
1 LJ
0.667 LW
N
112 206.663 M
115.335 206.663 L
S
GR
GS
[0.75 0 0 0.75 0 0.25] CT
0.149 GC
2 setlinecap
1 LJ
0.667 LW
N
112 199.101 M
115.335 199.101 L
S
GR
GS
[0.75 0 0 0.75 0 0.25] CT
0.149 GC
2 setlinecap
1 LJ
0.667 LW
N
112 149.353 M
115.335 149.353 L
S
GR
GS
[0.75 0 0 0.75 0 0.25] CT
0.149 GC
2 setlinecap
1 LJ
0.667 LW
N
112 120.252 M
115.335 120.252 L
S
GR
GS
[0.75 0 0 0.75 0 0.25] CT
0.149 GC
2 setlinecap
1 LJ
0.667 LW
N
112 99.604 M
115.335 99.604 L
S
GR
GS
[0.75 0 0 0.75 0 0.25] CT
0.149 GC
2 setlinecap
1 LJ
0.667 LW
N
112 83.589 M
115.335 83.589 L
S
GR
GS
[0.75 0 0 0.75 0 0.25] CT
0.149 GC
2 setlinecap
1 LJ
0.667 LW
N
112 70.503 M
115.335 70.503 L
S
GR
GS
[0.75 0 0 0.75 0 0.25] CT
0.149 GC
2 setlinecap
1 LJ
0.667 LW
N
112 59.44 M
115.335 59.44 L
S
GR
GS
[0.75 0 0 0.75 0 0.25] CT
0.149 GC
2 setlinecap
1 LJ
0.667 LW
N
112 49.856 M
115.335 49.856 L
S
GR
GS
[0.75 0 0 0.75 0 0.25] CT
0.149 GC
2 setlinecap
1 LJ
0.667 LW
N
112 41.402 M
115.335 41.402 L
S
GR
GS
[0.75 0 0 0.75 0 0.25] CT
0.149 GC
2 setlinecap
1 LJ
0.667 LW
N
112 33.841 M
115.335 33.841 L
S
GR
GS
[0.75 0 0 0.75 0 0.25] CT
0.149 GC
2 setlinecap
1 LJ
0.667 LW
N
779 285.512 M
775.665 285.512 L
S
GR
GS
[0.75 0 0 0.75 0 0.25] CT
0.149 GC
2 setlinecap
1 LJ
0.667 LW
N
779 264.864 M
775.665 264.864 L
S
GR
GS
[0.75 0 0 0.75 0 0.25] CT
0.149 GC
2 setlinecap
1 LJ
0.667 LW
N
779 248.849 M
775.665 248.849 L
S
GR
GS
[0.75 0 0 0.75 0 0.25] CT
0.149 GC
2 setlinecap
1 LJ
0.667 LW
N
779 235.764 M
775.665 235.764 L
S
GR
GS
[0.75 0 0 0.75 0 0.25] CT
0.149 GC
2 setlinecap
1 LJ
0.667 LW
N
779 224.7 M
775.665 224.7 L
S
GR
GS
[0.75 0 0 0.75 0 0.25] CT
0.149 GC
2 setlinecap
1 LJ
0.667 LW
N
779 215.116 M
775.665 215.116 L
S
GR
GS
[0.75 0 0 0.75 0 0.25] CT
0.149 GC
2 setlinecap
1 LJ
0.667 LW
N
779 206.663 M
775.665 206.663 L
S
GR
GS
[0.75 0 0 0.75 0 0.25] CT
0.149 GC
2 setlinecap
1 LJ
0.667 LW
N
779 199.101 M
775.665 199.101 L
S
GR
GS
[0.75 0 0 0.75 0 0.25] CT
0.149 GC
2 setlinecap
1 LJ
0.667 LW
N
779 149.353 M
775.665 149.353 L
S
GR
GS
[0.75 0 0 0.75 0 0.25] CT
0.149 GC
2 setlinecap
1 LJ
0.667 LW
N
779 120.252 M
775.665 120.252 L
S
GR
GS
[0.75 0 0 0.75 0 0.25] CT
0.149 GC
2 setlinecap
1 LJ
0.667 LW
N
779 99.604 M
775.665 99.604 L
S
GR
GS
[0.75 0 0 0.75 0 0.25] CT
0.149 GC
2 setlinecap
1 LJ
0.667 LW
N
779 83.589 M
775.665 83.589 L
S
GR
GS
[0.75 0 0 0.75 0 0.25] CT
0.149 GC
2 setlinecap
1 LJ
0.667 LW
N
779 70.503 M
775.665 70.503 L
S
GR
GS
[0.75 0 0 0.75 0 0.25] CT
0.149 GC
2 setlinecap
1 LJ
0.667 LW
N
779 59.44 M
775.665 59.44 L
S
GR
GS
[0.75 0 0 0.75 0 0.25] CT
0.149 GC
2 setlinecap
1 LJ
0.667 LW
N
779 49.856 M
775.665 49.856 L
S
GR
GS
[0.75 0 0 0.75 0 0.25] CT
0.149 GC
2 setlinecap
1 LJ
0.667 LW
N
779 41.402 M
775.665 41.402 L
S
GR
GS
[0.75 0 0 0.75 0 0.25] CT
0.149 GC
2 setlinecap
1 LJ
0.667 LW
N
779 33.841 M
775.665 33.841 L
S
GR
GS
[0.75 0 0 0.75 79.2 149.57561] CT
0.149 GC
N
/f-400439362{-24.368 4.48 M
-24.368 3.808 L
-21.993 3.808 -21.993 3.214 QT
-21.993 -6.77 L
-22.977 -6.286 -24.477 -6.286 QT
-24.477 -6.958 L
-22.149 -6.958 -20.962 -8.176 QT
-20.696 -8.176 L
-20.633 -8.176 -20.571 -8.122 QT
-20.508 -8.067 -20.508 -8.004 QT
-20.508 3.214 L
-20.508 3.808 -18.133 3.808 QT
-18.133 4.48 L
-24.368 4.48 L
cp}def
f-400439362
f
GR
GS
[0.75 0 0 0.75 79.2 149.57561] CT
0.149 GC
N
/f-1045379{-12.05 4.902 M
-14.378 4.902 -15.214 2.98 QT
-16.05 1.058 -16.05 -1.583 QT
-16.05 -3.223 -15.753 -4.684 QT
-15.456 -6.145 -14.558 -7.161 QT
-13.659 -8.176 -12.05 -8.176 QT
-10.8 -8.176 -10.003 -7.567 QT
-9.206 -6.958 -8.784 -5.981 QT
-8.363 -5.004 -8.214 -3.903 QT
-8.066 -2.801 -8.066 -1.583 QT
-8.066 0.058 -8.363 1.48 QT
-8.659 2.902 -9.542 3.902 QT
-10.425 4.902 -12.05 4.902 QT
cp
-12.05 4.402 M
-10.988 4.402 -10.472 3.316 QT
-9.956 2.23 -9.831 0.917 QT
-9.706 -0.395 -9.706 -1.879 QT
-9.706 -3.317 -9.831 -4.52 QT
-9.956 -5.723 -10.472 -6.7 QT
-10.988 -7.676 -12.05 -7.676 QT
-13.128 -7.676 -13.644 -6.7 QT
-14.159 -5.723 -14.284 -4.52 QT
-14.409 -3.317 -14.409 -1.879 QT
-14.409 -0.833 -14.355 0.105 QT
-14.3 1.042 -14.081 2.042 QT
-13.863 3.042 -13.363 3.722 QT
-12.863 4.402 -12.05 4.402 QT
cp}def
f-1045379
f
GR
GS
[0.75 0 0 0.75 79.2 149.57561] CT
0.149 GC
N
/f88046900{-4.217 -2.013 M
-5.81 -2.013 -6.381 -3.325 QT
-6.951 -4.638 -6.951 -6.435 QT
-6.951 -7.575 -6.748 -8.567 QT
-6.545 -9.56 -5.935 -10.255 QT
-5.326 -10.95 -4.217 -10.95 QT
-3.357 -10.95 -2.81 -10.536 QT
-2.264 -10.122 -1.982 -9.458 QT
-1.701 -8.794 -1.592 -8.036 QT
-1.482 -7.278 -1.482 -6.435 QT
-1.482 -5.325 -1.693 -4.349 QT
-1.904 -3.372 -2.506 -2.692 QT
-3.107 -2.013 -4.217 -2.013 QT
cp
-4.217 -2.341 M
-3.498 -2.341 -3.139 -3.083 QT
-2.779 -3.825 -2.701 -4.732 QT
-2.623 -5.638 -2.623 -6.653 QT
-2.623 -7.622 -2.701 -8.45 QT
-2.779 -9.278 -3.131 -9.95 QT
-3.482 -10.622 -4.217 -10.622 QT
-4.951 -10.622 -5.31 -9.942 QT
-5.67 -9.263 -5.748 -8.442 QT
-5.826 -7.622 -5.826 -6.653 QT
-5.826 -5.919 -5.795 -5.278 QT
-5.764 -4.638 -5.607 -3.958 QT
-5.451 -3.278 -5.115 -2.81 QT
-4.779 -2.341 -4.217 -2.341 QT
cp}def
f88046900
f
GR
GS
[0.75 0 0 0.75 79.2 25.63042] CT
0.149 GC
N
f-400439362
f
GR
GS
[0.75 0 0 0.75 79.2 25.63042] CT
0.149 GC
N
f-1045379
f
GR
GS
[0.75 0 0 0.75 79.2 25.63042] CT
0.149 GC
N
/f-1743039351{-6.264 -2.294 M
-6.264 -2.747 L
-4.639 -2.747 -4.639 -3.169 QT
-4.639 -9.982 L
-5.31 -9.669 -6.342 -9.669 QT
-6.342 -10.122 L
-4.748 -10.122 -3.935 -10.95 QT
-3.748 -10.95 L
-3.701 -10.95 -3.662 -10.919 QT
-3.623 -10.888 -3.623 -10.841 QT
-3.623 -3.169 L
-3.623 -2.747 -1.998 -2.747 QT
-1.998 -2.294 L
-6.264 -2.294 L
cp}def
f-1743039351
f
GR
GS
[0 -0.75 0.75 0 56.59996 125.4999] CT
0.149 GC
N
/f-1320386633{-60.904 -9.095 M
-60.904 -9.158 -60.888 -9.283 QT
-60.873 -9.408 -60.857 -9.525 QT
-60.841 -9.642 -60.841 -9.705 QT
-58.232 -20.095 L
-58.154 -20.455 -58.138 -20.658 QT
-58.138 -21.001 -59.498 -21.001 QT
-59.701 -21.001 -59.701 -21.283 QT
-59.685 -21.33 -59.654 -21.462 QT
-59.623 -21.595 -59.568 -21.666 QT
-59.513 -21.736 -59.404 -21.736 QT
-56.576 -21.97 L
-56.326 -21.97 -56.326 -21.689 QT
-59.341 -9.611 L
-59.498 -9.283 -59.498 -8.611 QT
-59.498 -7.705 -58.888 -7.705 QT
-58.232 -7.705 -57.912 -8.509 QT
-57.591 -9.314 -57.341 -10.486 QT
-57.295 -10.595 -57.154 -10.595 QT
-56.92 -10.595 L
-56.826 -10.595 -56.771 -10.533 QT
-56.716 -10.47 -56.716 -10.392 QT
-56.966 -9.376 -57.17 -8.791 QT
-57.373 -8.205 -57.81 -7.681 QT
-58.248 -7.158 -58.92 -7.158 QT
-59.763 -7.158 -60.334 -7.697 QT
-60.904 -8.236 -60.904 -9.095 QT
cp}def
f-1320386633
f
GR
GS
[0 -0.75 0.75 0 56.59996 125.4999] CT
0.149 GC
N
/f-997896659{-51.076 -7.158 M
-52.061 -7.158 -52.834 -7.626 QT
-53.608 -8.095 -54.029 -8.9 QT
-54.451 -9.705 -54.451 -10.72 QT
-54.451 -12.142 -53.654 -13.533 QT
-52.858 -14.923 -51.545 -15.798 QT
-50.233 -16.673 -48.779 -16.673 QT
-47.998 -16.673 -47.389 -16.408 QT
-46.779 -16.142 -46.334 -15.658 QT
-45.889 -15.173 -45.647 -14.525 QT
-45.404 -13.876 -45.404 -13.126 QT
-45.404 -12.033 -45.865 -10.97 QT
-46.326 -9.908 -47.131 -9.041 QT
-47.936 -8.173 -48.967 -7.666 QT
-49.998 -7.158 -51.076 -7.158 QT
cp
-51.029 -7.705 M
-50.092 -7.705 -49.319 -8.345 QT
-48.545 -8.986 -48.053 -9.955 QT
-47.561 -10.923 -47.287 -12.001 QT
-47.014 -13.08 -47.014 -13.939 QT
-47.014 -14.861 -47.475 -15.494 QT
-47.936 -16.126 -48.826 -16.126 QT
-50.061 -16.126 -50.983 -15.08 QT
-51.904 -14.033 -52.365 -12.572 QT
-52.826 -11.111 -52.826 -9.892 QT
-52.826 -8.986 -52.365 -8.345 QT
-51.904 -7.705 -51.029 -7.705 QT
cp}def
f-997896659
f
GR
GS
[0 -0.75 0.75 0 56.59996 125.4999] CT
0.149 GC
N
/f2003231325{-45.045 -4.392 M
-45.045 -4.908 -44.694 -5.291 QT
-44.342 -5.673 -43.842 -5.673 QT
-43.498 -5.673 -43.264 -5.462 QT
-43.03 -5.251 -43.03 -4.908 QT
-43.03 -4.533 -43.248 -4.228 QT
-43.467 -3.923 -43.811 -3.798 QT
-43.233 -3.626 -42.045 -3.626 QT
-41.076 -3.626 -40.28 -4.369 QT
-39.483 -5.111 -39.233 -6.095 QT
-38.623 -8.548 L
-39.764 -7.392 -40.998 -7.392 QT
-41.889 -7.392 -42.537 -7.853 QT
-43.186 -8.314 -43.522 -9.087 QT
-43.858 -9.861 -43.858 -10.72 QT
-43.858 -11.673 -43.459 -12.736 QT
-43.061 -13.798 -42.35 -14.697 QT
-41.639 -15.595 -40.717 -16.134 QT
-39.795 -16.673 -38.764 -16.673 QT
-38.155 -16.673 -37.662 -16.337 QT
-37.17 -16.001 -36.889 -15.439 QT
-36.67 -16.251 -35.983 -16.251 QT
-35.717 -16.251 -35.53 -16.095 QT
-35.342 -15.939 -35.342 -15.673 QT
-35.342 -15.611 -35.35 -15.58 QT
-35.358 -15.548 -35.358 -15.501 QT
-37.764 -5.97 L
-37.936 -5.314 -38.373 -4.767 QT
-38.811 -4.22 -39.405 -3.861 QT
-39.998 -3.501 -40.709 -3.291 QT
-41.42 -3.08 -42.076 -3.08 QT
-43.264 -3.08 -44.155 -3.314 QT
-45.045 -3.548 -45.045 -4.392 QT
cp
-40.951 -7.939 M
-39.608 -7.939 -38.311 -9.783 QT
-37.155 -14.361 L
-37.295 -15.095 -37.725 -15.611 QT
-38.155 -16.126 -38.811 -16.126 QT
-39.514 -16.126 -40.131 -15.556 QT
-40.748 -14.986 -41.155 -14.205 QT
-41.545 -13.439 -41.912 -12.017 QT
-42.28 -10.595 -42.28 -9.783 QT
-42.28 -9.064 -41.951 -8.501 QT
-41.623 -7.939 -40.951 -7.939 QT
cp}def
f2003231325
f
GR
GS
[0 -0.75 0.75 0 56.59996 125.4999] CT
0.149 GC
N
/f949549315{-25.905 -0.589 M
-30.655 -11.62 L
-32.124 -10.479 L
-32.499 -10.854 L
-29.499 -13.183 L
-25.077 -2.886 L
-14.171 -25.589 L
-14.062 -25.792 -13.812 -25.792 QT
-13.64 -25.792 -13.515 -25.667 QT
-13.39 -25.542 -13.39 -25.37 QT
-13.39 -25.261 -13.405 -25.229 QT
-25.124 -0.776 L
-25.218 -0.589 -25.452 -0.589 QT
-25.905 -0.589 L
cp}def
f949549315
f
GR
GS
[0 -0.75 0.75 0 56.59996 125.4999] CT
0.149 GC
N
-14.278 -25.769 76.104 0.821 re
f
GR
GS
[0 -0.75 0.75 0 56.59996 125.4999] CT
0.149 GC
N
/f-429156310{-13.31 -7.673 M
-13.31 -7.72 -13.27 -7.853 QT
-13.231 -7.986 -13.177 -8.056 QT
-13.122 -8.126 -13.013 -8.126 QT
-11.216 -8.126 -10.622 -8.236 QT
-10.06 -8.376 -9.95 -8.845 QT
-7.075 -20.376 L
-6.981 -20.626 -6.981 -20.83 QT
-6.981 -21.001 -7.731 -21.001 QT
-8.95 -21.001 L
-10.356 -21.001 -11.114 -20.572 QT
-11.872 -20.142 -12.231 -19.431 QT
-12.591 -18.72 -13.153 -17.111 QT
-13.231 -16.923 -13.372 -16.923 QT
-13.56 -16.923 L
-13.778 -16.923 -13.778 -17.189 QT
-12.278 -21.548 L
-12.231 -21.736 -12.075 -21.736 QT
0.331 -21.736 L
0.55 -21.736 0.55 -21.455 QT
-0.153 -17.111 L
-0.153 -17.048 -0.224 -16.986 QT
-0.294 -16.923 -0.356 -16.923 QT
-0.544 -16.923 L
-0.747 -16.923 -0.747 -17.189 QT
-0.528 -18.689 -0.528 -19.298 QT
-0.528 -20.033 -0.833 -20.416 QT
-1.138 -20.798 -1.63 -20.9 QT
-2.122 -21.001 -2.919 -21.001 QT
-4.153 -21.001 L
-4.716 -21.001 -4.911 -20.9 QT
-5.106 -20.798 -5.247 -20.283 QT
-8.122 -8.751 L
-8.138 -8.72 -8.145 -8.673 QT
-8.153 -8.626 -8.169 -8.564 QT
-8.169 -8.298 -7.856 -8.236 QT
-7.31 -8.126 -5.528 -8.126 QT
-5.31 -8.126 -5.31 -7.861 QT
-5.388 -7.564 -5.427 -7.478 QT
-5.466 -7.392 -5.669 -7.392 QT
-13.106 -7.392 L
-13.31 -7.392 -13.31 -7.673 QT
cp}def
f-429156310
f
GR
GS
[0 -0.75 0.75 0 56.59996 125.4999] CT
0.149 GC
N
/f-517052641{2.198 -7.751 M
2.198 -7.876 2.213 -7.939 QT
3.776 -14.205 L
3.932 -14.783 3.932 -15.22 QT
3.932 -16.126 3.323 -16.126 QT
2.666 -16.126 2.346 -15.345 QT
2.026 -14.564 1.729 -13.361 QT
1.729 -13.298 1.666 -13.259 QT
1.604 -13.22 1.557 -13.22 QT
1.307 -13.22 L
1.245 -13.22 1.19 -13.298 QT
1.135 -13.376 1.135 -13.439 QT
1.37 -14.361 1.573 -14.994 QT
1.776 -15.626 2.229 -16.15 QT
2.682 -16.673 3.338 -16.673 QT
4.073 -16.673 4.62 -16.251 QT
5.166 -15.83 5.307 -15.142 QT
5.838 -15.845 6.518 -16.259 QT
7.198 -16.673 8.01 -16.673 QT
8.666 -16.673 9.174 -16.283 QT
9.682 -15.892 9.682 -15.22 QT
9.682 -14.689 9.354 -14.298 QT
9.026 -13.908 8.463 -13.908 QT
8.135 -13.908 7.901 -14.119 QT
7.666 -14.33 7.666 -14.658 QT
7.666 -15.126 8.002 -15.486 QT
8.338 -15.845 8.791 -15.845 QT
8.448 -16.126 7.963 -16.126 QT
7.057 -16.126 6.393 -15.486 QT
5.729 -14.845 5.198 -13.861 QT
3.698 -7.861 L
3.635 -7.564 3.377 -7.361 QT
3.12 -7.158 2.823 -7.158 QT
2.557 -7.158 2.377 -7.322 QT
2.198 -7.486 2.198 -7.751 QT
cp}def
f-517052641
f
GR
GS
[0 -0.75 0.75 0 56.59996 125.4999] CT
0.149 GC
N
/f-1561569992{16.923 -2.189 M
15.751 -3.111 14.907 -4.306 QT
14.063 -5.501 13.524 -6.853 QT
12.985 -8.205 12.719 -9.681 QT
12.454 -11.158 12.454 -12.642 QT
12.454 -14.142 12.719 -15.619 QT
12.985 -17.095 13.532 -18.462 QT
14.079 -19.83 14.93 -21.017 QT
15.782 -22.205 16.923 -23.095 QT
16.923 -23.142 17.016 -23.142 QT
17.219 -23.142 L
17.282 -23.142 17.329 -23.087 QT
17.376 -23.033 17.376 -22.955 QT
17.376 -22.861 17.344 -22.83 QT
16.313 -21.814 15.633 -20.666 QT
14.954 -19.517 14.54 -18.22 QT
14.126 -16.923 13.938 -15.533 QT
13.751 -14.142 13.751 -12.642 QT
13.751 -5.97 17.313 -2.501 QT
17.376 -2.439 17.376 -2.33 QT
17.376 -2.283 17.321 -2.212 QT
17.266 -2.142 17.219 -2.142 QT
17.016 -2.142 L
16.923 -2.142 16.923 -2.189 QT
cp}def
f-1561569992
f
GR
GS
[0 -0.75 0.75 0 56.59996 125.4999] CT
0.149 GC
N
/f-1588517016{19.376 -7.392 M
19.173 -7.392 19.173 -7.673 QT
19.189 -7.72 19.212 -7.845 QT
19.236 -7.97 19.298 -8.048 QT
19.361 -8.126 19.439 -8.126 QT
20.72 -8.126 21.22 -8.267 QT
21.501 -8.361 21.626 -8.845 QT
24.501 -20.376 L
24.548 -20.58 24.548 -20.658 QT
24.548 -20.892 24.283 -20.923 QT
23.892 -21.001 22.783 -21.001 QT
22.58 -21.001 22.58 -21.283 QT
22.58 -21.33 22.611 -21.455 QT
22.642 -21.58 22.705 -21.658 QT
22.767 -21.736 22.845 -21.736 QT
33.939 -21.736 L
34.142 -21.736 34.142 -21.455 QT
33.642 -17.111 L
33.642 -17.048 33.572 -16.986 QT
33.501 -16.923 33.423 -16.923 QT
33.236 -16.923 L
33.017 -16.923 33.017 -17.189 QT
33.158 -18.142 33.158 -18.751 QT
33.158 -19.798 32.705 -20.291 QT
32.251 -20.783 31.564 -20.892 QT
30.876 -21.001 29.673 -21.001 QT
27.423 -21.001 L
26.845 -21.001 26.666 -20.9 QT
26.486 -20.798 26.33 -20.283 QT
24.986 -14.923 L
26.564 -14.923 L
27.345 -14.923 27.83 -15.009 QT
28.314 -15.095 28.626 -15.33 QT
28.939 -15.564 29.15 -16.009 QT
29.361 -16.455 29.533 -17.189 QT
29.595 -17.392 29.751 -17.392 QT
29.939 -17.392 L
30.158 -17.392 30.158 -17.111 QT
28.876 -11.923 L
28.783 -11.736 28.658 -11.736 QT
28.47 -11.736 L
28.267 -11.736 28.267 -12.017 QT
28.314 -12.236 28.345 -12.376 QT
28.376 -12.517 28.423 -12.791 QT
28.47 -13.064 28.47 -13.267 QT
28.47 -13.876 27.939 -14.041 QT
27.408 -14.205 26.548 -14.205 QT
24.814 -14.205 L
23.455 -8.751 L
23.408 -8.548 23.408 -8.548 QT
23.408 -8.298 23.564 -8.267 QT
24.111 -8.126 25.705 -8.126 QT
25.908 -8.126 25.908 -7.861 QT
25.83 -7.564 25.791 -7.478 QT
25.751 -7.392 25.548 -7.392 QT
19.376 -7.392 L
cp}def
f-1588517016
f
GR
GS
[0 -0.75 0.75 0 56.59996 125.4999] CT
0.149 GC
N
/f1290851859{35.87 -16.543 M
35.761 -16.543 35.682 -16.629 QT
35.604 -16.715 35.604 -16.824 QT
35.604 -16.933 35.682 -17.019 QT
35.761 -17.105 35.87 -17.105 QT
43.917 -17.105 L
44.026 -17.105 44.097 -17.019 QT
44.167 -16.933 44.167 -16.824 QT
44.167 -16.715 44.097 -16.629 QT
44.026 -16.543 43.917 -16.543 QT
35.87 -16.543 L
cp}def
f1290851859
f
GR
GS
[0 -0.75 0.75 0 56.59996 125.4999] CT
0.149 GC
N
/f-1603341742{46.924 -13.324 M
46.924 -13.824 L
48.674 -13.824 48.674 -14.261 QT
48.674 -21.605 L
47.955 -21.261 46.846 -21.261 QT
46.846 -21.746 L
48.565 -21.746 49.44 -22.652 QT
49.627 -22.652 L
49.674 -22.652 49.721 -22.613 QT
49.768 -22.574 49.768 -22.527 QT
49.768 -14.261 L
49.768 -13.824 51.518 -13.824 QT
51.518 -13.324 L
46.924 -13.324 L
cp}def
f-1603341742
f
GR
GS
[0 -0.75 0.75 0 56.59996 125.4999] CT
0.149 GC
N
/f-1958970210{55.2 -2.142 M
55.013 -2.142 55.013 -2.33 QT
55.013 -2.423 55.059 -2.455 QT
58.653 -5.97 58.653 -12.642 QT
58.653 -19.314 55.106 -22.783 QT
55.013 -22.83 55.013 -22.955 QT
55.013 -23.033 55.075 -23.087 QT
55.138 -23.142 55.2 -23.142 QT
55.403 -23.142 L
55.466 -23.142 55.497 -23.095 QT
57.013 -21.908 58.013 -20.205 QT
59.013 -18.501 59.481 -16.58 QT
59.95 -14.658 59.95 -12.642 QT
59.95 -11.158 59.7 -9.712 QT
59.45 -8.267 58.903 -6.869 QT
58.356 -5.47 57.513 -4.291 QT
56.669 -3.111 55.497 -2.189 QT
55.466 -2.142 55.403 -2.142 QT
55.2 -2.142 L
cp}def
f-1958970210
f
GR
GS
[0.75 0 0 0.75 0 0.25] CT
1 LJ
2.667 LW
N
113.631 34.28 M
115.262 54.726 L
116.892 68.093 L
118.523 77.528 L
120.154 83.864 L
121.785 90.326 L
123.416 95.931 L
125.046 100.089 L
126.677 104.012 L
128.308 107.95 L
129.939 111.064 L
131.57 114.154 L
133.2 117.311 L
134.831 120.156 L
136.462 122.657 L
138.093 124.981 L
139.724 127.117 L
141.355 129.294 L
142.985 131.165 L
144.616 132.935 L
146.247 134.687 L
147.878 136.371 L
149.509 137.895 L
151.139 139.338 L
152.77 140.805 L
154.401 142.173 L
156.032 143.485 L
157.663 144.771 L
159.293 146.067 L
160.924 147.373 L
162.555 148.491 L
164.186 149.541 L
165.817 150.593 L
167.447 151.735 L
169.078 152.861 L
170.709 153.896 L
172.34 154.754 L
173.971 155.808 L
175.601 156.698 L
177.232 157.606 L
178.863 158.383 L
180.494 159.281 L
182.125 160.086 L
183.756 161.031 L
185.386 161.826 L
187.017 162.591 L
188.648 163.387 L
190.279 164.129 L
191.91 164.868 L
193.54 165.647 L
195.171 166.322 L
196.802 166.999 L
198.433 167.685 L
200.064 168.374 L
201.694 169.002 L
203.325 169.692 L
204.956 170.325 L
206.587 170.984 L
208.218 171.608 L
209.848 172.222 L
211.479 172.789 L
213.11 173.372 L
214.741 173.943 L
216.372 174.459 L
218.002 174.97 L
219.633 175.577 L
221.264 176.063 L
222.895 176.553 L
224.526 177.111 L
226.156 177.659 L
227.787 178.154 L
229.418 178.61 L
231.049 179.129 L
232.68 179.706 L
234.311 180.139 L
235.941 180.663 L
237.572 181.122 L
239.203 181.545 L
240.834 182.033 L
242.465 182.51 L
244.095 182.94 L
245.726 183.365 L
247.357 183.843 L
248.988 184.291 L
250.619 184.738 L
252.249 185.166 L
253.88 185.56 L
255.511 185.998 L
257.142 186.381 L
258.773 186.776 L
260.403 187.154 L
262.034 187.572 L
263.665 187.952 L
265.296 188.359 L
266.927 188.658 L
268.557 189.01 L
270.188 189.392 L
271.819 189.744 L
273.45 190.068 L
275.081 190.43 L
276.711 190.764 L
278.342 191.105 L
279.973 191.432 L
281.604 191.792 L
283.235 192.099 L
284.866 192.428 L
286.496 192.743 L
288.127 193.061 L
289.758 193.369 L
291.389 193.707 L
293.02 194.055 L
294.65 194.361 L
296.281 194.696 L
297.912 195.02 L
299.543 195.325 L
301.174 195.628 L
302.804 195.926 L
304.435 196.223 L
306.066 196.591 L
307.697 196.926 L
309.328 197.205 L
310.958 197.542 L
312.589 197.817 L
314.22 198.095 L
315.851 198.38 L
317.482 198.653 L
319.112 198.938 L
320.743 199.25 L
322.374 199.542 L
324.005 199.837 L
325.636 200.115 L
327.267 200.405 L
328.897 200.678 L
330.528 200.907 L
332.159 201.18 L
333.79 201.438 L
335.421 201.702 L
337.051 201.951 L
338.682 202.199 L
340.313 202.473 L
341.944 202.716 L
343.575 202.966 L
345.205 203.208 L
346.836 203.46 L
348.467 203.711 L
350.098 203.965 L
351.729 204.206 L
353.359 204.483 L
354.99 204.727 L
356.621 204.965 L
358.252 205.194 L
359.883 205.417 L
361.513 205.677 L
363.144 205.897 L
364.775 206.119 L
366.406 206.334 L
368.037 206.571 L
369.667 206.785 L
371.298 207.014 L
372.929 207.235 L
374.56 207.466 L
376.191 207.71 L
377.822 207.934 L
379.452 208.166 L
381.083 208.386 L
382.714 208.587 L
384.345 208.781 L
385.976 208.977 L
387.606 209.191 L
389.237 209.397 L
390.868 209.589 L
392.499 209.816 L
394.13 209.999 L
395.76 210.188 L
397.391 210.395 L
399.022 210.612 L
400.653 210.824 L
402.284 211.026 L
403.914 211.219 L
405.545 211.42 L
407.176 211.619 L
408.807 211.814 L
410.438 212.02 L
412.068 212.217 L
413.699 212.387 L
415.33 212.567 L
416.961 212.753 L
418.592 212.945 L
420.223 213.134 L
421.853 213.321 L
423.484 213.513 L
425.115 213.692 L
426.746 213.883 L
428.377 214.07 L
430.007 214.275 L
431.638 214.456 L
433.269 214.614 L
434.9 214.794 L
436.531 214.969 L
438.161 215.15 L
439.792 215.332 L
441.423 215.525 L
443.054 215.711 L
444.685 215.876 L
446.315 216.048 L
447.946 216.241 L
449.577 216.428 L
451.208 216.616 L
452.839 216.781 L
454.469 216.965 L
456.1 217.128 L
457.731 217.288 L
459.362 217.471 L
460.993 217.633 L
462.623 217.789 L
464.254 217.938 L
465.885 218.105 L
467.516 218.28 L
469.147 218.453 L
470.777 218.61 L
472.408 218.812 L
474.039 218.971 L
475.67 219.122 L
477.301 219.281 L
478.932 219.434 L
480.562 219.601 L
482.193 219.766 L
483.824 219.927 L
485.455 220.074 L
487.086 220.229 L
488.716 220.381 L
490.347 220.536 L
491.978 220.685 L
493.609 220.845 L
495.24 221.007 L
496.87 221.154 L
498.501 221.299 L
500.132 221.45 L
501.763 221.597 L
503.394 221.747 L
505.024 221.909 L
506.655 222.053 L
508.286 222.207 L
509.917 222.348 L
511.548 222.48 L
513.179 222.626 L
514.809 222.774 L
516.44 222.902 L
518.071 223.055 L
519.702 223.219 L
521.333 223.354 L
522.963 223.485 L
524.594 223.635 L
526.225 223.786 L
527.856 223.925 L
529.487 224.066 L
531.117 224.221 L
532.748 224.375 L
534.379 224.518 L
536.01 224.662 L
537.641 224.794 L
539.271 224.938 L
540.902 225.063 L
542.533 225.199 L
544.164 225.335 L
545.795 225.467 L
547.425 225.607 L
549.056 225.736 L
550.687 225.868 L
552.318 225.991 L
553.949 226.12 L
555.579 226.248 L
557.21 226.376 L
558.841 226.518 L
560.472 226.65 L
562.103 226.784 L
563.733 226.905 L
565.364 227.038 L
566.995 227.155 L
568.626 227.279 L
570.257 227.409 L
571.888 227.527 L
573.518 227.652 L
575.149 227.771 L
576.78 227.898 L
578.411 228.024 L
580.042 228.127 L
581.672 228.24 L
583.303 228.364 L
584.934 228.487 L
586.565 228.611 L
588.196 228.729 L
589.826 228.85 L
591.457 228.977 L
593.088 229.099 L
594.719 229.234 L
596.35 229.368 L
597.98 229.504 L
599.611 229.634 L
601.242 229.756 L
602.873 229.877 L
604.504 230.001 L
606.134 230.128 L
607.765 230.251 L
609.396 230.365 L
611.027 230.483 L
612.658 230.601 L
614.289 230.723 L
615.919 230.841 L
617.55 230.956 L
619.181 231.058 L
620.812 231.165 L
622.443 231.294 L
624.073 231.425 L
625.704 231.541 L
627.335 231.65 L
628.966 231.765 L
630.597 231.887 L
632.227 231.99 L
633.858 232.105 L
635.489 232.214 L
637.12 232.323 L
638.751 232.427 L
640.381 232.534 L
642.012 232.649 L
643.643 232.756 L
645.274 232.858 L
646.905 232.97 L
648.535 233.093 L
650.166 233.2 L
651.797 233.303 L
653.428 233.403 L
655.059 233.52 L
656.689 233.635 L
658.32 233.74 L
659.951 233.825 L
661.582 233.922 L
663.213 234.028 L
664.844 234.14 L
666.474 234.259 L
668.105 234.354 L
669.736 234.455 L
671.367 234.55 L
672.998 234.65 L
674.628 234.755 L
676.259 234.87 L
677.89 234.979 L
679.521 235.07 L
681.152 235.184 L
682.782 235.281 L
684.413 235.385 L
686.044 235.477 L
687.675 235.587 L
689.306 235.68 L
690.936 235.777 L
692.567 235.876 L
694.198 235.979 L
695.829 236.074 L
697.46 236.159 L
699.09 236.266 L
700.721 236.361 L
702.352 236.45 L
703.983 236.548 L
705.614 236.648 L
707.245 236.729 L
708.875 236.827 L
710.506 236.937 L
712.137 237.036 L
713.768 237.14 L
715.399 237.232 L
717.029 237.325 L
718.66 237.421 L
720.291 237.528 L
721.922 237.623 L
723.553 237.717 L
725.183 237.807 L
726.814 237.912 L
728.445 238.012 L
730.076 238.111 L
731.707 238.198 L
733.337 238.304 L
734.968 238.399 L
736.599 238.5 L
738.23 238.594 L
739.861 238.687 L
741.491 238.781 L
743.122 238.875 L
744.753 238.969 L
746.384 239.052 L
748.015 239.154 L
749.645 239.247 L
751.276 239.333 L
752.907 239.423 L
754.538 239.513 L
756.169 239.599 L
757.799 239.695 L
759.43 239.786 L
761.061 239.877 L
762.692 239.963 L
764.323 240.053 L
765.954 240.148 L
767.584 240.249 L
769.215 240.339 L
770.846 240.43 L
772.477 240.51 L
774.108 240.591 L
775.738 240.675 L
777.369 240.76 L
S
GR
GS
[0.75 0 0 0.75 0 0.25] CT
1 0 0 RC
1 LJ
2.667 LW
N
113.631 112.769 M
115.262 131.213 L
116.892 138.449 L
118.523 144.991 L
120.154 150.184 L
121.785 156.096 L
123.416 161.525 L
125.046 164.42 L
126.677 168.334 L
128.308 170.824 L
129.939 174.031 L
131.57 176.214 L
133.2 178.98 L
134.831 182.253 L
136.462 184.368 L
138.093 186.443 L
139.724 188.147 L
141.355 189.824 L
142.985 191.436 L
144.616 193.088 L
146.247 194.747 L
147.878 196.568 L
149.509 198.037 L
151.139 199.251 L
152.77 200.841 L
154.401 202.179 L
156.032 203.558 L
157.663 204.797 L
159.293 205.913 L
160.924 207.299 L
162.555 208.397 L
164.186 209.421 L
165.817 210.339 L
167.447 211.137 L
169.078 212.058 L
170.709 213.004 L
172.34 213.799 L
173.971 214.682 L
175.601 215.549 L
177.232 216.307 L
178.863 217.107 L
180.494 217.817 L
182.125 218.546 L
183.756 219.444 L
185.386 220.207 L
187.017 221.004 L
188.648 221.803 L
190.279 222.72 L
191.91 223.434 L
193.54 224.002 L
195.171 224.572 L
196.802 225.19 L
198.433 225.911 L
200.064 226.538 L
201.694 227.354 L
203.325 227.916 L
204.956 228.577 L
206.587 229.317 L
208.218 229.87 L
209.848 230.336 L
211.479 230.752 L
213.11 231.425 L
214.741 231.962 L
216.372 232.462 L
218.002 232.978 L
219.633 233.557 L
221.264 234.063 L
222.895 234.501 L
224.526 235.033 L
226.156 235.526 L
227.787 236.037 L
229.418 236.552 L
231.049 237.074 L
232.68 237.632 L
234.311 238.098 L
235.941 238.724 L
237.572 239.11 L
239.203 239.568 L
240.834 240.041 L
242.465 240.59 L
244.095 241.002 L
245.726 241.362 L
247.357 241.89 L
248.988 242.277 L
250.619 242.674 L
252.249 243.258 L
253.88 243.63 L
255.511 244.121 L
257.142 244.568 L
258.773 244.934 L
260.403 245.381 L
262.034 245.786 L
263.665 246.178 L
265.296 246.549 L
266.927 246.886 L
268.557 247.254 L
270.188 247.638 L
271.819 248.064 L
273.45 248.418 L
275.081 248.79 L
276.711 249.16 L
278.342 249.539 L
279.973 249.914 L
281.604 250.365 L
283.235 250.747 L
284.866 251.059 L
286.496 251.433 L
288.127 251.788 L
289.758 252.133 L
291.389 252.499 L
293.02 252.869 L
294.65 253.226 L
296.281 253.632 L
297.912 254.016 L
299.543 254.391 L
301.174 254.699 L
302.804 255.206 L
304.435 255.591 L
306.066 256.014 L
307.697 256.35 L
309.328 256.713 L
310.958 257.124 L
312.589 257.53 L
314.22 258.024 L
315.851 258.375 L
317.482 258.805 L
319.112 259.232 L
320.743 259.6 L
322.374 259.989 L
324.005 260.323 L
325.636 260.775 L
327.267 261.099 L
328.897 261.553 L
330.528 261.926 L
332.159 262.419 L
333.79 262.902 L
335.421 263.358 L
337.051 263.783 L
338.682 264.3 L
340.313 264.825 L
341.944 265.277 L
343.575 265.751 L
345.205 266.249 L
346.836 266.734 L
348.467 267.263 L
350.098 267.77 L
351.729 268.365 L
353.359 268.856 L
354.99 269.426 L
356.621 270.012 L
358.252 270.539 L
359.883 271.106 L
361.513 271.735 L
363.144 272.196 L
364.775 272.669 L
366.406 273.151 L
368.037 273.652 L
369.667 274.123 L
371.298 274.596 L
372.929 275.071 L
374.56 275.56 L
376.191 275.984 L
377.822 276.415 L
379.452 276.888 L
381.083 277.334 L
382.714 277.801 L
384.345 278.214 L
385.976 278.639 L
387.606 279.084 L
389.237 279.57 L
390.868 279.999 L
392.499 280.43 L
394.13 280.785 L
395.76 281.101 L
397.391 281.486 L
399.022 281.927 L
400.653 282.328 L
402.284 282.646 L
403.914 282.966 L
405.545 283.251 L
407.176 283.585 L
408.807 283.892 L
410.438 284.16 L
412.068 284.437 L
413.699 284.693 L
415.33 284.975 L
416.961 285.184 L
418.592 285.508 L
420.223 285.798 L
421.853 286.023 L
423.484 286.245 L
425.115 286.48 L
426.746 286.688 L
428.377 286.897 L
430.007 287.155 L
431.638 287.356 L
433.269 287.553 L
434.9 287.745 L
436.531 287.922 L
438.161 288.09 L
439.792 288.296 L
441.423 288.44 L
443.054 288.652 L
444.685 288.795 L
446.315 288.937 L
447.946 289.074 L
449.577 289.215 L
451.208 289.373 L
452.839 289.513 L
454.469 289.652 L
456.1 289.809 L
457.731 289.986 L
459.362 290.118 L
460.993 290.277 L
462.623 290.406 L
464.254 290.505 L
465.885 290.67 L
467.516 290.837 L
469.147 290.981 L
470.777 291.129 L
472.408 291.295 L
474.039 291.41 L
475.67 291.578 L
477.301 291.756 L
478.932 291.881 L
480.562 291.989 L
482.193 292.092 L
483.824 292.193 L
485.455 292.299 L
487.086 292.396 L
488.716 292.483 L
490.347 292.561 L
491.978 292.696 L
493.609 292.841 L
495.24 292.95 L
496.87 293.064 L
498.501 293.154 L
500.132 293.246 L
501.763 293.361 L
503.394 293.471 L
505.024 293.587 L
506.655 293.659 L
508.286 293.763 L
509.917 293.845 L
511.548 293.918 L
513.179 293.998 L
514.809 294.098 L
516.44 294.167 L
518.071 294.254 L
519.702 294.376 L
521.333 294.47 L
522.963 294.536 L
524.594 294.64 L
526.225 294.763 L
527.856 294.856 L
529.487 294.949 L
531.117 295.057 L
532.748 295.132 L
534.379 295.2 L
536.01 295.268 L
537.641 295.334 L
539.271 295.401 L
540.902 295.475 L
542.533 295.557 L
544.164 295.651 L
545.795 295.738 L
547.425 295.819 L
549.056 295.921 L
550.687 296 L
552.318 296.075 L
553.949 296.116 L
555.579 296.191 L
557.21 296.233 L
558.841 296.317 L
560.472 296.403 L
562.103 296.477 L
563.733 296.569 L
565.364 296.628 L
566.995 296.676 L
568.626 296.757 L
570.257 296.817 L
571.888 296.882 L
573.518 296.965 L
575.149 297.036 L
576.78 297.114 L
578.411 297.159 L
580.042 297.204 L
581.672 297.261 L
583.303 297.324 L
584.934 297.391 L
586.565 297.454 L
588.196 297.525 L
589.826 297.586 L
591.457 297.664 L
593.088 297.764 L
594.719 297.881 L
596.35 297.969 L
597.98 298.074 L
599.611 298.171 L
601.242 298.261 L
602.873 298.337 L
604.504 298.387 L
606.134 298.491 L
607.765 298.575 L
609.396 298.66 L
611.027 298.759 L
612.658 298.835 L
614.289 298.898 L
615.919 298.959 L
617.55 299.067 L
619.181 299.126 L
620.812 299.192 L
622.443 299.285 L
624.073 299.386 L
625.704 299.479 L
627.335 299.567 L
628.966 299.652 L
630.597 299.751 L
632.227 299.854 L
633.858 299.967 L
635.489 300.039 L
637.12 300.108 L
638.751 300.186 L
640.381 300.244 L
642.012 300.309 L
643.643 300.387 L
645.274 300.481 L
646.905 300.563 L
648.535 300.664 L
650.166 300.748 L
651.797 300.828 L
653.428 300.912 L
655.059 301.01 L
656.689 301.094 L
658.32 301.172 L
659.951 301.244 L
661.582 301.321 L
663.213 301.405 L
664.844 301.505 L
666.474 301.597 L
668.105 301.699 L
669.736 301.786 L
671.367 301.868 L
672.998 301.956 L
674.628 302.056 L
676.259 302.158 L
677.89 302.225 L
679.521 302.296 L
681.152 302.4 L
682.782 302.477 L
684.413 302.579 L
686.044 302.654 L
687.675 302.737 L
689.306 302.821 L
690.936 302.917 L
692.567 303.002 L
694.198 303.079 L
695.829 303.181 L
697.46 303.261 L
699.09 303.348 L
700.721 303.399 L
702.352 303.49 L
703.983 303.587 L
705.614 303.68 L
707.245 303.763 L
708.875 303.855 L
710.506 303.969 L
712.137 304.04 L
713.768 304.115 L
715.399 304.213 L
717.029 304.322 L
718.66 304.398 L
720.291 304.491 L
721.922 304.589 L
723.553 304.644 L
725.183 304.705 L
726.814 304.795 L
728.445 304.883 L
730.076 304.962 L
731.707 305.044 L
733.337 305.131 L
734.968 305.215 L
736.599 305.317 L
738.23 305.359 L
739.861 305.441 L
741.491 305.525 L
743.122 305.587 L
744.753 305.684 L
746.384 305.758 L
748.015 305.836 L
749.645 305.908 L
751.276 305.979 L
752.907 306.033 L
754.538 306.127 L
756.169 306.182 L
757.799 306.266 L
759.43 306.314 L
761.061 306.393 L
762.692 306.448 L
764.323 306.493 L
765.954 306.552 L
767.584 306.611 L
769.215 306.684 L
770.846 306.746 L
772.477 306.801 L
774.108 306.872 L
775.738 306.947 L
777.369 307 L
S
GR
GS
[0.75 0 0 0.75 0 0.25] CT
1 GC
N
768 87 M
768 38 L
658 38 L
658 87 L
cp
f
GR
GS
[0.75 0 0 0.75 528.54932 38.58976] CT
N
/f1911859244{0.578 4.48 M
0.578 3.808 L
2.547 3.808 2.547 3.214 QT
2.547 -7.223 L
2.547 -7.833 0.578 -7.833 QT
0.578 -8.504 L
11.328 -8.504 L
11.859 -4.145 L
11.313 -4.145 L
11.109 -5.786 10.742 -6.528 QT
10.375 -7.27 9.57 -7.551 QT
8.766 -7.833 7.141 -7.833 QT
5.281 -7.833 L
4.938 -7.833 4.75 -7.801 QT
4.563 -7.77 4.438 -7.637 QT
4.313 -7.504 4.313 -7.223 QT
4.313 -2.583 L
5.719 -2.583 L
6.688 -2.583 7.164 -2.747 QT
7.641 -2.911 7.82 -3.372 QT
8 -3.833 8 -4.801 QT
8.547 -4.801 L
8.547 0.292 L
8 0.292 L
8 -0.676 7.82 -1.137 QT
7.641 -1.598 7.164 -1.762 QT
6.688 -1.926 5.719 -1.926 QT
4.313 -1.926 L
4.313 3.214 L
4.313 3.621 4.547 3.714 QT
4.781 3.808 5.281 3.808 QT
7.297 3.808 L
8.609 3.808 9.422 3.605 QT
10.234 3.402 10.688 2.91 QT
11.141 2.417 11.383 1.644 QT
11.625 0.871 11.844 -0.504 QT
12.391 -0.504 L
11.594 4.48 L
0.578 4.48 L
cp}def
f1911859244
f
GR
GS
[0.75 0 0 0.75 528.54932 38.58976] CT
N
/f460907587{13.282 4.48 M
13.282 3.808 L
15.251 3.808 15.251 3.214 QT
15.251 -7.223 L
15.251 -7.833 13.282 -7.833 QT
13.282 -8.504 L
18.969 -8.504 L
18.969 -7.833 L
17.016 -7.833 17.016 -7.223 QT
17.016 -1.067 L
22.891 -6.708 L
23.126 -6.973 23.126 -7.223 QT
23.126 -7.52 22.876 -7.676 QT
22.626 -7.833 22.297 -7.833 QT
22.297 -8.504 L
26.422 -8.504 L
26.422 -7.833 L
24.86 -7.833 23.688 -6.708 QT
20.313 -3.473 L
24.485 2.683 L
25.001 3.433 25.383 3.621 QT
25.766 3.808 26.688 3.808 QT
26.688 4.48 L
21.719 4.48 L
21.719 3.808 L
22.172 3.808 22.477 3.714 QT
22.782 3.621 22.782 3.277 QT
22.782 3.058 22.547 2.683 QT
19.141 -2.364 L
17.016 -0.301 L
17.016 3.214 L
17.016 3.808 18.969 3.808 QT
18.969 4.48 L
13.282 4.48 L
cp}def
f460907587
f
GR
GS
[0.75 0 0 0.75 528.54932 38.58976] CT
N
/f1552925769{27.8 4.48 M
27.8 3.808 L
29.769 3.808 29.769 3.214 QT
29.769 -7.223 L
29.769 -7.833 27.8 -7.833 QT
27.8 -8.504 L
38.285 -8.504 L
38.816 -4.145 L
38.269 -4.145 L
38.129 -5.348 37.91 -6.036 QT
37.691 -6.723 37.277 -7.122 QT
36.863 -7.52 36.16 -7.676 QT
35.457 -7.833 34.238 -7.833 QT
32.504 -7.833 L
32.16 -7.833 31.972 -7.801 QT
31.785 -7.77 31.66 -7.637 QT
31.535 -7.504 31.535 -7.223 QT
31.535 -2.333 L
32.879 -2.333 L
33.863 -2.333 34.316 -2.504 QT
34.769 -2.676 34.941 -3.137 QT
35.113 -3.598 35.113 -4.567 QT
35.66 -4.567 L
35.66 0.542 L
35.113 0.542 L
35.113 -0.426 34.941 -0.879 QT
34.769 -1.333 34.316 -1.504 QT
33.863 -1.676 32.879 -1.676 QT
31.535 -1.676 L
31.535 3.214 L
31.535 3.808 33.972 3.808 QT
33.972 4.48 L
27.8 4.48 L
cp}def
f1552925769
f
GR
GS
[0.75 0 0 0.75 0 0.25] CT
1 LJ
2.667 LW
N
661.977 51.12 M
701.75 51.12 L
S
GR
GS
[0.75 0 0 0.75 528.54932 55.66024] CT
N
/f1076049714{0.578 4.48 M
0.578 3.808 L
2.547 3.808 2.547 3.214 QT
2.547 -7.223 L
2.547 -7.833 0.578 -7.833 QT
0.578 -8.504 L
6.266 -8.504 L
6.266 -7.833 L
4.313 -7.833 4.313 -7.223 QT
4.313 -2.614 L
9.922 -2.614 L
9.922 -7.223 L
9.922 -7.833 7.953 -7.833 QT
7.953 -8.504 L
13.641 -8.504 L
13.641 -7.833 L
11.688 -7.833 11.688 -7.223 QT
11.688 3.214 L
11.688 3.808 13.641 3.808 QT
13.641 4.48 L
7.953 4.48 L
7.953 3.808 L
9.922 3.808 9.922 3.214 QT
9.922 -1.942 L
4.313 -1.942 L
4.313 3.214 L
4.313 3.808 6.266 3.808 QT
6.266 4.48 L
0.578 4.48 L
cp}def
f1076049714
f
GR
GS
[0.75 0 0 0.75 528.54932 55.66024] CT
N
/f1206368762{14.219 0.964 M
14.219 -0.208 L
19.234 -0.208 L
19.234 0.964 L
14.219 0.964 L
cp}def
f1206368762
f
GR
GS
[0.75 0 0 0.75 528.54932 55.66024] CT
N
/f989612386{20.8 4.48 M
20.8 3.808 L
22.769 3.808 22.769 3.214 QT
22.769 -7.223 L
22.769 -7.833 20.8 -7.833 QT
20.8 -8.504 L
31.55 -8.504 L
32.082 -4.145 L
31.535 -4.145 L
31.332 -5.786 30.964 -6.528 QT
30.597 -7.27 29.793 -7.551 QT
28.988 -7.833 27.363 -7.833 QT
25.503 -7.833 L
25.16 -7.833 24.972 -7.801 QT
24.785 -7.77 24.66 -7.637 QT
24.535 -7.504 24.535 -7.223 QT
24.535 -2.583 L
25.941 -2.583 L
26.91 -2.583 27.386 -2.747 QT
27.863 -2.911 28.043 -3.372 QT
28.222 -3.833 28.222 -4.801 QT
28.769 -4.801 L
28.769 0.292 L
28.222 0.292 L
28.222 -0.676 28.043 -1.137 QT
27.863 -1.598 27.386 -1.762 QT
26.91 -1.926 25.941 -1.926 QT
24.535 -1.926 L
24.535 3.214 L
24.535 3.621 24.769 3.714 QT
25.003 3.808 25.503 3.808 QT
27.519 3.808 L
28.832 3.808 29.644 3.605 QT
30.457 3.402 30.91 2.91 QT
31.363 2.417 31.605 1.644 QT
31.847 0.871 32.066 -0.504 QT
32.613 -0.504 L
31.816 4.48 L
20.8 4.48 L
cp}def
f989612386
f
GR
GS
[0.75 0 0 0.75 528.54932 55.66024] CT
N
/f-1954488926{33.504 4.48 M
33.504 3.808 L
35.473 3.808 35.473 3.214 QT
35.473 -7.223 L
35.473 -7.833 33.504 -7.833 QT
33.504 -8.504 L
39.192 -8.504 L
39.192 -7.833 L
37.238 -7.833 37.238 -7.223 QT
37.238 -1.067 L
43.113 -6.708 L
43.348 -6.973 43.348 -7.223 QT
43.348 -7.52 43.098 -7.676 QT
42.848 -7.833 42.52 -7.833 QT
42.52 -8.504 L
46.645 -8.504 L
46.645 -7.833 L
45.082 -7.833 43.91 -6.708 QT
40.535 -3.473 L
44.707 2.683 L
45.223 3.433 45.606 3.621 QT
45.988 3.808 46.91 3.808 QT
46.91 4.48 L
41.942 4.48 L
41.942 3.808 L
42.395 3.808 42.699 3.714 QT
43.004 3.621 43.004 3.277 QT
43.004 3.058 42.77 2.683 QT
39.363 -2.364 L
37.238 -0.301 L
37.238 3.214 L
37.238 3.808 39.192 3.808 QT
39.192 4.48 L
33.504 4.48 L
cp}def
f-1954488926
f
GR
GS
[0.75 0 0 0.75 528.54932 55.66024] CT
N
/f-1650973095{48.023 4.48 M
48.023 3.808 L
49.991 3.808 49.991 3.214 QT
49.991 -7.223 L
49.991 -7.833 48.023 -7.833 QT
48.023 -8.504 L
58.507 -8.504 L
59.038 -4.145 L
58.491 -4.145 L
58.351 -5.348 58.132 -6.036 QT
57.913 -6.723 57.499 -7.122 QT
57.085 -7.52 56.382 -7.676 QT
55.679 -7.833 54.46 -7.833 QT
52.726 -7.833 L
52.382 -7.833 52.195 -7.801 QT
52.007 -7.77 51.882 -7.637 QT
51.757 -7.504 51.757 -7.223 QT
51.757 -2.333 L
53.101 -2.333 L
54.085 -2.333 54.538 -2.504 QT
54.991 -2.676 55.163 -3.137 QT
55.335 -3.598 55.335 -4.567 QT
55.882 -4.567 L
55.882 0.542 L
55.335 0.542 L
55.335 -0.426 55.163 -0.879 QT
54.991 -1.333 54.538 -1.504 QT
54.085 -1.676 53.101 -1.676 QT
51.757 -1.676 L
51.757 3.214 L
51.757 3.808 54.195 3.808 QT
54.195 4.48 L
48.023 4.48 L
cp}def
f-1650973095
f
GR
GS
[0.75 0 0 0.75 0 0.25] CT
1 0 0 RC
1 LJ
2.667 LW
N
661.977 73.88 M
701.75 73.88 L
S
GR
GS
[0.75 0 0 0.75 0 0.25] CT
0.149 GC
10.0 ML
0.667 LW
N
658 87 M
658 38 L
768 38 L
768 87 L
cp
S
GR
%%Trailer
%%Pages: 1
%%EOF
