%!PS-Adobe-3.0 EPSF-3.0
%%Creator: (MATLAB, The Mathworks, Inc. Version 9.5.0.944444 \(R2018b\). Operating System: Windows 10)
%%Title: (C:/Users/Alex/Documents/PhD Docs/01. GIT/my_phd_thesis/Chapter4/Figures/paper/Simu00_ranking_042018_new.eps)
%%CreationDate: 2019-12-09T18:03:32
%%Pages: (atend)
%%BoundingBox: 0 0 599 479
%%LanguageLevel: 3
%%EndComments
%%BeginProlog
%%BeginResource: procset (Apache XML Graphics Std ProcSet) 1.2 0
%%Version: 1.2 0
%%Copyright: (Copyright 2001-2003,2010 The Apache Software Foundation. License terms: http://www.apache.org/licenses/LICENSE-2.0)
/bd{bind def}bind def
/ld{load def}bd
/GR/grestore ld
/GS/gsave ld
/RM/rmoveto ld
/C/curveto ld
/t/show ld
/L/lineto ld
/ML/setmiterlimit ld
/CT/concat ld
/f/fill ld
/N/newpath ld
/S/stroke ld
/CC/setcmykcolor ld
/A/ashow ld
/cp/closepath ld
/RC/setrgbcolor ld
/LJ/setlinejoin ld
/GC/setgray ld
/LW/setlinewidth ld
/M/moveto ld
/re {4 2 roll M
1 index 0 rlineto
0 exch rlineto
neg 0 rlineto
cp } bd
/_ctm matrix def
/_tm matrix def
/BT { _ctm currentmatrix pop matrix _tm copy pop 0 0 moveto } bd
/ET { _ctm setmatrix } bd
/iTm { _ctm setmatrix _tm concat } bd
/Tm { _tm astore pop iTm 0 0 moveto } bd
/ux 0.0 def
/uy 0.0 def
/F {
  /Tp exch def
  /Tf exch def
  Tf findfont Tp scalefont setfont
  /cf Tf def  /cs Tp def
} bd
/ULS {currentpoint /uy exch def /ux exch def} bd
/ULE {
  /Tcx currentpoint pop def
  gsave
  newpath
  cf findfont cs scalefont dup
  /FontMatrix get 0 get /Ts exch def /FontInfo get dup
  /UnderlinePosition get Ts mul /To exch def
  /UnderlineThickness get Ts mul /Tt exch def
  ux uy To add moveto  Tcx uy To add lineto
  Tt setlinewidth stroke
  grestore
} bd
/OLE {
  /Tcx currentpoint pop def
  gsave
  newpath
  cf findfont cs scalefont dup
  /FontMatrix get 0 get /Ts exch def /FontInfo get dup
  /UnderlinePosition get Ts mul /To exch def
  /UnderlineThickness get Ts mul /Tt exch def
  ux uy To add cs add moveto Tcx uy To add cs add lineto
  Tt setlinewidth stroke
  grestore
} bd
/SOE {
  /Tcx currentpoint pop def
  gsave
  newpath
  cf findfont cs scalefont dup
  /FontMatrix get 0 get /Ts exch def /FontInfo get dup
  /UnderlinePosition get Ts mul /To exch def
  /UnderlineThickness get Ts mul /Tt exch def
  ux uy To add cs 10 mul 26 idiv add moveto Tcx uy To add cs 10 mul 26 idiv add lineto
  Tt setlinewidth stroke
  grestore
} bd
/QT {
/Y22 exch store
/X22 exch store
/Y21 exch store
/X21 exch store
currentpoint
/Y21 load 2 mul add 3 div exch
/X21 load 2 mul add 3 div exch
/X21 load 2 mul /X22 load add 3 div
/Y21 load 2 mul /Y22 load add 3 div
/X22 load /Y22 load curveto
} bd
/SSPD {
dup length /d exch dict def
{
/v exch def
/k exch def
currentpagedevice k known {
/cpdv currentpagedevice k get def
v cpdv ne {
/upd false def
/nullv v type /nulltype eq def
/nullcpdv cpdv type /nulltype eq def
nullv nullcpdv or
{
/upd true def
} {
/sametype v type cpdv type eq def
sametype {
v type /arraytype eq {
/vlen v length def
/cpdvlen cpdv length def
vlen cpdvlen eq {
0 1 vlen 1 sub {
/i exch def
/obj v i get def
/cpdobj cpdv i get def
obj cpdobj ne {
/upd true def
exit
} if
} for
} {
/upd true def
} ifelse
} {
v type /dicttype eq {
v {
/dv exch def
/dk exch def
/cpddv cpdv dk get def
dv cpddv ne {
/upd true def
exit
} if
} forall
} {
/upd true def
} ifelse
} ifelse
} if
} ifelse
upd true eq {
d k v put
} if
} if
} if
} forall
d length 0 gt {
d setpagedevice
} if
} bd
/RE { % /NewFontName [NewEncodingArray] /FontName RE -
  findfont dup length dict begin
  {
    1 index /FID ne
    {def} {pop pop} ifelse
  } forall
  /Encoding exch def
  /FontName 1 index def
  currentdict definefont pop
  end
} bind def
%%EndResource
%%BeginResource: procset (Apache XML Graphics EPS ProcSet) 1.0 0
%%Version: 1.0 0
%%Copyright: (Copyright 2002-2003 The Apache Software Foundation. License terms: http://www.apache.org/licenses/LICENSE-2.0)
/BeginEPSF { %def
/b4_Inc_state save def         % Save state for cleanup
/dict_count countdictstack def % Count objects on dict stack
/op_count count 1 sub def      % Count objects on operand stack
userdict begin                 % Push userdict on dict stack
/showpage { } def              % Redefine showpage, { } = null proc
0 setgray 0 setlinecap         % Prepare graphics state
1 setlinewidth 0 setlinejoin
10 setmiterlimit [ ] 0 setdash newpath
/languagelevel where           % If level not equal to 1 then
{pop languagelevel             % set strokeadjust and
1 ne                           % overprint to their defaults.
{false setstrokeadjust false setoverprint
} if
} if
} bd
/EndEPSF { %def
count op_count sub {pop} repeat            % Clean up stacks
countdictstack dict_count sub {end} repeat
b4_Inc_state restore
} bd
%%EndResource
%FOPBeginFontDict
%%IncludeResource: font Courier-Oblique
%%IncludeResource: font Courier-BoldOblique
%%IncludeResource: font Courier-Bold
%%IncludeResource: font ZapfDingbats
%%IncludeResource: font Symbol
%%IncludeResource: font Helvetica
%%IncludeResource: font Helvetica-Oblique
%%IncludeResource: font Helvetica-Bold
%%IncludeResource: font Helvetica-BoldOblique
%%IncludeResource: font Times-Roman
%%IncludeResource: font Times-Italic
%%IncludeResource: font Times-Bold
%%IncludeResource: font Times-BoldItalic
%%IncludeResource: font Courier
%FOPEndFontDict
%%BeginResource: encoding WinAnsiEncoding
/WinAnsiEncoding [
/.notdef /.notdef /.notdef /.notdef /.notdef
/.notdef /.notdef /.notdef /.notdef /.notdef
/.notdef /.notdef /.notdef /.notdef /.notdef
/.notdef /.notdef /.notdef /.notdef /.notdef
/.notdef /.notdef /.notdef /.notdef /.notdef
/.notdef /.notdef /.notdef /.notdef /.notdef
/.notdef /.notdef /space /exclam /quotedbl
/numbersign /dollar /percent /ampersand /quotesingle
/parenleft /parenright /asterisk /plus /comma
/hyphen /period /slash /zero /one
/two /three /four /five /six
/seven /eight /nine /colon /semicolon
/less /equal /greater /question /at
/A /B /C /D /E
/F /G /H /I /J
/K /L /M /N /O
/P /Q /R /S /T
/U /V /W /X /Y
/Z /bracketleft /backslash /bracketright /asciicircum
/underscore /quoteleft /a /b /c
/d /e /f /g /h
/i /j /k /l /m
/n /o /p /q /r
/s /t /u /v /w
/x /y /z /braceleft /bar
/braceright /asciitilde /bullet /Euro /bullet
/quotesinglbase /florin /quotedblbase /ellipsis /dagger
/daggerdbl /circumflex /perthousand /Scaron /guilsinglleft
/OE /bullet /Zcaron /bullet /bullet
/quoteleft /quoteright /quotedblleft /quotedblright /bullet
/endash /emdash /asciitilde /trademark /scaron
/guilsinglright /oe /bullet /zcaron /Ydieresis
/space /exclamdown /cent /sterling /currency
/yen /brokenbar /section /dieresis /copyright
/ordfeminine /guillemotleft /logicalnot /sfthyphen /registered
/macron /degree /plusminus /twosuperior /threesuperior
/acute /mu /paragraph /middot /cedilla
/onesuperior /ordmasculine /guillemotright /onequarter /onehalf
/threequarters /questiondown /Agrave /Aacute /Acircumflex
/Atilde /Adieresis /Aring /AE /Ccedilla
/Egrave /Eacute /Ecircumflex /Edieresis /Igrave
/Iacute /Icircumflex /Idieresis /Eth /Ntilde
/Ograve /Oacute /Ocircumflex /Otilde /Odieresis
/multiply /Oslash /Ugrave /Uacute /Ucircumflex
/Udieresis /Yacute /Thorn /germandbls /agrave
/aacute /acircumflex /atilde /adieresis /aring
/ae /ccedilla /egrave /eacute /ecircumflex
/edieresis /igrave /iacute /icircumflex /idieresis
/eth /ntilde /ograve /oacute /ocircumflex
/otilde /odieresis /divide /oslash /ugrave
/uacute /ucircumflex /udieresis /yacute /thorn
/ydieresis
] def
%%EndResource
%FOPBeginFontReencode
/Courier-Oblique findfont
dup length dict begin
  {1 index /FID ne {def} {pop pop} ifelse} forall
  /Encoding WinAnsiEncoding def
  currentdict
end
/Courier-Oblique exch definefont pop
/Courier-BoldOblique findfont
dup length dict begin
  {1 index /FID ne {def} {pop pop} ifelse} forall
  /Encoding WinAnsiEncoding def
  currentdict
end
/Courier-BoldOblique exch definefont pop
/Courier-Bold findfont
dup length dict begin
  {1 index /FID ne {def} {pop pop} ifelse} forall
  /Encoding WinAnsiEncoding def
  currentdict
end
/Courier-Bold exch definefont pop
/Helvetica findfont
dup length dict begin
  {1 index /FID ne {def} {pop pop} ifelse} forall
  /Encoding WinAnsiEncoding def
  currentdict
end
/Helvetica exch definefont pop
/Helvetica-Oblique findfont
dup length dict begin
  {1 index /FID ne {def} {pop pop} ifelse} forall
  /Encoding WinAnsiEncoding def
  currentdict
end
/Helvetica-Oblique exch definefont pop
/Helvetica-Bold findfont
dup length dict begin
  {1 index /FID ne {def} {pop pop} ifelse} forall
  /Encoding WinAnsiEncoding def
  currentdict
end
/Helvetica-Bold exch definefont pop
/Helvetica-BoldOblique findfont
dup length dict begin
  {1 index /FID ne {def} {pop pop} ifelse} forall
  /Encoding WinAnsiEncoding def
  currentdict
end
/Helvetica-BoldOblique exch definefont pop
/Times-Roman findfont
dup length dict begin
  {1 index /FID ne {def} {pop pop} ifelse} forall
  /Encoding WinAnsiEncoding def
  currentdict
end
/Times-Roman exch definefont pop
/Times-Italic findfont
dup length dict begin
  {1 index /FID ne {def} {pop pop} ifelse} forall
  /Encoding WinAnsiEncoding def
  currentdict
end
/Times-Italic exch definefont pop
/Times-Bold findfont
dup length dict begin
  {1 index /FID ne {def} {pop pop} ifelse} forall
  /Encoding WinAnsiEncoding def
  currentdict
end
/Times-Bold exch definefont pop
/Times-BoldItalic findfont
dup length dict begin
  {1 index /FID ne {def} {pop pop} ifelse} forall
  /Encoding WinAnsiEncoding def
  currentdict
end
/Times-BoldItalic exch definefont pop
/Courier findfont
dup length dict begin
  {1 index /FID ne {def} {pop pop} ifelse} forall
  /Encoding WinAnsiEncoding def
  currentdict
end
/Courier exch definefont pop
%FOPEndFontReencode
%%EndProlog
%%Page: 1 1
%%PageBoundingBox: 0 0 599 479
%%BeginPageSetup
[1 0 0 -1 0 479] CT
%%EndPageSetup
GS
[0.75 0 0 0.75 0 -0.25] CT
1 GC
N
0 0 799 639 re
f
GR
GS
[0.75 0 0 0.75 0 -0.25] CT
1 GC
N
0 0 799 639 re
f
GR
GS
[0.75 0 0 0.75 0 -0.25] CT
1 GC
N
104 569 M
723 569 L
723 48 L
104 48 L
cp
f
GR
GS
[0.75 0 0 0.75 0 -0.25] CT
0.873 GC
1 LJ
0.667 LW
N
723 569 M
104 569 L
S
GR
GS
[0.75 0 0 0.75 0 -0.25] CT
0.873 GC
1 LJ
0.667 LW
N
723 464.8 M
104 464.8 L
S
GR
GS
[0.75 0 0 0.75 0 -0.25] CT
0.873 GC
1 LJ
0.667 LW
N
723 360.6 M
104 360.6 L
S
GR
GS
[0.75 0 0 0.75 0 -0.25] CT
0.873 GC
1 LJ
0.667 LW
N
723 256.4 M
104 256.4 L
S
GR
GS
[0.75 0 0 0.75 0 -0.25] CT
0.873 GC
1 LJ
0.667 LW
N
723 152.2 M
104 152.2 L
S
GR
GS
[0.75 0 0 0.75 0 -0.25] CT
0.873 GC
1 LJ
0.667 LW
N
723 48 M
104 48 L
S
GR
GS
[0.75 0 0 0.75 0 -0.25] CT
0.149 GC
1 LJ
0.667 LW
N
104 569 M
723 569 L
S
GR
GS
[0.75 0 0 0.75 0 -0.25] CT
0.149 GC
1 LJ
0.667 LW
N
104 48 M
723 48 L
S
GR
GS
[0.75 0 0 0.75 0 -0.25] CT
0.149 GC
2 setlinecap
1 LJ
0.667 LW
N
104 569 M
104 562.81 L
S
GR
GS
[0.75 0 0 0.75 0 -0.25] CT
0.149 GC
2 setlinecap
1 LJ
0.667 LW
N
165.9 569 M
165.9 562.81 L
S
GR
GS
[0.75 0 0 0.75 0 -0.25] CT
0.149 GC
2 setlinecap
1 LJ
0.667 LW
N
227.8 569 M
227.8 562.81 L
S
GR
GS
[0.75 0 0 0.75 0 -0.25] CT
0.149 GC
2 setlinecap
1 LJ
0.667 LW
N
289.7 569 M
289.7 562.81 L
S
GR
GS
[0.75 0 0 0.75 0 -0.25] CT
0.149 GC
2 setlinecap
1 LJ
0.667 LW
N
351.6 569 M
351.6 562.81 L
S
GR
GS
[0.75 0 0 0.75 0 -0.25] CT
0.149 GC
2 setlinecap
1 LJ
0.667 LW
N
413.5 569 M
413.5 562.81 L
S
GR
GS
[0.75 0 0 0.75 0 -0.25] CT
0.149 GC
2 setlinecap
1 LJ
0.667 LW
N
475.4 569 M
475.4 562.81 L
S
GR
GS
[0.75 0 0 0.75 0 -0.25] CT
0.149 GC
2 setlinecap
1 LJ
0.667 LW
N
537.3 569 M
537.3 562.81 L
S
GR
GS
[0.75 0 0 0.75 0 -0.25] CT
0.149 GC
2 setlinecap
1 LJ
0.667 LW
N
599.2 569 M
599.2 562.81 L
S
GR
GS
[0.75 0 0 0.75 0 -0.25] CT
0.149 GC
2 setlinecap
1 LJ
0.667 LW
N
661.1 569 M
661.1 562.81 L
S
GR
GS
[0.75 0 0 0.75 0 -0.25] CT
0.149 GC
2 setlinecap
1 LJ
0.667 LW
N
723 569 M
723 562.81 L
S
GR
GS
[0.75 0 0 0.75 0 -0.25] CT
0.149 GC
2 setlinecap
1 LJ
0.667 LW
N
104 48 M
104 54.19 L
S
GR
GS
[0.75 0 0 0.75 0 -0.25] CT
0.149 GC
2 setlinecap
1 LJ
0.667 LW
N
165.9 48 M
165.9 54.19 L
S
GR
GS
[0.75 0 0 0.75 0 -0.25] CT
0.149 GC
2 setlinecap
1 LJ
0.667 LW
N
227.8 48 M
227.8 54.19 L
S
GR
GS
[0.75 0 0 0.75 0 -0.25] CT
0.149 GC
2 setlinecap
1 LJ
0.667 LW
N
289.7 48 M
289.7 54.19 L
S
GR
GS
[0.75 0 0 0.75 0 -0.25] CT
0.149 GC
2 setlinecap
1 LJ
0.667 LW
N
351.6 48 M
351.6 54.19 L
S
GR
GS
[0.75 0 0 0.75 0 -0.25] CT
0.149 GC
2 setlinecap
1 LJ
0.667 LW
N
413.5 48 M
413.5 54.19 L
S
GR
GS
[0.75 0 0 0.75 0 -0.25] CT
0.149 GC
2 setlinecap
1 LJ
0.667 LW
N
475.4 48 M
475.4 54.19 L
S
GR
GS
[0.75 0 0 0.75 0 -0.25] CT
0.149 GC
2 setlinecap
1 LJ
0.667 LW
N
537.3 48 M
537.3 54.19 L
S
GR
GS
[0.75 0 0 0.75 0 -0.25] CT
0.149 GC
2 setlinecap
1 LJ
0.667 LW
N
599.2 48 M
599.2 54.19 L
S
GR
GS
[0.75 0 0 0.75 0 -0.25] CT
0.149 GC
2 setlinecap
1 LJ
0.667 LW
N
661.1 48 M
661.1 54.19 L
S
GR
GS
[0.75 0 0 0.75 0 -0.25] CT
0.149 GC
2 setlinecap
1 LJ
0.667 LW
N
723 48 M
723 54.19 L
S
GR
GS
[0.75 0 0 0.75 124.425 432.10001] CT
0.149 GC
N
-3.719 18.301 M
-3.156 19.129 -2.203 19.527 QT
-1.25 19.926 -0.156 19.926 QT
1.234 19.926 1.82 18.738 QT
2.406 17.551 2.406 16.035 QT
2.406 15.347 2.281 14.668 QT
2.156 13.988 1.867 13.402 QT
1.578 12.816 1.063 12.465 QT
0.547 12.113 -0.188 12.113 QT
-1.781 12.113 L
-1.984 12.113 -1.984 11.894 QT
-1.984 11.691 L
-1.984 11.504 -1.781 11.504 QT
-0.453 11.394 L
0.391 11.394 0.945 10.761 QT
1.5 10.129 1.758 9.222 QT
2.016 8.316 2.016 7.488 QT
2.016 6.347 1.477 5.605 QT
0.938 4.863 -0.156 4.863 QT
-1.078 4.863 -1.906 5.207 QT
-2.734 5.551 -3.234 6.254 QT
-3.188 6.254 -3.148 6.246 QT
-3.109 6.238 -3.063 6.238 QT
-2.531 6.238 -2.164 6.613 QT
-1.797 6.988 -1.797 7.519 QT
-1.797 8.035 -2.164 8.41 QT
-2.531 8.785 -3.063 8.785 QT
-3.594 8.785 -3.969 8.41 QT
-4.344 8.035 -4.344 7.519 QT
-4.344 6.488 -3.727 5.722 QT
-3.109 4.957 -2.125 4.566 QT
-1.141 4.176 -0.156 4.176 QT
0.563 4.176 1.375 4.394 QT
2.188 4.613 2.844 5.011 QT
3.5 5.41 3.914 6.043 QT
4.328 6.676 4.328 7.488 QT
4.328 8.504 3.875 9.355 QT
3.422 10.207 2.641 10.832 QT
1.859 11.457 0.922 11.754 QT
1.953 11.957 2.891 12.543 QT
3.828 13.129 4.398 14.043 QT
4.969 14.957 4.969 16.004 QT
4.969 17.332 4.242 18.402 QT
3.516 19.472 2.336 20.082 QT
1.156 20.691 -0.156 20.691 QT
-1.281 20.691 -2.414 20.261 QT
-3.547 19.832 -4.266 18.972 QT
-4.984 18.113 -4.984 16.926 QT
-4.984 16.332 -4.586 15.933 QT
-4.188 15.535 -3.594 15.535 QT
-3.203 15.535 -2.883 15.715 QT
-2.563 15.894 -2.383 16.222 QT
-2.203 16.551 -2.203 16.926 QT
-2.203 17.504 -2.609 17.902 QT
-3.016 18.301 -3.594 18.301 QT
-3.719 18.301 L
cp
f
GR
GS
[0.75 0 0 0.75 170.85 432.10001] CT
0.149 GC
N
-10.797 20.16 M
-10.797 19.519 L
-10.797 19.457 -10.75 19.379 QT
-7.031 15.254 L
-6.188 14.347 -5.656 13.722 QT
-5.125 13.097 -4.609 12.293 QT
-4.094 11.488 -3.797 10.652 QT
-3.5 9.816 -3.5 8.879 QT
-3.5 7.894 -3.867 6.996 QT
-4.234 6.097 -4.953 5.558 QT
-5.672 5.019 -6.688 5.019 QT
-7.734 5.019 -8.563 5.644 QT
-9.391 6.269 -9.734 7.269 QT
-9.641 7.238 -9.484 7.238 QT
-8.938 7.238 -8.555 7.605 QT
-8.172 7.972 -8.172 8.551 QT
-8.172 9.097 -8.555 9.48 QT
-8.938 9.863 -9.484 9.863 QT
-10.047 9.863 -10.422 9.465 QT
-10.797 9.066 -10.797 8.551 QT
-10.797 7.644 -10.461 6.855 QT
-10.125 6.066 -9.484 5.449 QT
-8.844 4.832 -8.039 4.504 QT
-7.234 4.176 -6.344 4.176 QT
-4.969 4.176 -3.781 4.754 QT
-2.594 5.332 -1.906 6.394 QT
-1.219 7.457 -1.219 8.879 QT
-1.219 9.91 -1.672 10.847 QT
-2.125 11.785 -2.844 12.558 QT
-3.563 13.332 -4.672 14.301 QT
-5.781 15.269 -6.141 15.597 QT
-8.859 18.207 L
-6.547 18.207 L
-4.844 18.207 -3.703 18.183 QT
-2.563 18.16 -2.5 18.097 QT
-2.219 17.785 -1.922 15.879 QT
-1.219 15.879 L
-1.891 20.16 L
-10.797 20.16 L
cp
f
GR
GS
[0.75 0 0 0.75 170.85 432.10001] CT
0.149 GC
N
2.234 20.16 M
2.234 19.316 L
5.234 19.316 5.234 18.551 QT
5.234 5.957 L
3.984 6.551 2.094 6.551 QT
2.094 5.707 L
5.031 5.707 6.531 4.176 QT
6.875 4.176 L
6.953 4.176 7.031 4.238 QT
7.109 4.301 7.109 4.379 QT
7.109 18.551 L
7.109 19.316 10.109 19.316 QT
10.109 20.16 L
2.234 20.16 L
cp
f
GR
GS
[0.75 0 0 0.75 217.27501 432.10001] CT
0.149 GC
N
-1.828 19.535 M
-1.828 18.207 -1.594 16.926 QT
-1.359 15.644 -0.906 14.394 QT
-0.453 13.144 0.188 11.949 QT
0.828 10.754 1.578 9.691 QT
3.781 6.644 L
1.031 6.644 L
-3.234 6.644 -3.359 6.769 QT
-3.672 7.144 -3.953 8.972 QT
-4.656 8.972 L
-3.859 3.941 L
-3.156 3.941 L
-3.156 4.004 L
-3.156 4.441 -1.695 4.574 QT
-0.234 4.707 1.172 4.707 QT
5.641 4.707 L
5.641 5.316 L
5.641 5.347 5.633 5.355 QT
5.625 5.363 5.609 5.394 QT
2.313 10.035 L
1.094 11.832 0.789 14.035 QT
0.484 16.238 0.484 19.535 QT
0.484 20.004 0.141 20.347 QT
-0.203 20.691 -0.672 20.691 QT
-1.141 20.691 -1.484 20.347 QT
-1.828 20.004 -1.828 19.535 QT
cp
f
GR
GS
[0.75 0 0 0.75 263.7 432.10001] CT
0.149 GC
N
-9.766 20.16 M
-9.766 19.316 L
-6.766 19.316 -6.766 18.551 QT
-6.766 5.957 L
-8.016 6.551 -9.906 6.551 QT
-9.906 5.707 L
-6.969 5.707 -5.469 4.176 QT
-5.125 4.176 L
-5.047 4.176 -4.969 4.238 QT
-4.891 4.301 -4.891 4.379 QT
-4.891 18.551 L
-4.891 19.316 -1.891 19.316 QT
-1.891 20.16 L
-9.766 20.16 L
cp
f
GR
GS
[0.75 0 0 0.75 263.7 432.10001] CT
0.149 GC
N
1.203 20.16 M
1.203 19.519 L
1.203 19.457 1.25 19.379 QT
4.969 15.254 L
5.813 14.347 6.344 13.722 QT
6.875 13.097 7.391 12.293 QT
7.906 11.488 8.203 10.652 QT
8.5 9.816 8.5 8.879 QT
8.5 7.894 8.133 6.996 QT
7.766 6.097 7.047 5.558 QT
6.328 5.019 5.313 5.019 QT
4.266 5.019 3.438 5.644 QT
2.609 6.269 2.266 7.269 QT
2.359 7.238 2.516 7.238 QT
3.063 7.238 3.445 7.605 QT
3.828 7.972 3.828 8.551 QT
3.828 9.097 3.445 9.48 QT
3.063 9.863 2.516 9.863 QT
1.953 9.863 1.578 9.465 QT
1.203 9.066 1.203 8.551 QT
1.203 7.644 1.539 6.855 QT
1.875 6.066 2.516 5.449 QT
3.156 4.832 3.961 4.504 QT
4.766 4.176 5.656 4.176 QT
7.031 4.176 8.219 4.754 QT
9.406 5.332 10.094 6.394 QT
10.781 7.457 10.781 8.879 QT
10.781 9.91 10.328 10.847 QT
9.875 11.785 9.156 12.558 QT
8.438 13.332 7.328 14.301 QT
6.219 15.269 5.859 15.597 QT
3.141 18.207 L
5.453 18.207 L
7.156 18.207 8.297 18.183 QT
9.438 18.16 9.5 18.097 QT
9.781 17.785 10.078 15.879 QT
10.781 15.879 L
10.109 20.16 L
1.203 20.16 L
cp
f
GR
GS
[0.75 0 0 0.75 310.125 432.10001] CT
0.149 GC
N
/f143727194{-9.766 20.16 M
-9.766 19.316 L
-6.766 19.316 -6.766 18.551 QT
-6.766 5.957 L
-8.016 6.551 -9.906 6.551 QT
-9.906 5.707 L
-6.969 5.707 -5.469 4.176 QT
-5.125 4.176 L
-5.047 4.176 -4.969 4.238 QT
-4.891 4.301 -4.891 4.379 QT
-4.891 18.551 L
-4.891 19.316 -1.891 19.316 QT
-1.891 20.16 L
-9.766 20.16 L
cp}def
f143727194
f
GR
GS
[0.75 0 0 0.75 310.125 432.10001] CT
0.149 GC
N
/f-1523441606{2.234 20.16 M
2.234 19.316 L
5.234 19.316 5.234 18.551 QT
5.234 5.957 L
3.984 6.551 2.094 6.551 QT
2.094 5.707 L
5.031 5.707 6.531 4.176 QT
6.875 4.176 L
6.953 4.176 7.031 4.238 QT
7.109 4.301 7.109 4.379 QT
7.109 18.551 L
7.109 19.316 10.109 19.316 QT
10.109 20.16 L
2.234 20.16 L
cp}def
f-1523441606
f
GR
GS
[0.75 0 0 0.75 356.55 432.10001] CT
0.149 GC
N
f143727194
f
GR
GS
[0.75 0 0 0.75 356.55 432.10001] CT
0.149 GC
N
/f-1565563839{6 20.691 M
4.516 20.691 3.516 19.894 QT
2.516 19.097 1.977 17.84 QT
1.438 16.582 1.227 15.199 QT
1.016 13.816 1.016 12.394 QT
1.016 10.504 1.75 8.59 QT
2.484 6.676 3.922 5.426 QT
5.359 4.176 7.328 4.176 QT
8.141 4.176 8.852 4.488 QT
9.563 4.801 9.969 5.402 QT
10.375 6.004 10.375 6.863 QT
10.375 7.347 10.039 7.683 QT
9.703 8.019 9.219 8.019 QT
8.75 8.019 8.406 7.676 QT
8.063 7.332 8.063 6.863 QT
8.063 6.394 8.406 6.051 QT
8.75 5.707 9.219 5.707 QT
9.344 5.707 L
9.031 5.269 8.477 5.066 QT
7.922 4.863 7.328 4.863 QT
6.594 4.863 5.984 5.183 QT
5.375 5.504 4.883 6.043 QT
4.391 6.582 4.063 7.23 QT
3.734 7.879 3.547 8.707 QT
3.359 9.535 3.313 10.261 QT
3.266 10.988 3.266 12.097 QT
3.688 11.113 4.461 10.488 QT
5.234 9.863 6.219 9.863 QT
7.281 9.863 8.156 10.293 QT
9.031 10.722 9.664 11.488 QT
10.297 12.254 10.633 13.238 QT
10.969 14.222 10.969 15.238 QT
10.969 16.644 10.344 17.918 QT
9.719 19.191 8.578 19.941 QT
7.438 20.691 6 20.691 QT
cp
6 19.926 M
6.922 19.926 7.484 19.504 QT
8.047 19.082 8.313 18.386 QT
8.578 17.691 8.641 16.98 QT
8.703 16.269 8.703 15.238 QT
8.703 13.879 8.578 12.918 QT
8.453 11.957 7.875 11.222 QT
7.297 10.488 6.125 10.488 QT
5.141 10.488 4.516 11.144 QT
3.891 11.801 3.602 12.801 QT
3.313 13.801 3.313 14.738 QT
3.313 15.051 3.344 15.207 QT
3.344 15.254 3.336 15.277 QT
3.328 15.301 3.313 15.332 QT
3.313 16.363 3.523 17.418 QT
3.734 18.472 4.336 19.199 QT
4.938 19.926 6 19.926 QT
cp}def
f-1565563839
f
GR
GS
[0.75 0 0 0.75 402.97499 432.10001] CT
0.149 GC
N
/f-678663693{-10.797 20.16 M
-10.797 19.519 L
-10.797 19.457 -10.75 19.379 QT
-7.031 15.254 L
-6.188 14.347 -5.656 13.722 QT
-5.125 13.097 -4.609 12.293 QT
-4.094 11.488 -3.797 10.652 QT
-3.5 9.816 -3.5 8.879 QT
-3.5 7.894 -3.867 6.996 QT
-4.234 6.097 -4.953 5.558 QT
-5.672 5.019 -6.688 5.019 QT
-7.734 5.019 -8.563 5.644 QT
-9.391 6.269 -9.734 7.269 QT
-9.641 7.238 -9.484 7.238 QT
-8.938 7.238 -8.555 7.605 QT
-8.172 7.972 -8.172 8.551 QT
-8.172 9.097 -8.555 9.48 QT
-8.938 9.863 -9.484 9.863 QT
-10.047 9.863 -10.422 9.465 QT
-10.797 9.066 -10.797 8.551 QT
-10.797 7.644 -10.461 6.855 QT
-10.125 6.066 -9.484 5.449 QT
-8.844 4.832 -8.039 4.504 QT
-7.234 4.176 -6.344 4.176 QT
-4.969 4.176 -3.781 4.754 QT
-2.594 5.332 -1.906 6.394 QT
-1.219 7.457 -1.219 8.879 QT
-1.219 9.91 -1.672 10.847 QT
-2.125 11.785 -2.844 12.558 QT
-3.563 13.332 -4.672 14.301 QT
-5.781 15.269 -6.141 15.597 QT
-8.859 18.207 L
-6.547 18.207 L
-4.844 18.207 -3.703 18.183 QT
-2.563 18.16 -2.5 18.097 QT
-2.219 17.785 -1.922 15.879 QT
-1.219 15.879 L
-1.891 20.16 L
-10.797 20.16 L
cp}def
f-678663693
f
GR
GS
[0.75 0 0 0.75 402.97499 432.10001] CT
0.149 GC
N
/f1089235638{4.172 19.535 M
4.172 18.207 4.406 16.926 QT
4.641 15.644 5.094 14.394 QT
5.547 13.144 6.188 11.949 QT
6.828 10.754 7.578 9.691 QT
9.781 6.644 L
7.031 6.644 L
2.766 6.644 2.641 6.769 QT
2.328 7.144 2.047 8.972 QT
1.344 8.972 L
2.141 3.941 L
2.844 3.941 L
2.844 4.004 L
2.844 4.441 4.305 4.574 QT
5.766 4.707 7.172 4.707 QT
11.641 4.707 L
11.641 5.316 L
11.641 5.347 11.633 5.355 QT
11.625 5.363 11.609 5.394 QT
8.313 10.035 L
7.094 11.832 6.789 14.035 QT
6.484 16.238 6.484 19.535 QT
6.484 20.004 6.141 20.347 QT
5.797 20.691 5.328 20.691 QT
4.859 20.691 4.516 20.347 QT
4.172 20.004 4.172 19.535 QT
cp}def
f1089235638
f
GR
GS
[0.75 0 0 0.75 449.40001 432.10001] CT
0.149 GC
N
f-678663693
f
GR
GS
[0.75 0 0 0.75 449.40001 432.10001] CT
0.149 GC
N
/f-1909175845{2.094 17.426 M
2.328 18.129 2.844 18.707 QT
3.359 19.285 4.055 19.605 QT
4.75 19.926 5.5 19.926 QT
7.234 19.926 7.891 18.574 QT
8.547 17.222 8.547 15.301 QT
8.547 14.472 8.516 13.902 QT
8.484 13.332 8.359 12.816 QT
8.141 11.972 7.578 11.34 QT
7.016 10.707 6.219 10.707 QT
5.406 10.707 4.828 10.949 QT
4.25 11.191 3.883 11.519 QT
3.516 11.847 3.234 12.215 QT
2.953 12.582 2.891 12.597 QT
2.609 12.597 L
2.563 12.597 2.469 12.519 QT
2.375 12.441 2.375 12.379 QT
2.375 4.363 L
2.375 4.301 2.453 4.238 QT
2.531 4.176 2.609 4.176 QT
2.688 4.176 L
4.297 4.941 6.125 4.941 QT
7.906 4.941 9.547 4.176 QT
9.625 4.176 L
9.703 4.176 9.773 4.23 QT
9.844 4.285 9.844 4.363 QT
9.844 4.582 L
9.844 4.707 9.797 4.707 QT
8.984 5.785 7.742 6.394 QT
6.5 7.004 5.188 7.004 QT
4.219 7.004 3.219 6.738 QT
3.219 11.269 L
4.016 10.629 4.641 10.355 QT
5.266 10.082 6.234 10.082 QT
7.563 10.082 8.609 10.84 QT
9.656 11.597 10.219 12.824 QT
10.781 14.051 10.781 15.332 QT
10.781 16.769 10.07 18.004 QT
9.359 19.238 8.141 19.965 QT
6.922 20.691 5.5 20.691 QT
4.313 20.691 3.32 20.082 QT
2.328 19.472 1.766 18.441 QT
1.203 17.41 1.203 16.238 QT
1.203 15.707 1.555 15.363 QT
1.906 15.019 2.422 15.019 QT
2.953 15.019 3.313 15.371 QT
3.672 15.722 3.672 16.238 QT
3.672 16.754 3.313 17.113 QT
2.953 17.472 2.422 17.472 QT
2.344 17.472 2.242 17.457 QT
2.141 17.441 2.094 17.426 QT
cp}def
f-1909175845
f
GR
GS
[0.75 0 0 0.75 495.82498 432.10001] CT
0.149 GC
N
/f641269121{-4.984 16.519 M
-4.984 15.066 -4.039 13.965 QT
-3.094 12.863 -1.609 12.113 QT
-2.5 11.551 L
-3.313 11.004 -3.828 10.105 QT
-4.344 9.207 -4.344 8.222 QT
-4.344 7.082 -3.742 6.152 QT
-3.141 5.222 -2.141 4.699 QT
-1.141 4.176 0 4.176 QT
1.063 4.176 2.055 4.605 QT
3.047 5.035 3.688 5.847 QT
4.328 6.66 4.328 7.769 QT
4.328 8.582 3.945 9.269 QT
3.563 9.957 2.898 10.511 QT
2.234 11.066 1.484 11.457 QT
2.859 12.332 L
3.813 12.957 4.391 13.965 QT
4.969 14.972 4.969 16.082 QT
4.969 17.379 4.273 18.449 QT
3.578 19.519 2.43 20.105 QT
1.281 20.691 0 20.691 QT
-1.234 20.691 -2.391 20.183 QT
-3.547 19.676 -4.266 18.722 QT
-4.984 17.769 -4.984 16.519 QT
cp
-3.688 16.519 M
-3.688 17.457 -3.164 18.246 QT
-2.641 19.035 -1.789 19.48 QT
-0.938 19.926 0 19.926 QT
1.391 19.926 2.531 19.113 QT
3.672 18.301 3.672 16.941 QT
3.672 16.488 3.492 16.035 QT
3.313 15.582 2.984 15.215 QT
2.656 14.847 2.266 14.613 QT
-0.953 12.535 L
-1.703 12.926 -2.336 13.535 QT
-2.969 14.144 -3.328 14.91 QT
-3.688 15.676 -3.688 16.519 QT
cp
-2.031 9.191 M
0.875 11.066 L
1.875 10.472 2.523 9.644 QT
3.172 8.816 3.172 7.769 QT
3.172 6.957 2.719 6.285 QT
2.266 5.613 1.539 5.238 QT
0.813 4.863 -0.016 4.863 QT
-0.75 4.863 -1.484 5.144 QT
-2.219 5.426 -2.703 5.98 QT
-3.188 6.535 -3.188 7.285 QT
-3.188 8.41 -2.031 9.191 QT
cp}def
f641269121
f
GR
GS
[0.75 0 0 0.75 310.12523 454.69998] CT
0.149 GC
N
/f-891252455{-27.741 22.176 M
-27.741 21.254 L
-25.053 21.254 -25.053 20.442 QT
-25.053 6.16 L
-25.053 5.332 -27.741 5.332 QT
-27.741 4.41 L
-18.475 4.41 L
-17.053 4.41 -15.631 4.996 QT
-14.209 5.582 -13.295 6.699 QT
-12.381 7.817 -12.381 9.301 QT
-12.381 10.754 -13.303 11.84 QT
-14.225 12.926 -15.639 13.496 QT
-17.053 14.067 -18.475 14.067 QT
-22.647 14.067 L
-22.647 20.442 L
-22.647 21.254 -19.959 21.254 QT
-19.959 22.176 L
-27.741 22.176 L
cp
-22.725 13.285 M
-19.194 13.285 L
-17.756 13.285 -16.866 12.871 QT
-15.975 12.457 -15.569 11.59 QT
-15.163 10.723 -15.163 9.301 QT
-15.163 7.176 -16.092 6.254 QT
-17.022 5.332 -19.194 5.332 QT
-21.397 5.332 L
-21.866 5.332 -22.131 5.371 QT
-22.397 5.41 -22.561 5.59 QT
-22.725 5.77 -22.725 6.16 QT
-22.725 13.285 L
cp}def
f-891252455
f
GR
GS
[0.75 0 0 0.75 310.12523 454.69998] CT
0.149 GC
N
/f-831788594{-9.774 22.176 M
-9.774 21.254 L
-7.086 21.254 -7.086 20.442 QT
-7.086 6.16 L
-7.086 5.332 -9.774 5.332 QT
-9.774 4.41 L
-1.602 4.41 L
-0.149 4.41 1.46 4.942 QT
3.07 5.473 4.148 6.551 QT
5.226 7.629 5.226 9.129 QT
5.226 10.223 4.57 11.074 QT
3.914 11.926 2.89 12.504 QT
1.867 13.082 0.804 13.332 QT
1.976 13.738 2.851 14.629 QT
3.726 15.52 3.898 16.66 QT
4.273 18.973 L
4.523 20.535 4.804 21.301 QT
5.085 22.067 6.039 22.067 QT
6.851 22.067 7.249 21.317 QT
7.648 20.567 7.648 19.676 QT
7.648 19.582 7.734 19.512 QT
7.82 19.442 7.898 19.442 QT
8.148 19.442 L
8.398 19.442 8.398 19.785 QT
8.398 20.504 8.117 21.184 QT
7.835 21.863 7.312 22.309 QT
6.789 22.754 6.054 22.754 QT
4.179 22.754 2.828 21.817 QT
1.476 20.879 1.476 19.082 QT
1.476 16.77 L
1.476 15.473 0.578 14.543 QT
-0.321 13.613 -1.633 13.613 QT
-4.758 13.613 L
-4.758 20.442 L
-4.758 21.254 -2.071 21.254 QT
-2.071 22.176 L
-9.774 22.176 L
cp
-4.758 12.942 M
-1.977 12.942 L
0.179 12.942 1.312 12.074 QT
2.445 11.207 2.445 9.129 QT
2.445 7.051 1.328 6.192 QT
0.21 5.332 -1.977 5.332 QT
-3.43 5.332 L
-3.899 5.332 -4.165 5.371 QT
-4.43 5.41 -4.594 5.59 QT
-4.758 5.77 -4.758 6.16 QT
-4.758 12.942 L
cp}def
f-831788594
f
GR
GS
[0.75 0 0 0.75 310.12523 454.69998] CT
0.149 GC
N
/f1585619083{9.597 22.176 M
9.597 21.254 L
12.284 21.254 12.284 19.723 QT
12.284 5.488 L
11.425 5.332 9.597 5.332 QT
9.597 4.41 L
14.581 4.41 L
14.706 4.41 14.753 4.52 QT
23.956 18.067 L
23.956 6.863 L
23.956 5.332 21.284 5.332 QT
21.284 4.41 L
27.456 4.41 L
27.456 5.332 L
24.8 5.332 24.8 6.863 QT
24.8 21.942 L
24.8 22.02 24.698 22.098 QT
24.597 22.176 24.534 22.176 QT
24.206 22.176 L
24.081 22.176 24.034 22.067 QT
13.113 6.004 L
13.113 19.723 L
13.113 21.254 15.8 21.254 QT
15.8 22.176 L
9.597 22.176 L
cp}def
f1585619083
f
GR
GS
[0.75 0 0 0.75 0 -0.25] CT
0.149 GC
1 LJ
0.667 LW
N
104 569 M
104 48 L
S
GR
GS
[0.75 0 0 0.75 0 -0.25] CT
0.149 GC
1 LJ
0.667 LW
N
723 569 M
723 48 L
S
GR
GS
[0.75 0 0 0.75 0 -0.25] CT
0.149 GC
2 setlinecap
1 LJ
0.667 LW
N
104 569 M
110.19 569 L
S
GR
GS
[0.75 0 0 0.75 0 -0.25] CT
0.149 GC
2 setlinecap
1 LJ
0.667 LW
N
104 464.8 M
110.19 464.8 L
S
GR
GS
[0.75 0 0 0.75 0 -0.25] CT
0.149 GC
2 setlinecap
1 LJ
0.667 LW
N
104 360.6 M
110.19 360.6 L
S
GR
GS
[0.75 0 0 0.75 0 -0.25] CT
0.149 GC
2 setlinecap
1 LJ
0.667 LW
N
104 256.4 M
110.19 256.4 L
S
GR
GS
[0.75 0 0 0.75 0 -0.25] CT
0.149 GC
2 setlinecap
1 LJ
0.667 LW
N
104 152.2 M
110.19 152.2 L
S
GR
GS
[0.75 0 0 0.75 0 -0.25] CT
0.149 GC
2 setlinecap
1 LJ
0.667 LW
N
104 48 M
110.19 48 L
S
GR
GS
[0.75 0 0 0.75 0 -0.25] CT
0.149 GC
2 setlinecap
1 LJ
0.667 LW
N
723 569 M
716.81 569 L
S
GR
GS
[0.75 0 0 0.75 0 -0.25] CT
0.149 GC
2 setlinecap
1 LJ
0.667 LW
N
723 464.8 M
716.81 464.8 L
S
GR
GS
[0.75 0 0 0.75 0 -0.25] CT
0.149 GC
2 setlinecap
1 LJ
0.667 LW
N
723 360.6 M
716.81 360.6 L
S
GR
GS
[0.75 0 0 0.75 0 -0.25] CT
0.149 GC
2 setlinecap
1 LJ
0.667 LW
N
723 256.4 M
716.81 256.4 L
S
GR
GS
[0.75 0 0 0.75 0 -0.25] CT
0.149 GC
2 setlinecap
1 LJ
0.667 LW
N
723 152.2 M
716.81 152.2 L
S
GR
GS
[0.75 0 0 0.75 0 -0.25] CT
0.149 GC
2 setlinecap
1 LJ
0.667 LW
N
723 48 M
716.81 48 L
S
GR
GS
[0.75 0 0 0.75 72.4 426.5] CT
0.149 GC
N
/f1219663315{-6 6.291 M
-8.938 6.291 -10 3.869 QT
-11.063 1.447 -11.063 -1.896 QT
-11.063 -3.974 -10.68 -5.818 QT
-10.297 -7.662 -9.164 -8.943 QT
-8.031 -10.224 -6 -10.224 QT
-4.422 -10.224 -3.414 -9.451 QT
-2.406 -8.678 -1.875 -7.451 QT
-1.344 -6.224 -1.148 -4.826 QT
-0.953 -3.428 -0.953 -1.896 QT
-0.953 0.166 -1.336 1.963 QT
-1.719 3.76 -2.836 5.026 QT
-3.953 6.291 -6 6.291 QT
cp
-6 5.666 M
-4.656 5.666 -4 4.291 QT
-3.344 2.916 -3.195 1.252 QT
-3.047 -0.412 -3.047 -2.287 QT
-3.047 -4.084 -3.195 -5.607 QT
-3.344 -7.131 -4 -8.365 QT
-4.656 -9.599 -6 -9.599 QT
-7.359 -9.599 -8.016 -8.357 QT
-8.672 -7.115 -8.82 -5.599 QT
-8.969 -4.084 -8.969 -2.287 QT
-8.969 -0.943 -8.906 0.236 QT
-8.844 1.416 -8.563 2.682 QT
-8.281 3.947 -7.656 4.807 QT
-7.031 5.666 -6 5.666 QT
cp}def
f1219663315
f
GR
GS
[0.75 0 0 0.75 72.4 348.34999] CT
0.149 GC
N
/f-1055894690{-24.667 6.291 M
-27.604 6.291 -28.667 3.869 QT
-29.729 1.447 -29.729 -1.896 QT
-29.729 -3.974 -29.346 -5.818 QT
-28.964 -7.662 -27.831 -8.943 QT
-26.698 -10.224 -24.667 -10.224 QT
-23.089 -10.224 -22.081 -9.451 QT
-21.073 -8.678 -20.542 -7.451 QT
-20.011 -6.224 -19.815 -4.826 QT
-19.62 -3.428 -19.62 -1.896 QT
-19.62 0.166 -20.003 1.963 QT
-20.386 3.76 -21.503 5.026 QT
-22.62 6.291 -24.667 6.291 QT
cp
-24.667 5.666 M
-23.323 5.666 -22.667 4.291 QT
-22.011 2.916 -21.862 1.252 QT
-21.714 -0.412 -21.714 -2.287 QT
-21.714 -4.084 -21.862 -5.607 QT
-22.011 -7.131 -22.667 -8.365 QT
-23.323 -9.599 -24.667 -9.599 QT
-26.026 -9.599 -26.682 -8.357 QT
-27.339 -7.115 -27.487 -5.599 QT
-27.636 -4.084 -27.636 -2.287 QT
-27.636 -0.943 -27.573 0.236 QT
-27.511 1.416 -27.229 2.682 QT
-26.948 3.947 -26.323 4.807 QT
-25.698 5.666 -24.667 5.666 QT
cp}def
f-1055894690
f
GR
GS
[0.75 0 0 0.75 72.4 348.34999] CT
0.149 GC
N
/f-1543496504{-16.651 4.432 M
-16.651 3.901 -16.253 3.51 QT
-15.854 3.119 -15.323 3.119 QT
-14.995 3.119 -14.682 3.299 QT
-14.37 3.479 -14.19 3.791 QT
-14.01 4.104 -14.01 4.432 QT
-14.01 4.963 -14.401 5.361 QT
-14.792 5.76 -15.323 5.76 QT
-15.854 5.76 -16.253 5.361 QT
-16.651 4.963 -16.651 4.432 QT
cp}def
f-1543496504
f
GR
GS
[0.75 0 0 0.75 72.4 348.34999] CT
0.149 GC
N
/f429638810{-9.906 3.026 M
-9.672 3.729 -9.156 4.307 QT
-8.641 4.885 -7.945 5.205 QT
-7.25 5.526 -6.5 5.526 QT
-4.766 5.526 -4.109 4.174 QT
-3.453 2.822 -3.453 0.901 QT
-3.453 0.072 -3.484 -0.498 QT
-3.516 -1.068 -3.641 -1.584 QT
-3.859 -2.428 -4.422 -3.06 QT
-4.984 -3.693 -5.781 -3.693 QT
-6.594 -3.693 -7.172 -3.451 QT
-7.75 -3.209 -8.117 -2.881 QT
-8.484 -2.553 -8.766 -2.185 QT
-9.047 -1.818 -9.109 -1.803 QT
-9.391 -1.803 L
-9.438 -1.803 -9.531 -1.881 QT
-9.625 -1.959 -9.625 -2.021 QT
-9.625 -10.037 L
-9.625 -10.099 -9.547 -10.162 QT
-9.469 -10.224 -9.391 -10.224 QT
-9.313 -10.224 L
-7.703 -9.459 -5.875 -9.459 QT
-4.094 -9.459 -2.453 -10.224 QT
-2.375 -10.224 L
-2.297 -10.224 -2.227 -10.17 QT
-2.156 -10.115 -2.156 -10.037 QT
-2.156 -9.818 L
-2.156 -9.693 -2.203 -9.693 QT
-3.016 -8.615 -4.258 -8.006 QT
-5.5 -7.396 -6.813 -7.396 QT
-7.781 -7.396 -8.781 -7.662 QT
-8.781 -3.131 L
-7.984 -3.771 -7.359 -4.045 QT
-6.734 -4.318 -5.766 -4.318 QT
-4.438 -4.318 -3.391 -3.56 QT
-2.344 -2.803 -1.781 -1.576 QT
-1.219 -0.349 -1.219 0.932 QT
-1.219 2.369 -1.93 3.604 QT
-2.641 4.838 -3.859 5.565 QT
-5.078 6.291 -6.5 6.291 QT
-7.688 6.291 -8.68 5.682 QT
-9.672 5.072 -10.234 4.041 QT
-10.797 3.01 -10.797 1.838 QT
-10.797 1.307 -10.445 0.963 QT
-10.094 0.619 -9.578 0.619 QT
-9.047 0.619 -8.688 0.971 QT
-8.328 1.322 -8.328 1.838 QT
-8.328 2.354 -8.688 2.713 QT
-9.047 3.072 -9.578 3.072 QT
-9.656 3.072 -9.758 3.057 QT
-9.859 3.041 -9.906 3.026 QT
cp}def
f429638810
f
GR
GS
[0.75 0 0 0.75 72.4 270.2] CT
0.149 GC
N
/f361407121{-9.766 5.76 M
-9.766 4.916 L
-6.766 4.916 -6.766 4.151 QT
-6.766 -8.443 L
-8.016 -7.849 -9.906 -7.849 QT
-9.906 -8.693 L
-6.969 -8.693 -5.469 -10.224 QT
-5.125 -10.224 L
-5.047 -10.224 -4.969 -10.162 QT
-4.891 -10.099 -4.891 -10.021 QT
-4.891 4.151 L
-4.891 4.916 -1.891 4.916 QT
-1.891 5.76 L
-9.766 5.76 L
cp}def
f361407121
f
GR
GS
[0.75 0 0 0.75 72.4 192.05] CT
0.149 GC
N
/f-820689371{-28.432 5.76 M
-28.432 4.916 L
-25.432 4.916 -25.432 4.151 QT
-25.432 -8.443 L
-26.682 -7.849 -28.573 -7.849 QT
-28.573 -8.693 L
-25.636 -8.693 -24.136 -10.224 QT
-23.792 -10.224 L
-23.714 -10.224 -23.636 -10.162 QT
-23.557 -10.099 -23.557 -10.021 QT
-23.557 4.151 L
-23.557 4.916 -20.557 4.916 QT
-20.557 5.76 L
-28.432 5.76 L
cp}def
f-820689371
f
GR
GS
[0.75 0 0 0.75 72.4 192.05] CT
0.149 GC
N
f-1543496504
f
GR
GS
[0.75 0 0 0.75 72.4 192.05] CT
0.149 GC
N
f429638810
f
GR
GS
[0.75 0 0 0.75 72.4 113.9] CT
0.149 GC
N
/f-939971694{-10.797 5.76 M
-10.797 5.119 L
-10.797 5.057 -10.75 4.979 QT
-7.031 0.854 L
-6.188 -0.053 -5.656 -0.678 QT
-5.125 -1.303 -4.609 -2.107 QT
-4.094 -2.912 -3.797 -3.748 QT
-3.5 -4.584 -3.5 -5.521 QT
-3.5 -6.506 -3.867 -7.404 QT
-4.234 -8.303 -4.953 -8.842 QT
-5.672 -9.381 -6.688 -9.381 QT
-7.734 -9.381 -8.563 -8.756 QT
-9.391 -8.131 -9.734 -7.131 QT
-9.641 -7.162 -9.484 -7.162 QT
-8.938 -7.162 -8.555 -6.795 QT
-8.172 -6.428 -8.172 -5.849 QT
-8.172 -5.303 -8.555 -4.92 QT
-8.938 -4.537 -9.484 -4.537 QT
-10.047 -4.537 -10.422 -4.935 QT
-10.797 -5.334 -10.797 -5.849 QT
-10.797 -6.756 -10.461 -7.545 QT
-10.125 -8.334 -9.484 -8.951 QT
-8.844 -9.568 -8.039 -9.896 QT
-7.234 -10.224 -6.344 -10.224 QT
-4.969 -10.224 -3.781 -9.646 QT
-2.594 -9.068 -1.906 -8.006 QT
-1.219 -6.943 -1.219 -5.521 QT
-1.219 -4.49 -1.672 -3.553 QT
-2.125 -2.615 -2.844 -1.842 QT
-3.563 -1.068 -4.672 -0.099 QT
-5.781 0.869 -6.141 1.197 QT
-8.859 3.807 L
-6.547 3.807 L
-4.844 3.807 -3.703 3.783 QT
-2.563 3.76 -2.5 3.697 QT
-2.219 3.385 -1.922 1.479 QT
-1.219 1.479 L
-1.891 5.76 L
-10.797 5.76 L
cp}def
f-939971694
f
GR
GS
[0.75 0 0 0.75 72.4 35.75] CT
0.149 GC
N
/f-2074444030{-29.464 5.76 M
-29.464 5.119 L
-29.464 5.057 -29.417 4.979 QT
-25.698 0.854 L
-24.854 -0.053 -24.323 -0.678 QT
-23.792 -1.303 -23.276 -2.107 QT
-22.761 -2.912 -22.464 -3.748 QT
-22.167 -4.584 -22.167 -5.521 QT
-22.167 -6.506 -22.534 -7.404 QT
-22.901 -8.303 -23.62 -8.842 QT
-24.339 -9.381 -25.354 -9.381 QT
-26.401 -9.381 -27.229 -8.756 QT
-28.057 -8.131 -28.401 -7.131 QT
-28.307 -7.162 -28.151 -7.162 QT
-27.604 -7.162 -27.221 -6.795 QT
-26.839 -6.428 -26.839 -5.849 QT
-26.839 -5.303 -27.221 -4.92 QT
-27.604 -4.537 -28.151 -4.537 QT
-28.714 -4.537 -29.089 -4.935 QT
-29.464 -5.334 -29.464 -5.849 QT
-29.464 -6.756 -29.128 -7.545 QT
-28.792 -8.334 -28.151 -8.951 QT
-27.511 -9.568 -26.706 -9.896 QT
-25.901 -10.224 -25.011 -10.224 QT
-23.636 -10.224 -22.448 -9.646 QT
-21.261 -9.068 -20.573 -8.006 QT
-19.886 -6.943 -19.886 -5.521 QT
-19.886 -4.49 -20.339 -3.553 QT
-20.792 -2.615 -21.511 -1.842 QT
-22.229 -1.068 -23.339 -0.099 QT
-24.448 0.869 -24.807 1.197 QT
-27.526 3.807 L
-25.214 3.807 L
-23.511 3.807 -22.37 3.783 QT
-21.229 3.76 -21.167 3.697 QT
-20.886 3.385 -20.589 1.479 QT
-19.886 1.479 L
-20.557 5.76 L
-29.464 5.76 L
cp}def
f-2074444030
f
GR
GS
[0.75 0 0 0.75 72.4 35.75] CT
0.149 GC
N
f-1543496504
f
GR
GS
[0.75 0 0 0.75 72.4 35.75] CT
0.149 GC
N
f429638810
f
GR
GS
[0 -0.75 0.75 0 46.39993 231.12482] CT
0.149 GC
N
/f-705616379{-33.819 -9.207 M
-34.976 -9.207 -35.866 -9.762 QT
-36.757 -10.317 -37.249 -11.254 QT
-37.741 -12.192 -37.741 -13.332 QT
-37.741 -14.535 -37.194 -15.863 QT
-36.647 -17.192 -35.702 -18.301 QT
-34.757 -19.41 -33.561 -20.059 QT
-32.366 -20.707 -31.116 -20.707 QT
-24.554 -20.707 L
-24.288 -20.707 -24.101 -20.535 QT
-23.913 -20.363 -23.913 -20.051 QT
-23.913 -19.676 -24.186 -19.387 QT
-24.46 -19.098 -24.835 -19.098 QT
-28.007 -19.098 L
-27.272 -17.988 -27.272 -16.395 QT
-27.272 -15.098 -27.78 -13.824 QT
-28.288 -12.551 -29.186 -11.504 QT
-30.085 -10.457 -31.28 -9.832 QT
-32.476 -9.207 -33.819 -9.207 QT
cp
-33.788 -9.895 M
-32.366 -9.895 -31.272 -11.004 QT
-30.179 -12.113 -29.593 -13.723 QT
-29.007 -15.332 -29.007 -16.707 QT
-29.007 -17.817 -29.624 -18.457 QT
-30.241 -19.098 -31.335 -19.098 QT
-32.851 -19.098 -33.913 -18.082 QT
-34.976 -17.067 -35.499 -15.535 QT
-36.022 -14.004 -36.022 -12.582 QT
-36.022 -11.457 -35.436 -10.676 QT
-34.851 -9.895 -33.788 -9.895 QT
cp}def
f-705616379
f
GR
GS
[0 -0.75 0.75 0 46.39993 231.12482] CT
0.149 GC
N
/f-169296765{-17.902 -15.452 M
-18.246 -15.827 L
-15.824 -18.248 L
-13.418 -15.827 L
-13.777 -15.452 L
-15.824 -17.248 L
-17.902 -15.452 L
cp}def
f-169296765
f
GR
GS
[0 -0.75 0.75 0 46.39993 231.12482] CT
0.149 GC
N
/f-766268280{-20.468 -0.684 M
-21.593 -0.684 -22.25 -1.544 QT
-22.906 -2.403 -22.906 -3.575 QT
-22.906 -4.716 -22.312 -5.958 QT
-21.718 -7.2 -20.703 -8.02 QT
-19.687 -8.841 -18.515 -8.841 QT
-17.984 -8.841 -17.562 -8.544 QT
-17.14 -8.247 -16.89 -7.762 QT
-15.89 -11.778 L
-15.812 -12.091 -15.796 -12.262 QT
-15.796 -12.544 -16.968 -12.544 QT
-17.156 -12.544 -17.156 -12.794 QT
-17.14 -12.825 -17.109 -12.942 QT
-17.078 -13.059 -17.031 -13.122 QT
-16.984 -13.184 -16.89 -13.184 QT
-14.468 -13.372 L
-14.25 -13.372 -14.25 -13.153 QT
-16.843 -2.794 L
-16.968 -2.497 -16.968 -1.934 QT
-16.968 -1.153 -16.453 -1.153 QT
-15.89 -1.153 -15.593 -1.872 QT
-15.296 -2.591 -15.093 -3.528 QT
-15.062 -3.637 -14.953 -3.637 QT
-14.734 -3.637 L
-14.656 -3.637 -14.617 -3.575 QT
-14.578 -3.512 -14.578 -3.466 QT
-14.89 -2.2 -15.265 -1.442 QT
-15.64 -0.684 -16.484 -0.684 QT
-17.093 -0.684 -17.554 -1.044 QT
-18.015 -1.403 -18.14 -1.981 QT
-19.296 -0.684 -20.468 -0.684 QT
cp
-20.453 -1.153 M
-19.796 -1.153 -19.187 -1.645 QT
-18.578 -2.137 -18.14 -2.794 QT
-18.125 -2.809 -18.125 -2.872 QT
-17.14 -6.825 L
-17.234 -7.466 -17.593 -7.919 QT
-17.953 -8.372 -18.562 -8.372 QT
-19.156 -8.372 -19.679 -7.88 QT
-20.203 -7.387 -20.562 -6.7 QT
-20.921 -5.981 -21.242 -4.723 QT
-21.562 -3.466 -21.562 -2.778 QT
-21.562 -2.153 -21.296 -1.653 QT
-21.031 -1.153 -20.453 -1.153 QT
cp}def
f-766268280
f
GR
GS
[0 -0.75 0.75 0 46.39993 231.12482] CT
0.149 GC
N
/f1198782535{4.208 -3.051 M
2.755 -4.192 1.708 -5.676 QT
0.661 -7.16 -0.003 -8.832 QT
-0.667 -10.504 -0.995 -12.332 QT
-1.324 -14.16 -1.324 -16.004 QT
-1.324 -17.863 -0.995 -19.692 QT
-0.667 -21.52 0.012 -23.215 QT
0.692 -24.91 1.747 -26.379 QT
2.801 -27.848 4.208 -28.957 QT
4.208 -29.004 4.333 -29.004 QT
4.583 -29.004 L
4.645 -29.004 4.716 -28.934 QT
4.786 -28.863 4.786 -28.77 QT
4.786 -28.66 4.723 -28.613 QT
3.458 -27.363 2.614 -25.942 QT
1.77 -24.52 1.255 -22.918 QT
0.739 -21.317 0.512 -19.59 QT
0.286 -17.863 0.286 -16.004 QT
0.286 -7.738 4.708 -3.442 QT
4.786 -3.379 4.786 -3.238 QT
4.786 -3.176 4.716 -3.09 QT
4.645 -3.004 4.583 -3.004 QT
4.333 -3.004 L
4.208 -3.004 4.208 -3.051 QT
cp}def
f1198782535
f
GR
GS
[0 -0.75 0.75 0 46.39993 231.12482] CT
0.149 GC
N
/f1823455369{7.193 -9.504 M
7.193 -10.426 L
8.068 -10.426 8.646 -10.559 QT
9.224 -10.692 9.224 -11.238 QT
9.224 -18.348 L
9.224 -19.035 9.013 -19.348 QT
8.803 -19.66 8.404 -19.731 QT
8.006 -19.801 7.193 -19.801 QT
7.193 -20.707 L
10.959 -20.988 L
10.959 -18.457 L
11.474 -19.567 12.498 -20.278 QT
13.521 -20.988 14.724 -20.988 QT
17.724 -20.988 18.24 -18.551 QT
18.771 -19.645 19.771 -20.317 QT
20.771 -20.988 21.959 -20.988 QT
23.146 -20.988 23.951 -20.613 QT
24.756 -20.238 25.162 -19.457 QT
25.568 -18.676 25.568 -17.488 QT
25.568 -11.238 L
25.568 -10.692 26.146 -10.559 QT
26.724 -10.426 27.599 -10.426 QT
27.599 -9.504 L
21.646 -9.504 L
21.646 -10.426 L
22.537 -10.426 23.107 -10.559 QT
23.678 -10.692 23.678 -11.238 QT
23.678 -17.41 L
23.678 -18.723 23.31 -19.52 QT
22.943 -20.317 21.803 -20.317 QT
20.303 -20.317 19.326 -19.113 QT
18.349 -17.91 18.349 -16.379 QT
18.349 -11.238 L
18.349 -10.692 18.92 -10.559 QT
19.49 -10.426 20.381 -10.426 QT
20.381 -9.504 L
14.428 -9.504 L
14.428 -10.426 L
15.318 -10.426 15.888 -10.559 QT
16.459 -10.692 16.459 -11.238 QT
16.459 -17.41 L
16.459 -18.676 16.092 -19.496 QT
15.724 -20.317 14.568 -20.317 QT
13.068 -20.317 12.092 -19.113 QT
11.115 -17.91 11.115 -16.379 QT
11.115 -11.238 L
11.115 -10.692 11.693 -10.559 QT
12.271 -10.426 13.146 -10.426 QT
13.146 -9.504 L
7.193 -9.504 L
cp}def
f1823455369
f
GR
GS
[0 -0.75 0.75 0 46.39993 231.12482] CT
0.149 GC
N
/f43075594{30.099 -3.004 M
29.865 -3.004 29.865 -3.238 QT
29.865 -3.348 29.928 -3.395 QT
34.365 -7.738 34.365 -16.004 QT
34.365 -24.27 29.974 -28.567 QT
29.865 -28.629 29.865 -28.77 QT
29.865 -28.863 29.935 -28.934 QT
30.006 -29.004 30.099 -29.004 QT
30.349 -29.004 L
30.412 -29.004 30.474 -28.957 QT
32.334 -27.488 33.576 -25.379 QT
34.818 -23.27 35.396 -20.879 QT
35.974 -18.488 35.974 -16.004 QT
35.974 -14.16 35.662 -12.379 QT
35.349 -10.598 34.678 -8.863 QT
34.006 -7.129 32.959 -5.66 QT
31.912 -4.192 30.474 -3.051 QT
30.412 -3.004 30.349 -3.004 QT
30.099 -3.004 L
cp}def
f43075594
f
GR
GS
[0.75 0 0 0.75 0 -0.25] CT
0.149 GC
1 LJ
0.667 LW
N
104 569 M
723 569 L
S
GR
GS
[0.75 0 0 0.75 124.425 335.62517] CT
N
5.867 0 M
5.867 -3.24 3.24 -5.867 0 -5.867 C
-3.24 -5.867 -5.867 -3.24 -5.867 0 C
-5.867 3.24 -3.24 5.867 0 5.867 C
3.24 5.867 5.867 3.24 5.867 0 C
cp
f
GR
GS
[0.75 0 0 0.75 124.425 335.62517] CT
10.0 ML
2.667 LW
N
5.867 0 M
5.867 -3.24 3.24 -5.867 0 -5.867 C
-3.24 -5.867 -5.867 -3.24 -5.867 0 C
-5.867 3.24 -3.24 5.867 0 5.867 C
3.24 5.867 5.867 3.24 5.867 0 C
cp
S
GR
GS
[0.75 0 0 0.75 170.85 293.90388] CT
N
/f-819729944{5.867 0 M
5.867 -3.24 3.24 -5.867 0 -5.867 C
-3.24 -5.867 -5.867 -3.24 -5.867 0 C
-5.867 3.24 -3.24 5.867 0 5.867 C
3.24 5.867 5.867 3.24 5.867 0 C
cp}def
f-819729944
f
GR
GS
[0.75 0 0 0.75 170.85 293.90388] CT
10.0 ML
2.667 LW
N
5.867 0 M
5.867 -3.24 3.24 -5.867 0 -5.867 C
-3.24 -5.867 -5.867 -3.24 -5.867 0 C
-5.867 3.24 -3.24 5.867 0 5.867 C
3.24 5.867 5.867 3.24 5.867 0 C
cp
S
GR
GS
[0.75 0 0 0.75 217.27501 288.20289] CT
N
f-819729944
f
GR
GS
[0.75 0 0 0.75 217.27501 288.20289] CT
10.0 ML
2.667 LW
N
5.867 0 M
5.867 -3.24 3.24 -5.867 0 -5.867 C
-3.24 -5.867 -5.867 -3.24 -5.867 0 C
-5.867 3.24 -3.24 5.867 0 5.867 C
3.24 5.867 5.867 3.24 5.867 0 C
cp
S
GR
GS
[0.75 0 0 0.75 263.7 281.47225] CT
N
f-819729944
f
GR
GS
[0.75 0 0 0.75 263.7 281.47225] CT
10.0 ML
2.667 LW
N
5.867 0 M
5.867 -3.24 3.24 -5.867 0 -5.867 C
-3.24 -5.867 -5.867 -3.24 -5.867 0 C
-5.867 3.24 -3.24 5.867 0 5.867 C
3.24 5.867 5.867 3.24 5.867 0 C
cp
S
GR
GS
[0.75 0 0 0.75 310.125 247.13906] CT
N
f-819729944
f
GR
GS
[0.75 0 0 0.75 310.125 247.13906] CT
10.0 ML
2.667 LW
N
5.867 0 M
5.867 -3.24 3.24 -5.867 0 -5.867 C
-3.24 -5.867 -5.867 -3.24 -5.867 0 C
-5.867 3.24 -3.24 5.867 0 5.867 C
3.24 5.867 5.867 3.24 5.867 0 C
cp
S
GR
GS
[0.75 0 0 0.75 356.55 240.93959] CT
N
f-819729944
f
GR
GS
[0.75 0 0 0.75 356.55 240.93959] CT
10.0 ML
2.667 LW
N
5.867 0 M
5.867 -3.24 3.24 -5.867 0 -5.867 C
-3.24 -5.867 -5.867 -3.24 -5.867 0 C
-5.867 3.24 -3.24 5.867 0 5.867 C
3.24 5.867 5.867 3.24 5.867 0 C
cp
S
GR
GS
[0.75 0 0 0.75 402.97499 164.87561] CT
N
f-819729944
f
GR
GS
[0.75 0 0 0.75 402.97499 164.87561] CT
10.0 ML
2.667 LW
N
5.867 0 M
5.867 -3.24 3.24 -5.867 0 -5.867 C
-3.24 -5.867 -5.867 -3.24 -5.867 0 C
-5.867 3.24 -3.24 5.867 0 5.867 C
3.24 5.867 5.867 3.24 5.867 0 C
cp
S
GR
GS
[0.75 0 0 0.75 449.40001 157.81767] CT
N
f-819729944
f
GR
GS
[0.75 0 0 0.75 449.40001 157.81767] CT
10.0 ML
2.667 LW
N
5.867 0 M
5.867 -3.24 3.24 -5.867 0 -5.867 C
-3.24 -5.867 -5.867 -3.24 -5.867 0 C
-5.867 3.24 -3.24 5.867 0 5.867 C
3.24 5.867 5.867 3.24 5.867 0 C
cp
S
GR
GS
[0.75 0 0 0.75 495.82498 100.70844] CT
N
f-819729944
f
GR
GS
[0.75 0 0 0.75 495.82498 100.70844] CT
10.0 ML
2.667 LW
N
5.867 0 M
5.867 -3.24 3.24 -5.867 0 -5.867 C
-3.24 -5.867 -5.867 -3.24 -5.867 0 C
-5.867 3.24 -3.24 5.867 0 5.867 C
3.24 5.867 5.867 3.24 5.867 0 C
cp
S
GR
GS
[0.75 0 0 0.75 0 -0.25] CT
1 LJ
2.667 LW
N
165.9 569 M
165.9 447.834 L
S
GR
GS
[0.75 0 0 0.75 0 -0.25] CT
1 LJ
2.667 LW
N
227.8 569 M
227.8 392.205 L
S
GR
GS
[0.75 0 0 0.75 0 -0.25] CT
1 LJ
2.667 LW
N
289.7 569 M
289.7 384.604 L
S
GR
GS
[0.75 0 0 0.75 0 -0.25] CT
1 LJ
2.667 LW
N
351.6 569 M
351.6 375.63 L
S
GR
GS
[0.75 0 0 0.75 0 -0.25] CT
1 LJ
2.667 LW
N
413.5 569 M
413.5 329.852 L
S
GR
GS
[0.75 0 0 0.75 0 -0.25] CT
1 LJ
2.667 LW
N
475.4 569 M
475.4 321.586 L
S
GR
GS
[0.75 0 0 0.75 0 -0.25] CT
1 LJ
2.667 LW
N
537.3 569 M
537.3 220.167 L
S
GR
GS
[0.75 0 0 0.75 0 -0.25] CT
1 LJ
2.667 LW
N
599.2 569 M
599.2 210.757 L
S
GR
GS
[0.75 0 0 0.75 0 -0.25] CT
1 LJ
2.667 LW
N
661.1 569 M
661.1 134.611 L
S
GR
GS
[0.75 0 0 0.75 124.425 411.69048] CT
1 0 0 RC
N
f-819729944
f
GR
GS
[0.75 0 0 0.75 124.425 411.69048] CT
1 0 0 RC
10.0 ML
2.667 LW
N
5.867 0 M
5.867 -3.24 3.24 -5.867 0 -5.867 C
-3.24 -5.867 -5.867 -3.24 -5.867 0 C
-5.867 3.24 -3.24 5.867 0 5.867 C
3.24 5.867 5.867 3.24 5.867 0 C
cp
S
GR
GS
[0.75 0 0 0.75 170.85 294.98756] CT
1 0 0 RC
N
f-819729944
f
GR
GS
[0.75 0 0 0.75 170.85 294.98756] CT
1 0 0 RC
10.0 ML
2.667 LW
N
5.867 0 M
5.867 -3.24 3.24 -5.867 0 -5.867 C
-3.24 -5.867 -5.867 -3.24 -5.867 0 C
-5.867 3.24 -3.24 5.867 0 5.867 C
3.24 5.867 5.867 3.24 5.867 0 C
cp
S
GR
GS
[0.75 0 0 0.75 217.27501 307.32526] CT
1 0 0 RC
N
f-819729944
f
GR
GS
[0.75 0 0 0.75 217.27501 307.32526] CT
1 0 0 RC
10.0 ML
2.667 LW
N
5.867 0 M
5.867 -3.24 3.24 -5.867 0 -5.867 C
-3.24 -5.867 -5.867 -3.24 -5.867 0 C
-5.867 3.24 -3.24 5.867 0 5.867 C
3.24 5.867 5.867 3.24 5.867 0 C
cp
S
GR
GS
[0.75 0 0 0.75 263.7 262.81383] CT
1 0 0 RC
N
f-819729944
f
GR
GS
[0.75 0 0 0.75 263.7 262.81383] CT
1 0 0 RC
10.0 ML
2.667 LW
N
5.867 0 M
5.867 -3.24 3.24 -5.867 0 -5.867 C
-3.24 -5.867 -5.867 -3.24 -5.867 0 C
-5.867 3.24 -3.24 5.867 0 5.867 C
3.24 5.867 5.867 3.24 5.867 0 C
cp
S
GR
GS
[0.75 0 0 0.75 310.125 220.35513] CT
1 0 0 RC
N
f-819729944
f
GR
GS
[0.75 0 0 0.75 310.125 220.35513] CT
1 0 0 RC
10.0 ML
2.667 LW
N
5.867 0 M
5.867 -3.24 3.24 -5.867 0 -5.867 C
-3.24 -5.867 -5.867 -3.24 -5.867 0 C
-5.867 3.24 -3.24 5.867 0 5.867 C
3.24 5.867 5.867 3.24 5.867 0 C
cp
S
GR
GS
[0.75 0 0 0.75 356.55 241.02206] CT
1 0 0 RC
N
f-819729944
f
GR
GS
[0.75 0 0 0.75 356.55 241.02206] CT
1 0 0 RC
10.0 ML
2.667 LW
N
5.867 0 M
5.867 -3.24 3.24 -5.867 0 -5.867 C
-3.24 -5.867 -5.867 -3.24 -5.867 0 C
-5.867 3.24 -3.24 5.867 0 5.867 C
3.24 5.867 5.867 3.24 5.867 0 C
cp
S
GR
GS
[0.75 0 0 0.75 402.97499 54.87465] CT
1 0 0 RC
N
f-819729944
f
GR
GS
[0.75 0 0 0.75 402.97499 54.87465] CT
1 0 0 RC
10.0 ML
2.667 LW
N
5.867 0 M
5.867 -3.24 3.24 -5.867 0 -5.867 C
-3.24 -5.867 -5.867 -3.24 -5.867 0 C
-5.867 3.24 -3.24 5.867 0 5.867 C
3.24 5.867 5.867 3.24 5.867 0 C
cp
S
GR
GS
[0.75 0 0 0.75 449.40001 49.69368] CT
1 0 0 RC
N
f-819729944
f
GR
GS
[0.75 0 0 0.75 449.40001 49.69368] CT
1 0 0 RC
10.0 ML
2.667 LW
N
5.867 0 M
5.867 -3.24 3.24 -5.867 0 -5.867 C
-3.24 -5.867 -5.867 -3.24 -5.867 0 C
-5.867 3.24 -3.24 5.867 0 5.867 C
3.24 5.867 5.867 3.24 5.867 0 C
cp
S
GR
GS
[0.75 0 0 0.75 495.82498 63.42614] CT
1 0 0 RC
N
f-819729944
f
GR
GS
[0.75 0 0 0.75 495.82498 63.42614] CT
1 0 0 RC
10.0 ML
2.667 LW
N
5.867 0 M
5.867 -3.24 3.24 -5.867 0 -5.867 C
-3.24 -5.867 -5.867 -3.24 -5.867 0 C
-5.867 3.24 -3.24 5.867 0 5.867 C
3.24 5.867 5.867 3.24 5.867 0 C
cp
S
GR
GS
[0.75 0 0 0.75 0 -0.25] CT
1 0 0 RC
[8 8] 0 setdash
2 LJ
2.667 LW
N
165.9 569 M
165.9 549.254 L
S
GR
GS
[0.75 0 0 0.75 0 -0.25] CT
1 0 0 RC
[8 8] 0 setdash
2 LJ
2.667 LW
N
227.8 569 M
227.8 393.65 L
S
GR
GS
[0.75 0 0 0.75 0 -0.25] CT
1 0 0 RC
[8 8] 0 setdash
2 LJ
2.667 LW
N
289.7 569 M
289.7 410.1 L
S
GR
GS
[0.75 0 0 0.75 0 -0.25] CT
1 0 0 RC
[8 8] 0 setdash
2 LJ
2.667 LW
N
351.6 569 M
351.6 350.752 L
S
GR
GS
[0.75 0 0 0.75 0 -0.25] CT
1 0 0 RC
[8 8] 0 setdash
2 LJ
2.667 LW
N
413.5 569 M
413.5 294.14 L
S
GR
GS
[0.75 0 0 0.75 0 -0.25] CT
1 0 0 RC
[8 8] 0 setdash
2 LJ
2.667 LW
N
475.4 569 M
475.4 321.696 L
S
GR
GS
[0.75 0 0 0.75 0 -0.25] CT
1 0 0 RC
[8 8] 0 setdash
2 LJ
2.667 LW
N
537.3 569 M
537.3 73.5 L
S
GR
GS
[0.75 0 0 0.75 0 -0.25] CT
1 0 0 RC
[8 8] 0 setdash
2 LJ
2.667 LW
N
599.2 569 M
599.2 66.592 L
S
GR
GS
[0.75 0 0 0.75 0 -0.25] CT
1 0 0 RC
[8 8] 0 setdash
2 LJ
2.667 LW
N
661.1 569 M
661.1 84.902 L
S
GR
GS
[0.75 0 0 0.75 0 -0.25] CT
1 GC
N
/f-946689108{394 132 M
394 65 L
138 65 L
138 132 L
cp}def
f-946689108
f
GR
GS
[0.75 0 0 0.75 138.75 61.72368] CT
/Helvetica 24 F
GS
[1 0 0 1 0 0] CT
0 9.5 moveto 
1 -1 scale
(Experimental value) t 
GR
GR
GS
[0.75 0 0 0.75 0 -0.25] CT
1 LJ
2.667 LW
N
142 82.632 M
170 82.632 L
S
GR
GS
[0.75 0 0 0.75 127.5 61.72368] CT
N
f-819729944
f
GR
GS
[0.75 0 0 0.75 127.5 61.72368] CT
10.0 ML
2.667 LW
N
5.867 0 M
5.867 -3.24 3.24 -5.867 0 -5.867 C
-3.24 -5.867 -5.867 -3.24 -5.867 0 C
-5.867 3.24 -3.24 5.867 0 5.867 C
3.24 5.867 5.867 3.24 5.867 0 C
cp
S
GR
GS
[0.75 0 0 0.75 138.75 85.52632] CT
/Helvetica 24 F
GS
[1 0 0 1 0 0] CT
0 9.5 moveto 
1 -1 scale
(Analytic formula) t 
GR
GR
GS
[0.75 0 0 0.75 0 -0.25] CT
1 0 0 RC
[8 8] 0 setdash
2 LJ
2.667 LW
N
142 114.368 M
170 114.368 L
S
GR
GS
[0.75 0 0 0.75 127.5 85.52632] CT
1 0 0 RC
N
f-819729944
f
GR
GS
[0.75 0 0 0.75 127.5 85.52632] CT
1 0 0 RC
10.0 ML
2.667 LW
N
5.867 0 M
5.867 -3.24 3.24 -5.867 0 -5.867 C
-3.24 -5.867 -5.867 -3.24 -5.867 0 C
-5.867 3.24 -3.24 5.867 0 5.867 C
3.24 5.867 5.867 3.24 5.867 0 C
cp
S
GR
GS
[0.75 0 0 0.75 0 -0.25] CT
0.149 GC
10.0 ML
0.667 LW
N
138 132 M
138 65 L
394 65 L
394 132 L
cp
S
GR
GS
[0.75 0 0 0.75 0 -0.25] CT
0.502 GC
1 LJ
0.667 LW
N
500.1 320.988 M
500.01 318.758 L
499.738 316.545 L
499.286 314.363 L
498.659 312.229 L
497.86 310.158 L
496.896 308.165 L
495.773 306.264 L
494.499 304.47 L
493.084 302.794 L
491.538 301.25 L
489.871 299.848 L
488.097 298.598 L
486.227 297.51 L
484.275 296.59 L
482.255 295.847 L
480.183 295.284 L
478.071 294.907 L
475.937 294.718 L
473.795 294.718 L
471.661 294.907 L
469.55 295.284 L
467.477 295.847 L
465.457 296.59 L
463.506 297.51 L
461.636 298.598 L
459.861 299.848 L
458.195 301.25 L
456.648 302.794 L
455.233 304.47 L
453.959 306.264 L
452.836 308.165 L
451.872 310.158 L
451.073 312.229 L
450.446 314.363 L
449.995 316.545 L
449.723 318.758 L
449.632 320.988 L
449.723 323.218 L
449.995 325.432 L
450.446 327.614 L
451.073 329.748 L
451.872 331.819 L
452.836 333.812 L
453.959 335.712 L
455.233 337.507 L
456.648 339.182 L
458.195 340.727 L
459.861 342.129 L
461.636 343.379 L
463.506 344.467 L
465.457 345.387 L
467.477 346.13 L
469.55 346.692 L
471.661 347.07 L
473.795 347.259 L
475.937 347.259 L
478.071 347.07 L
480.183 346.692 L
482.255 346.13 L
484.275 345.387 L
486.227 344.467 L
488.097 343.379 L
489.871 342.129 L
491.538 340.727 L
493.084 339.182 L
494.499 337.507 L
495.773 335.712 L
496.896 333.812 L
497.86 331.819 L
498.659 329.748 L
499.286 327.614 L
499.738 325.432 L
500.01 323.218 L
500.1 320.988 L
cp
S
GR
GS
[0.75 0 0 0.75 0 -0.25] CT
0.502 GC
1 LJ
0.667 LW
N
377.252 361.67 M
377.161 359.44 L
376.889 357.226 L
376.438 355.044 L
375.81 352.91 L
375.012 350.839 L
374.047 348.846 L
372.924 346.946 L
371.651 345.151 L
370.236 343.476 L
368.689 341.932 L
367.023 340.53 L
365.248 339.28 L
363.378 338.191 L
361.426 337.272 L
359.407 336.528 L
357.334 335.966 L
355.223 335.589 L
353.089 335.399 L
350.947 335.399 L
348.812 335.589 L
346.701 335.966 L
344.628 336.528 L
342.609 337.272 L
340.657 338.191 L
338.787 339.28 L
337.012 340.53 L
335.346 341.932 L
333.799 343.476 L
332.384 345.151 L
331.111 346.946 L
329.988 348.846 L
329.023 350.839 L
328.225 352.91 L
327.598 355.044 L
327.146 357.226 L
326.874 359.44 L
326.783 361.67 L
326.874 363.9 L
327.146 366.114 L
327.598 368.296 L
328.225 370.43 L
329.023 372.501 L
329.988 374.494 L
331.111 376.394 L
332.384 378.189 L
333.799 379.864 L
335.346 381.408 L
337.012 382.811 L
338.787 384.06 L
340.657 385.149 L
342.609 386.068 L
344.628 386.812 L
346.701 387.374 L
348.812 387.751 L
350.947 387.941 L
353.089 387.941 L
355.223 387.751 L
357.334 387.374 L
359.407 386.812 L
361.426 386.068 L
363.378 385.149 L
365.248 384.06 L
367.023 382.811 L
368.689 381.408 L
370.236 379.864 L
371.651 378.189 L
372.924 376.394 L
374.047 374.494 L
375.012 372.501 L
375.81 370.43 L
376.438 368.296 L
376.889 366.114 L
377.161 363.9 L
377.252 361.67 L
cp
S
GR
GS
[0.75 0 0 0.75 0 -0.25] CT
0.502 GC
1 LJ
0.667 LW
N
314.377 398.383 M
314.286 396.153 L
314.014 393.939 L
313.562 391.757 L
312.935 389.623 L
312.136 387.552 L
311.172 385.559 L
310.049 383.659 L
308.775 381.864 L
307.36 380.189 L
305.814 378.644 L
304.147 377.242 L
302.373 375.992 L
300.503 374.904 L
298.551 373.985 L
296.531 373.241 L
294.459 372.679 L
292.347 372.301 L
290.213 372.112 L
288.071 372.112 L
285.937 372.301 L
283.826 372.679 L
281.753 373.241 L
279.733 373.985 L
277.782 374.904 L
275.912 375.992 L
274.137 377.242 L
272.471 378.644 L
270.924 380.189 L
269.509 381.864 L
268.235 383.659 L
267.112 385.559 L
266.148 387.552 L
265.349 389.623 L
264.722 391.757 L
264.271 393.939 L
263.999 396.153 L
263.908 398.383 L
263.999 400.613 L
264.271 402.827 L
264.722 405.008 L
265.349 407.142 L
266.148 409.213 L
267.112 411.206 L
268.235 413.107 L
269.509 414.901 L
270.924 416.577 L
272.471 418.121 L
274.137 419.523 L
275.912 420.773 L
277.782 421.862 L
279.733 422.781 L
281.753 423.524 L
283.826 424.087 L
285.937 424.464 L
288.071 424.653 L
290.213 424.653 L
292.347 424.464 L
294.459 424.087 L
296.531 423.524 L
298.551 422.781 L
300.503 421.862 L
302.373 420.773 L
304.147 419.523 L
305.814 418.121 L
307.36 416.577 L
308.775 414.901 L
310.049 413.107 L
311.172 411.206 L
312.136 409.213 L
312.935 407.142 L
313.562 405.008 L
314.014 402.827 L
314.286 400.613 L
314.377 398.383 L
cp
S
GR
GS
[0.75 0 0 0.75 0 -0.25] CT
0.502 GC
1 LJ
0.667 LW
N
252.469 391.437 M
252.378 389.207 L
252.106 386.993 L
251.654 384.812 L
251.027 382.677 L
250.228 380.606 L
249.264 378.614 L
248.141 376.713 L
246.867 374.919 L
245.452 373.243 L
243.906 371.699 L
242.239 370.297 L
240.465 369.047 L
238.595 367.958 L
236.643 367.039 L
234.623 366.295 L
232.551 365.733 L
230.439 365.356 L
228.305 365.167 L
226.163 365.167 L
224.029 365.356 L
221.918 365.733 L
219.845 366.295 L
217.826 367.039 L
215.874 367.958 L
214.004 369.047 L
212.229 370.297 L
210.563 371.699 L
209.016 373.243 L
207.601 374.919 L
206.327 376.713 L
205.204 378.614 L
204.24 380.606 L
203.441 382.677 L
202.814 384.812 L
202.363 386.993 L
202.091 389.207 L
202 391.437 L
202.091 393.667 L
202.363 395.881 L
202.814 398.063 L
203.441 400.197 L
204.24 402.268 L
205.204 404.261 L
206.327 406.161 L
207.601 407.956 L
209.016 409.631 L
210.563 411.175 L
212.229 412.578 L
214.004 413.827 L
215.874 414.916 L
217.826 415.835 L
219.845 416.579 L
221.918 417.141 L
224.029 417.518 L
226.163 417.708 L
228.305 417.708 L
230.439 417.518 L
232.551 417.141 L
234.623 416.579 L
236.643 415.835 L
238.595 414.916 L
240.465 413.827 L
242.239 412.578 L
243.906 411.175 L
245.452 409.631 L
246.867 407.956 L
248.141 406.161 L
249.264 404.261 L
250.228 402.268 L
251.027 400.197 L
251.654 398.063 L
252.106 395.881 L
252.378 393.667 L
252.469 391.437 L
cp
S
GR
GS
[0.75 0 0 0.75 0 -0.25] CT
0.502 GC
1 LJ
0.667 LW
N
439.16 311.066 M
439.069 308.836 L
438.797 306.622 L
438.346 304.44 L
437.718 302.306 L
436.92 300.235 L
435.955 298.242 L
434.832 296.342 L
433.559 294.547 L
432.144 292.872 L
430.597 291.328 L
428.931 289.926 L
427.156 288.676 L
425.286 287.587 L
423.334 286.668 L
421.315 285.924 L
419.242 285.362 L
417.131 284.985 L
414.996 284.795 L
412.855 284.795 L
410.72 284.985 L
408.609 285.362 L
406.536 285.924 L
404.517 286.668 L
402.565 287.587 L
400.695 288.676 L
398.92 289.926 L
397.254 291.328 L
395.707 292.872 L
394.292 294.547 L
393.019 296.342 L
391.896 298.242 L
390.931 300.235 L
390.133 302.306 L
389.505 304.44 L
389.054 306.622 L
388.782 308.836 L
388.691 311.066 L
388.782 313.296 L
389.054 315.51 L
389.505 317.692 L
390.133 319.826 L
390.931 321.897 L
391.896 323.89 L
393.019 325.79 L
394.292 327.585 L
395.707 329.26 L
397.254 330.804 L
398.92 332.207 L
400.695 333.456 L
402.565 334.545 L
404.517 335.464 L
406.536 336.208 L
408.609 336.77 L
410.72 337.147 L
412.855 337.337 L
414.996 337.337 L
417.131 337.147 L
419.242 336.77 L
421.315 336.208 L
423.334 335.464 L
425.286 334.545 L
427.156 333.456 L
428.931 332.207 L
430.597 330.804 L
432.144 329.26 L
433.559 327.585 L
434.832 325.79 L
435.955 323.89 L
436.92 321.897 L
437.718 319.826 L
438.346 317.692 L
438.797 315.51 L
439.069 313.296 L
439.16 311.066 L
cp
S
GR
%%Trailer
%%Pages: 1
%%EOF
