%!PS-Adobe-3.0 EPSF-3.0
%%Creator: (MATLAB, The Mathworks, Inc. Version 9.5.0.944444 \(R2018b\). Operating System: Windows 10)
%%Title: (C:/Users/Alex/Documents/PhD Docs/01. GIT/my_phd_thesis/Chapter8/Figures/capsloc_res/pieCharts_examples_f02.eps)
%%CreationDate: 2019-11-04T10:29:28
%%Pages: (atend)
%%BoundingBox: 0 0 603 541
%%LanguageLevel: 3
%%EndComments
%%BeginProlog
%%BeginResource: procset (Apache XML Graphics Std ProcSet) 1.2 0
%%Version: 1.2 0
%%Copyright: (Copyright 2001-2003,2010 The Apache Software Foundation. License terms: http://www.apache.org/licenses/LICENSE-2.0)
/bd{bind def}bind def
/ld{load def}bd
/GR/grestore ld
/GS/gsave ld
/RM/rmoveto ld
/C/curveto ld
/t/show ld
/L/lineto ld
/ML/setmiterlimit ld
/CT/concat ld
/f/fill ld
/N/newpath ld
/S/stroke ld
/CC/setcmykcolor ld
/A/ashow ld
/cp/closepath ld
/RC/setrgbcolor ld
/LJ/setlinejoin ld
/GC/setgray ld
/LW/setlinewidth ld
/M/moveto ld
/re {4 2 roll M
1 index 0 rlineto
0 exch rlineto
neg 0 rlineto
cp } bd
/_ctm matrix def
/_tm matrix def
/BT { _ctm currentmatrix pop matrix _tm copy pop 0 0 moveto } bd
/ET { _ctm setmatrix } bd
/iTm { _ctm setmatrix _tm concat } bd
/Tm { _tm astore pop iTm 0 0 moveto } bd
/ux 0.0 def
/uy 0.0 def
/F {
  /Tp exch def
  /Tf exch def
  Tf findfont Tp scalefont setfont
  /cf Tf def  /cs Tp def
} bd
/ULS {currentpoint /uy exch def /ux exch def} bd
/ULE {
  /Tcx currentpoint pop def
  gsave
  newpath
  cf findfont cs scalefont dup
  /FontMatrix get 0 get /Ts exch def /FontInfo get dup
  /UnderlinePosition get Ts mul /To exch def
  /UnderlineThickness get Ts mul /Tt exch def
  ux uy To add moveto  Tcx uy To add lineto
  Tt setlinewidth stroke
  grestore
} bd
/OLE {
  /Tcx currentpoint pop def
  gsave
  newpath
  cf findfont cs scalefont dup
  /FontMatrix get 0 get /Ts exch def /FontInfo get dup
  /UnderlinePosition get Ts mul /To exch def
  /UnderlineThickness get Ts mul /Tt exch def
  ux uy To add cs add moveto Tcx uy To add cs add lineto
  Tt setlinewidth stroke
  grestore
} bd
/SOE {
  /Tcx currentpoint pop def
  gsave
  newpath
  cf findfont cs scalefont dup
  /FontMatrix get 0 get /Ts exch def /FontInfo get dup
  /UnderlinePosition get Ts mul /To exch def
  /UnderlineThickness get Ts mul /Tt exch def
  ux uy To add cs 10 mul 26 idiv add moveto Tcx uy To add cs 10 mul 26 idiv add lineto
  Tt setlinewidth stroke
  grestore
} bd
/QT {
/Y22 exch store
/X22 exch store
/Y21 exch store
/X21 exch store
currentpoint
/Y21 load 2 mul add 3 div exch
/X21 load 2 mul add 3 div exch
/X21 load 2 mul /X22 load add 3 div
/Y21 load 2 mul /Y22 load add 3 div
/X22 load /Y22 load curveto
} bd
/SSPD {
dup length /d exch dict def
{
/v exch def
/k exch def
currentpagedevice k known {
/cpdv currentpagedevice k get def
v cpdv ne {
/upd false def
/nullv v type /nulltype eq def
/nullcpdv cpdv type /nulltype eq def
nullv nullcpdv or
{
/upd true def
} {
/sametype v type cpdv type eq def
sametype {
v type /arraytype eq {
/vlen v length def
/cpdvlen cpdv length def
vlen cpdvlen eq {
0 1 vlen 1 sub {
/i exch def
/obj v i get def
/cpdobj cpdv i get def
obj cpdobj ne {
/upd true def
exit
} if
} for
} {
/upd true def
} ifelse
} {
v type /dicttype eq {
v {
/dv exch def
/dk exch def
/cpddv cpdv dk get def
dv cpddv ne {
/upd true def
exit
} if
} forall
} {
/upd true def
} ifelse
} ifelse
} if
} ifelse
upd true eq {
d k v put
} if
} if
} if
} forall
d length 0 gt {
d setpagedevice
} if
} bd
/RE { % /NewFontName [NewEncodingArray] /FontName RE -
  findfont dup length dict begin
  {
    1 index /FID ne
    {def} {pop pop} ifelse
  } forall
  /Encoding exch def
  /FontName 1 index def
  currentdict definefont pop
  end
} bind def
%%EndResource
%%BeginResource: procset (Apache XML Graphics EPS ProcSet) 1.0 0
%%Version: 1.0 0
%%Copyright: (Copyright 2002-2003 The Apache Software Foundation. License terms: http://www.apache.org/licenses/LICENSE-2.0)
/BeginEPSF { %def
/b4_Inc_state save def         % Save state for cleanup
/dict_count countdictstack def % Count objects on dict stack
/op_count count 1 sub def      % Count objects on operand stack
userdict begin                 % Push userdict on dict stack
/showpage { } def              % Redefine showpage, { } = null proc
0 setgray 0 setlinecap         % Prepare graphics state
1 setlinewidth 0 setlinejoin
10 setmiterlimit [ ] 0 setdash newpath
/languagelevel where           % If level not equal to 1 then
{pop languagelevel             % set strokeadjust and
1 ne                           % overprint to their defaults.
{false setstrokeadjust false setoverprint
} if
} if
} bd
/EndEPSF { %def
count op_count sub {pop} repeat            % Clean up stacks
countdictstack dict_count sub {end} repeat
b4_Inc_state restore
} bd
%%EndResource
%FOPBeginFontDict
%%IncludeResource: font Courier-Oblique
%%IncludeResource: font Courier-BoldOblique
%%IncludeResource: font Courier-Bold
%%IncludeResource: font ZapfDingbats
%%IncludeResource: font Symbol
%%IncludeResource: font Helvetica
%%IncludeResource: font Helvetica-Oblique
%%IncludeResource: font Helvetica-Bold
%%IncludeResource: font Helvetica-BoldOblique
%%IncludeResource: font Times-Roman
%%IncludeResource: font Times-Italic
%%IncludeResource: font Times-Bold
%%IncludeResource: font Times-BoldItalic
%%IncludeResource: font Courier
%FOPEndFontDict
%%BeginResource: encoding WinAnsiEncoding
/WinAnsiEncoding [
/.notdef /.notdef /.notdef /.notdef /.notdef
/.notdef /.notdef /.notdef /.notdef /.notdef
/.notdef /.notdef /.notdef /.notdef /.notdef
/.notdef /.notdef /.notdef /.notdef /.notdef
/.notdef /.notdef /.notdef /.notdef /.notdef
/.notdef /.notdef /.notdef /.notdef /.notdef
/.notdef /.notdef /space /exclam /quotedbl
/numbersign /dollar /percent /ampersand /quotesingle
/parenleft /parenright /asterisk /plus /comma
/hyphen /period /slash /zero /one
/two /three /four /five /six
/seven /eight /nine /colon /semicolon
/less /equal /greater /question /at
/A /B /C /D /E
/F /G /H /I /J
/K /L /M /N /O
/P /Q /R /S /T
/U /V /W /X /Y
/Z /bracketleft /backslash /bracketright /asciicircum
/underscore /quoteleft /a /b /c
/d /e /f /g /h
/i /j /k /l /m
/n /o /p /q /r
/s /t /u /v /w
/x /y /z /braceleft /bar
/braceright /asciitilde /bullet /Euro /bullet
/quotesinglbase /florin /quotedblbase /ellipsis /dagger
/daggerdbl /circumflex /perthousand /Scaron /guilsinglleft
/OE /bullet /Zcaron /bullet /bullet
/quoteleft /quoteright /quotedblleft /quotedblright /bullet
/endash /emdash /asciitilde /trademark /scaron
/guilsinglright /oe /bullet /zcaron /Ydieresis
/space /exclamdown /cent /sterling /currency
/yen /brokenbar /section /dieresis /copyright
/ordfeminine /guillemotleft /logicalnot /sfthyphen /registered
/macron /degree /plusminus /twosuperior /threesuperior
/acute /mu /paragraph /middot /cedilla
/onesuperior /ordmasculine /guillemotright /onequarter /onehalf
/threequarters /questiondown /Agrave /Aacute /Acircumflex
/Atilde /Adieresis /Aring /AE /Ccedilla
/Egrave /Eacute /Ecircumflex /Edieresis /Igrave
/Iacute /Icircumflex /Idieresis /Eth /Ntilde
/Ograve /Oacute /Ocircumflex /Otilde /Odieresis
/multiply /Oslash /Ugrave /Uacute /Ucircumflex
/Udieresis /Yacute /Thorn /germandbls /agrave
/aacute /acircumflex /atilde /adieresis /aring
/ae /ccedilla /egrave /eacute /ecircumflex
/edieresis /igrave /iacute /icircumflex /idieresis
/eth /ntilde /ograve /oacute /ocircumflex
/otilde /odieresis /divide /oslash /ugrave
/uacute /ucircumflex /udieresis /yacute /thorn
/ydieresis
] def
%%EndResource
%FOPBeginFontReencode
/Courier-Oblique findfont
dup length dict begin
  {1 index /FID ne {def} {pop pop} ifelse} forall
  /Encoding WinAnsiEncoding def
  currentdict
end
/Courier-Oblique exch definefont pop
/Courier-BoldOblique findfont
dup length dict begin
  {1 index /FID ne {def} {pop pop} ifelse} forall
  /Encoding WinAnsiEncoding def
  currentdict
end
/Courier-BoldOblique exch definefont pop
/Courier-Bold findfont
dup length dict begin
  {1 index /FID ne {def} {pop pop} ifelse} forall
  /Encoding WinAnsiEncoding def
  currentdict
end
/Courier-Bold exch definefont pop
/Helvetica findfont
dup length dict begin
  {1 index /FID ne {def} {pop pop} ifelse} forall
  /Encoding WinAnsiEncoding def
  currentdict
end
/Helvetica exch definefont pop
/Helvetica-Oblique findfont
dup length dict begin
  {1 index /FID ne {def} {pop pop} ifelse} forall
  /Encoding WinAnsiEncoding def
  currentdict
end
/Helvetica-Oblique exch definefont pop
/Helvetica-Bold findfont
dup length dict begin
  {1 index /FID ne {def} {pop pop} ifelse} forall
  /Encoding WinAnsiEncoding def
  currentdict
end
/Helvetica-Bold exch definefont pop
/Helvetica-BoldOblique findfont
dup length dict begin
  {1 index /FID ne {def} {pop pop} ifelse} forall
  /Encoding WinAnsiEncoding def
  currentdict
end
/Helvetica-BoldOblique exch definefont pop
/Times-Roman findfont
dup length dict begin
  {1 index /FID ne {def} {pop pop} ifelse} forall
  /Encoding WinAnsiEncoding def
  currentdict
end
/Times-Roman exch definefont pop
/Times-Italic findfont
dup length dict begin
  {1 index /FID ne {def} {pop pop} ifelse} forall
  /Encoding WinAnsiEncoding def
  currentdict
end
/Times-Italic exch definefont pop
/Times-Bold findfont
dup length dict begin
  {1 index /FID ne {def} {pop pop} ifelse} forall
  /Encoding WinAnsiEncoding def
  currentdict
end
/Times-Bold exch definefont pop
/Times-BoldItalic findfont
dup length dict begin
  {1 index /FID ne {def} {pop pop} ifelse} forall
  /Encoding WinAnsiEncoding def
  currentdict
end
/Times-BoldItalic exch definefont pop
/Courier findfont
dup length dict begin
  {1 index /FID ne {def} {pop pop} ifelse} forall
  /Encoding WinAnsiEncoding def
  currentdict
end
/Courier exch definefont pop
%FOPEndFontReencode
%%EndProlog
%%Page: 1 1
%%PageBoundingBox: 0 0 603 541
%%BeginPageSetup
[1 0 0 -1 0 541] CT
%%EndPageSetup
GS
[0.75 0 0 0.75 0 0.25] CT
N
0 0 M
804 0 L
804 721 L
0 721 L
0 0 L
cp
clip
1 GC
N
0 0 804 721 re
f
GR
GS
[0.75 0 0 0.75 0 0.25] CT
1 GC
N
0 0 804 721 re
f
GR
GS
[0.75 0 0 0.75 171.37516 47.64999] CT
/Helvetica-Bold 17.6 F
GS
[1 0 0 1 0 0] CT
-95 -4 moveto 
1 -1 scale
(ENU Profitability SM01) t 
GR
GR
GS
[0.75 0 0 0.75 0 0.25] CT
0.302 0.745 0.933 RC
N
113.959 237.688 M
116.746 244.15 L
119.934 250.424 L
123.509 256.485 L
127.458 262.311 L
131.764 267.876 L
136.411 273.161 L
218.216 196.542 L
218.216 84.459 L
211.183 84.679 L
204.177 85.341 L
197.226 86.442 L
190.358 87.976 L
183.6 89.938 L
176.978 92.321 L
170.519 95.114 L
164.248 98.307 L
158.189 101.888 L
152.368 105.841 L
146.805 110.152 L
141.525 114.804 L
136.546 119.778 L
131.89 125.055 L
127.574 130.613 L
123.615 136.431 L
120.03 142.486 L
116.831 148.755 L
114.032 155.211 L
111.643 161.831 L
109.675 168.587 L
108.135 175.454 L
107.028 182.404 L
106.36 189.409 L
106.133 196.443 L
106.348 203.477 L
107.004 210.483 L
108.098 217.435 L
109.626 224.305 L
111.582 231.064 L
cp
f
GR
GS
[0.75 0 0 0.75 0 0.25] CT
0.302 0.745 0.933 RC
2 setlinecap
10.0 ML
0.667 LW
N
218.216 196.542 M
218.216 84.459 L
211.183 84.679 L
204.177 85.341 L
197.226 86.442 L
190.358 87.976 L
183.6 89.938 L
176.978 92.321 L
170.519 95.114 L
164.248 98.307 L
158.189 101.888 L
152.368 105.841 L
146.805 110.152 L
141.525 114.804 L
136.546 119.778 L
131.89 125.055 L
127.574 130.613 L
123.615 136.431 L
120.03 142.486 L
116.831 148.755 L
114.032 155.211 L
111.643 161.831 L
109.675 168.587 L
108.135 175.454 L
107.028 182.404 L
106.36 189.409 L
106.133 196.443 L
106.348 203.477 L
107.004 210.483 L
108.098 217.435 L
109.626 224.305 L
111.582 231.064 L
113.959 237.688 L
116.746 244.15 L
119.934 250.424 L
123.509 256.485 L
127.458 262.311 L
131.764 267.876 L
136.411 273.161 L
218.216 196.542 L
218.216 196.542 L
S
GR
GS
[0.75 0 0 0.75 0 0.25] CT
0 0.749 0.749 RC
N
162.427 291.538 M
168.217 295.491 L
174.243 299.076 L
180.481 302.276 L
186.907 305.08 L
193.495 307.477 L
200.221 309.457 L
207.057 311.013 L
213.977 312.138 L
220.954 312.829 L
227.961 313.082 L
234.969 312.896 L
241.952 312.273 L
248.883 311.214 L
255.734 309.724 L
262.478 307.809 L
269.09 305.476 L
275.542 302.733 L
281.811 299.593 L
287.871 296.067 L
293.698 292.169 L
299.271 287.915 L
304.566 283.32 L
309.564 278.403 L
314.245 273.183 L
318.59 267.681 L
322.583 261.918 L
326.208 255.917 L
329.45 249.701 L
332.297 243.294 L
334.739 236.721 L
336.764 230.009 L
228.5 201 L
146.694 277.619 L
151.645 282.584 L
156.896 287.23 L
cp
f
GR
GS
[0.75 0 0 0.75 0 0.25] CT
0 0.749 0.749 RC
2 setlinecap
10.0 ML
0.667 LW
N
228.5 201 M
146.694 277.619 L
151.645 282.584 L
156.896 287.23 L
162.427 291.538 L
168.217 295.491 L
174.243 299.076 L
180.481 302.276 L
186.907 305.08 L
193.495 307.477 L
200.221 309.457 L
207.057 311.013 L
213.977 312.138 L
220.954 312.829 L
227.961 313.082 L
234.969 312.896 L
241.952 312.273 L
248.883 311.214 L
255.734 309.724 L
262.478 307.809 L
269.09 305.476 L
275.542 302.733 L
281.811 299.593 L
287.871 296.067 L
293.698 292.169 L
299.271 287.915 L
304.566 283.32 L
309.564 278.403 L
314.245 273.183 L
318.59 267.681 L
322.583 261.918 L
326.208 255.917 L
329.45 249.701 L
332.297 243.294 L
334.739 236.721 L
336.764 230.009 L
228.5 201 L
228.5 201 L
S
GR
GS
[0.75 0 0 0.75 0 0.25] CT
0 0.447 0.741 RC
N
228.5 88.917 M
228.5 201 L
336.764 230.009 L
338.333 223.346 L
339.493 216.599 L
340.238 209.794 L
340.566 202.956 L
340.477 196.111 L
339.969 189.284 L
339.046 182.501 L
337.711 175.787 L
335.968 169.167 L
333.824 162.665 L
331.287 156.307 L
328.367 150.115 L
325.074 144.113 L
321.421 138.324 L
317.422 132.768 L
313.09 127.467 L
308.443 122.44 L
303.498 117.706 L
298.274 113.283 L
292.788 109.187 L
287.063 105.433 L
281.12 102.036 L
274.98 99.009 L
268.667 96.361 L
262.204 94.104 L
255.615 92.246 L
248.926 90.794 L
242.16 89.752 L
235.343 89.126 L
cp
f
GR
GS
[0.75 0 0 0.75 0 0.25] CT
0 0.447 0.741 RC
2 setlinecap
10.0 ML
0.667 LW
N
228.5 201 M
336.764 230.009 L
338.333 223.346 L
339.493 216.599 L
340.238 209.794 L
340.566 202.956 L
340.477 196.111 L
339.969 189.284 L
339.046 182.501 L
337.711 175.787 L
335.968 169.167 L
333.824 162.665 L
331.287 156.307 L
328.367 150.115 L
325.074 144.113 L
321.421 138.324 L
317.422 132.768 L
313.09 127.467 L
308.443 122.44 L
303.498 117.706 L
298.274 113.283 L
292.788 109.187 L
287.063 105.433 L
281.12 102.036 L
274.98 99.009 L
268.667 96.361 L
262.204 94.104 L
255.615 92.246 L
248.926 90.794 L
242.16 89.752 L
235.343 89.126 L
228.5 88.917 L
228.5 201 L
228.5 201 L
S
GR
GS
[0.75 0 0 0.75 142.57274 138.62712] CT
1 GC
/Helvetica-Bold 18.667 F
GS
[1 0 0 1 0 0] CT
-38 -5 moveto 
1 -1 scale
(37%) t 
GR
GR
GS
[0.75 0 0 0.75 184.84307 185.19758] CT
1 GC
/Helvetica-Bold 18.667 F
GS
[1 0 0 1 0 0] CT
-19 19 moveto 
1 -1 scale
(34%) t 
GR
GR
GS
[0.75 0 0 0.75 192.23538 127.7086] CT
1 GC
/Helvetica-Bold 18.667 F
GS
[1 0 0 1 0 0] CT
0 -5 moveto 
1 -1 scale
( 29%) t 
GR
GR
GS
[0.75 0 0 0.75 0 0.25] CT
1 GC
N
617 673 M
617 645 L
196 645 L
196 673 L
cp
f
GR
GS
[0.75 0 0 0.75 182.25 494.5] CT
/Helvetica 18.667 F
GS
[1 0 0 1 0 0] CT
0 7 moveto 
1 -1 scale
(Profitable) t 
GR
GR
GS
[0.75 0 0 0.75 0 0.25] CT
0.302 0.745 0.933 RC
N
240 668 M
240 650 L
200 650 L
200 668 L
cp
f
GR
GS
[0.75 0 0 0.75 0 0.25] CT
0.302 0.745 0.933 RC
10.0 ML
0.667 LW
N
200 668 M
200 650 L
240 650 L
240 668 L
cp
S
GR
GS
[0.75 0 0 0.75 279.75 494.5] CT
/Helvetica 18.667 F
GS
[1 0 0 1 0 0] CT
0 7 moveto 
1 -1 scale
(Hysteresis) t 
GR
GR
GS
[0.75 0 0 0.75 0 0.25] CT
0 0.749 0.749 RC
N
370 668 M
370 650 L
330 650 L
330 668 L
cp
f
GR
GS
[0.75 0 0 0.75 0 0.25] CT
0 0.749 0.749 RC
10.0 ML
0.667 LW
N
330 668 M
330 650 L
370 650 L
370 668 L
cp
S
GR
GS
[0.75 0 0 0.75 384 494.5] CT
/Helvetica 18.667 F
GS
[1 0 0 1 0 0] CT
0 7 moveto 
1 -1 scale
(Unprofitable) t 
GR
GR
GS
[0.75 0 0 0.75 0 0.25] CT
0 0.447 0.741 RC
N
509 668 M
509 650 L
469 650 L
469 668 L
cp
f
GR
GS
[0.75 0 0 0.75 0 0.25] CT
0 0.447 0.741 RC
10.0 ML
0.667 LW
N
469 668 M
469 650 L
509 650 L
509 668 L
cp
S
GR
GS
[0.75 0 0 0.75 0 0.25] CT
1 GC
10.0 ML
0.667 LW
N
196 673 M
196 645 L
617 645 L
617 673 L
cp
S
GR
GS
[0.75 0 0 0.75 447.37541 46.89999] CT
/Helvetica-Bold 17.6 F
GS
[1 0 0 1 0 0] CT
-88.5 -4 moveto 
1 -1 scale
(EN Profitability SM01) t 
GR
GR
GS
[0.75 0 0 0.75 0 0.25] CT
0.302 0.745 0.933 RC
N
477.775 215.523 M
479.344 222.186 L
587.608 193.177 L
587.608 81.093 L
580.765 81.303 L
573.948 81.929 L
567.182 82.97 L
560.492 84.423 L
553.904 86.281 L
547.441 88.538 L
541.128 91.185 L
534.988 94.213 L
529.044 97.61 L
523.319 101.364 L
517.834 105.459 L
512.609 109.883 L
507.664 114.617 L
503.017 119.644 L
498.686 124.945 L
494.687 130.501 L
491.034 136.29 L
487.741 142.292 L
484.821 148.484 L
482.284 154.842 L
480.14 161.343 L
478.397 167.964 L
477.062 174.678 L
476.139 181.461 L
475.631 188.288 L
475.542 195.133 L
475.87 201.971 L
476.615 208.776 L
cp
f
GR
GS
[0.75 0 0 0.75 0 0.25] CT
0.302 0.745 0.933 RC
2 setlinecap
10.0 ML
0.667 LW
N
587.608 193.177 M
587.608 81.093 L
580.765 81.303 L
573.948 81.929 L
567.182 82.97 L
560.492 84.423 L
553.904 86.281 L
547.441 88.538 L
541.128 91.185 L
534.988 94.213 L
529.044 97.61 L
523.319 101.364 L
517.834 105.459 L
512.609 109.883 L
507.664 114.617 L
503.017 119.644 L
498.686 124.945 L
494.687 130.501 L
491.034 136.29 L
487.741 142.292 L
484.821 148.484 L
482.284 154.842 L
480.14 161.343 L
478.397 167.964 L
477.062 174.678 L
476.139 181.461 L
475.631 188.288 L
475.542 195.133 L
475.87 201.971 L
476.615 208.776 L
477.775 215.523 L
479.344 222.186 L
587.608 193.177 L
587.608 193.177 L
S
GR
GS
[0.75 0 0 0.75 0 0.25] CT
0 0.749 0.749 RC
N
560.881 306.273 M
567.491 308.264 L
574.211 309.845 L
581.015 311.009 L
587.878 311.751 L
594.774 312.07 L
601.676 311.964 L
608.559 311.433 L
615.396 310.479 L
622.162 309.106 L
628.83 307.319 L
635.375 305.126 L
641.773 302.533 L
647.999 299.552 L
654.03 296.193 L
659.842 292.468 L
665.415 288.394 L
670.726 283.984 L
675.755 279.255 L
596.5 200 L
488.236 229.009 L
490.227 235.619 L
492.621 242.094 L
495.41 248.409 L
498.581 254.54 L
502.125 260.465 L
506.026 266.16 L
510.27 271.604 L
514.842 276.777 L
519.723 281.658 L
524.896 286.23 L
530.34 290.474 L
536.035 294.375 L
541.96 297.919 L
548.091 301.09 L
554.406 303.879 L
cp
f
GR
GS
[0.75 0 0 0.75 0 0.25] CT
0 0.749 0.749 RC
2 setlinecap
10.0 ML
0.667 LW
N
596.5 200 M
488.236 229.009 L
490.227 235.619 L
492.621 242.094 L
495.41 248.409 L
498.581 254.54 L
502.125 260.465 L
506.026 266.16 L
510.27 271.604 L
514.842 276.777 L
519.723 281.658 L
524.896 286.23 L
530.34 290.474 L
536.035 294.375 L
541.96 297.919 L
548.091 301.09 L
554.406 303.879 L
560.881 306.273 L
567.491 308.264 L
574.211 309.845 L
581.015 311.009 L
587.878 311.751 L
594.774 312.07 L
601.676 311.964 L
608.559 311.433 L
615.396 310.479 L
622.162 309.106 L
628.83 307.319 L
635.375 305.126 L
641.773 302.533 L
647.999 299.552 L
654.03 296.193 L
659.842 292.468 L
665.415 288.394 L
670.726 283.984 L
675.755 279.255 L
596.5 200 L
596.5 200 L
S
GR
GS
[0.75 0 0 0.75 0 0.25] CT
0 0.447 0.741 RC
N
596.5 87.917 M
596.5 200 L
675.755 279.255 L
680.514 274.192 L
684.95 268.843 L
689.045 263.23 L
692.786 257.374 L
696.156 251.297 L
699.143 245.023 L
701.736 238.577 L
703.924 231.981 L
705.699 225.263 L
707.055 218.448 L
707.985 211.562 L
708.488 204.632 L
708.559 197.684 L
708.201 190.744 L
707.412 183.84 L
706.198 176.999 L
704.562 170.246 L
702.51 163.607 L
700.052 157.108 L
697.195 150.773 L
693.951 144.628 L
690.332 138.696 L
686.353 133 L
682.029 127.561 L
677.376 122.4 L
672.412 117.538 L
667.156 112.992 L
661.629 108.781 L
655.851 104.921 L
649.846 101.426 L
643.635 98.309 L
637.243 95.584 L
630.695 93.26 L
624.015 91.346 L
617.229 89.85 L
610.364 88.777 L
603.445 88.132 L
cp
f
GR
GS
[0.75 0 0 0.75 0 0.25] CT
0 0.447 0.741 RC
2 setlinecap
10.0 ML
0.667 LW
N
596.5 200 M
675.755 279.255 L
680.514 274.192 L
684.95 268.843 L
689.045 263.23 L
692.786 257.374 L
696.156 251.297 L
699.143 245.023 L
701.736 238.577 L
703.924 231.981 L
705.699 225.263 L
707.055 218.448 L
707.985 211.562 L
708.488 204.632 L
708.559 197.684 L
708.201 190.744 L
707.412 183.84 L
706.198 176.999 L
704.562 170.246 L
702.51 163.607 L
700.052 157.108 L
697.195 150.773 L
693.951 144.628 L
690.332 138.696 L
686.353 133 L
682.029 127.561 L
677.376 122.4 L
672.412 117.538 L
667.156 112.992 L
661.629 108.781 L
655.851 104.921 L
649.846 101.426 L
643.635 98.309 L
637.243 95.584 L
630.695 93.26 L
624.015 91.346 L
617.229 89.85 L
610.364 88.777 L
603.445 88.132 L
596.5 87.917 L
596.5 200 L
596.5 200 L
S
GR
GS
[0.75 0 0 0.75 418.34546 126.34119] CT
1 GC
/Helvetica-Bold 18.667 F
GS
[1 0 0 1 0 0] CT
-38 -5 moveto 
1 -1 scale
(29%) t 
GR
GR
GS
[0.75 0 0 0.75 436.19234 187.06796] CT
1 GC
/Helvetica-Bold 18.667 F
GS
[1 0 0 1 0 0] CT
-19 19 moveto 
1 -1 scale
(33%) t 
GR
GR
GS
[0.75 0 0 0.75 472.05501 127.61375] CT
1 GC
/Helvetica-Bold 18.667 F
GS
[1 0 0 1 0 0] CT
0 7 moveto 
1 -1 scale
( 38%) t 
GR
GR
GS
[0.75 0 0 0.75 172.87516 270.39999] CT
/Helvetica-Bold 17.6 F
GS
[1 0 0 1 0 0] CT
-95 -4 moveto 
1 -1 scale
(ENU Profitability SM02) t 
GR
GR
GS
[0.75 0 0 0.75 0 0.25] CT
0.302 0.745 0.933 RC
N
122.357 548.778 M
125.901 554.657 L
129.798 560.308 L
134.034 565.71 L
138.593 570.843 L
143.457 575.686 L
220.076 493.881 L
220.076 381.797 L
213.215 382.008 L
206.379 382.637 L
199.595 383.685 L
192.888 385.145 L
186.282 387.013 L
179.804 389.282 L
173.476 391.944 L
167.323 394.988 L
161.368 398.403 L
155.634 402.175 L
150.141 406.292 L
144.91 410.738 L
139.961 415.495 L
135.313 420.546 L
130.983 425.873 L
126.987 431.454 L
123.34 437.27 L
120.056 443.298 L
117.147 449.516 L
114.624 455.9 L
112.497 462.426 L
110.773 469.071 L
109.459 475.809 L
108.56 482.614 L
108.08 489.462 L
108.019 496.326 L
108.379 503.181 L
109.158 510.001 L
110.353 516.761 L
111.959 523.435 L
113.971 529.998 L
116.381 536.425 L
119.18 542.693 L
cp
f
GR
GS
[0.75 0 0 0.75 0 0.25] CT
0.302 0.745 0.933 RC
2 setlinecap
10.0 ML
0.667 LW
N
220.076 493.881 M
220.076 381.797 L
213.215 382.008 L
206.379 382.637 L
199.595 383.685 L
192.888 385.145 L
186.282 387.013 L
179.804 389.282 L
173.476 391.944 L
167.323 394.988 L
161.368 398.403 L
155.634 402.175 L
150.141 406.292 L
144.91 410.738 L
139.961 415.495 L
135.313 420.546 L
130.983 425.873 L
126.987 431.454 L
123.34 437.27 L
120.056 443.298 L
117.147 449.516 L
114.624 455.9 L
112.497 462.426 L
110.773 469.071 L
109.459 475.809 L
108.56 482.614 L
108.08 489.462 L
108.019 496.326 L
108.379 503.181 L
109.158 510.001 L
110.353 516.761 L
111.959 523.435 L
113.971 529.998 L
116.381 536.425 L
119.18 542.693 L
122.357 548.778 L
125.901 554.657 L
129.798 560.308 L
134.034 565.71 L
138.593 570.843 L
143.457 575.686 L
220.076 493.881 L
220.076 493.881 L
S
GR
GS
[0.75 0 0 0.75 0 0.25] CT
0 0.749 0.749 RC
N
182.026 599.059 M
188.286 601.83 L
194.704 604.213 L
201.255 606.201 L
207.915 607.784 L
214.659 608.958 L
221.462 609.718 L
228.299 610.062 L
235.145 609.987 L
241.973 609.495 L
248.758 608.586 L
230.5 498 L
153.881 579.806 L
159.018 584.331 L
164.421 588.533 L
170.072 592.398 L
175.947 595.911 L
cp
f
GR
GS
[0.75 0 0 0.75 0 0.25] CT
0 0.749 0.749 RC
2 setlinecap
10.0 ML
0.667 LW
N
230.5 498 M
153.881 579.806 L
159.018 584.331 L
164.421 588.533 L
170.072 592.398 L
175.947 595.911 L
182.026 599.059 L
188.286 601.83 L
194.704 604.213 L
201.255 606.201 L
207.915 607.784 L
214.659 608.958 L
221.462 609.718 L
228.299 610.062 L
235.145 609.987 L
241.973 609.495 L
248.758 608.586 L
230.5 498 L
230.5 498 L
S
GR
GS
[0.75 0 0 0.75 0 0.25] CT
0 0.447 0.741 RC
N
262.304 605.476 M
268.907 603.298 L
275.361 600.714 L
281.643 597.735 L
287.729 594.372 L
293.594 590.638 L
299.216 586.548 L
304.574 582.117 L
309.647 577.363 L
314.415 572.303 L
318.861 566.957 L
322.966 561.346 L
326.716 555.491 L
330.095 549.415 L
333.091 543.141 L
335.693 536.694 L
337.889 530.097 L
339.673 523.377 L
341.036 516.559 L
341.974 509.67 L
342.483 502.736 L
342.561 495.784 L
342.208 488.84 L
341.426 481.932 L
340.216 475.085 L
338.584 468.327 L
336.536 461.683 L
334.081 455.178 L
331.226 448.838 L
327.985 442.688 L
324.368 436.75 L
320.389 431.048 L
316.065 425.604 L
311.412 420.438 L
306.447 415.57 L
301.191 411.02 L
295.662 406.805 L
289.882 402.94 L
283.874 399.441 L
277.661 396.321 L
271.266 393.593 L
264.714 391.266 L
258.03 389.35 L
251.241 387.852 L
244.372 386.778 L
237.449 386.132 L
230.5 385.917 L
230.5 498 L
248.758 608.586 L
255.579 607.242 L
cp
f
GR
GS
[0.75 0 0 0.75 0 0.25] CT
0 0.447 0.741 RC
2 setlinecap
10.0 ML
0.667 LW
N
230.5 498 M
248.758 608.586 L
255.579 607.242 L
262.304 605.476 L
268.907 603.298 L
275.361 600.714 L
281.643 597.735 L
287.729 594.372 L
293.594 590.638 L
299.216 586.548 L
304.574 582.117 L
309.647 577.363 L
314.415 572.303 L
318.861 566.957 L
322.966 561.346 L
326.716 555.491 L
330.095 549.415 L
333.091 543.141 L
335.693 536.694 L
337.889 530.097 L
339.673 523.377 L
341.036 516.559 L
341.974 509.67 L
342.483 502.736 L
342.561 495.784 L
342.208 488.84 L
341.426 481.932 L
340.216 475.085 L
338.584 468.327 L
336.536 461.683 L
334.081 455.178 L
331.226 448.838 L
327.985 442.688 L
324.368 436.75 L
320.389 431.048 L
316.065 425.604 L
311.412 420.438 L
306.447 415.57 L
301.191 411.02 L
295.662 406.805 L
289.882 402.94 L
283.874 399.441 L
277.661 396.321 L
271.266 393.593 L
264.714 391.266 L
258.03 389.35 L
251.241 387.852 L
244.372 386.778 L
237.449 386.132 L
230.5 385.917 L
230.5 498 L
230.5 498 L
S
GR
GS
[0.75 0 0 0.75 141.30952 356.17682] CT
1 GC
/Helvetica-Bold 18.667 F
GS
[1 0 0 1 0 0] CT
-38 7 moveto 
1 -1 scale
(38%) t 
GR
GR
GS
[0.75 0 0 0.75 158.03273 417.23709] CT
1 GC
/Helvetica-Bold 18.667 F
GS
[1 0 0 1 0 0] CT
-19 19 moveto 
1 -1 scale
(15%) t 
GR
GR
GS
[0.75 0 0 0.75 201.28445 369.94335] CT
1 GC
/Helvetica-Bold 18.667 F
GS
[1 0 0 1 0 0] CT
0 7 moveto 
1 -1 scale
(47%) t 
GR
GR
GS
[0.75 0 0 0.75 448.12541 270.39999] CT
/Helvetica-Bold 17.6 F
GS
[1 0 0 1 0 0] CT
-88.5 -4 moveto 
1 -1 scale
(EN Profitability SM02) t 
GR
GR
GS
[0.75 0 0 0.75 0 0.25] CT
0.302 0.745 0.933 RC
N
482.959 534.688 M
485.746 541.15 L
488.934 547.424 L
492.509 553.485 L
496.458 559.31 L
500.764 564.876 L
505.411 570.161 L
587.216 493.542 L
587.216 381.459 L
580.183 381.68 L
573.177 382.341 L
566.226 383.442 L
559.358 384.976 L
552.6 386.938 L
545.978 389.321 L
539.519 392.114 L
533.248 395.307 L
527.189 398.888 L
521.368 402.841 L
515.805 407.152 L
510.525 411.804 L
505.546 416.778 L
500.89 422.055 L
496.574 427.613 L
492.615 433.431 L
489.03 439.486 L
485.831 445.755 L
483.032 452.211 L
480.643 458.831 L
478.675 465.587 L
477.135 472.454 L
476.028 479.404 L
475.36 486.409 L
475.133 493.443 L
475.348 500.477 L
476.004 507.483 L
477.098 514.435 L
478.626 521.305 L
480.582 528.064 L
cp
f
GR
GS
[0.75 0 0 0.75 0 0.25] CT
0.302 0.745 0.933 RC
2 setlinecap
10.0 ML
0.667 LW
N
587.216 493.542 M
587.216 381.459 L
580.183 381.68 L
573.177 382.341 L
566.226 383.442 L
559.358 384.976 L
552.6 386.938 L
545.978 389.321 L
539.519 392.114 L
533.248 395.307 L
527.189 398.888 L
521.368 402.841 L
515.805 407.152 L
510.525 411.804 L
505.546 416.778 L
500.89 422.055 L
496.574 427.613 L
492.615 433.431 L
489.03 439.486 L
485.831 445.755 L
483.032 452.211 L
480.643 458.831 L
478.675 465.587 L
477.135 472.454 L
476.028 479.404 L
475.36 486.409 L
475.133 493.443 L
475.348 500.477 L
476.004 507.483 L
477.098 514.435 L
478.626 521.305 L
480.582 528.064 L
482.959 534.688 L
485.746 541.15 L
488.934 547.424 L
492.509 553.485 L
496.458 559.31 L
500.764 564.876 L
505.411 570.161 L
587.216 493.542 L
587.216 493.542 L
S
GR
GS
[0.75 0 0 0.75 0 0.25] CT
0 0.749 0.749 RC
N
536.543 592.058 M
542.368 595.587 L
548.397 598.755 L
554.608 601.552 L
560.976 603.966 L
567.48 605.988 L
574.094 607.612 L
580.795 608.831 L
587.557 609.641 L
594.357 610.039 L
601.167 610.023 L
597.5 498 L
515.694 574.619 L
520.499 579.447 L
525.588 583.973 L
530.943 588.182 L
cp
f
GR
GS
[0.75 0 0 0.75 0 0.25] CT
0 0.749 0.749 RC
2 setlinecap
10.0 ML
0.667 LW
N
597.5 498 M
515.694 574.619 L
520.499 579.447 L
525.588 583.973 L
530.943 588.182 L
536.543 592.058 L
542.368 595.587 L
548.397 598.755 L
554.608 601.552 L
560.976 603.966 L
567.48 605.988 L
574.094 607.612 L
580.795 608.831 L
587.557 609.641 L
594.357 610.039 L
601.167 610.023 L
597.5 498 L
597.5 498 L
S
GR
GS
[0.75 0 0 0.75 0 0.25] CT
0 0.447 0.741 RC
N
615.034 608.703 M
621.879 607.4 L
628.629 605.674 L
635.26 603.531 L
641.744 600.981 L
648.058 598.033 L
654.176 594.698 L
660.075 590.99 L
665.732 586.922 L
671.125 582.51 L
676.234 577.772 L
681.039 572.725 L
685.521 567.39 L
689.663 561.787 L
693.448 555.937 L
696.863 549.863 L
699.893 543.588 L
702.528 537.138 L
704.757 530.536 L
706.572 523.809 L
707.964 516.981 L
708.93 510.081 L
709.466 503.133 L
709.568 496.166 L
709.238 489.206 L
708.475 482.28 L
707.284 475.415 L
705.669 468.637 L
703.635 461.972 L
701.191 455.447 L
698.347 449.086 L
695.112 442.914 L
691.501 436.955 L
687.526 431.232 L
683.203 425.767 L
678.549 420.581 L
673.582 415.695 L
668.321 411.126 L
662.786 406.893 L
656.999 403.013 L
650.982 399.499 L
644.758 396.366 L
638.351 393.626 L
631.787 391.29 L
625.09 389.365 L
618.286 387.861 L
611.402 386.782 L
604.465 386.133 L
597.5 385.917 L
597.5 498 L
601.167 610.023 L
608.121 609.579 L
cp
f
GR
GS
[0.75 0 0 0.75 0 0.25] CT
0 0.447 0.741 RC
2 setlinecap
10.0 ML
0.667 LW
N
597.5 498 M
601.167 610.023 L
608.121 609.579 L
615.034 608.703 L
621.879 607.4 L
628.629 605.674 L
635.26 603.531 L
641.744 600.981 L
648.058 598.033 L
654.176 594.698 L
660.075 590.99 L
665.732 586.922 L
671.125 582.51 L
676.234 577.772 L
681.039 572.725 L
685.521 567.39 L
689.663 561.787 L
693.448 555.937 L
696.863 549.863 L
699.893 543.588 L
702.528 537.138 L
704.757 530.536 L
706.572 523.809 L
707.964 516.981 L
708.93 510.081 L
709.466 503.133 L
709.568 496.166 L
709.238 489.206 L
708.475 482.28 L
707.284 475.415 L
705.669 468.637 L
703.635 461.972 L
701.191 455.447 L
698.347 449.086 L
695.112 442.914 L
691.501 436.955 L
687.526 431.232 L
683.203 425.767 L
678.549 420.581 L
673.582 415.695 L
668.321 411.126 L
662.786 406.893 L
656.999 403.013 L
650.982 399.499 L
644.758 396.366 L
638.351 393.626 L
631.787 391.29 L
625.09 389.365 L
618.286 387.861 L
611.402 386.782 L
604.465 386.133 L
597.5 385.917 L
597.5 498 L
597.5 498 L
S
GR
GS
[0.75 0 0 0.75 420.82274 360.62713] CT
1 GC
/Helvetica-Bold 18.667 F
GS
[1 0 0 1 0 0] CT
-38 -5 moveto 
1 -1 scale
(37%) t 
GR
GR
GS
[0.75 0 0 0.75 425.48872 418.67996] CT
1 GC
/Helvetica-Bold 18.667 F
GS
[1 0 0 1 0 0] CT
-19 19 moveto 
1 -1 scale
(14%) t 
GR
GR
GS
[0.75 0 0 0.75 475.33136 375.98705] CT
1 GC
/Helvetica-Bold 18.667 F
GS
[1 0 0 1 0 0] CT
0 7 moveto 
1 -1 scale
( 49%) t 
GR
GR
%%Trailer
%%Pages: 1
%%EOF
