\relax 
\providecommand\hyper@newdestlabel[2]{}
\providecommand*\new@tpo@label[2]{}
\abx@aux@refcontext{nty/global//global/global}
\providecommand\HyperFirstAtBeginDocument{\AtBeginDocument}
\HyperFirstAtBeginDocument{\ifx\hyper@anchor\@undefined
\global\let\oldcontentsline\contentsline
\gdef\contentsline#1#2#3#4{\oldcontentsline{#1}{#2}{#3}}
\global\let\oldnewlabel\newlabel
\gdef\newlabel#1#2{\newlabelxx{#1}#2}
\gdef\newlabelxx#1#2#3#4#5#6{\oldnewlabel{#1}{{#2}{#3}}}
\AtEndDocument{\ifx\hyper@anchor\@undefined
\let\contentsline\oldcontentsline
\let\newlabel\oldnewlabel
\fi}
\fi}
\global\let\hyper@last\relax 
\gdef\HyperFirstAtBeginDocument#1{#1}
\providecommand\HyField@AuxAddToFields[1]{}
\providecommand\HyField@AuxAddToCoFields[2]{}
\AC@reset@newl@bel
\@writefile{toc}{\boolfalse {citerequest}\boolfalse {citetracker}\boolfalse {pagetracker}\boolfalse {backtracker}\relax }
\@writefile{lof}{\boolfalse {citerequest}\boolfalse {citetracker}\boolfalse {pagetracker}\boolfalse {backtracker}\relax }
\@writefile{lot}{\boolfalse {citerequest}\boolfalse {citetracker}\boolfalse {pagetracker}\boolfalse {backtracker}\relax }
\babel@aux{italian}{}
\babel@aux{italian}{}
\babel@aux{italian}{}
\babel@aux{english}{}
\AC@undonewlabel{acro:GNSS}
\newlabel{acro:GNSS}{{}{iii}{\summaryname }{chapter*.1}{}}
\acronymused{GNSS}
\acronymused{GNSS}
\AC@undonewlabel{acro:LoS}
\newlabel{acro:LoS}{{}{iii}{\summaryname }{chapter*.1}{}}
\acronymused{LoS}
\acronymused{GNSS}
\acronymused{GNSS}
\acronymused{GNSS}
\acronymused{GNSS}
\AC@undonewlabel{acro:CP}
\newlabel{acro:CP}{{}{iii}{\summaryname }{chapter*.1}{}}
\acronymused{CP}
\acronymused{GNSS}
\acronymused{CP}
\AC@undonewlabel{acro:PoC}
\newlabel{acro:PoC}{{}{iii}{\summaryname }{chapter*.1}{}}
\acronymused{PoC}
\acronymused{GNSS}
\acronymused{GNSS}
\acronymused{CP}
\acronymused{PoC}
\AC@undonewlabel{acro:DGPS}
\newlabel{acro:DGPS}{{}{viii}{\contentsname }{chapter*.3}{}}
\acronymused{DGPS}
\acronymused{GNSS}
\acronymused{GNSS}
\AC@undonewlabel{acro:IAR}
\newlabel{acro:IAR}{{}{ix}{\contentsname }{chapter*.3}{}}
\acronymused{IAR}
\acronymused{IAR}
\acronymused{IAR}
\AC@undonewlabel{acro:HMM}
\newlabel{acro:HMM}{{}{ix}{\contentsname }{chapter*.3}{}}
\acronymused{HMM}
\acronymused{HMM}
\acronymused{GNSS}
\AC@undonewlabel{acro:WLS}
\newlabel{acro:WLS}{{}{ix}{\contentsname }{chapter*.3}{}}
\acronymused{WLS}
\AC@undonewlabel{acro:SAIA}
\newlabel{acro:SAIA}{{}{ix}{\contentsname }{chapter*.3}{}}
\acronymused{SAIA}
\acronymused{WLS}
\AC@undonewlabel{acro:CRLB}
\newlabel{acro:CRLB}{{}{ix}{\contentsname }{chapter*.3}{}}
\acronymused{CRLB}
\AC@undonewlabel{acro:FIM}
\newlabel{acro:FIM}{{}{ix}{\contentsname }{chapter*.3}{}}
\acronymused{FIM}
\acronymused{CRLB}
\acronymused{FIM}
\acronymused{FIM}
\AC@undonewlabel{acro:H-LMS}
\newlabel{acro:H-LMS}{{}{x}{\contentsname }{chapter*.3}{}}
\acronymused{H-LMS}
\acronymused{GNSS}
\acronymused{GNSS}
\acronymused{GNSS}
\acronymused{GNSS}
\@writefile{toc}{\contentsline {chapter}{List of Tables}{xii}{chapter*.4}\protected@file@percent }
\acronymused{H-LMS}
\AC@undonewlabel{acro:SSE}
\newlabel{acro:SSE}{{}{xii}{\listtablename }{chapter*.4}{}}
\acronymused{SSE}
\AC@undonewlabel{acro:DB}
\newlabel{acro:DB}{{}{xii}{\listtablename }{chapter*.4}{}}
\acronymused{DB}
\@writefile{toc}{\contentsline {chapter}{List of Figures}{xiv}{chapter*.5}\protected@file@percent }
\AC@undonewlabel{acro:TDoA}
\newlabel{acro:TDoA}{{}{xiv}{\listfigurename }{chapter*.5}{}}
\acronymused{TDoA}
\AC@undonewlabel{acro:DoA}
\newlabel{acro:DoA}{{}{xiv}{\listfigurename }{chapter*.5}{}}
\acronymused{DoA}
\AC@undonewlabel{acro:ToA}
\newlabel{acro:ToA}{{}{xiv}{\listfigurename }{chapter*.5}{}}
\acronymused{ToA}
\acronymused{GNSS}
\AC@undonewlabel{acro:GPS}
\newlabel{acro:GPS}{{}{xiv}{\listfigurename }{chapter*.5}{}}
\acronymused{GPS}
\AC@undonewlabel{acro:RF}
\newlabel{acro:RF}{{}{xiv}{\listfigurename }{chapter*.5}{}}
\acronymused{RF}
\acronymused{GPS}
\AC@undonewlabel{acro:RNSS}
\newlabel{acro:RNSS}{{}{xiv}{\listfigurename }{chapter*.5}{}}
\acronymused{RNSS}
\acronymused{GNSS}
\acronymused{RF}
\AC@undonewlabel{acro:CAF}
\newlabel{acro:CAF}{{}{xiv}{\listfigurename }{chapter*.5}{}}
\acronymused{CAF}
\AC@undonewlabel{acro:PRN}
\newlabel{acro:PRN}{{}{xiv}{\listfigurename }{chapter*.5}{}}
\acronymused{PRN}
\acronymused{PRN}
\AC@undonewlabel{acro:DLL}
\newlabel{acro:DLL}{{}{xiv}{\listfigurename }{chapter*.5}{}}
\acronymused{DLL}
\AC@undonewlabel{acro:PLL}
\newlabel{acro:PLL}{{}{xiv}{\listfigurename }{chapter*.5}{}}
\acronymused{PLL}
\acronymused{GNSS}
\acronymused{GPS}
\acronymused{GNSS}
\AC@undonewlabel{acro:PVT}
\newlabel{acro:PVT}{{}{xiv}{\listfigurename }{chapter*.5}{}}
\acronymused{PVT}
\acronymused{GNSS}
\acronymused{PVT}
\AC@undonewlabel{acro:APD}
\newlabel{acro:APD}{{}{xv}{\listfigurename }{chapter*.5}{}}
\acronymused{APD}
\acronymused{GPS}
\acronymused{GPS}
\acronymused{PVT}
\acronymused{IAR}
\acronymused{IAR}
\acronymused{GNSS}
\@writefile{loc}{\ChangesListline {added}{Added~(1)}{H}{xv}}
\AC@undonewlabel{acro:LTP}
\newlabel{acro:LTP}{{}{xv}{\listfigurename }{chapter*.5}{}}
\acronymused{LTP}
\acronymused{IAR}
\acronymused{IAR}
\acronymused{RF}
\AC@undonewlabel{acro:STD}
\newlabel{acro:STD}{{}{xv}{\listfigurename }{chapter*.5}{}}
\acronymused{STD}
\AC@undonewlabel{acro:PCC}
\newlabel{acro:PCC}{{}{xv}{\listfigurename }{chapter*.5}{}}
\acronymused{PCC}
\acronymused{PCC}
\acronymused{IAR}
\AC@undonewlabel{acro:PDF}
\newlabel{acro:PDF}{{}{xvi}{\listfigurename }{chapter*.5}{}}
\acronymused{PDF}
\acronymused{GNSS}
\acronymused{GNSS}
\AC@undonewlabel{acro:KF}
\newlabel{acro:KF}{{}{xvi}{\listfigurename }{chapter*.5}{}}
\acronymused{KF}
\acronymused{KF}
\acronymused{PVT}
\AC@undonewlabel{acro:LMS}
\newlabel{acro:LMS}{{}{xvi}{\listfigurename }{chapter*.5}{}}
\acronymused{LMS}
\AC@undonewlabel{acro:W-IAR}
\newlabel{acro:W-IAR}{{}{xvi}{\listfigurename }{chapter*.5}{}}
\acronymused{W-IAR}
\acronymused{IAR}
\acronymused{PDF}
\AC@undonewlabel{acro:BIC}
\newlabel{acro:BIC}{{}{xvi}{\listfigurename }{chapter*.5}{}}
\acronymused{BIC}
\acronymused{W-IAR}
\AC@undonewlabel{acro:CDF}
\newlabel{acro:CDF}{{}{xvi}{\listfigurename }{chapter*.5}{}}
\acronymused{CDF}
\acronymused{CRLB}
\acronymused{LMS}
\acronymused{H-LMS}
\acronymused{PCC}
\acronymused{CRLB}
\acronymused{H-LMS}
\acronymused{CRLB}
\acronymused{LMS}
\acronymused{CP}
\acronymused{GNSS}
\AC@undonewlabel{acro:CAPS.loc}
\newlabel{acro:CAPS.loc}{{}{xvii}{\listfigurename }{chapter*.5}{}}
\acronymused{CAPS.loc}
\AC@undonewlabel{acro:CPA}
\newlabel{acro:CPA}{{}{xvii}{\listfigurename }{chapter*.5}{}}
\acronymused{CPA}
\acronymused{CPA}
\AC@undonewlabel{acro:CPS}
\newlabel{acro:CPS}{{}{xvii}{\listfigurename }{chapter*.5}{}}
\acronymused{CPS}
\AC@undonewlabel{acro:DDR}
\newlabel{acro:DDR}{{}{xviii}{\listfigurename }{chapter*.5}{}}
\acronymused{DDR}
\AC@undonewlabel{acro:PVT-R}
\newlabel{acro:PVT-R}{{}{xviii}{\listfigurename }{chapter*.5}{}}
\acronymused{PVT-R}
\AC@undonewlabel{acro:GDOP}
\newlabel{acro:GDOP}{{}{xviii}{\listfigurename }{chapter*.5}{}}
\acronymused{GDOP}
\acronymused{APD}
\acronymused{GDOP}
\acronymused{CPS}
\@writefile{loc}{\ChangesListline {added}{Added~(1)}{(Up direction is omitted for readability)}{xviii}}
\acronymused{CP}
\acronymused{CP}
\acronymused{GNSS}
\acronymused{PVT}
\acronymused{CP}
\acronymused{CP}
\acronymused{CP}
\acronymused{CP}
\acronymused{CP}
\acronymused{CP}
\acronymused{CDF}
\AC@undonewlabel{acro:LLA}
\newlabel{acro:LLA}{{}{xviii}{\listfigurename }{chapter*.5}{}}
\acronymused{LLA}
\acronymused{LTP}
\acronymused{LLA}
\acronymused{CAPS.loc}
\@input{Chapter0/chapter0.aux}
\abx@aux@cite{gsa2019market}
\abx@aux@segm{0}{0}{gsa2019market}
\abx@aux@cite{7471482}
\abx@aux@segm{0}{0}{7471482}
\abx@aux@cite{grewal2007global}
\abx@aux@segm{0}{0}{grewal2007global}
\abx@aux@cite{4770175}
\abx@aux@segm{0}{0}{4770175}
\abx@aux@cite{jekeli2012inertial}
\abx@aux@segm{0}{0}{jekeli2012inertial}
\abx@aux@cite{noureldin2012fundamentals}
\abx@aux@segm{0}{0}{noureldin2012fundamentals}
\abx@aux@cite{5290369}
\abx@aux@segm{0}{0}{5290369}
\abx@aux@cite{s17020255}
\abx@aux@segm{0}{0}{s17020255}
\abx@aux@cite{7993222}
\abx@aux@segm{0}{0}{7993222}
\abx@aux@cite{8248655}
\abx@aux@segm{0}{0}{8248655}
\abx@aux@cite{cristodaro2019advanced}
\abx@aux@segm{0}{0}{cristodaro2019advanced}
\abx@aux@cite{7247673}
\abx@aux@segm{0}{0}{7247673}
\abx@aux@cite{8460352}
\abx@aux@segm{0}{0}{8460352}
\abx@aux@cite{rodriguez2018robust}
\abx@aux@segm{0}{0}{rodriguez2018robust}
\abx@aux@cite{cherif2018loosely}
\abx@aux@segm{0}{0}{cherif2018loosely}
\abx@aux@cite{8255823}
\abx@aux@segm{0}{0}{8255823}
\abx@aux@cite{8272318}
\abx@aux@segm{0}{0}{8272318}
\abx@aux@cite{5466205}
\abx@aux@segm{0}{0}{5466205}
\abx@aux@cite{7297658}
\abx@aux@segm{0}{0}{7297658}
\abx@aux@cite{7015602}
\abx@aux@segm{0}{0}{7015602}
\abx@aux@segm{0}{0}{cristodaro2019advanced}
\abx@aux@cite{basnayake2011relative}
\abx@aux@segm{0}{0}{basnayake2011relative}
\abx@aux@cite{1709862}
\abx@aux@segm{0}{0}{1709862}
\abx@aux@cite{zekavat2011handbook}
\abx@aux@segm{0}{0}{zekavat2011handbook}
\abx@aux@cite{shen2010limitsPart2}
\abx@aux@segm{0}{0}{shen2010limitsPart2}
\abx@aux@cite{5871406}
\abx@aux@segm{0}{0}{5871406}
\abx@aux@cite{1668252}
\abx@aux@segm{0}{0}{1668252}
\abx@aux@cite{4285854}
\abx@aux@segm{0}{0}{4285854}
\abx@aux@cite{1067998}
\abx@aux@segm{0}{0}{1067998}
\abx@aux@cite{7434174}
\abx@aux@segm{0}{0}{7434174}
\abx@aux@cite{5937274}
\abx@aux@segm{0}{0}{5937274}
\abx@aux@cite{shen2017dsrc}
\abx@aux@segm{0}{0}{shen2017dsrc}
\abx@aux@cite{hossain2016cooperative}
\abx@aux@segm{0}{0}{hossain2016cooperative}
\abx@aux@cite{7857839}
\abx@aux@segm{0}{0}{7857839}
\abx@aux@cite{alam2013cooperative}
\abx@aux@segm{0}{0}{alam2013cooperative}
\abx@aux@cite{uluskan2018circular}
\abx@aux@segm{0}{0}{uluskan2018circular}
\abx@aux@cite{8374808}
\abx@aux@segm{0}{0}{8374808}
\abx@aux@cite{caceres2010hybrid}
\abx@aux@segm{0}{0}{caceres2010hybrid}
\abx@aux@cite{6236174}
\abx@aux@segm{0}{0}{6236174}
\abx@aux@cite{6020821}
\abx@aux@segm{0}{0}{6020821}
\abx@aux@cite{minetto2018tight}
\abx@aux@segm{0}{0}{minetto2018tight}
\abx@aux@cite{Minetto:2019:GCP:3331054.3331552}
\abx@aux@segm{0}{0}{Minetto:2019:GCP:3331054.3331552}
\abx@aux@segm{0}{0}{7015602}
\abx@aux@cite{948650}
\abx@aux@segm{0}{0}{948650}
\abx@aux@cite{6240332}
\abx@aux@segm{0}{0}{6240332}
\abx@aux@segm{0}{0}{7015602}
\abx@aux@segm{0}{0}{948650}
\abx@aux@cite{4343975}
\abx@aux@segm{0}{0}{4343975}
\abx@aux@cite{liu2014improving}
\abx@aux@segm{0}{0}{liu2014improving}
\abx@aux@segm{0}{0}{liu2014improving}
\abx@aux@cite{lassoued2019cooperative}
\abx@aux@segm{0}{0}{lassoued2019cooperative}
\abx@aux@cite{8688455}
\abx@aux@segm{0}{0}{8688455}
\abx@aux@segm{0}{0}{zekavat2011handbook}
\abx@aux@cite{MinettoIAReusipco}
\abx@aux@segm{0}{0}{MinettoIAReusipco}
\abx@aux@cite{minettoCRLB}
\abx@aux@segm{0}{0}{minettoCRLB}
\abx@aux@segm{0}{0}{minetto2018tight}
\abx@aux@cite{minetto2018PLANS}
\abx@aux@segm{0}{0}{minetto2018PLANS}
\abx@aux@segm{0}{0}{Minetto:2019:GCP:3331054.3331552}
\abx@aux@cite{gogoiVTC2019}
\abx@aux@segm{0}{0}{gogoiVTC2019}
\abx@aux@cite{minetto2017IAR}
\abx@aux@segm{0}{0}{minetto2017IAR}
\abx@aux@cite{8926529}
\abx@aux@segm{0}{0}{8926529}
\abx@aux@cite{Gogoi_2018}
\abx@aux@segm{0}{0}{Gogoi_2018}
\abx@aux@cite{linty2018effects}
\abx@aux@segm{0}{0}{linty2018effects}
\abx@aux@cite{hanselD1}
\abx@aux@segm{0}{0}{hanselD1}
\abx@aux@cite{hanselD2}
\abx@aux@segm{0}{0}{hanselD2}
\abx@aux@cite{hanselD3}
\abx@aux@segm{0}{0}{hanselD3}
\abx@aux@cite{SVN49}
\abx@aux@segm{0}{0}{SVN49}
\abx@aux@cite{GalileoOutage}
\abx@aux@segm{0}{0}{GalileoOutage}
\abx@aux@segm{0}{0}{minettoCRLB}
\@input{Chapter1/chapter1.aux}
\abx@aux@cite{kaplan2017understanding}
\abx@aux@segm{0}{0}{kaplan2017understanding}
\abx@aux@cite{bradford1996global}
\abx@aux@segm{0}{0}{bradford1996global}
\abx@aux@segm{0}{0}{kaplan2017understanding}
\abx@aux@cite{misra2006global}
\abx@aux@segm{0}{0}{misra2006global}
\abx@aux@segm{0}{0}{zekavat2011handbook}
\abx@aux@cite{sobel2005longitude}
\abx@aux@segm{0}{0}{sobel2005longitude}
\abx@aux@segm{0}{0}{kaplan2017understanding}
\abx@aux@segm{0}{0}{zekavat2011handbook}
\abx@aux@segm{0}{0}{misra2006global}
\abx@aux@cite{Hein2000}
\abx@aux@segm{0}{0}{Hein2000}
\abx@aux@segm{0}{0}{kaplan2017understanding}
\abx@aux@cite{navstar1993icd}
\abx@aux@segm{0}{0}{navstar1993icd}
\abx@aux@cite{roper2010gps}
\abx@aux@segm{0}{0}{roper2010gps}
\abx@aux@cite{martin2008gps}
\abx@aux@segm{0}{0}{martin2008gps}
\abx@aux@cite{global2008interface}
\abx@aux@segm{0}{0}{global2008interface}
\abx@aux@segm{0}{0}{Hein2000}
\abx@aux@cite{1490}
\abx@aux@segm{0}{0}{1490}
\abx@aux@cite{falcone2017galileo}
\abx@aux@segm{0}{0}{falcone2017galileo}
\abx@aux@cite{kishimoto2001qzss}
\abx@aux@segm{0}{0}{kishimoto2001qzss}
\abx@aux@cite{ganeshan2005indian}
\abx@aux@segm{0}{0}{ganeshan2005indian}
\abx@aux@cite{saikiran2013irnss}
\abx@aux@segm{0}{0}{saikiran2013irnss}
\abx@aux@segm{0}{0}{misra2006global}
\abx@aux@cite{prasad2005applied}
\abx@aux@segm{0}{0}{prasad2005applied}
\abx@aux@cite{gauthier2001egnos}
\abx@aux@segm{0}{0}{gauthier2001egnos}
\abx@aux@cite{van2009gps}
\abx@aux@segm{0}{0}{van2009gps}
\abx@aux@cite{loh1995us}
\abx@aux@segm{0}{0}{loh1995us}
\abx@aux@cite{rao2007gagan}
\abx@aux@segm{0}{0}{rao2007gagan}
\abx@aux@cite{bisnath2009current}
\abx@aux@segm{0}{0}{bisnath2009current}
\abx@aux@segm{0}{0}{kaplan2017understanding}
\abx@aux@cite{haykin2003least}
\abx@aux@segm{0}{0}{haykin2003least}
\abx@aux@segm{0}{0}{kaplan2017understanding}
\abx@aux@segm{0}{0}{kaplan2017understanding}
\@input{Chapter2/chapter2.aux}
\abx@aux@segm{0}{0}{misra2006global}
\abx@aux@segm{0}{0}{kaplan2017understanding}
\abx@aux@segm{0}{0}{navstar1993icd}
\abx@aux@cite{avila2008mboc}
\abx@aux@segm{0}{0}{avila2008mboc}
\abx@aux@cite{galileo2008galileo}
\abx@aux@segm{0}{0}{galileo2008galileo}
\abx@aux@segm{0}{0}{avila2008mboc}
\abx@aux@segm{0}{0}{galileo2008galileo}
\abx@aux@segm{0}{0}{galileo2008galileo}
\abx@aux@segm{0}{0}{navstar1993icd}
\abx@aux@segm{0}{0}{galileo2008galileo}
\abx@aux@cite{GPS_ICD_800_2014}
\abx@aux@segm{0}{0}{GPS_ICD_800_2014}
\abx@aux@cite{GPS_ICD_705_2014}
\abx@aux@segm{0}{0}{GPS_ICD_705_2014}
\abx@aux@cite{GPS_ICD_200_2016}
\abx@aux@segm{0}{0}{GPS_ICD_200_2016}
\abx@aux@cite{inbook2011overview}
\abx@aux@segm{0}{0}{inbook2011overview}
\abx@aux@segm{0}{0}{GPS_ICD_800_2014}
\abx@aux@segm{0}{0}{GPS_ICD_705_2014}
\abx@aux@segm{0}{0}{GPS_ICD_200_2016}
\abx@aux@segm{0}{0}{inbook2011overview}
\abx@aux@cite{EC_GalCSdecision_2017}
\abx@aux@segm{0}{0}{EC_GalCSdecision_2017}
\abx@aux@cite{EC_GalInitService_2016}
\abx@aux@segm{0}{0}{EC_GalInitService_2016}
\abx@aux@cite{EU_GalileoICD_2016}
\abx@aux@segm{0}{0}{EU_GalileoICD_2016}
\abx@aux@segm{0}{0}{inbook2011overview}
\abx@aux@segm{0}{0}{EC_GalCSdecision_2017}
\abx@aux@segm{0}{0}{EC_GalInitService_2016}
\abx@aux@segm{0}{0}{EU_GalileoICD_2016}
\abx@aux@segm{0}{0}{inbook2011overview}
\abx@aux@segm{0}{0}{misra2006global}
\abx@aux@segm{0}{0}{kaplan2017understanding}
\abx@aux@segm{0}{0}{kaplan2017understanding}
\abx@aux@cite{kaplan2005understanding}
\abx@aux@segm{0}{0}{kaplan2005understanding}
\abx@aux@segm{0}{0}{cristodaro2019advanced}
\abx@aux@segm{0}{0}{cristodaro2019advanced}
\abx@aux@cite{borio2008statistical}
\abx@aux@segm{0}{0}{borio2008statistical}
\abx@aux@segm{0}{0}{kaplan2005understanding}
\abx@aux@segm{0}{0}{misra2006global}
\abx@aux@segm{0}{0}{kaplan2005understanding}
\abx@aux@segm{0}{0}{kaplan2005understanding}
\abx@aux@segm{0}{0}{kaplan2005understanding}
\abx@aux@segm{0}{0}{kaplan2005understanding}
\abx@aux@segm{0}{0}{kaplan2005understanding}
\abx@aux@segm{0}{0}{kaplan2005understanding}
\abx@aux@segm{0}{0}{kaplan2005understanding}
\abx@aux@segm{0}{0}{bradford1996global}
\abx@aux@segm{0}{0}{misra2006global}
\abx@aux@segm{0}{0}{kaplan2005understanding}
\abx@aux@segm{0}{0}{kaplan2005understanding}
\abx@aux@segm{0}{0}{kaplan2005understanding}
\abx@aux@segm{0}{0}{navstar1993icd}
\abx@aux@segm{0}{0}{galileo2008galileo}
\abx@aux@segm{0}{0}{gsa2019market}
\abx@aux@segm{0}{0}{linty2018effects}
\abx@aux@segm{0}{0}{linty2018effects}
\abx@aux@cite{pini2012estimation}
\abx@aux@segm{0}{0}{pini2012estimation}
\abx@aux@segm{0}{0}{kaplan2017understanding}
\abx@aux@segm{0}{0}{navstar1993icd}
\abx@aux@segm{0}{0}{kaplan2017understanding}
\abx@aux@segm{0}{0}{navstar1993icd}
\abx@aux@segm{0}{0}{navstar1993icd}
\abx@aux@segm{0}{0}{kaplan2017understanding}
\abx@aux@cite{presti2014software}
\abx@aux@segm{0}{0}{presti2014software}
\abx@aux@cite{won2006gnss}
\abx@aux@segm{0}{0}{won2006gnss}
\abx@aux@cite{presti2011novel}
\abx@aux@segm{0}{0}{presti2011novel}
\abx@aux@cite{6934166}
\abx@aux@segm{0}{0}{6934166}
\abx@aux@cite{5708021}
\abx@aux@segm{0}{0}{5708021}
\abx@aux@cite{6253108}
\abx@aux@segm{0}{0}{6253108}
\abx@aux@cite{5606125}
\abx@aux@segm{0}{0}{5606125}
\abx@aux@cite{5594103}
\abx@aux@segm{0}{0}{5594103}
\@input{Chapter3/chapter3.aux}
\abx@aux@segm{0}{0}{kaplan2017understanding}
\abx@aux@cite{hofmann2012global}
\abx@aux@segm{0}{0}{hofmann2012global}
\abx@aux@cite{8678911}
\abx@aux@segm{0}{0}{8678911}
\abx@aux@cite{oh2011formation}
\abx@aux@segm{0}{0}{oh2011formation}
\abx@aux@cite{7949096}
\abx@aux@segm{0}{0}{7949096}
\abx@aux@segm{0}{0}{1668252}
\abx@aux@segm{0}{0}{1067998}
\abx@aux@cite{de2017survey}
\abx@aux@segm{0}{0}{de2017survey}
\abx@aux@cite{8064679}
\abx@aux@segm{0}{0}{8064679}
\abx@aux@cite{wang2016bias}
\abx@aux@segm{0}{0}{wang2016bias}
\abx@aux@cite{Venkatraman1337329}
\abx@aux@segm{0}{0}{Venkatraman1337329}
\abx@aux@cite{6781631}
\abx@aux@segm{0}{0}{6781631}
\abx@aux@cite{1618619}
\abx@aux@segm{0}{0}{1618619}
\abx@aux@segm{0}{0}{de2017survey}
\abx@aux@segm{0}{0}{de2017survey}
\abx@aux@cite{wee2018vehicular}
\abx@aux@segm{0}{0}{wee2018vehicular}
\abx@aux@cite{7368912}
\abx@aux@segm{0}{0}{7368912}
\abx@aux@cite{8048545}
\abx@aux@segm{0}{0}{8048545}
\abx@aux@segm{0}{0}{8678911}
\abx@aux@cite{5940433}
\abx@aux@segm{0}{0}{5940433}
\abx@aux@cite{1689615}
\abx@aux@segm{0}{0}{1689615}
\abx@aux@cite{caceres2010hybrid2}
\abx@aux@segm{0}{0}{caceres2010hybrid2}
\abx@aux@segm{0}{0}{caceres2010hybrid}
\abx@aux@cite{penna2010CRLB}
\abx@aux@segm{0}{0}{penna2010CRLB}
\abx@aux@segm{0}{0}{minetto2017IAR}
\abx@aux@cite{van1998innovation}
\abx@aux@segm{0}{0}{van1998innovation}
\abx@aux@cite{langley1991mathematics}
\abx@aux@segm{0}{0}{langley1991mathematics}
\abx@aux@cite{bhattacharyya1946measure}
\abx@aux@segm{0}{0}{bhattacharyya1946measure}
\abx@aux@cite{bityukov2013method}
\abx@aux@segm{0}{0}{bityukov2013method}
\abx@aux@cite{ong2011use}
\abx@aux@segm{0}{0}{ong2011use}
\abx@aux@cite{7530562}
\abx@aux@segm{0}{0}{7530562}
\abx@aux@cite{tahir2018accuracy}
\abx@aux@segm{0}{0}{tahir2018accuracy}
\abx@aux@segm{0}{0}{liu2014improving}
\abx@aux@cite{DePonteMuller2014}
\abx@aux@segm{0}{0}{DePonteMuller2014}
\abx@aux@segm{0}{0}{MinettoIAReusipco}
\abx@aux@segm{0}{0}{tahir2018accuracy}
\abx@aux@cite{remondi1985using}
\abx@aux@segm{0}{0}{remondi1985using}
\abx@aux@segm{0}{0}{hofmann2012global}
\abx@aux@segm{0}{0}{minettoCRLB}
\abx@aux@cite{rohani2015novel}
\abx@aux@segm{0}{0}{rohani2015novel}
\abx@aux@segm{0}{0}{1709862}
\abx@aux@segm{0}{0}{7015602}
\abx@aux@segm{0}{0}{alam2013cooperative}
\abx@aux@cite{deponte2013zero}
\abx@aux@segm{0}{0}{deponte2013zero}
\abx@aux@segm{0}{0}{hofmann2012global}
\abx@aux@segm{0}{0}{deponte2013zero}
\abx@aux@segm{0}{0}{deponte2013zero}
\abx@aux@segm{0}{0}{tahir2018accuracy}
\abx@aux@cite{differentialGEOSPATIAL}
\abx@aux@segm{0}{0}{differentialGEOSPATIAL}
\abx@aux@segm{0}{0}{differentialGEOSPATIAL}
\abx@aux@segm{0}{0}{hofmann2012global}
\abx@aux@segm{0}{0}{kaplan2017understanding}
\abx@aux@cite{707266}
\abx@aux@segm{0}{0}{707266}
\abx@aux@cite{lehner2005novel}
\abx@aux@segm{0}{0}{lehner2005novel}
\abx@aux@segm{0}{0}{hofmann2012global}
\abx@aux@segm{0}{0}{kaplan2017understanding}
\abx@aux@segm{0}{0}{deponte2013zero}
\abx@aux@cite{8307419}
\abx@aux@segm{0}{0}{8307419}
\abx@aux@segm{0}{0}{8307419}
\abx@aux@segm{0}{0}{minetto2017IAR}
\abx@aux@segm{0}{0}{minetto2018PLANS}
\abx@aux@segm{0}{0}{navstar1993icd}
\abx@aux@cite{754809}
\abx@aux@segm{0}{0}{754809}
\abx@aux@cite{de2013zero}
\abx@aux@segm{0}{0}{de2013zero}
\abx@aux@segm{0}{0}{minetto2017IAR}
\abx@aux@cite{fisher2006statistical}
\abx@aux@segm{0}{0}{fisher2006statistical}
\abx@aux@segm{0}{0}{kaplan2017understanding}
\abx@aux@segm{0}{0}{minetto2018PLANS}
\abx@aux@segm{0}{0}{minetto2018PLANS}
\abx@aux@segm{0}{0}{minetto2018PLANS}
\abx@aux@segm{0}{0}{minetto2018PLANS}
\@input{Chapter4/chapter4.aux}
\abx@aux@cite{wang1998}
\abx@aux@segm{0}{0}{wang1998}
\abx@aux@cite{Teunissen1999}
\abx@aux@segm{0}{0}{Teunissen1999}
\abx@aux@cite{Wang2002}
\abx@aux@segm{0}{0}{Wang2002}
\abx@aux@segm{0}{0}{kaplan2017understanding}
\abx@aux@segm{0}{0}{minetto2018PLANS}
\abx@aux@cite{lopresti2014software}
\abx@aux@segm{0}{0}{lopresti2014software}
\abx@aux@cite{detrendingPseudo}
\abx@aux@segm{0}{0}{detrendingPseudo}
\abx@aux@cite{salih2013suitability}
\abx@aux@segm{0}{0}{salih2013suitability}
\abx@aux@segm{0}{0}{minetto2018PLANS}
\@input{Chapter5/chapter5.aux}
\abx@aux@cite{dardari2012satellite}
\abx@aux@segm{0}{0}{dardari2012satellite}
\abx@aux@cite{xiong2014hybrid}
\abx@aux@segm{0}{0}{xiong2014hybrid}
\abx@aux@cite{angrisano2010gnss}
\abx@aux@segm{0}{0}{angrisano2010gnss}
\abx@aux@cite{falco2012performance}
\abx@aux@segm{0}{0}{falco2012performance}
\abx@aux@segm{0}{0}{cristodaro2019advanced}
\abx@aux@cite{gordon2004beyond}
\abx@aux@segm{0}{0}{gordon2004beyond}
\abx@aux@segm{0}{0}{falco2012performance}
\abx@aux@cite{kay1993fundamentals}
\abx@aux@segm{0}{0}{kay1993fundamentals}
\abx@aux@segm{0}{0}{rohani2015novel}
\abx@aux@segm{0}{0}{8374808}
\abx@aux@segm{0}{0}{caceres2010hybrid}
\abx@aux@segm{0}{0}{caceres2010hybrid2}
\abx@aux@cite{6081348}
\abx@aux@segm{0}{0}{6081348}
\abx@aux@segm{0}{0}{kaplan2017understanding}
\abx@aux@cite{brown}
\abx@aux@segm{0}{0}{brown}
\abx@aux@segm{0}{0}{tahir2018accuracy}
\abx@aux@segm{0}{0}{haykin2003least}
\abx@aux@cite{stark1986probability}
\abx@aux@segm{0}{0}{stark1986probability}
\abx@aux@segm{0}{0}{minetto2017IAR}
\abx@aux@cite{Deng2015453}
\abx@aux@segm{0}{0}{Deng2015453}
\abx@aux@segm{0}{0}{grewal2007global}
\abx@aux@segm{0}{0}{kaplan2017understanding}
\abx@aux@segm{0}{0}{brown}
\abx@aux@segm{0}{0}{kaplan2017understanding}
\abx@aux@segm{0}{0}{754809}
\abx@aux@segm{0}{0}{brown}
\abx@aux@segm{0}{0}{brown}
\abx@aux@cite{sheijani2013implementation}
\abx@aux@segm{0}{0}{sheijani2013implementation}
\abx@aux@cite{gordon1993novel}
\abx@aux@segm{0}{0}{gordon1993novel}
\abx@aux@cite{sun2013particle}
\abx@aux@segm{0}{0}{sun2013particle}
\abx@aux@cite{978396}
\abx@aux@segm{0}{0}{978396}
\abx@aux@cite{5546308}
\abx@aux@segm{0}{0}{5546308}
\abx@aux@cite{978374}
\abx@aux@segm{0}{0}{978374}
\abx@aux@cite{smith2013sequential}
\abx@aux@segm{0}{0}{smith2013sequential}
\abx@aux@cite{529326}
\abx@aux@segm{0}{0}{529326}
\abx@aux@cite{li2015resampling}
\abx@aux@segm{0}{0}{li2015resampling}
\abx@aux@segm{0}{0}{978396}
\abx@aux@cite{905890}
\abx@aux@segm{0}{0}{905890}
\abx@aux@segm{0}{0}{minettoCRLB}
\abx@aux@segm{0}{0}{8926529}
\abx@aux@segm{0}{0}{penna2010CRLB}
\abx@aux@segm{0}{0}{5871406}
\abx@aux@cite{7112186}
\abx@aux@segm{0}{0}{7112186}
\abx@aux@cite{gabela2018cramer}
\abx@aux@segm{0}{0}{gabela2018cramer}
\abx@aux@cite{1268022}
\abx@aux@segm{0}{0}{1268022}
\abx@aux@cite{hendeby2004fundamental}
\abx@aux@segm{0}{0}{hendeby2004fundamental}
\abx@aux@cite{Goel2019}
\abx@aux@segm{0}{0}{Goel2019}
\abx@aux@cite{hoang2017coop}
\abx@aux@segm{0}{0}{hoang2017coop}
\abx@aux@cite{8752742}
\abx@aux@segm{0}{0}{8752742}
\abx@aux@cite{4412548}
\abx@aux@segm{0}{0}{4412548}
\abx@aux@segm{0}{0}{4343975}
\abx@aux@segm{0}{0}{6236174}
\abx@aux@cite{alam2011dsrc}
\abx@aux@segm{0}{0}{alam2011dsrc}
\abx@aux@cite{Lassoued2015}
\abx@aux@segm{0}{0}{Lassoued2015}
\abx@aux@segm{0}{0}{kaplan2017understanding}
\abx@aux@segm{0}{0}{misra2006global}
\abx@aux@cite{GDOPandCRLB}
\abx@aux@segm{0}{0}{GDOPandCRLB}
\abx@aux@segm{0}{0}{7112186}
\abx@aux@segm{0}{0}{kay1993fundamentals}
\abx@aux@segm{0}{0}{kaplan2017understanding}
\abx@aux@segm{0}{0}{kaplan2017understanding}
\abx@aux@segm{0}{0}{penna2010CRLB}
\abx@aux@segm{0}{0}{hoang2017coop}
\abx@aux@segm{0}{0}{kaplan2017understanding}
\abx@aux@segm{0}{0}{penna2010CRLB}
\abx@aux@segm{0}{0}{minetto2018PLANS}
\abx@aux@segm{0}{0}{brown}
\abx@aux@cite{4046308}
\abx@aux@segm{0}{0}{4046308}
\abx@aux@segm{0}{0}{penna2010CRLB}
\abx@aux@segm{0}{0}{minetto2018PLANS}
\@input{Chapter7/chapter7.aux}
\abx@aux@segm{0}{0}{minetto2017IAR}
\abx@aux@segm{0}{0}{8926529}
\abx@aux@segm{0}{0}{MinettoIAReusipco}
\abx@aux@segm{0}{0}{minetto2017IAR}
\abx@aux@segm{0}{0}{MinettoIAReusipco}
\abx@aux@segm{0}{0}{brown}
\abx@aux@segm{0}{0}{brown}
\abx@aux@segm{0}{0}{1067998}
\abx@aux@segm{0}{0}{MinettoIAReusipco}
\abx@aux@segm{0}{0}{Deng2015453}
\abx@aux@segm{0}{0}{MinettoIAReusipco}
\abx@aux@segm{0}{0}{MinettoIAReusipco}
\abx@aux@segm{0}{0}{cristodaro2019advanced}
\abx@aux@segm{0}{0}{minettoCRLB}
\abx@aux@cite{shen2010limitsPart1}
\abx@aux@segm{0}{0}{shen2010limitsPart1}
\abx@aux@segm{0}{0}{minetto2018PLANS}
\abx@aux@cite{6311243}
\abx@aux@segm{0}{0}{6311243}
\abx@aux@cite{8891571}
\abx@aux@segm{0}{0}{8891571}
\abx@aux@cite{1544987}
\abx@aux@segm{0}{0}{1544987}
\abx@aux@cite{4570072}
\abx@aux@segm{0}{0}{4570072}
\abx@aux@segm{0}{0}{978396}
\abx@aux@segm{0}{0}{5546308}
\abx@aux@segm{0}{0}{978396}
\abx@aux@segm{0}{0}{978396}
\abx@aux@segm{0}{0}{4570072}
\abx@aux@segm{0}{0}{kaplan2017understanding}
\@input{Chapter8/chapter8.aux}
\abx@aux@cite{8821521}
\abx@aux@segm{0}{0}{8821521}
\abx@aux@cite{7102684}
\abx@aux@segm{0}{0}{7102684}
\abx@aux@cite{RD_04}
\abx@aux@segm{0}{0}{RD_04}
\abx@aux@cite{RD_09}
\abx@aux@segm{0}{0}{RD_09}
\abx@aux@segm{0}{0}{gsa2019market}
\abx@aux@cite{8287016}
\abx@aux@segm{0}{0}{8287016}
\abx@aux@cite{7583720}
\abx@aux@segm{0}{0}{7583720}
\abx@aux@cite{trimbleR10}
\abx@aux@segm{0}{0}{trimbleR10}
\abx@aux@cite{trimbleR2}
\abx@aux@segm{0}{0}{trimbleR2}
\abx@aux@cite{gsa2018using}
\abx@aux@segm{0}{0}{gsa2018using}
\abx@aux@cite{Zhang2018}
\abx@aux@segm{0}{0}{Zhang2018}
\abx@aux@segm{0}{0}{gsa2018using}
\abx@aux@segm{0}{0}{Gogoi_2018}
\abx@aux@cite{Robustelli_2019}
\abx@aux@segm{0}{0}{Robustelli_2019}
\abx@aux@cite{Yoon_2016}
\abx@aux@segm{0}{0}{Yoon_2016}
\abx@aux@cite{DABOVE201994}
\abx@aux@segm{0}{0}{DABOVE201994}
\abx@aux@cite{7314860}
\abx@aux@segm{0}{0}{7314860}
\abx@aux@cite{7515010}
\abx@aux@segm{0}{0}{7515010}
\abx@aux@cite{8421016}
\abx@aux@segm{0}{0}{8421016}
\abx@aux@cite{PPPfrance}
\abx@aux@segm{0}{0}{PPPfrance}
\abx@aux@cite{laurichesse2017smartphone}
\abx@aux@segm{0}{0}{laurichesse2017smartphone}
\abx@aux@cite{banville2016precise}
\abx@aux@segm{0}{0}{banville2016precise}
\abx@aux@cite{realini2017precise}
\abx@aux@segm{0}{0}{realini2017precise}
\abx@aux@segm{0}{0}{lucas2016demonstration}
\abx@aux@segm{0}{0}{Gogoi_2018}
\abx@aux@cite{broadcom}
\abx@aux@segm{0}{0}{broadcom}
\abx@aux@segm{0}{0}{broadcom}
\abx@aux@cite{mongo}
\abx@aux@segm{0}{0}{mongo}
\abx@aux@segm{0}{0}{gogoiVTC2019}
\abx@aux@cite{ROSurl}
\abx@aux@segm{0}{0}{ROSurl}
\abx@aux@segm{0}{0}{gogoiVTC2019}
\abx@aux@cite{gCoGnss}
\abx@aux@segm{0}{0}{gCoGnss}
\abx@aux@segm{0}{0}{gsa2018using}
\abx@aux@cite{developerandroid}
\abx@aux@segm{0}{0}{developerandroid}
\abx@aux@segm{0}{0}{de2013zero}
\abx@aux@segm{0}{0}{van1998innovation}
\abx@aux@segm{0}{0}{misra2006global}
\abx@aux@cite{Zhu_2019}
\abx@aux@segm{0}{0}{Zhu_2019}
\@input{Chapter10/chapter10.aux}
\@input{Appendix2/appendix2.aux}
\abx@aux@cite{refFrame}
\abx@aux@segm{0}{0}{refFrame}
\abx@aux@cite{refFrame2}
\abx@aux@segm{0}{0}{refFrame2}
\abx@aux@cite{WGS84}
\abx@aux@segm{0}{0}{WGS84}
\@input{Appendix1/appendix1.aux}
\abx@aux@cite{errEllipse01}
\abx@aux@segm{0}{0}{errEllipse01}
\abx@aux@cite{errEllipse02}
\abx@aux@segm{0}{0}{errEllipse02}
\abx@aux@segm{0}{0}{van1998innovation}
\abx@aux@cite{soler1985transformation}
\abx@aux@segm{0}{0}{soler1985transformation}
\@input{Appendix4/appendix4.aux}
\@input{Appendix5/appendix5.aux}
\newacro{A/D}[\AC@hyperlink{A/D}{A/D}]{Analog-to-Digital}
\newacro{ADC}[\AC@hyperlink{ADC}{ADC}]{Analog-to-Digital Converter}
\newacro{AGC}[\AC@hyperlink{AGC}{AGC}]{Automatic Gain Control}
\newacro{AoA}[\AC@hyperlink{AoA}{AoA}]{Angle of Arrival}
\newacro{AWGN}[\AC@hyperlink{AWGN}{AWGN}]{Additive White Gaussian Noise}
\newacro{APD}[\AC@hyperlink{APD}{APD}]{Absolute Position Distance}
\newacro{API}[\AC@hyperlink{API}{API}]{Application Programming Interface}
\newacro{AGNSS}[\AC@hyperlink{AGNSS}{AGNSS}]{Assisted GNSS}
\newacro{BOC}[\AC@hyperlink{BOC}{BOC}]{Binary Offset Carrier}
\newacro{BPSK}[\AC@hyperlink{BPSK}{BPSK}]{Binary Phase Shift Keying}
\newacro{BIC}[\AC@hyperlink{BIC}{BIC}]{Bayesian Information Criterion}
\newacro{CAF}[\AC@hyperlink{CAF}{CAF}]{Cross Ambiguity Function}
\newacro{CAPS.loc}[\AC@hyperlink{CAPS.loc}{CAPS.loc}]{Collaborative Android Positioning System for enhanced LOCalization}
\newacro{CBOC}[\AC@hyperlink{CBOC}{CBOC}]{Composite Binary Offset Carrier}
\newacro{CDF}[\AC@hyperlink{CDF}{CDF}]{Cumulative Distribution Function}
\newacro{CDMA}[\AC@hyperlink{CDMA}{CDMA}]{Code Division Multiple Access}
\newacro{CN0}[\AC@hyperlink{CN0}{$C/N_0$}]{Carrier-to-Noise density power ratio}
\newacro{CoO}[\AC@hyperlink{CoO}{CoO}]{Cell of Origin}
\newacro{CS}[\AC@hyperlink{CS}{CS}]{Commercial Service}
\newacro{CRM}[\AC@hyperlink{CRM}{CRM}]{Cooperative Raw Message}
\newacro{CP}[\AC@hyperlink{CP}{CP}]{Cooperative Positioning}
\newacro{CW}[\AC@hyperlink{CW}{CW}]{Continuous Wave}
\newacro{CWI}[\AC@hyperlink{CWI}{CWI}]{Continuous Wave Interference}
\newacro{CDOP}[\AC@hyperlink{CDOP}{CDOP}]{Cooperative Dilution of Precision}
\newacro{CRLB}[\AC@hyperlink{CRLB}{CRLB}]{Cramer-Rao Lower Bound}
\newacro{CRU}[\AC@hyperlink{CRU}{CRU}]{Collaborative Ranging Unit}
\newacro{COTS}[\AC@hyperlink{COTS}{COTS}]{Commercial Off-the-shelf}
\newacro{CPS}[\AC@hyperlink{CPS}{CPS}]{Cooperative Positiong Service}
\newacro{CPA}[\AC@hyperlink{CPA}{CPA}]{Cooperative Positioning Application}
\newacro{CPU}[\AC@hyperlink{CPU}{CPU}]{Control Processing Unit}
\newacro{CCD}[\AC@hyperlink{CCD}{CCD}]{Charge-Coupled Device}
\newacro{CMOS}[\AC@hyperlink{CMOS}{CMOS}]{complementary metal-oxide semiconductor}
\newacro{DAC}[\AC@hyperlink{DAC}{DAC}]{Digital-Analog Converter}
\newacro{DoD}[\AC@hyperlink{DoD}{DoD}]{Department of Defense}
\newacro{DARPA}[\AC@hyperlink{DARPA}{DARPA}]{Defense Advanced Research Projects Agency}
\newacro{DC}[\AC@hyperlink{DC}{DC}]{Deeply Coupled}
\newacro{DD}[\AC@hyperlink{DD}{DD}]{Double Difference}
\newacro{DDR}[\AC@hyperlink{DDR}{DDR}]{Double Difference Ranging}
\newacro{DCM}[\AC@hyperlink{DCM}{DCM}]{Direction Cosine Matrix}
\newacro{DLL}[\AC@hyperlink{DLL}{DLL}]{Delay Lock Loop}
\newacro{DSP}[\AC@hyperlink{DSP}{DSP}]{Digital Signal Processors}
\newacro{DOP}[\AC@hyperlink{DOP}{DOP}]{Dilution Of Precision}
\newacro{DGNSS}[\AC@hyperlink{DGNSS}{DGNSS}]{Differential GNSS}
\newacro{DGPS}[\AC@hyperlink{DGPS}{DGPS}]{Differential GPS}
\newacro{DSRC}[\AC@hyperlink{DSRC}{DSRC}]{Direct Short-Range Communication}
\newacro{DB}[\AC@hyperlink{DB}{DB}]{Database}
\newacro{ECEF}[\AC@hyperlink{ECEF}{ECEF}]{Earth-Centered Earth-Fixed}
\newacro{ENU}[\AC@hyperlink{ENU}{ENU}]{East-North-Up}
\newacro{ECI}[\AC@hyperlink{ECI}{ECI}]{Earth-Centered Inertial}
\newacro{EKF}[\AC@hyperlink{EKF}{EKF}]{Extended Kalman Filter}
\newacro{EPF}[\AC@hyperlink{EPF}{EPF}]{Extended Particle Filter}
\newacro{EOC}[\AC@hyperlink{EOC}{EOC}]{Early Operational Capability}
\newacro{ESA}[\AC@hyperlink{ESA}{ESA}]{European Space Agency}
\newacro{FLL}[\AC@hyperlink{FLL}{FLL}]{Frequency Lock Loop}
\newacro{FPGA}[\AC@hyperlink{FPGA}{FPGA}]{Field Programmable Gate Array}
\newacro{FIM}[\AC@hyperlink{FIM}{FIM}]{Fisher Information Matrix}
\newacro{FDMA}[\AC@hyperlink{FDMA}{FDMA}]{Frequency Division Multiple Access}
\newacro{GBPT}[\AC@hyperlink{GBPT}{GBPT}]{GNSS-Based Positioning Terminal}
\newacro{GLONASS}[\AC@hyperlink{GLONASS}{GLONASS}]{GLobal NAvigation Satellite System}
\newacro{GM}[\AC@hyperlink{GM}{GM}]{Gauss-Markov}
\newacro{GNSS}[\AC@hyperlink{GNSS}{GNSS}]{Global Navigation Satellite System}
\newacro{GPP}[\AC@hyperlink{GPP}{GPP}]{General Purpose Processor}
\newacro{GPS}[\AC@hyperlink{GPS}{GPS}]{Global Positioning System}
\newacro{GSA}[\AC@hyperlink{GSA}{GSA}]{Global Navigation Satellite Systems Agency}
\newacro{GDOP}[\AC@hyperlink{GDOP}{GDOP}]{Geometrical Dilution of Precision}
\newacro{GoF}[\AC@hyperlink{GoF}{GoF}]{Goodness of Fit}
\newacro{GEV}[\AC@hyperlink{GEV}{GEV}]{Generalized Extreme Value}
\newacro{GUI}[\AC@hyperlink{GUI}{GUI}]{Graphic User Interface}
\newacro{HOW}[\AC@hyperlink{HOW}{HOW}]{Hand-over word}
\newacro{HPE}[\AC@hyperlink{HPE}{HPE}]{Horizontal Positioning Error}
\newacro{HW}[\AC@hyperlink{HW}{HW}]{Hardware}
\newacro{H-LMS}[\AC@hyperlink{H-LMS}{H-LMS}]{Hybrid Least Mean Square}
\newacro{H-PVT}[\AC@hyperlink{H-PVT}{H-PVT}]{Hybrid PVT}
\newacro{H-WLMS}[\AC@hyperlink{H-WLMS}{H-WLMS}]{Hybrid Weighted Least Mean Square}
\newacro{H-EKF}[\AC@hyperlink{H-EKF}{H-EKF}]{Hybrid Extended Kalman Filter}
\newacro{H-PF}[\AC@hyperlink{H-PF}{H-PF}]{Hybrid Particle Filter}
\newacro{HMM}[\AC@hyperlink{HMM}{HMM}]{Hidden-state Markov Model}
\newacro{IAR}[\AC@hyperlink{IAR}{IAR}]{Inter-Agent Ranging}
\newacro{IF}[\AC@hyperlink{IF}{IF}]{Intermediate Frequency}
\newacro{IMU}[\AC@hyperlink{IMU}{IMU}]{Inertial Measurement Unit}
\newacro{ICD}[\AC@hyperlink{ICD}{ICD}]{Interface Control Document}
\newacro{IOC}[\AC@hyperlink{IOC}{IOC}]{Initial Operational Capability}
\newacro{IOV}[\AC@hyperlink{IOV}{IOV}]{In-Orbit Validation}
\newacro{INS}[\AC@hyperlink{INS}{INS}]{Inertial Navigation System}
\newacro{IVS}[\AC@hyperlink{IVS}{IVS}]{In-Vehicle Systems }
\newacro{ISMR}[\AC@hyperlink{ISMR}{ISMR}]{Ionospheric Scintillation Monitoring Receivers}
\newacro{ITS}[\AC@hyperlink{ITS}{ITS}]{Intelligent Transport System}
\newacro{IoT}[\AC@hyperlink{IoT}{IoT}]{Internet of Things}
\newacro{ILS}[\AC@hyperlink{ILS}{ILS}]{Instrument Landing System}
\newacro{KF}[\AC@hyperlink{KF}{KF}]{Kalman Filter}
\newacro{KPI}[\AC@hyperlink{KPI}{KPI}]{Key Performance Indicator}
\newacro{LC}[\AC@hyperlink{LC}{LC}]{Loosely Coupled}
\newacro{LLA}[\AC@hyperlink{LLA}{LLA}]{Latitude Longitude Altitude}
\newacro{LoS}[\AC@hyperlink{LoS}{LoS}]{Line-of-Sight}
\newacro{LDOP}[\AC@hyperlink{LDOP}{LDOP}]{Line Dilution Of Precision}
\newacro{LORAN}[\AC@hyperlink{LORAN}{LORAN}]{LOng-range Aid to Navigation}
\newacro{LiDAR}[\AC@hyperlink{LiDAR}{LiDAR}]{Light Detection and Ranging System}
\newacro{LNA}[\AC@hyperlink{LNA}{LNA}]{Low Noise Amplifier}
\newacro{LO}[\AC@hyperlink{LO}{LO}]{Local Oscillator}
\newacro{LMS}[\AC@hyperlink{LMS}{LMS}]{Least Mean Square}
\newacro{LS}[\AC@hyperlink{LS}{LS}]{Least Square}
\newacro{LTP}[\AC@hyperlink{LTP}{LTP}]{Local Tangent Plane}
\newacro{LBS}[\AC@hyperlink{LBS}{LBS}]{Location-Based Service}
\newacro{MBOC}[\AC@hyperlink{MBOC}{MBOC}]{Multiplexed BOC}
\newacro{MCS}[\AC@hyperlink{MCS}{MCS}]{Multilevel Coded Spreading Symbols}
\newacro{MEMS}[\AC@hyperlink{MEMS}{MEMS}]{Micro Electro-Mechanical System}
\newacro{ML}[\AC@hyperlink{ML}{ML}]{Maximum Likelihood}
\newacro{MLE}[\AC@hyperlink{MLE}{MLE}]{Maximum Likelihood Estimation}
\newacro{MSE}[\AC@hyperlink{MSE}{MSE}]{Mean Square Error}
\newacro{MMSE}[\AC@hyperlink{MMSE}{MMSE}]{Minimum Mean Square Error}
\newacro{MAP}[\AC@hyperlink{MAP}{MAP}]{Maximum A Posteriori}
\newacro{MEO}[\AC@hyperlink{MEO}{MEO}]{Medium Earth Orbit}
\newacro{NBI}[\AC@hyperlink{NBI}{NBI}]{Narrow Band Interference}
\newacro{NCO}[\AC@hyperlink{NCO}{NCO}]{Numerical Controlled Oscillator}
\newacro{NED}[\AC@hyperlink{NED}{NED}]{North-East-Down}
\newacro{NLOS}[\AC@hyperlink{NLOS}{NLOS}]{Non-Line-of-Sight}
\newacro{NNSS}[\AC@hyperlink{NNSS}{NNSS}]{Navy Navigation Satellite System}
\newacro{NAVSTAR}[\AC@hyperlink{NAVSTAR}{NAVSTAR}]{Navigation System with Time and Ranging}
\newacro{OS}[\AC@hyperlink{OS}{OS}]{Open Service}
\newacro{OCXO}[\AC@hyperlink{OCXO}{OCXO}]{Oven Controlled Xtal Oscillator}
\newacro{PC}[\AC@hyperlink{PC}{PC}]{Personal Computer}
\newacro{PPP}[\AC@hyperlink{PPP}{PPP}]{Precise Point Positioning}
\newacro{PLL}[\AC@hyperlink{PLL}{PLL}]{Phase Lock Loop}
\newacro{PND}[\AC@hyperlink{PND}{PND}]{Personal Navigation Device}
\newacro{PNT}[\AC@hyperlink{PNT}{PNT}]{Positioning and Navigation Technologies}
\newacro{PRN}[\AC@hyperlink{PRN}{PRN}]{Pseudo-Random Noise}
\newacro{PRS}[\AC@hyperlink{PRS}{PRS}]{Public Regulated Service}
\newacro{PSD}[\AC@hyperlink{PSD}{PSD}]{Power Spectral Density}
\newacro{PVT}[\AC@hyperlink{PVT}{PVT}]{Position, Velocity and Time}
\newacro{PDF}[\AC@hyperlink{PDF}{PDF}]{Probability Density Function}
\newacro{PR}[\AC@hyperlink{PR}{PR}]{Pseudorange Ranging}
\newacro{PF}[\AC@hyperlink{PF}{PF}]{Particle Filter}
\newacro{PCC}[\AC@hyperlink{PCC}{PCC}]{Pearson's Correlation Coefficients}
\newacro{PoC}[\AC@hyperlink{PoC}{PoC}]{Proof of Concept}
\newacro{RADAR}[\AC@hyperlink{RADAR}{RADAR}]{RAdio Detection And Ranging}
\newacro{RNSS}[\AC@hyperlink{RNSS}{RNSS}]{Radio Navigation Satellite Services}
\newacro{ROS}[\AC@hyperlink{ROS}{ROS}]{Robot Operating System}
\newacro{RIMS}[\AC@hyperlink{RIMS}{RIMS}]{Ranging and Integrity Monitoring Station}
\newacro{RR}[\AC@hyperlink{RR}{R\&R}]{Record and Replay}
\newacro{RF}[\AC@hyperlink{RF}{RF}]{Radio Frequency}
\newacro{RFE}[\AC@hyperlink{RFE}{RFE}]{Radio Front-End}
\newacro{RFCS}[\AC@hyperlink{RFCS}{RFCS}]{Radio-Frequency Constellation Simulators}
\newacro{RFI}[\AC@hyperlink{RFI}{RFI}]{Radio-Frequency Interference}
\newacro{RMS}[\AC@hyperlink{RMS}{RMS}]{Root Mean Square}
\newacro{RSS}[\AC@hyperlink{RSS}{RSS}]{Receives Signal Straight}
\newacro{RTT}[\AC@hyperlink{RTT}{RTT}]{Round-trip Time}
\newacro{RSSI}[\AC@hyperlink{RSSI}{RSSI}]{Receives Signal Straight Indicator}
\newacro{RTMeS}[\AC@hyperlink{RTMeS}{RTMeS}]{Reference Trajectory Measurement System}
\newacro{RFCS}[\AC@hyperlink{RFCS}{RFCS}]{Radio Frequency Constellation Simulators}
\newacro{RTK}[\AC@hyperlink{RTK}{RTK}]{Real Time Kinematic}
\newacro{RTC}[\AC@hyperlink{RTC}{RTC}]{Real Time Clock}
\newacro{RMD}[\AC@hyperlink{RMD}{RMD}]{Raw Measurements Database}
\newacro{SAIA}[\AC@hyperlink{SAIA}{SAIA}]{Self-Adaptive Iterative Algorithm}
\newacro{SBAS}[\AC@hyperlink{SBAS}{SBAS}]{Satellite-based Augementation System}
\newacro{SDR}[\AC@hyperlink{SDR}{SDR}]{Software Defined Radio}
\newacro{SD}[\AC@hyperlink{SD}{SD}]{Single Difference}
\newacro{SiS}[\AC@hyperlink{SiS}{SiS}]{Signal-in-Space}
\newacro{SIS}[\AC@hyperlink{SIS}{SIS}]{Sequential Importance Sampling}
\newacro{SSE}[\AC@hyperlink{SSE}{SSE}]{Sum of Squared Error}
\newacro{SIFT}[\AC@hyperlink{SIFT}{SIFT}]{Scale Invariant Feature Transform}
\newacro{SLAM}[\AC@hyperlink{SLAM}{SLAM}]{Simultaneous Localization And Mapping}
\newacro{SONAR}[\AC@hyperlink{SONAR}{SONAR}]{Sound Navigation and Ranging}
\newacro{SNR}[\AC@hyperlink{SNR}{SNR}]{Signal-to-Noise Ratio}
\newacro{SoL}[\AC@hyperlink{SoL}{SoL}]{Safety-of-Life}
\newacro{SAR}[\AC@hyperlink{SAR}{SAR}]{Search-and-Rescue}
\newacro{SV}[\AC@hyperlink{SV}{SV}]{Satellite Vehicle}
\newacro{SW}[\AC@hyperlink{SW}{SW}]{Software}
\newacro{SPP}[\AC@hyperlink{SPP}{SPP}]{Single Point Positioning}
\newacro{SIR}[\AC@hyperlink{SIR}{SIR}]{Sampling Importance Resampling}
\newacro{STD}[\AC@hyperlink{STD}{STD}]{Standard Deviation}
\newacro{STL}[\AC@hyperlink{STL}{STL}]{Satellite Time and Location}
\newacro{s-PF}[\AC@hyperlink{s-PF}{s-PF}]{suboptimal PF}
\newacro{TC}[\AC@hyperlink{TC}{TC}]{Tightly Coupled}
\newacro{TLM}[\AC@hyperlink{TLM}{TLM}]{Telemetry word}
\newacro{TDoA}[\AC@hyperlink{TDoA}{TDoA}]{Time Difference of Arrival}
\newacro{ToA}[\AC@hyperlink{ToA}{ToA}]{Time of Arrival}
\newacro{DoA}[\AC@hyperlink{DoA}{DoA}]{Direction of Arrival}
\newacro{ToF}[\AC@hyperlink{ToF}{ToF}]{Time of Flight}
\newacro{TOW}[\AC@hyperlink{TOW}{TOW}]{Time of Week}
\newacro{TTF}[\AC@hyperlink{TTF}{TTF}]{Time-to-First-Fix}
\newacro{UKF}[\AC@hyperlink{UKF}{UKF}]{Unscented Kalman Filter}
\newacro{UAV}[\AC@hyperlink{UAV}{UAV}]{Unmanned Aerial Vehicle}
\newacro{USB}[\AC@hyperlink{USB}{USB}]{Universal Serial Bus}
\newacro{USRP}[\AC@hyperlink{USRP}{USRP}]{Universal Software Radio Peripheral}
\newacro{UTC}[\AC@hyperlink{UTC}{U-TC}]{Ultra-Tightly Coupled}
\newacro{UWB}[\AC@hyperlink{UWB}{UWB}]{Ultra Wide Band}
\newacro{UERE}[\AC@hyperlink{UERE}{UERE}]{User-equivalent Range Error}
\newacro{UDP}[\AC@hyperlink{UDP}{UDP}]{User Datagram Protocol}
\newacro{UHF}[\AC@hyperlink{UHF}{UHF}]{Ultra High Frequency}
\newacro{VDLL}[\AC@hyperlink{VDLL}{VDLL}]{Vector Delay Lock Loop}
\newacro{VERT}[\AC@hyperlink{VERT}{VERT}]{Vehicle for Experimental Research on Trajectories}
\newacro{VFLL}[\AC@hyperlink{VFLL}{VFLL}]{Vector Frequency Lock Loop}
\newacro{VO}[\AC@hyperlink{VO}{VO}]{Visual Odometry}
\newacro{VLC}[\AC@hyperlink{VLC}{VLC}]{Visual Light Communication}
\newacro{VSG}[\AC@hyperlink{VSG}{VSG}]{Vector Signal Generator}
\newacro{VHF}[\AC@hyperlink{VHF}{VHF}]{Very High Frequency}
\newacro{WB}[\AC@hyperlink{WB}{WB}]{Wide-Band}
\newacro{WBI}[\AC@hyperlink{WBI}{WBI}]{Wide-Band Interference}
\newacro{WLAN}[\AC@hyperlink{WLAN}{WLAN}]{Wireless Local Area Network}
\newacro{WLS}[\AC@hyperlink{WLS}{WLS}]{Weighted Least Square}
\newacro{W-DDR}[\AC@hyperlink{W-DDR}{W-DDR}]{Weighted Double Difference Ranging}
\newacro{WSS}[\AC@hyperlink{WSS}{WSS}]{Wheel Speed Sensor}
\newacro{W-SAIA}[\AC@hyperlink{W-SAIA}{W-SAIA}]{Weighted SAIA}
\newacro{W-IAR}[\AC@hyperlink{W-IAR}{W-IAR}]{Weighted IAR}
\newacro{WGN}[\AC@hyperlink{WGN}{WGN}]{White Gaussian Noise}
\@writefile{toc}{\contentsline {chapter}{Bibliography}{199}{appendix*.158}\protected@file@percent }
\@writefile{lof}{\addvspace {10\p@ }}
\@writefile{lot}{\addvspace {10\p@ }}
\abx@aux@refcontextdefaultsdone
\abx@aux@defaultrefcontext{0}{broadcom}{nty/global//global/global}
\abx@aux@defaultrefcontext{0}{4570072}{nty/global//global/global}
\abx@aux@defaultrefcontext{0}{6020821}{nty/global//global/global}
\abx@aux@defaultrefcontext{0}{6236174}{nty/global//global/global}
\abx@aux@defaultrefcontext{0}{alam2011dsrc}{nty/global//global/global}
\abx@aux@defaultrefcontext{0}{alam2013cooperative}{nty/global//global/global}
\abx@aux@defaultrefcontext{0}{angrisano2010gnss}{nty/global//global/global}
\abx@aux@defaultrefcontext{0}{978374}{nty/global//global/global}
\abx@aux@defaultrefcontext{0}{avila2008mboc}{nty/global//global/global}
\abx@aux@defaultrefcontext{0}{banville2016precise}{nty/global//global/global}
\abx@aux@defaultrefcontext{0}{basnayake2011relative}{nty/global//global/global}
\abx@aux@defaultrefcontext{0}{bhattacharyya1946measure}{nty/global//global/global}
\abx@aux@defaultrefcontext{0}{bisnath2009current}{nty/global//global/global}
\abx@aux@defaultrefcontext{0}{bityukov2013method}{nty/global//global/global}
\abx@aux@defaultrefcontext{0}{borio2008statistical}{nty/global//global/global}
\abx@aux@defaultrefcontext{0}{bradford1996global}{nty/global//global/global}
\abx@aux@defaultrefcontext{0}{brown}{nty/global//global/global}
\abx@aux@defaultrefcontext{0}{6081348}{nty/global//global/global}
\abx@aux@defaultrefcontext{0}{caceres2010hybrid}{nty/global//global/global}
\abx@aux@defaultrefcontext{0}{GDOPandCRLB}{nty/global//global/global}
\abx@aux@defaultrefcontext{0}{8048545}{nty/global//global/global}
\abx@aux@defaultrefcontext{0}{cherif2018loosely}{nty/global//global/global}
\abx@aux@defaultrefcontext{0}{7368912}{nty/global//global/global}
\abx@aux@defaultrefcontext{0}{hanselD2}{nty/global//global/global}
\abx@aux@defaultrefcontext{0}{hanselD3}{nty/global//global/global}
\abx@aux@defaultrefcontext{0}{7993222}{nty/global//global/global}
\abx@aux@defaultrefcontext{0}{cristodaro2019advanced}{nty/global//global/global}
\abx@aux@defaultrefcontext{0}{7857839}{nty/global//global/global}
\abx@aux@defaultrefcontext{0}{7583720}{nty/global//global/global}
\abx@aux@defaultrefcontext{0}{DABOVE201994}{nty/global//global/global}
\abx@aux@defaultrefcontext{0}{dardari2012satellite}{nty/global//global/global}
\abx@aux@defaultrefcontext{0}{6311243}{nty/global//global/global}
\abx@aux@defaultrefcontext{0}{7949096}{nty/global//global/global}
\abx@aux@defaultrefcontext{0}{deponte2013zero}{nty/global//global/global}
\abx@aux@defaultrefcontext{0}{WGS84}{nty/global//global/global}
\abx@aux@defaultrefcontext{0}{Deng2015453}{nty/global//global/global}
\abx@aux@defaultrefcontext{0}{1618619}{nty/global//global/global}
\abx@aux@defaultrefcontext{0}{905890}{nty/global//global/global}
\abx@aux@defaultrefcontext{0}{inbook2011overview}{nty/global//global/global}
\abx@aux@defaultrefcontext{0}{detrendingPseudo}{nty/global//global/global}
\abx@aux@defaultrefcontext{0}{7102684}{nty/global//global/global}
\abx@aux@defaultrefcontext{0}{6934166}{nty/global//global/global}
\abx@aux@defaultrefcontext{0}{GalileoOutage}{nty/global//global/global}
\abx@aux@defaultrefcontext{0}{SVN49}{nty/global//global/global}
\abx@aux@defaultrefcontext{0}{errEllipse02}{nty/global//global/global}
\abx@aux@defaultrefcontext{0}{errEllipse01}{nty/global//global/global}
\abx@aux@defaultrefcontext{0}{EC_GalCSdecision_2017}{nty/global//global/global}
\abx@aux@defaultrefcontext{0}{EC_GalInitService_2016}{nty/global//global/global}
\abx@aux@defaultrefcontext{0}{EU_GalileoICD_2016}{nty/global//global/global}
\abx@aux@defaultrefcontext{0}{s17020255}{nty/global//global/global}
\abx@aux@defaultrefcontext{0}{falco2012performance}{nty/global//global/global}
\abx@aux@defaultrefcontext{0}{falcone2017galileo}{nty/global//global/global}
\abx@aux@defaultrefcontext{0}{8821521}{nty/global//global/global}
\abx@aux@defaultrefcontext{0}{fisher2006statistical}{nty/global//global/global}
\abx@aux@defaultrefcontext{0}{gabela2018cramer}{nty/global//global/global}
\abx@aux@defaultrefcontext{0}{galileo2008galileo}{nty/global//global/global}
\abx@aux@defaultrefcontext{0}{ganeshan2005indian}{nty/global//global/global}
\abx@aux@defaultrefcontext{0}{6781631}{nty/global//global/global}
\abx@aux@defaultrefcontext{0}{hanselD1}{nty/global//global/global}
\abx@aux@defaultrefcontext{0}{gauthier2001egnos}{nty/global//global/global}
\abx@aux@defaultrefcontext{0}{GPS_ICD_200_2016}{nty/global//global/global}
\abx@aux@defaultrefcontext{0}{GPS_ICD_800_2014}{nty/global//global/global}
\abx@aux@defaultrefcontext{0}{GPS_ICD_705_2014}{nty/global//global/global}
\abx@aux@defaultrefcontext{0}{global2008interface}{nty/global//global/global}
\abx@aux@defaultrefcontext{0}{Goel2019}{nty/global//global/global}
\abx@aux@defaultrefcontext{0}{gogoiVTC2019}{nty/global//global/global}
\abx@aux@defaultrefcontext{0}{Gogoi_2018}{nty/global//global/global}
\abx@aux@defaultrefcontext{0}{developerandroid}{nty/global//global/global}
\abx@aux@defaultrefcontext{0}{529326}{nty/global//global/global}
\abx@aux@defaultrefcontext{0}{gordon1993novel}{nty/global//global/global}
\abx@aux@defaultrefcontext{0}{gordon2004beyond}{nty/global//global/global}
\abx@aux@defaultrefcontext{0}{grewal2007global}{nty/global//global/global}
\abx@aux@defaultrefcontext{0}{7015602}{nty/global//global/global}
\abx@aux@defaultrefcontext{0}{gsa2018using}{nty/global//global/global}
\abx@aux@defaultrefcontext{0}{gsa2019market}{nty/global//global/global}
\abx@aux@defaultrefcontext{0}{5546308}{nty/global//global/global}
\abx@aux@defaultrefcontext{0}{978396}{nty/global//global/global}
\abx@aux@defaultrefcontext{0}{8307419}{nty/global//global/global}
\abx@aux@defaultrefcontext{0}{haykin2003least}{nty/global//global/global}
\abx@aux@defaultrefcontext{0}{Hein2000}{nty/global//global/global}
\abx@aux@defaultrefcontext{0}{hendeby2004fundamental}{nty/global//global/global}
\abx@aux@defaultrefcontext{0}{hoang2017coop}{nty/global//global/global}
\abx@aux@defaultrefcontext{0}{hofmann2012global}{nty/global//global/global}
\abx@aux@defaultrefcontext{0}{hossain2016cooperative}{nty/global//global/global}
\abx@aux@defaultrefcontext{0}{7314860}{nty/global//global/global}
\abx@aux@defaultrefcontext{0}{7112186}{nty/global//global/global}
\abx@aux@defaultrefcontext{0}{1709862}{nty/global//global/global}
\abx@aux@defaultrefcontext{0}{8678911}{nty/global//global/global}
\abx@aux@defaultrefcontext{0}{refFrame}{nty/global//global/global}
\abx@aux@defaultrefcontext{0}{refFrame2}{nty/global//global/global}
\abx@aux@defaultrefcontext{0}{jekeli2012inertial}{nty/global//global/global}
\abx@aux@defaultrefcontext{0}{kaplan2017understanding}{nty/global//global/global}
\abx@aux@defaultrefcontext{0}{kaplan2005understanding}{nty/global//global/global}
\abx@aux@defaultrefcontext{0}{6253108}{nty/global//global/global}
\abx@aux@defaultrefcontext{0}{kay1993fundamentals}{nty/global//global/global}
\abx@aux@defaultrefcontext{0}{8272318}{nty/global//global/global}
\abx@aux@defaultrefcontext{0}{gCoGnss}{nty/global//global/global}
\abx@aux@defaultrefcontext{0}{7434174}{nty/global//global/global}
\abx@aux@defaultrefcontext{0}{5940433}{nty/global//global/global}
\abx@aux@defaultrefcontext{0}{8374808}{nty/global//global/global}
\abx@aux@defaultrefcontext{0}{kishimoto2001qzss}{nty/global//global/global}
\abx@aux@defaultrefcontext{0}{4412548}{nty/global//global/global}
\abx@aux@defaultrefcontext{0}{langley1991mathematics}{nty/global//global/global}
\abx@aux@defaultrefcontext{0}{1268022}{nty/global//global/global}
\abx@aux@defaultrefcontext{0}{Lassoued2015}{nty/global//global/global}
\abx@aux@defaultrefcontext{0}{lassoued2019cooperative}{nty/global//global/global}
\abx@aux@defaultrefcontext{0}{laurichesse2017smartphone}{nty/global//global/global}
\abx@aux@defaultrefcontext{0}{lehner2005novel}{nty/global//global/global}
\abx@aux@defaultrefcontext{0}{li2015resampling}{nty/global//global/global}
\abx@aux@defaultrefcontext{0}{7515010}{nty/global//global/global}
\abx@aux@defaultrefcontext{0}{RD_04}{nty/global//global/global}
\abx@aux@defaultrefcontext{0}{linty2018effects}{nty/global//global/global}
\abx@aux@defaultrefcontext{0}{liu2014improving}{nty/global//global/global}
\abx@aux@defaultrefcontext{0}{5606125}{nty/global//global/global}
\abx@aux@defaultrefcontext{0}{loh1995us}{nty/global//global/global}
\abx@aux@defaultrefcontext{0}{RD_09}{nty/global//global/global}
\abx@aux@defaultrefcontext{0}{lucas2016demonstration}{nty/global//global/global}
\abx@aux@defaultrefcontext{0}{5708021}{nty/global//global/global}
\abx@aux@defaultrefcontext{0}{1490}{nty/global//global/global}
\abx@aux@defaultrefcontext{0}{1544987}{nty/global//global/global}
\abx@aux@defaultrefcontext{0}{martin2008gps}{nty/global//global/global}
\abx@aux@defaultrefcontext{0}{5871406}{nty/global//global/global}
\abx@aux@defaultrefcontext{0}{minettoCRLB}{nty/global//global/global}
\abx@aux@defaultrefcontext{0}{MinettoIAReusipco}{nty/global//global/global}
\abx@aux@defaultrefcontext{0}{minetto2018PLANS}{nty/global//global/global}
\abx@aux@defaultrefcontext{0}{8926529}{nty/global//global/global}
\abx@aux@defaultrefcontext{0}{8891571}{nty/global//global/global}
\abx@aux@defaultrefcontext{0}{minetto2018tight}{nty/global//global/global}
\abx@aux@defaultrefcontext{0}{minetto2017IAR}{nty/global//global/global}
\abx@aux@defaultrefcontext{0}{Minetto:2019:GCP:3331054.3331552}{nty/global//global/global}
\abx@aux@defaultrefcontext{0}{misra2006global}{nty/global//global/global}
\abx@aux@defaultrefcontext{0}{mongo}{nty/global//global/global}
\abx@aux@defaultrefcontext{0}{1668252}{nty/global//global/global}
\abx@aux@defaultrefcontext{0}{4285854}{nty/global//global/global}
\abx@aux@defaultrefcontext{0}{navstar1993icd}{nty/global//global/global}
\abx@aux@defaultrefcontext{0}{8064679}{nty/global//global/global}
\abx@aux@defaultrefcontext{0}{noureldin2012fundamentals}{nty/global//global/global}
\abx@aux@defaultrefcontext{0}{oh2011formation}{nty/global//global/global}
\abx@aux@defaultrefcontext{0}{ong2011use}{nty/global//global/global}
\abx@aux@defaultrefcontext{0}{penna2010CRLB}{nty/global//global/global}
\abx@aux@defaultrefcontext{0}{pini2012estimation}{nty/global//global/global}
\abx@aux@defaultrefcontext{0}{DePonteMuller2014}{nty/global//global/global}
\abx@aux@defaultrefcontext{0}{de2017survey}{nty/global//global/global}
\abx@aux@defaultrefcontext{0}{de2013zero}{nty/global//global/global}
\abx@aux@defaultrefcontext{0}{prasad2005applied}{nty/global//global/global}
\abx@aux@defaultrefcontext{0}{presti2011novel}{nty/global//global/global}
\abx@aux@defaultrefcontext{0}{lopresti2014software}{nty/global//global/global}
\abx@aux@defaultrefcontext{0}{presti2014software}{nty/global//global/global}
\abx@aux@defaultrefcontext{0}{PPPfrance}{nty/global//global/global}
\abx@aux@defaultrefcontext{0}{rao2007gagan}{nty/global//global/global}
\abx@aux@defaultrefcontext{0}{5594103}{nty/global//global/global}
\abx@aux@defaultrefcontext{0}{realini2017precise}{nty/global//global/global}
\abx@aux@defaultrefcontext{0}{948650}{nty/global//global/global}
\abx@aux@defaultrefcontext{0}{754809}{nty/global//global/global}
\abx@aux@defaultrefcontext{0}{remondi1985using}{nty/global//global/global}
\abx@aux@defaultrefcontext{0}{4343975}{nty/global//global/global}
\abx@aux@defaultrefcontext{0}{Robustelli_2019}{nty/global//global/global}
\abx@aux@defaultrefcontext{0}{rodriguez2018robust}{nty/global//global/global}
\abx@aux@defaultrefcontext{0}{7297658}{nty/global//global/global}
\abx@aux@defaultrefcontext{0}{rohani2015novel}{nty/global//global/global}
\abx@aux@defaultrefcontext{0}{roper2010gps}{nty/global//global/global}
\abx@aux@defaultrefcontext{0}{ROSurl}{nty/global//global/global}
\abx@aux@defaultrefcontext{0}{1067998}{nty/global//global/global}
\abx@aux@defaultrefcontext{0}{saikiran2013irnss}{nty/global//global/global}
\abx@aux@defaultrefcontext{0}{salih2013suitability}{nty/global//global/global}
\abx@aux@defaultrefcontext{0}{8752742}{nty/global//global/global}
\abx@aux@defaultrefcontext{0}{8255823}{nty/global//global/global}
\abx@aux@defaultrefcontext{0}{5937274}{nty/global//global/global}
\abx@aux@defaultrefcontext{0}{sheijani2013implementation}{nty/global//global/global}
\abx@aux@defaultrefcontext{0}{shen2017dsrc}{nty/global//global/global}
\abx@aux@defaultrefcontext{0}{shen2010limitsPart1}{nty/global//global/global}
\abx@aux@defaultrefcontext{0}{shen2010limitsPart2}{nty/global//global/global}
\abx@aux@defaultrefcontext{0}{8460352}{nty/global//global/global}
\abx@aux@defaultrefcontext{0}{differentialGEOSPATIAL}{nty/global//global/global}
\abx@aux@defaultrefcontext{0}{4770175}{nty/global//global/global}
\abx@aux@defaultrefcontext{0}{smith2013sequential}{nty/global//global/global}
\abx@aux@defaultrefcontext{0}{sobel2005longitude}{nty/global//global/global}
\abx@aux@defaultrefcontext{0}{soler1985transformation}{nty/global//global/global}
\abx@aux@defaultrefcontext{0}{caceres2010hybrid2}{nty/global//global/global}
\abx@aux@defaultrefcontext{0}{stark1986probability}{nty/global//global/global}
\abx@aux@defaultrefcontext{0}{8688455}{nty/global//global/global}
\abx@aux@defaultrefcontext{0}{8421016}{nty/global//global/global}
\abx@aux@defaultrefcontext{0}{sun2013particle}{nty/global//global/global}
\abx@aux@defaultrefcontext{0}{tahir2018accuracy}{nty/global//global/global}
\abx@aux@defaultrefcontext{0}{1689615}{nty/global//global/global}
\abx@aux@defaultrefcontext{0}{4046308}{nty/global//global/global}
\abx@aux@defaultrefcontext{0}{Teunissen1999}{nty/global//global/global}
\abx@aux@defaultrefcontext{0}{5290369}{nty/global//global/global}
\abx@aux@defaultrefcontext{0}{trimbleR10}{nty/global//global/global}
\abx@aux@defaultrefcontext{0}{trimbleR2}{nty/global//global/global}
\abx@aux@defaultrefcontext{0}{707266}{nty/global//global/global}
\abx@aux@defaultrefcontext{0}{uluskan2018circular}{nty/global//global/global}
\abx@aux@defaultrefcontext{0}{van2009gps}{nty/global//global/global}
\abx@aux@defaultrefcontext{0}{van1998innovation}{nty/global//global/global}
\abx@aux@defaultrefcontext{0}{Venkatraman1337329}{nty/global//global/global}
\abx@aux@defaultrefcontext{0}{Wang2002}{nty/global//global/global}
\abx@aux@defaultrefcontext{0}{wang1998}{nty/global//global/global}
\abx@aux@defaultrefcontext{0}{wang2016bias}{nty/global//global/global}
\abx@aux@defaultrefcontext{0}{wee2018vehicular}{nty/global//global/global}
\abx@aux@defaultrefcontext{0}{7530562}{nty/global//global/global}
\abx@aux@defaultrefcontext{0}{won2006gnss}{nty/global//global/global}
\abx@aux@defaultrefcontext{0}{xiong2014hybrid}{nty/global//global/global}
\abx@aux@defaultrefcontext{0}{6240332}{nty/global//global/global}
\abx@aux@defaultrefcontext{0}{8287016}{nty/global//global/global}
\abx@aux@defaultrefcontext{0}{Yoon_2016}{nty/global//global/global}
\abx@aux@defaultrefcontext{0}{zekavat2011handbook}{nty/global//global/global}
\abx@aux@defaultrefcontext{0}{Zhang2018}{nty/global//global/global}
\abx@aux@defaultrefcontext{0}{5466205}{nty/global//global/global}
\abx@aux@defaultrefcontext{0}{Zhu_2019}{nty/global//global/global}
\abx@aux@defaultrefcontext{0}{7471482}{nty/global//global/global}
\abx@aux@defaultrefcontext{0}{8248655}{nty/global//global/global}
\abx@aux@defaultrefcontext{0}{7247673}{nty/global//global/global}
