[0] Config.pm:304> INFO - This is Biber 2.12
[1] Config.pm:307> INFO - Logfile is 'Thesis_summary.blg'
[48] biber-MSWIN64:315> INFO - === 
[560] Utils.pm:209> ERROR - Cannot find control file 'Thesis_summary.bcf'! - Did latex run successfully on your .tex file before you ran biber?
[560] Biber.pm:114> INFO - ERRORS: 1
