%!PS-Adobe-3.0 EPSF-3.0
%%Creator: (MATLAB, The Mathworks, Inc. Version 9.5.0.944444 \(R2018b\). Operating System: Windows 10)
%%Title: (C:/Users/navsas/Dropbox/Collaborative ranging CRLB/fig/lemniscateTraj_peer_noAxes.eps)
%%CreationDate: 2018-11-28T11:02:34
%%Pages: (atend)
%%BoundingBox: 0 0 679 287
%%LanguageLevel: 3
%%EndComments
%%BeginProlog
%%BeginResource: procset (Apache XML Graphics Std ProcSet) 1.2 0
%%Version: 1.2 0
%%Copyright: (Copyright 2001-2003,2010 The Apache Software Foundation. License terms: http://www.apache.org/licenses/LICENSE-2.0)
/bd{bind def}bind def
/ld{load def}bd
/GR/grestore ld
/GS/gsave ld
/RM/rmoveto ld
/C/curveto ld
/t/show ld
/L/lineto ld
/ML/setmiterlimit ld
/CT/concat ld
/f/fill ld
/N/newpath ld
/S/stroke ld
/CC/setcmykcolor ld
/A/ashow ld
/cp/closepath ld
/RC/setrgbcolor ld
/LJ/setlinejoin ld
/GC/setgray ld
/LW/setlinewidth ld
/M/moveto ld
/re {4 2 roll M
1 index 0 rlineto
0 exch rlineto
neg 0 rlineto
cp } bd
/_ctm matrix def
/_tm matrix def
/BT { _ctm currentmatrix pop matrix _tm copy pop 0 0 moveto } bd
/ET { _ctm setmatrix } bd
/iTm { _ctm setmatrix _tm concat } bd
/Tm { _tm astore pop iTm 0 0 moveto } bd
/ux 0.0 def
/uy 0.0 def
/F {
  /Tp exch def
  /Tf exch def
  Tf findfont Tp scalefont setfont
  /cf Tf def  /cs Tp def
} bd
/ULS {currentpoint /uy exch def /ux exch def} bd
/ULE {
  /Tcx currentpoint pop def
  gsave
  newpath
  cf findfont cs scalefont dup
  /FontMatrix get 0 get /Ts exch def /FontInfo get dup
  /UnderlinePosition get Ts mul /To exch def
  /UnderlineThickness get Ts mul /Tt exch def
  ux uy To add moveto  Tcx uy To add lineto
  Tt setlinewidth stroke
  grestore
} bd
/OLE {
  /Tcx currentpoint pop def
  gsave
  newpath
  cf findfont cs scalefont dup
  /FontMatrix get 0 get /Ts exch def /FontInfo get dup
  /UnderlinePosition get Ts mul /To exch def
  /UnderlineThickness get Ts mul /Tt exch def
  ux uy To add cs add moveto Tcx uy To add cs add lineto
  Tt setlinewidth stroke
  grestore
} bd
/SOE {
  /Tcx currentpoint pop def
  gsave
  newpath
  cf findfont cs scalefont dup
  /FontMatrix get 0 get /Ts exch def /FontInfo get dup
  /UnderlinePosition get Ts mul /To exch def
  /UnderlineThickness get Ts mul /Tt exch def
  ux uy To add cs 10 mul 26 idiv add moveto Tcx uy To add cs 10 mul 26 idiv add lineto
  Tt setlinewidth stroke
  grestore
} bd
/QT {
/Y22 exch store
/X22 exch store
/Y21 exch store
/X21 exch store
currentpoint
/Y21 load 2 mul add 3 div exch
/X21 load 2 mul add 3 div exch
/X21 load 2 mul /X22 load add 3 div
/Y21 load 2 mul /Y22 load add 3 div
/X22 load /Y22 load curveto
} bd
/SSPD {
dup length /d exch dict def
{
/v exch def
/k exch def
currentpagedevice k known {
/cpdv currentpagedevice k get def
v cpdv ne {
/upd false def
/nullv v type /nulltype eq def
/nullcpdv cpdv type /nulltype eq def
nullv nullcpdv or
{
/upd true def
} {
/sametype v type cpdv type eq def
sametype {
v type /arraytype eq {
/vlen v length def
/cpdvlen cpdv length def
vlen cpdvlen eq {
0 1 vlen 1 sub {
/i exch def
/obj v i get def
/cpdobj cpdv i get def
obj cpdobj ne {
/upd true def
exit
} if
} for
} {
/upd true def
} ifelse
} {
v type /dicttype eq {
v {
/dv exch def
/dk exch def
/cpddv cpdv dk get def
dv cpddv ne {
/upd true def
exit
} if
} forall
} {
/upd true def
} ifelse
} ifelse
} if
} ifelse
upd true eq {
d k v put
} if
} if
} if
} forall
d length 0 gt {
d setpagedevice
} if
} bd
/RE { % /NewFontName [NewEncodingArray] /FontName RE -
  findfont dup length dict begin
  {
    1 index /FID ne
    {def} {pop pop} ifelse
  } forall
  /Encoding exch def
  /FontName 1 index def
  currentdict definefont pop
  end
} bind def
%%EndResource
%%BeginResource: procset (Apache XML Graphics EPS ProcSet) 1.0 0
%%Version: 1.0 0
%%Copyright: (Copyright 2002-2003 The Apache Software Foundation. License terms: http://www.apache.org/licenses/LICENSE-2.0)
/BeginEPSF { %def
/b4_Inc_state save def         % Save state for cleanup
/dict_count countdictstack def % Count objects on dict stack
/op_count count 1 sub def      % Count objects on operand stack
userdict begin                 % Push userdict on dict stack
/showpage { } def              % Redefine showpage, { } = null proc
0 setgray 0 setlinecap         % Prepare graphics state
1 setlinewidth 0 setlinejoin
10 setmiterlimit [ ] 0 setdash newpath
/languagelevel where           % If level not equal to 1 then
{pop languagelevel             % set strokeadjust and
1 ne                           % overprint to their defaults.
{false setstrokeadjust false setoverprint
} if
} if
} bd
/EndEPSF { %def
count op_count sub {pop} repeat            % Clean up stacks
countdictstack dict_count sub {end} repeat
b4_Inc_state restore
} bd
%%EndResource
%FOPBeginFontDict
%%IncludeResource: font Courier-Oblique
%%IncludeResource: font Courier-BoldOblique
%%IncludeResource: font Courier-Bold
%%IncludeResource: font ZapfDingbats
%%IncludeResource: font Symbol
%%IncludeResource: font Helvetica
%%IncludeResource: font Helvetica-Oblique
%%IncludeResource: font Helvetica-Bold
%%IncludeResource: font Helvetica-BoldOblique
%%IncludeResource: font Times-Roman
%%IncludeResource: font Times-Italic
%%IncludeResource: font Times-Bold
%%IncludeResource: font Times-BoldItalic
%%IncludeResource: font Courier
%FOPEndFontDict
%%BeginResource: encoding WinAnsiEncoding
/WinAnsiEncoding [
/.notdef /.notdef /.notdef /.notdef /.notdef
/.notdef /.notdef /.notdef /.notdef /.notdef
/.notdef /.notdef /.notdef /.notdef /.notdef
/.notdef /.notdef /.notdef /.notdef /.notdef
/.notdef /.notdef /.notdef /.notdef /.notdef
/.notdef /.notdef /.notdef /.notdef /.notdef
/.notdef /.notdef /space /exclam /quotedbl
/numbersign /dollar /percent /ampersand /quotesingle
/parenleft /parenright /asterisk /plus /comma
/hyphen /period /slash /zero /one
/two /three /four /five /six
/seven /eight /nine /colon /semicolon
/less /equal /greater /question /at
/A /B /C /D /E
/F /G /H /I /J
/K /L /M /N /O
/P /Q /R /S /T
/U /V /W /X /Y
/Z /bracketleft /backslash /bracketright /asciicircum
/underscore /quoteleft /a /b /c
/d /e /f /g /h
/i /j /k /l /m
/n /o /p /q /r
/s /t /u /v /w
/x /y /z /braceleft /bar
/braceright /asciitilde /bullet /Euro /bullet
/quotesinglbase /florin /quotedblbase /ellipsis /dagger
/daggerdbl /circumflex /perthousand /Scaron /guilsinglleft
/OE /bullet /Zcaron /bullet /bullet
/quoteleft /quoteright /quotedblleft /quotedblright /bullet
/endash /emdash /asciitilde /trademark /scaron
/guilsinglright /oe /bullet /zcaron /Ydieresis
/space /exclamdown /cent /sterling /currency
/yen /brokenbar /section /dieresis /copyright
/ordfeminine /guillemotleft /logicalnot /sfthyphen /registered
/macron /degree /plusminus /twosuperior /threesuperior
/acute /mu /paragraph /middot /cedilla
/onesuperior /ordmasculine /guillemotright /onequarter /onehalf
/threequarters /questiondown /Agrave /Aacute /Acircumflex
/Atilde /Adieresis /Aring /AE /Ccedilla
/Egrave /Eacute /Ecircumflex /Edieresis /Igrave
/Iacute /Icircumflex /Idieresis /Eth /Ntilde
/Ograve /Oacute /Ocircumflex /Otilde /Odieresis
/multiply /Oslash /Ugrave /Uacute /Ucircumflex
/Udieresis /Yacute /Thorn /germandbls /agrave
/aacute /acircumflex /atilde /adieresis /aring
/ae /ccedilla /egrave /eacute /ecircumflex
/edieresis /igrave /iacute /icircumflex /idieresis
/eth /ntilde /ograve /oacute /ocircumflex
/otilde /odieresis /divide /oslash /ugrave
/uacute /ucircumflex /udieresis /yacute /thorn
/ydieresis
] def
%%EndResource
%FOPBeginFontReencode
/Courier-Oblique findfont
dup length dict begin
  {1 index /FID ne {def} {pop pop} ifelse} forall
  /Encoding WinAnsiEncoding def
  currentdict
end
/Courier-Oblique exch definefont pop
/Courier-BoldOblique findfont
dup length dict begin
  {1 index /FID ne {def} {pop pop} ifelse} forall
  /Encoding WinAnsiEncoding def
  currentdict
end
/Courier-BoldOblique exch definefont pop
/Courier-Bold findfont
dup length dict begin
  {1 index /FID ne {def} {pop pop} ifelse} forall
  /Encoding WinAnsiEncoding def
  currentdict
end
/Courier-Bold exch definefont pop
/Helvetica findfont
dup length dict begin
  {1 index /FID ne {def} {pop pop} ifelse} forall
  /Encoding WinAnsiEncoding def
  currentdict
end
/Helvetica exch definefont pop
/Helvetica-Oblique findfont
dup length dict begin
  {1 index /FID ne {def} {pop pop} ifelse} forall
  /Encoding WinAnsiEncoding def
  currentdict
end
/Helvetica-Oblique exch definefont pop
/Helvetica-Bold findfont
dup length dict begin
  {1 index /FID ne {def} {pop pop} ifelse} forall
  /Encoding WinAnsiEncoding def
  currentdict
end
/Helvetica-Bold exch definefont pop
/Helvetica-BoldOblique findfont
dup length dict begin
  {1 index /FID ne {def} {pop pop} ifelse} forall
  /Encoding WinAnsiEncoding def
  currentdict
end
/Helvetica-BoldOblique exch definefont pop
/Times-Roman findfont
dup length dict begin
  {1 index /FID ne {def} {pop pop} ifelse} forall
  /Encoding WinAnsiEncoding def
  currentdict
end
/Times-Roman exch definefont pop
/Times-Italic findfont
dup length dict begin
  {1 index /FID ne {def} {pop pop} ifelse} forall
  /Encoding WinAnsiEncoding def
  currentdict
end
/Times-Italic exch definefont pop
/Times-Bold findfont
dup length dict begin
  {1 index /FID ne {def} {pop pop} ifelse} forall
  /Encoding WinAnsiEncoding def
  currentdict
end
/Times-Bold exch definefont pop
/Times-BoldItalic findfont
dup length dict begin
  {1 index /FID ne {def} {pop pop} ifelse} forall
  /Encoding WinAnsiEncoding def
  currentdict
end
/Times-BoldItalic exch definefont pop
/Courier findfont
dup length dict begin
  {1 index /FID ne {def} {pop pop} ifelse} forall
  /Encoding WinAnsiEncoding def
  currentdict
end
/Courier exch definefont pop
%FOPEndFontReencode
%%EndProlog
%%Page: 1 1
%%PageBoundingBox: 0 0 679 287
%%BeginPageSetup
[1 0 0 -1 0 287] CT
%%EndPageSetup
GS
[0.75 0 0 0.75 0 -0.25] CT
N
0 0 M
905 0 L
905 383 L
0 383 L
0 0 L
cp
clip
1 GC
N
0 0 905 383 re
f
GR
GS
[0.75 0 0 0.75 0 -0.25] CT
1 GC
N
0 0 905 383 re
f
GR
GS
[0.75 0 0 0.75 0 -0.25] CT
1 LJ
4 LW
N
794.259 185 M
794.142 179.006 L
793.792 173.026 L
793.209 167.074 L
792.396 161.164 L
791.356 155.31 L
790.091 149.524 L
788.608 143.82 L
786.91 138.211 L
785.003 132.708 L
782.893 127.322 L
780.588 122.064 L
778.095 116.945 L
775.421 111.972 L
772.575 107.156 L
769.566 102.504 L
766.401 98.022 L
763.09 93.717 L
759.642 89.593 L
756.067 85.657 L
752.373 81.91 L
748.57 78.357 L
744.667 75 L
740.672 71.84 L
736.596 68.878 L
732.446 66.114 L
728.231 63.548 L
723.959 61.179 L
719.638 59.006 L
715.276 57.026 L
710.88 55.238 L
706.458 53.638 L
702.015 52.223 L
697.558 50.991 L
693.093 49.936 L
688.625 49.056 L
684.161 48.345 L
679.704 47.801 L
675.259 47.417 L
670.831 47.19 L
666.423 47.114 L
662.039 47.186 L
657.682 47.399 L
653.355 47.75 L
649.061 48.234 L
644.802 48.845 L
640.58 49.579 L
636.397 50.432 L
632.254 51.398 L
628.154 52.473 L
624.097 53.653 L
620.084 54.933 L
616.116 56.31 L
612.194 57.777 L
608.318 59.333 L
604.488 60.973 L
600.704 62.692 L
596.968 64.488 L
593.277 66.357 L
589.633 68.294 L
586.035 70.298 L
582.482 72.365 L
578.975 74.491 L
575.512 76.674 L
572.092 78.91 L
568.716 81.198 L
565.382 83.534 L
562.09 85.916 L
558.838 88.341 L
555.626 90.808 L
552.453 93.313 L
549.318 95.855 L
546.219 98.432 L
543.156 101.042 L
540.128 103.683 L
537.133 106.353 L
534.17 109.05 L
531.239 111.773 L
528.338 114.521 L
525.466 117.291 L
522.621 120.083 L
519.803 122.894 L
517.011 125.725 L
514.243 128.573 L
511.498 131.437 L
508.775 134.317 L
506.072 137.211 L
503.389 140.117 L
500.724 143.036 L
498.076 145.966 L
495.444 148.906 L
492.826 151.855 L
490.222 154.813 L
487.63 157.778 L
485.049 160.749 L
482.478 163.727 L
479.916 166.71 L
477.361 169.697 L
474.812 172.688 L
472.268 175.681 L
469.727 178.677 L
467.19 181.674 L
464.654 184.672 L
462.117 187.67 L
459.58 190.668 L
457.041 193.664 L
454.498 196.657 L
451.951 199.648 L
449.398 202.636 L
446.838 205.619 L
444.269 208.597 L
441.691 211.569 L
439.103 214.534 L
436.503 217.493 L
433.89 220.442 L
431.262 223.383 L
428.619 226.314 L
425.96 229.233 L
423.282 232.141 L
420.586 235.036 L
417.869 237.917 L
415.131 240.782 L
412.37 243.632 L
409.586 246.464 L
406.776 249.278 L
403.94 252.072 L
401.077 254.845 L
398.186 257.595 L
395.264 260.322 L
392.312 263.023 L
389.328 265.696 L
386.311 268.341 L
383.259 270.955 L
380.173 273.537 L
377.05 276.085 L
373.889 278.596 L
370.691 281.069 L
367.453 283.502 L
364.175 285.891 L
360.856 288.235 L
357.495 290.532 L
354.091 292.778 L
350.643 294.972 L
347.152 297.109 L
343.616 299.188 L
340.035 301.204 L
336.408 303.156 L
332.735 305.04 L
329.016 306.852 L
325.251 308.589 L
321.44 310.247 L
317.582 311.822 L
313.678 313.311 L
309.729 314.71 L
305.735 316.014 L
301.697 317.219 L
297.615 318.321 L
293.491 319.315 L
289.327 320.198 L
285.123 320.964 L
280.881 321.609 L
276.605 322.127 L
272.294 322.515 L
267.953 322.768 L
263.585 322.88 L
259.191 322.847 L
254.777 322.665 L
250.344 322.328 L
245.898 321.831 L
241.444 321.171 L
236.984 320.343 L
232.526 319.342 L
228.074 318.165 L
223.634 316.808 L
219.212 315.267 L
214.815 313.54 L
210.449 311.622 L
206.122 309.512 L
201.841 307.208 L
197.614 304.707 L
193.449 302.009 L
189.355 299.114 L
185.34 296.021 L
181.412 292.73 L
177.582 289.244 L
173.857 285.564 L
170.247 281.693 L
166.762 277.635 L
163.409 273.393 L
160.2 268.973 L
157.142 264.38 L
154.244 259.621 L
151.516 254.704 L
148.965 249.637 L
146.599 244.428 L
144.426 239.087 L
142.452 233.625 L
140.685 228.053 L
139.131 222.382 L
137.794 216.625 L
136.679 210.794 L
135.79 204.903 L
135.13 198.965 L
134.702 192.993 L
134.507 187.003 L
134.546 181.008 L
134.819 175.021 L
135.324 169.059 L
136.06 163.133 L
137.025 157.258 L
138.215 151.448 L
139.625 145.716 L
141.253 140.073 L
143.09 134.533 L
145.133 129.107 L
147.373 123.805 L
149.804 118.639 L
152.419 113.616 L
155.208 108.747 L
158.164 104.039 L
161.278 99.5 L
164.541 95.135 L
167.944 90.95 L
171.478 86.951 L
175.133 83.14 L
178.901 79.523 L
182.772 76.1 L
186.737 72.873 L
190.787 69.845 L
194.913 67.015 L
199.108 64.383 L
203.361 61.949 L
207.667 59.71 L
212.016 57.666 L
216.401 55.814 L
220.815 54.151 L
225.252 52.675 L
229.705 51.382 L
234.168 50.269 L
238.635 49.331 L
243.102 48.564 L
247.562 47.964 L
252.011 47.527 L
256.445 47.248 L
260.86 47.123 L
265.253 47.146 L
269.619 47.312 L
273.956 47.618 L
278.262 48.058 L
282.533 48.627 L
286.767 49.321 L
290.963 50.134 L
295.12 51.063 L
299.234 52.102 L
303.306 53.248 L
307.333 54.495 L
311.316 55.839 L
315.254 57.277 L
319.146 58.804 L
322.991 60.416 L
326.79 62.109 L
330.542 63.88 L
334.248 65.725 L
337.908 67.64 L
341.521 69.622 L
345.089 71.668 L
348.611 73.774 L
352.089 75.938 L
355.523 78.157 L
358.914 80.428 L
362.262 82.748 L
365.568 85.115 L
368.833 87.526 L
372.058 89.979 L
375.244 92.472 L
378.392 95.002 L
381.503 97.568 L
384.578 100.167 L
387.618 102.797 L
390.624 105.458 L
393.597 108.146 L
396.538 110.861 L
399.449 113.6 L
402.331 116.363 L
405.185 119.148 L
408.011 121.953 L
410.812 124.777 L
413.588 127.62 L
416.341 130.479 L
419.071 133.353 L
421.78 136.243 L
424.47 139.145 L
427.141 142.06 L
429.794 144.986 L
432.432 147.923 L
435.054 150.869 L
437.662 153.824 L
440.258 156.786 L
442.842 159.756 L
445.417 162.732 L
447.982 165.713 L
450.54 168.699 L
453.09 171.688 L
455.636 174.681 L
458.177 177.676 L
460.716 180.673 L
463.252 183.671 L
465.788 186.669 L
468.325 189.667 L
470.863 192.663 L
473.405 195.658 L
475.95 198.65 L
478.501 201.638 L
481.059 204.623 L
483.625 207.603 L
486.199 210.577 L
488.784 213.545 L
491.38 216.505 L
493.989 219.458 L
496.612 222.402 L
499.249 225.336 L
501.903 228.259 L
504.574 231.171 L
507.264 234.07 L
509.974 236.956 L
512.705 239.827 L
515.458 242.682 L
518.234 245.52 L
521.035 248.34 L
523.862 251.141 L
526.716 253.921 L
529.598 256.679 L
532.509 259.414 L
535.451 262.123 L
538.424 264.806 L
541.431 267.461 L
544.47 270.086 L
547.545 272.679 L
550.656 275.238 L
553.804 277.762 L
556.989 280.248 L
560.214 282.694 L
563.479 285.098 L
566.784 287.458 L
570.131 289.77 L
573.52 292.034 L
576.953 294.245 L
580.43 296.401 L
583.951 298.5 L
587.517 300.538 L
591.128 302.512 L
594.786 304.419 L
598.489 306.255 L
602.239 308.017 L
606.035 309.702 L
609.877 311.305 L
613.766 312.824 L
617.7 314.253 L
621.679 315.589 L
625.702 316.827 L
629.77 317.964 L
633.879 318.995 L
638.03 319.916 L
642.221 320.721 L
646.451 321.407 L
650.716 321.968 L
655.015 322.401 L
659.346 322.699 L
663.706 322.859 L
668.091 322.875 L
672.5 322.743 L
676.926 322.458 L
681.368 322.015 L
685.82 321.41 L
690.279 320.638 L
694.738 319.696 L
699.193 318.578 L
703.638 317.282 L
708.066 315.803 L
712.473 314.138 L
716.85 312.284 L
721.19 310.238 L
725.488 307.999 L
729.733 305.564 L
733.92 302.932 L
738.039 300.103 L
742.081 297.076 L
746.039 293.851 L
749.903 290.43 L
753.664 286.815 L
757.313 283.007 L
760.841 279.011 L
764.239 274.83 L
767.497 270.469 L
770.607 265.933 L
773.559 261.229 L
776.345 256.364 L
778.956 251.346 L
781.385 246.183 L
783.623 240.885 L
785.664 235.462 L
787.501 229.926 L
789.127 224.286 L
790.537 218.557 L
791.727 212.749 L
792.692 206.877 L
793.428 200.952 L
793.934 194.991 L
794.207 189.005 L
S
GR
GS
[0.75 0 0 0.75 224.57648 138.5] CT
1 0 0 RC
N
10 0 M
10 -5.523 5.523 -10 0 -10 C
-5.523 -10 -10 -5.523 -10 0 C
-10 5.523 -5.523 10 0 10 C
5.523 10 10 5.523 10 0 C
cp
f
GR
GS
[0.75 0 0 0.75 224.57648 138.5] CT
1 0 0 RC
10.0 ML
2.667 LW
N
10 0 M
10 -5.523 5.523 -10 0 -10 C
-5.523 -10 -10 -5.523 -10 0 C
-10 5.523 -5.523 10 0 10 C
5.523 10 10 5.523 10 0 C
cp
S
GR
GS
[0.75 0 0 0.75 0 -0.25] CT
1 0 0 RC
1 LJ
0.667 LW
N
794.634 181.685 M
794.634 178.039 L
S
GR
GS
[0.75 0 0 0.75 0 -0.25] CT
1 0 0 RC
1 LJ
0.667 LW
N
782.134 189.706 M
794.634 156.373 L
794.634 178.039 L
782.134 189.706 L
S
GR
GS
[0.75 0 0 0.75 0 -0.25] CT
1 0 0 RC
1 LJ
0.667 LW
N
794.634 156.373 M
807.134 189.706 L
794.634 178.039 L
794.634 156.373 L
S
GR
GS
[0.75 0 0 0.75 0 -0.25] CT
1 0 0 RC
N
794.634 156.373 M
782.134 189.706 L
794.634 178.039 L
807.134 189.706 L
cp
f
GR
GS
[0.75 0 0 0.75 0 -0.25] CT
1 0 0 RC
1 LJ
0.667 LW
N
212.151 56.932 M
212.196 56.917 L
S
GR
GS
[0.75 0 0 0.75 0 -0.25] CT
1 0 0 RC
1 LJ
0.667 LW
N
197.162 48.773 M
232.74 50.032 L
212.196 56.917 L
197.162 48.773 L
S
GR
GS
[0.75 0 0 0.75 0 -0.25] CT
1 0 0 RC
1 LJ
0.667 LW
N
232.74 50.032 M
205.107 72.477 L
212.196 56.917 L
232.74 50.032 L
S
GR
GS
[0.75 0 0 0.75 0 -0.25] CT
1 0 0 RC
N
232.74 50.032 M
197.162 48.773 L
212.196 56.917 L
205.107 72.477 L
cp
f
GR
GS
[0.75 0 0 0.75 199.70322 77.7973] CT
N
8.358 3.987 M
7.827 3.425 L
11.468 -0.216 L
15.077 3.425 L
14.546 3.987 L
11.468 1.284 L
8.358 3.987 L
cp
f
GR
GS
[0.75 0 0 0.75 199.70322 77.7973] CT
N
4.688 25.852 M
3 25.852 2.016 24.571 QT
1.031 23.29 1.031 21.54 QT
1.031 19.806 1.93 17.946 QT
2.828 16.087 4.344 14.852 QT
5.859 13.618 7.625 13.618 QT
8.406 13.618 9.047 14.063 QT
9.688 14.509 10.047 15.243 QT
11.563 9.227 L
11.672 8.759 11.688 8.493 QT
11.688 8.056 9.938 8.056 QT
9.656 8.056 9.656 7.712 QT
9.672 7.634 9.719 7.462 QT
9.766 7.29 9.844 7.204 QT
9.922 7.118 10.047 7.118 QT
13.688 6.821 L
14.016 6.821 14.016 7.165 QT
10.125 22.696 L
9.938 23.149 9.938 23.993 QT
9.938 25.149 10.719 25.149 QT
11.563 25.149 12.008 24.071 QT
12.453 22.993 12.75 21.587 QT
12.797 21.431 12.953 21.431 QT
13.297 21.431 L
13.391 21.431 13.461 21.524 QT
13.531 21.618 13.531 21.696 QT
13.047 23.571 12.492 24.712 QT
11.938 25.852 10.672 25.852 QT
9.75 25.852 9.055 25.321 QT
8.359 24.79 8.188 23.915 QT
6.453 25.852 4.688 25.852 QT
cp
4.719 25.149 M
5.703 25.149 6.617 24.415 QT
7.531 23.681 8.188 22.696 QT
8.219 22.665 8.219 22.587 QT
9.688 16.649 L
9.531 15.696 8.992 15.009 QT
8.453 14.321 7.547 14.321 QT
6.641 14.321 5.859 15.063 QT
5.078 15.806 4.531 16.821 QT
4.016 17.915 3.531 19.798 QT
3.047 21.681 3.047 22.727 QT
3.047 23.649 3.445 24.399 QT
3.844 25.149 4.719 25.149 QT
cp
f
GR
GS
[0.75 0 0 0.75 199.70322 77.7973] CT
N
22.255 32.259 M
20.755 31.071 19.661 29.532 QT
18.567 27.993 17.88 26.251 QT
17.192 24.509 16.848 22.61 QT
16.505 20.712 16.505 18.806 QT
16.505 16.868 16.848 14.97 QT
17.192 13.071 17.895 11.321 QT
18.598 9.571 19.692 8.04 QT
20.786 6.509 22.255 5.352 QT
22.255 5.306 22.38 5.306 QT
22.63 5.306 L
22.708 5.306 22.778 5.376 QT
22.848 5.446 22.848 5.54 QT
22.848 5.665 22.786 5.712 QT
21.473 7.009 20.598 8.485 QT
19.723 9.962 19.184 11.626 QT
18.645 13.29 18.411 15.079 QT
18.177 16.868 18.177 18.806 QT
18.177 27.384 22.77 31.837 QT
22.848 31.931 22.848 32.071 QT
22.848 32.134 22.77 32.22 QT
22.692 32.306 22.63 32.306 QT
22.38 32.306 L
22.255 32.306 22.255 32.259 QT
cp
f
GR
GS
[0.75 0 0 0.75 199.70322 77.7973] CT
N
25.922 23.368 M
25.922 22.977 26 22.618 QT
27.953 14.868 L
25.125 14.868 L
24.844 14.868 24.844 14.509 QT
24.953 13.915 25.203 13.915 QT
28.188 13.915 L
29.266 9.509 L
29.375 9.149 29.695 8.899 QT
30.016 8.649 30.406 8.649 QT
30.75 8.649 30.984 8.852 QT
31.219 9.056 31.219 9.399 QT
31.219 9.477 31.211 9.524 QT
31.203 9.571 31.188 9.634 QT
30.109 13.915 L
32.891 13.915 L
33.156 13.915 33.156 14.274 QT
33.156 14.337 33.109 14.493 QT
33.063 14.649 33 14.759 QT
32.938 14.868 32.813 14.868 QT
29.859 14.868 L
27.922 22.665 L
27.734 23.431 27.734 23.993 QT
27.734 25.149 28.516 25.149 QT
29.703 25.149 30.625 24.032 QT
31.547 22.915 32.031 21.587 QT
32.141 21.431 32.234 21.431 QT
32.563 21.431 L
32.672 21.431 32.742 21.501 QT
32.813 21.571 32.813 21.665 QT
32.813 21.712 32.781 21.743 QT
32.188 23.384 31.055 24.618 QT
29.922 25.852 28.453 25.852 QT
27.391 25.852 26.656 25.157 QT
25.922 24.462 25.922 23.368 QT
cp
f
GR
GS
[0.75 0 0 0.75 199.70322 77.7973] CT
N
35.536 27.399 M
35.723 27.946 36.13 28.399 QT
36.536 28.852 37.083 29.11 QT
37.63 29.368 38.223 29.368 QT
39.598 29.368 40.122 28.306 QT
40.645 27.243 40.645 25.712 QT
40.645 25.056 40.622 24.602 QT
40.598 24.149 40.489 23.743 QT
40.317 23.071 39.88 22.571 QT
39.442 22.071 38.802 22.071 QT
38.161 22.071 37.7 22.266 QT
37.239 22.462 36.95 22.72 QT
36.661 22.977 36.442 23.266 QT
36.223 23.556 36.161 23.571 QT
35.942 23.571 L
35.895 23.571 35.833 23.509 QT
35.77 23.446 35.77 23.399 QT
35.77 17.056 L
35.77 17.009 35.825 16.954 QT
35.88 16.899 35.942 16.899 QT
36.005 16.899 L
37.286 17.509 38.723 17.509 QT
40.13 17.509 41.442 16.899 QT
41.489 16.899 L
41.567 16.899 41.622 16.946 QT
41.677 16.993 41.677 17.056 QT
41.677 17.227 L
41.677 17.321 41.63 17.321 QT
40.989 18.181 40.012 18.665 QT
39.036 19.149 37.973 19.149 QT
37.223 19.149 36.427 18.931 QT
36.427 22.524 L
37.052 22.009 37.552 21.79 QT
38.052 21.571 38.817 21.571 QT
39.864 21.571 40.692 22.181 QT
41.52 22.79 41.966 23.759 QT
42.411 24.727 42.411 25.727 QT
42.411 26.868 41.848 27.845 QT
41.286 28.821 40.325 29.399 QT
39.364 29.977 38.223 29.977 QT
37.302 29.977 36.512 29.493 QT
35.723 29.009 35.278 28.188 QT
34.833 27.368 34.833 26.462 QT
34.833 26.024 35.106 25.759 QT
35.38 25.493 35.802 25.493 QT
36.223 25.493 36.505 25.766 QT
36.786 26.04 36.786 26.462 QT
36.786 26.868 36.505 27.149 QT
36.223 27.431 35.802 27.431 QT
35.739 27.431 35.653 27.415 QT
35.567 27.399 35.536 27.399 QT
cp
f
GR
GS
[0.75 0 0 0.75 199.70322 77.7973] CT
N
46.296 32.306 M
46.062 32.306 46.062 32.071 QT
46.062 31.946 46.109 31.899 QT
50.734 27.384 50.734 18.806 QT
50.734 10.227 46.171 5.774 QT
46.062 5.696 46.062 5.54 QT
46.062 5.446 46.132 5.376 QT
46.203 5.306 46.296 5.306 QT
46.546 5.306 L
46.624 5.306 46.687 5.352 QT
48.624 6.884 49.914 9.071 QT
51.203 11.259 51.804 13.743 QT
52.406 16.227 52.406 18.806 QT
52.406 20.712 52.085 22.563 QT
51.765 24.415 51.054 26.22 QT
50.343 28.024 49.265 29.548 QT
48.187 31.071 46.687 32.259 QT
46.624 32.306 46.546 32.306 QT
46.296 32.306 L
cp
f
GR
GS
[0.75 0 0 0.75 0 -0.25] CT
[10 6] 0 setdash
2 LJ
0.667 LW
N
291.82 175.973 M
221.103 59.52 L
S
GR
GS
[0.75 0 0 0.75 231.19137 113.75] CT
N
0.594 22.4 M
0.594 21.025 L
2.891 21.025 3.141 20.775 QT
6.781 16.65 L
2.734 11.791 L
0.719 11.791 L
0.719 10.416 L
7.078 10.416 L
7.078 11.791 L
6.109 11.791 L
8.531 14.681 L
10.875 12.009 L
10.875 11.9 10.484 11.845 QT
10.094 11.791 9.859 11.791 QT
9.859 10.416 L
15.25 10.416 L
15.25 11.791 L
12.953 11.791 12.719 12.041 QT
9.422 15.759 L
13.797 21.025 L
15.828 21.025 L
15.828 22.4 L
9.453 22.4 L
9.453 21.025 L
10.453 21.025 L
7.672 17.728 L
4.969 20.806 L
4.969 20.9 5.359 20.962 QT
5.75 21.025 6 21.025 QT
6 22.4 L
0.594 22.4 L
cp
f
GR
GS
[0.75 0 0 0.75 231.19137 113.75] CT
N
17.654 26.072 M
17.654 25.962 17.669 25.915 QT
19.091 20.244 L
19.232 19.712 19.232 19.306 QT
19.232 18.494 18.669 18.494 QT
18.076 18.494 17.787 19.205 QT
17.498 19.915 17.232 20.994 QT
17.232 21.056 17.177 21.087 QT
17.123 21.119 17.076 21.119 QT
16.857 21.119 L
16.794 21.119 16.748 21.048 QT
16.701 20.978 16.701 20.931 QT
16.904 20.103 17.091 19.525 QT
17.279 18.947 17.685 18.478 QT
18.091 18.009 18.685 18.009 QT
19.404 18.009 19.951 18.455 QT
20.498 18.9 20.498 19.603 QT
21.06 18.853 21.826 18.431 QT
22.591 18.009 23.435 18.009 QT
24.123 18.009 24.615 18.236 QT
25.107 18.462 25.38 18.931 QT
25.654 19.4 25.654 20.056 QT
25.654 20.837 25.302 21.939 QT
24.951 23.04 24.435 24.4 QT
24.169 25.025 24.169 25.54 QT
24.169 26.119 24.607 26.119 QT
25.341 26.119 25.841 25.314 QT
26.341 24.509 26.544 23.603 QT
26.576 23.494 26.701 23.494 QT
26.919 23.494 L
26.998 23.494 27.044 23.54 QT
27.091 23.587 27.091 23.665 QT
27.091 23.681 27.076 23.712 QT
26.81 24.79 26.169 25.705 QT
25.529 26.619 24.56 26.619 QT
23.888 26.619 23.419 26.158 QT
22.951 25.697 22.951 25.04 QT
22.951 24.681 23.091 24.29 QT
23.341 23.665 23.654 22.806 QT
23.966 21.947 24.162 21.158 QT
24.357 20.369 24.357 19.759 QT
24.357 19.244 24.138 18.869 QT
23.919 18.494 23.404 18.494 QT
22.701 18.494 22.123 18.798 QT
21.544 19.103 21.107 19.611 QT
20.669 20.119 20.31 20.822 QT
19.013 25.978 L
18.951 26.244 18.724 26.431 QT
18.498 26.619 18.216 26.619 QT
17.982 26.619 17.818 26.47 QT
17.654 26.322 17.654 26.072 QT
cp
f
GR
GS
[0.75 0 0 0.75 92.44136 28.58277] CT
N
/f-1257444556{0.594 22.4 M
0.594 21.025 L
2.891 21.025 3.141 20.775 QT
6.781 16.65 L
2.734 11.791 L
0.719 11.791 L
0.719 10.416 L
7.078 10.416 L
7.078 11.791 L
6.109 11.791 L
8.531 14.681 L
10.875 12.009 L
10.875 11.9 10.484 11.845 QT
10.094 11.791 9.859 11.791 QT
9.859 10.416 L
15.25 10.416 L
15.25 11.791 L
12.953 11.791 12.719 12.041 QT
9.422 15.759 L
13.797 21.025 L
15.828 21.025 L
15.828 22.4 L
9.453 22.4 L
9.453 21.025 L
10.453 21.025 L
7.672 17.728 L
4.969 20.806 L
4.969 20.9 5.359 20.962 QT
5.75 21.025 6 21.025 QT
6 22.4 L
0.594 22.4 L
cp}def
f-1257444556
f
GR
GS
[0.75 0 0 0.75 92.44136 28.58277] CT
N
/f-803425662{17.654 26.072 M
17.654 25.962 17.669 25.915 QT
19.091 20.244 L
19.232 19.712 19.232 19.306 QT
19.232 18.494 18.669 18.494 QT
18.076 18.494 17.787 19.205 QT
17.498 19.915 17.232 20.994 QT
17.232 21.056 17.177 21.087 QT
17.123 21.119 17.076 21.119 QT
16.857 21.119 L
16.794 21.119 16.748 21.048 QT
16.701 20.978 16.701 20.931 QT
16.904 20.103 17.091 19.525 QT
17.279 18.947 17.685 18.478 QT
18.091 18.009 18.685 18.009 QT
19.404 18.009 19.951 18.455 QT
20.498 18.9 20.498 19.603 QT
21.06 18.853 21.826 18.431 QT
22.591 18.009 23.435 18.009 QT
24.341 18.009 24.998 18.462 QT
25.654 18.915 25.654 19.759 QT
26.232 18.947 27.013 18.478 QT
27.794 18.009 28.732 18.009 QT
29.716 18.009 30.31 18.54 QT
30.904 19.072 30.904 20.056 QT
30.904 20.837 30.56 21.939 QT
30.216 23.04 29.701 24.4 QT
29.419 25.056 29.419 25.54 QT
29.419 26.119 29.873 26.119 QT
30.607 26.119 31.099 25.314 QT
31.591 24.509 31.794 23.603 QT
31.857 23.494 31.951 23.494 QT
32.185 23.494 L
32.248 23.494 32.302 23.548 QT
32.357 23.603 32.357 23.665 QT
32.357 23.681 32.341 23.712 QT
32.076 24.79 31.435 25.705 QT
30.794 26.619 29.826 26.619 QT
29.154 26.619 28.685 26.158 QT
28.216 25.697 28.216 25.04 QT
28.216 24.697 28.373 24.29 QT
28.904 22.869 29.263 21.744 QT
29.623 20.619 29.623 19.759 QT
29.623 19.244 29.404 18.869 QT
29.185 18.494 28.685 18.494 QT
27.654 18.494 26.896 19.126 QT
26.138 19.759 25.576 20.822 QT
25.544 20.994 25.513 21.103 QT
24.294 25.978 L
24.232 26.244 24.005 26.431 QT
23.779 26.619 23.498 26.619 QT
23.279 26.619 23.107 26.47 QT
22.935 26.322 22.935 26.072 QT
22.935 25.962 22.951 25.915 QT
24.169 21.072 L
24.357 20.29 24.357 19.759 QT
24.357 19.244 24.138 18.869 QT
23.919 18.494 23.404 18.494 QT
22.701 18.494 22.123 18.798 QT
21.544 19.103 21.107 19.611 QT
20.669 20.119 20.31 20.822 QT
19.013 25.978 L
18.951 26.244 18.724 26.431 QT
18.498 26.619 18.216 26.619 QT
17.982 26.619 17.818 26.47 QT
17.654 26.322 17.654 26.072 QT
cp}def
f-803425662
f
GR
GS
[0.75 0 0 0.75 92.44136 28.58277] CT
N
/f-890823355{42.283 29.103 M
40.783 27.916 39.689 26.376 QT
38.596 24.837 37.908 23.095 QT
37.221 21.353 36.877 19.455 QT
36.533 17.556 36.533 15.65 QT
36.533 13.712 36.877 11.814 QT
37.221 9.916 37.924 8.166 QT
38.627 6.416 39.721 4.884 QT
40.814 3.353 42.283 2.197 QT
42.283 2.15 42.408 2.15 QT
42.658 2.15 L
42.736 2.15 42.806 2.22 QT
42.877 2.291 42.877 2.384 QT
42.877 2.509 42.814 2.556 QT
41.502 3.853 40.627 5.33 QT
39.752 6.806 39.213 8.47 QT
38.674 10.134 38.439 11.923 QT
38.205 13.712 38.205 15.65 QT
38.205 24.228 42.799 28.681 QT
42.877 28.775 42.877 28.916 QT
42.877 28.978 42.799 29.064 QT
42.721 29.15 42.658 29.15 QT
42.408 29.15 L
42.283 29.15 42.283 29.103 QT
cp}def
f-890823355
f
GR
GS
[0.75 0 0 0.75 92.44136 28.58277] CT
N
/f246314812{45.95 20.212 M
45.95 19.822 46.028 19.462 QT
47.982 11.712 L
45.153 11.712 L
44.872 11.712 44.872 11.353 QT
44.982 10.759 45.232 10.759 QT
48.216 10.759 L
49.294 6.353 L
49.403 5.994 49.724 5.744 QT
50.044 5.494 50.435 5.494 QT
50.778 5.494 51.013 5.697 QT
51.247 5.9 51.247 6.244 QT
51.247 6.322 51.239 6.369 QT
51.232 6.416 51.216 6.478 QT
50.138 10.759 L
52.919 10.759 L
53.185 10.759 53.185 11.119 QT
53.185 11.181 53.138 11.337 QT
53.091 11.494 53.028 11.603 QT
52.966 11.712 52.841 11.712 QT
49.888 11.712 L
47.95 19.509 L
47.763 20.275 47.763 20.837 QT
47.763 21.994 48.544 21.994 QT
49.732 21.994 50.653 20.876 QT
51.575 19.759 52.06 18.431 QT
52.169 18.275 52.263 18.275 QT
52.591 18.275 L
52.7 18.275 52.771 18.345 QT
52.841 18.416 52.841 18.509 QT
52.841 18.556 52.81 18.587 QT
52.216 20.228 51.083 21.462 QT
49.95 22.697 48.482 22.697 QT
47.419 22.697 46.685 22.001 QT
45.95 21.306 45.95 20.212 QT
cp}def
f246314812
f
GR
GS
[0.75 0 0 0.75 92.44136 28.58277] CT
N
/f-523680091{55.564 24.244 M
55.752 24.79 56.158 25.244 QT
56.564 25.697 57.111 25.955 QT
57.658 26.212 58.252 26.212 QT
59.627 26.212 60.15 25.15 QT
60.674 24.087 60.674 22.556 QT
60.674 21.9 60.65 21.447 QT
60.627 20.994 60.517 20.587 QT
60.346 19.915 59.908 19.415 QT
59.471 18.915 58.83 18.915 QT
58.189 18.915 57.728 19.111 QT
57.267 19.306 56.978 19.564 QT
56.689 19.822 56.471 20.111 QT
56.252 20.4 56.189 20.415 QT
55.971 20.415 L
55.924 20.415 55.861 20.353 QT
55.799 20.29 55.799 20.244 QT
55.799 13.9 L
55.799 13.853 55.853 13.798 QT
55.908 13.744 55.971 13.744 QT
56.033 13.744 L
57.314 14.353 58.752 14.353 QT
60.158 14.353 61.471 13.744 QT
61.517 13.744 L
61.596 13.744 61.65 13.79 QT
61.705 13.837 61.705 13.9 QT
61.705 14.072 L
61.705 14.165 61.658 14.165 QT
61.017 15.025 60.041 15.509 QT
59.064 15.994 58.002 15.994 QT
57.252 15.994 56.455 15.775 QT
56.455 19.369 L
57.08 18.853 57.58 18.634 QT
58.08 18.415 58.846 18.415 QT
59.892 18.415 60.721 19.025 QT
61.549 19.634 61.994 20.603 QT
62.439 21.572 62.439 22.572 QT
62.439 23.712 61.877 24.689 QT
61.314 25.665 60.353 26.244 QT
59.392 26.822 58.252 26.822 QT
57.33 26.822 56.541 26.337 QT
55.752 25.853 55.306 25.033 QT
54.861 24.212 54.861 23.306 QT
54.861 22.869 55.135 22.603 QT
55.408 22.337 55.83 22.337 QT
56.252 22.337 56.533 22.611 QT
56.814 22.884 56.814 23.306 QT
56.814 23.712 56.533 23.994 QT
56.252 24.275 55.83 24.275 QT
55.767 24.275 55.681 24.259 QT
55.596 24.244 55.564 24.244 QT
cp}def
f-523680091
f
GR
GS
[0.75 0 0 0.75 92.44136 28.58277] CT
N
/f2106431499{66.325 29.15 M
66.09 29.15 66.09 28.916 QT
66.09 28.791 66.137 28.744 QT
70.762 24.228 70.762 15.65 QT
70.762 7.072 66.2 2.619 QT
66.09 2.541 66.09 2.384 QT
66.09 2.291 66.161 2.22 QT
66.231 2.15 66.325 2.15 QT
66.575 2.15 L
66.653 2.15 66.715 2.197 QT
68.653 3.728 69.942 5.916 QT
71.231 8.103 71.833 10.587 QT
72.434 13.072 72.434 15.65 QT
72.434 17.556 72.114 19.408 QT
71.793 21.259 71.083 23.064 QT
70.372 24.869 69.293 26.392 QT
68.215 27.916 66.715 29.103 QT
66.653 29.15 66.575 29.15 QT
66.325 29.15 L
cp}def
f2106431499
f
GR
GS
[0.75 0 0 0.75 528.19139 118.58277] CT
N
f-1257444556
f
GR
GS
[0.75 0 0 0.75 528.19139 118.58277] CT
N
f-803425662
f
GR
GS
[0.75 0 0 0.75 528.19139 118.58277] CT
N
f-890823355
f
GR
GS
[0.75 0 0 0.75 528.19139 118.58277] CT
N
f246314812
f
GR
GS
[0.75 0 0 0.75 528.19139 118.58277] CT
N
/f-1465293943{55.674 26.4 M
55.674 25.728 L
58.049 25.728 58.049 25.134 QT
58.049 15.15 L
57.064 15.634 55.564 15.634 QT
55.564 14.962 L
57.892 14.962 59.08 13.744 QT
59.346 13.744 L
59.408 13.744 59.471 13.798 QT
59.533 13.853 59.533 13.915 QT
59.533 25.134 L
59.533 25.728 61.908 25.728 QT
61.908 26.4 L
55.674 26.4 L
cp}def
f-1465293943
f
GR
GS
[0.75 0 0 0.75 528.19139 118.58277] CT
N
f2106431499
f
GR
GS
[0.75 0 0 0.75 0 -0.25] CT
1 0 0 RC
1 LJ
0.667 LW
N
617 57 M
619.319 55.998 L
S
GR
GS
[0.75 0 0 0.75 0 -0.25] CT
1 0 0 RC
1 LJ
0.667 LW
N
634.987 62.845 M
599.43 64.592 L
619.319 55.998 L
634.987 62.845 L
S
GR
GS
[0.75 0 0 0.75 0 -0.25] CT
1 0 0 RC
1 LJ
0.667 LW
N
599.43 64.592 M
625.071 39.896 L
619.319 55.998 L
599.43 64.592 L
S
GR
GS
[0.75 0 0 0.75 0 -0.25] CT
1 0 0 RC
N
599.43 64.592 M
634.987 62.845 L
619.319 55.998 L
625.071 39.896 L
cp
f
GR
GS
[0.75 0 0 0.75 471.94139 45.83277] CT
N
f-1257444556
f
GR
GS
[0.75 0 0 0.75 471.94139 45.83277] CT
N
f-803425662
f
GR
GS
[0.75 0 0 0.75 471.94139 45.83277] CT
N
f-890823355
f
GR
GS
[0.75 0 0 0.75 471.94139 45.83277] CT
N
f246314812
f
GR
GS
[0.75 0 0 0.75 471.94139 45.83277] CT
N
/f1092092935{54.861 26.4 M
54.861 25.884 L
54.861 25.837 54.892 25.79 QT
57.846 22.525 L
58.517 21.79 58.931 21.306 QT
59.346 20.822 59.752 20.181 QT
60.158 19.54 60.392 18.876 QT
60.627 18.212 60.627 17.462 QT
60.627 16.681 60.346 15.97 QT
60.064 15.259 59.494 14.837 QT
58.924 14.415 58.111 14.415 QT
57.283 14.415 56.627 14.908 QT
55.971 15.4 55.705 16.197 QT
55.767 16.181 55.908 16.181 QT
56.33 16.181 56.635 16.462 QT
56.939 16.744 56.939 17.212 QT
56.939 17.634 56.635 17.939 QT
56.33 18.244 55.908 18.244 QT
55.455 18.244 55.158 17.931 QT
54.861 17.619 54.861 17.212 QT
54.861 16.494 55.127 15.869 QT
55.392 15.244 55.9 14.751 QT
56.408 14.259 57.041 14.001 QT
57.674 13.744 58.392 13.744 QT
59.471 13.744 60.408 14.205 QT
61.346 14.665 61.892 15.501 QT
62.439 16.337 62.439 17.462 QT
62.439 18.29 62.08 19.033 QT
61.721 19.775 61.158 20.384 QT
60.596 20.994 59.713 21.759 QT
58.83 22.525 58.549 22.79 QT
56.392 24.853 L
58.221 24.853 L
59.564 24.853 60.471 24.83 QT
61.377 24.806 61.439 24.759 QT
61.658 24.525 61.892 23.009 QT
62.439 23.009 L
61.908 26.4 L
54.861 26.4 L
cp}def
f1092092935
f
GR
GS
[0.75 0 0 0.75 471.94139 45.83277] CT
N
f2106431499
f
GR
GS
[0.75 0 0 0.75 0 -0.25] CT
1 0 0 RC
1 LJ
0.667 LW
N
440.582 212.874 M
433.783 220.16 L
S
GR
GS
[0.75 0 0 0.75 0 -0.25] CT
1 0 0 RC
1 LJ
0.667 LW
N
450.881 220.159 M
419 236 L
433.783 220.16 L
450.881 220.159 L
S
GR
GS
[0.75 0 0 0.75 0 -0.25] CT
1 0 0 RC
1 LJ
0.667 LW
N
419 236 M
432.604 203.102 L
433.783 220.16 L
419 236 L
S
GR
GS
[0.75 0 0 0.75 0 -0.25] CT
1 0 0 RC
N
419 236 M
450.881 220.159 L
433.783 220.16 L
432.604 203.102 L
cp
f
GR
GS
[0.75 0 0 0.75 270.19064 131.21452] CT
N
/f1237405860{8.358 3.987 M
7.827 3.425 L
11.468 -0.216 L
15.077 3.425 L
14.546 3.987 L
11.468 1.284 L
8.358 3.987 L
cp}def
f1237405860
f
GR
GS
[0.75 0 0 0.75 270.19064 131.21452] CT
N
/f2011899593{4.688 25.852 M
3 25.852 2.016 24.571 QT
1.031 23.29 1.031 21.54 QT
1.031 19.806 1.93 17.946 QT
2.828 16.087 4.344 14.852 QT
5.859 13.618 7.625 13.618 QT
8.406 13.618 9.047 14.063 QT
9.688 14.509 10.047 15.243 QT
11.563 9.227 L
11.672 8.759 11.688 8.493 QT
11.688 8.056 9.938 8.056 QT
9.656 8.056 9.656 7.712 QT
9.672 7.634 9.719 7.462 QT
9.766 7.29 9.844 7.204 QT
9.922 7.118 10.047 7.118 QT
13.688 6.821 L
14.016 6.821 14.016 7.165 QT
10.125 22.696 L
9.938 23.149 9.938 23.993 QT
9.938 25.149 10.719 25.149 QT
11.563 25.149 12.008 24.071 QT
12.453 22.993 12.75 21.587 QT
12.797 21.431 12.953 21.431 QT
13.297 21.431 L
13.391 21.431 13.461 21.524 QT
13.531 21.618 13.531 21.696 QT
13.047 23.571 12.492 24.712 QT
11.938 25.852 10.672 25.852 QT
9.75 25.852 9.055 25.321 QT
8.359 24.79 8.188 23.915 QT
6.453 25.852 4.688 25.852 QT
cp
4.719 25.149 M
5.703 25.149 6.617 24.415 QT
7.531 23.681 8.188 22.696 QT
8.219 22.665 8.219 22.587 QT
9.688 16.649 L
9.531 15.696 8.992 15.009 QT
8.453 14.321 7.547 14.321 QT
6.641 14.321 5.859 15.063 QT
5.078 15.806 4.531 16.821 QT
4.016 17.915 3.531 19.798 QT
3.047 21.681 3.047 22.727 QT
3.047 23.649 3.445 24.399 QT
3.844 25.149 4.719 25.149 QT
cp}def
f2011899593
f
GR
GS
[0.75 0 0 0.75 270.19064 131.21452] CT
N
/f-778073597{22.255 32.259 M
20.755 31.071 19.661 29.532 QT
18.567 27.993 17.88 26.251 QT
17.192 24.509 16.848 22.61 QT
16.505 20.712 16.505 18.806 QT
16.505 16.868 16.848 14.97 QT
17.192 13.071 17.895 11.321 QT
18.598 9.571 19.692 8.04 QT
20.786 6.509 22.255 5.352 QT
22.255 5.306 22.38 5.306 QT
22.63 5.306 L
22.708 5.306 22.778 5.376 QT
22.848 5.446 22.848 5.54 QT
22.848 5.665 22.786 5.712 QT
21.473 7.009 20.598 8.485 QT
19.723 9.962 19.184 11.626 QT
18.645 13.29 18.411 15.079 QT
18.177 16.868 18.177 18.806 QT
18.177 27.384 22.77 31.837 QT
22.848 31.931 22.848 32.071 QT
22.848 32.134 22.77 32.22 QT
22.692 32.306 22.63 32.306 QT
22.38 32.306 L
22.255 32.306 22.255 32.259 QT
cp}def
f-778073597
f
GR
GS
[0.75 0 0 0.75 270.19064 131.21452] CT
N
/f-13001499{25.922 23.368 M
25.922 22.977 26 22.618 QT
27.953 14.868 L
25.125 14.868 L
24.844 14.868 24.844 14.509 QT
24.953 13.915 25.203 13.915 QT
28.188 13.915 L
29.266 9.509 L
29.375 9.149 29.695 8.899 QT
30.016 8.649 30.406 8.649 QT
30.75 8.649 30.984 8.852 QT
31.219 9.056 31.219 9.399 QT
31.219 9.477 31.211 9.524 QT
31.203 9.571 31.188 9.634 QT
30.109 13.915 L
32.891 13.915 L
33.156 13.915 33.156 14.274 QT
33.156 14.337 33.109 14.493 QT
33.063 14.649 33 14.759 QT
32.938 14.868 32.813 14.868 QT
29.859 14.868 L
27.922 22.665 L
27.734 23.431 27.734 23.993 QT
27.734 25.149 28.516 25.149 QT
29.703 25.149 30.625 24.032 QT
31.547 22.915 32.031 21.587 QT
32.141 21.431 32.234 21.431 QT
32.563 21.431 L
32.672 21.431 32.742 21.501 QT
32.813 21.571 32.813 21.665 QT
32.813 21.712 32.781 21.743 QT
32.188 23.384 31.055 24.618 QT
29.922 25.852 28.453 25.852 QT
27.391 25.852 26.656 25.157 QT
25.922 24.462 25.922 23.368 QT
cp}def
f-13001499
f
GR
GS
[0.75 0 0 0.75 270.19064 131.21452] CT
N
/f71310394{35.692 28.087 M
36.13 28.743 36.88 29.056 QT
37.63 29.368 38.505 29.368 QT
39.598 29.368 40.067 28.431 QT
40.536 27.493 40.536 26.29 QT
40.536 25.759 40.434 25.22 QT
40.333 24.681 40.106 24.212 QT
39.88 23.743 39.473 23.47 QT
39.067 23.196 38.489 23.196 QT
37.223 23.196 L
37.052 23.196 37.052 23.009 QT
37.052 22.852 L
37.052 22.696 37.223 22.696 QT
38.27 22.618 L
38.942 22.618 39.38 22.118 QT
39.817 21.618 40.02 20.899 QT
40.223 20.181 40.223 19.524 QT
40.223 18.618 39.802 18.032 QT
39.38 17.446 38.505 17.446 QT
37.77 17.446 37.114 17.72 QT
36.458 17.993 36.067 18.556 QT
36.114 18.54 36.137 18.54 QT
36.161 18.54 36.192 18.54 QT
36.63 18.54 36.919 18.837 QT
37.208 19.134 37.208 19.54 QT
37.208 19.946 36.919 20.243 QT
36.63 20.54 36.192 20.54 QT
35.786 20.54 35.489 20.243 QT
35.192 19.946 35.192 19.54 QT
35.192 18.727 35.684 18.126 QT
36.177 17.524 36.95 17.212 QT
37.723 16.899 38.505 16.899 QT
39.083 16.899 39.716 17.071 QT
40.348 17.243 40.872 17.563 QT
41.395 17.884 41.723 18.384 QT
42.052 18.884 42.052 19.524 QT
42.052 20.321 41.692 21.001 QT
41.333 21.681 40.716 22.173 QT
40.098 22.665 39.348 22.899 QT
40.177 23.056 40.919 23.524 QT
41.661 23.993 42.114 24.712 QT
42.567 25.431 42.567 26.274 QT
42.567 27.321 41.989 28.173 QT
41.411 29.024 40.473 29.501 QT
39.536 29.977 38.505 29.977 QT
37.614 29.977 36.716 29.634 QT
35.817 29.29 35.247 28.618 QT
34.677 27.946 34.677 26.993 QT
34.677 26.524 34.989 26.204 QT
35.302 25.884 35.786 25.884 QT
36.083 25.884 36.341 26.032 QT
36.598 26.181 36.739 26.438 QT
36.88 26.696 36.88 26.993 QT
36.88 27.462 36.559 27.774 QT
36.239 28.087 35.786 28.087 QT
35.692 28.087 L
cp}def
f71310394
f
GR
GS
[0.75 0 0 0.75 270.19064 131.21452] CT
N
/f-1036825299{46.296 32.306 M
46.062 32.306 46.062 32.071 QT
46.062 31.946 46.109 31.899 QT
50.734 27.384 50.734 18.806 QT
50.734 10.227 46.171 5.774 QT
46.062 5.696 46.062 5.54 QT
46.062 5.446 46.132 5.376 QT
46.203 5.306 46.296 5.306 QT
46.546 5.306 L
46.624 5.306 46.687 5.352 QT
48.624 6.884 49.914 9.071 QT
51.203 11.259 51.804 13.743 QT
52.406 16.227 52.406 18.806 QT
52.406 20.712 52.085 22.563 QT
51.765 24.415 51.054 26.22 QT
50.343 28.024 49.265 29.548 QT
48.187 31.071 46.687 32.259 QT
46.624 32.306 46.546 32.306 QT
46.296 32.306 L
cp}def
f-1036825299
f
GR
GS
[0.75 0 0 0.75 314.44137 174.08277] CT
N
f-1257444556
f
GR
GS
[0.75 0 0 0.75 314.44137 174.08277] CT
N
f-803425662
f
GR
GS
[0.75 0 0 0.75 314.44137 174.08277] CT
N
f-890823355
f
GR
GS
[0.75 0 0 0.75 314.44137 174.08277] CT
N
f246314812
f
GR
GS
[0.75 0 0 0.75 314.44137 174.08277] CT
N
/f691211476{55.721 24.931 M
56.158 25.587 56.908 25.9 QT
57.658 26.212 58.533 26.212 QT
59.627 26.212 60.096 25.275 QT
60.564 24.337 60.564 23.134 QT
60.564 22.603 60.463 22.064 QT
60.361 21.525 60.135 21.056 QT
59.908 20.587 59.502 20.314 QT
59.096 20.04 58.517 20.04 QT
57.252 20.04 L
57.08 20.04 57.08 19.853 QT
57.08 19.697 L
57.08 19.54 57.252 19.54 QT
58.299 19.462 L
58.971 19.462 59.408 18.962 QT
59.846 18.462 60.049 17.744 QT
60.252 17.025 60.252 16.369 QT
60.252 15.462 59.83 14.876 QT
59.408 14.29 58.533 14.29 QT
57.799 14.29 57.142 14.564 QT
56.486 14.837 56.096 15.4 QT
56.142 15.384 56.166 15.384 QT
56.189 15.384 56.221 15.384 QT
56.658 15.384 56.947 15.681 QT
57.236 15.978 57.236 16.384 QT
57.236 16.79 56.947 17.087 QT
56.658 17.384 56.221 17.384 QT
55.814 17.384 55.517 17.087 QT
55.221 16.79 55.221 16.384 QT
55.221 15.572 55.713 14.97 QT
56.205 14.369 56.978 14.056 QT
57.752 13.744 58.533 13.744 QT
59.111 13.744 59.744 13.915 QT
60.377 14.087 60.9 14.408 QT
61.424 14.728 61.752 15.228 QT
62.08 15.728 62.08 16.369 QT
62.08 17.165 61.721 17.845 QT
61.361 18.525 60.744 19.017 QT
60.127 19.509 59.377 19.744 QT
60.205 19.9 60.947 20.369 QT
61.689 20.837 62.142 21.556 QT
62.596 22.275 62.596 23.119 QT
62.596 24.165 62.017 25.017 QT
61.439 25.869 60.502 26.345 QT
59.564 26.822 58.533 26.822 QT
57.642 26.822 56.744 26.478 QT
55.846 26.134 55.275 25.462 QT
54.705 24.79 54.705 23.837 QT
54.705 23.369 55.017 23.048 QT
55.33 22.728 55.814 22.728 QT
56.111 22.728 56.369 22.876 QT
56.627 23.025 56.767 23.283 QT
56.908 23.54 56.908 23.837 QT
56.908 24.306 56.588 24.619 QT
56.267 24.931 55.814 24.931 QT
55.721 24.931 L
cp}def
f691211476
f
GR
GS
[0.75 0 0 0.75 314.44137 174.08277] CT
N
f2106431499
f
GR
GS
[0.75 0 0 0.75 0 -0.25] CT
1 0 0 RC
1 LJ
0.667 LW
N
190.023 301.86 M
191.41 303.231 L
S
GR
GS
[0.75 0 0 0.75 0 -0.25] CT
1 0 0 RC
1 LJ
0.667 LW
N
190.92 320.323 M
176 288 L
191.41 303.231 L
190.92 320.323 L
S
GR
GS
[0.75 0 0 0.75 0 -0.25] CT
1 0 0 RC
1 LJ
0.667 LW
N
176 288 M
208.494 302.542 L
191.41 303.231 L
176 288 L
S
GR
GS
[0.75 0 0 0.75 0 -0.25] CT
1 0 0 RC
N
176 288 M
190.92 320.323 L
191.41 303.231 L
208.494 302.542 L
cp
f
GR
GS
[0.75 0 0 0.75 158.44136 210.83277] CT
N
f-1257444556
f
GR
GS
[0.75 0 0 0.75 158.44136 210.83277] CT
N
f-803425662
f
GR
GS
[0.75 0 0 0.75 158.44136 210.83277] CT
N
f-890823355
f
GR
GS
[0.75 0 0 0.75 158.44136 210.83277] CT
N
f246314812
f
GR
GS
[0.75 0 0 0.75 158.44136 210.83277] CT
N
/f-1233988076{54.439 23.259 M
54.439 22.603 L
60.314 13.837 L
60.377 13.744 60.502 13.744 QT
60.783 13.744 L
61.002 13.744 61.002 13.962 QT
61.002 22.603 L
62.861 22.603 L
62.861 23.259 L
61.002 23.259 L
61.002 25.134 L
61.002 25.525 61.556 25.626 QT
62.111 25.728 62.846 25.728 QT
62.846 26.4 L
57.611 26.4 L
57.611 25.728 L
58.346 25.728 58.9 25.626 QT
59.455 25.525 59.455 25.134 QT
59.455 23.259 L
54.439 23.259 L
cp
55.064 22.603 M
59.564 22.603 L
59.564 15.869 L
55.064 22.603 L
cp}def
f-1233988076
f
GR
GS
[0.75 0 0 0.75 158.44136 210.83277] CT
N
f2106431499
f
GR
GS
[0.75 0 0 0.75 0 -0.25] CT
[10 6] 0 setdash
2 LJ
0.667 LW
N
289.135 189.775 M
192 292 L
S
GR
GS
[0.75 0 0 0.75 147.11272 149.28379] CT
N
f1237405860
f
GR
GS
[0.75 0 0 0.75 147.11272 149.28379] CT
N
f2011899593
f
GR
GS
[0.75 0 0 0.75 147.11272 149.28379] CT
N
f-778073597
f
GR
GS
[0.75 0 0 0.75 147.11272 149.28379] CT
N
f-13001499
f
GR
GS
[0.75 0 0 0.75 147.11272 149.28379] CT
N
/f-1079859119{34.411 26.415 M
34.411 25.759 L
40.286 16.993 L
40.348 16.899 40.473 16.899 QT
40.755 16.899 L
40.973 16.899 40.973 17.118 QT
40.973 25.759 L
42.833 25.759 L
42.833 26.415 L
40.973 26.415 L
40.973 28.29 L
40.973 28.681 41.528 28.782 QT
42.083 28.884 42.817 28.884 QT
42.817 29.556 L
37.583 29.556 L
37.583 28.884 L
38.317 28.884 38.872 28.782 QT
39.427 28.681 39.427 28.29 QT
39.427 26.415 L
34.411 26.415 L
cp
35.036 25.759 M
39.536 25.759 L
39.536 19.024 L
35.036 25.759 L
cp}def
f-1079859119
f
GR
GS
[0.75 0 0 0.75 147.11272 149.28379] CT
N
f-1036825299
f
GR
GS
[0.75 0 0 0.75 0 -0.25] CT
[10 6] 0 setdash
2 LJ
0.667 LW
N
310 190 M
422 224 L
S
GR
%%Trailer
%%Pages: 1
%%EOF
