\relax 
\providecommand\hyper@newdestlabel[2]{}
\@writefile{toc}{\contentsline {chapter}{\numberline {B}Position Error Covariance Matrix and Geometrical representations}{175}{appendix.B}\protected@file@percent }
\@writefile{lof}{\addvspace {10\p@ }}
\@writefile{lot}{\addvspace {10\p@ }}
\newlabel{appendix:covEllipse}{{B}{175}{Position Error Covariance Matrix and Geometrical representations}{appendix.B}{}}
\acronymused{WLS}
\@writefile{toc}{\contentsline {section}{\numberline {B.1}Sample Covariance Matrix estimation}{175}{section.B.1}\protected@file@percent }
\acronymused{GNSS}
\@writefile{toc}{\contentsline {section}{\numberline {B.2}Covariance Matrix and Error Ellipse }{176}{section.B.2}\protected@file@percent }
\AC@undonewlabel{acro:HPE}
\newlabel{acro:HPE}{{B.2}{176}{Covariance Matrix and Error Ellipse }{section.B.2}{}}
\acronymused{HPE}
\AC@undonewlabel{acro:KPI}
\newlabel{acro:KPI}{{B.2}{176}{Covariance Matrix and Error Ellipse }{section.B.2}{}}
\acronymused{KPI}
\acronymused{GNSS}
\@writefile{lof}{\contentsline {figure}{\numberline {B.1}{\ignorespaces \relax \fontsize  {10}{12}\selectfont  \abovedisplayskip 10\p@ plus2\p@ minus5\p@ \abovedisplayshortskip \z@ plus3\p@ \belowdisplayshortskip 6\p@ plus3\p@ minus3\p@ \def \leftmargin \leftmargini \parsep 4.5\p@ plus2\p@ minus\p@ \topsep 9\p@ plus3\p@ minus5\p@ \itemsep 4.5\p@ plus2\p@ minus\p@ {\leftmargin \leftmargini \topsep 6\p@ plus2\p@ minus2\p@ \parsep 3\p@ plus2\p@ minus\p@ \itemsep \parsep }\belowdisplayskip \abovedisplayskip {Error ellipse of uncorrelated 2D positioning unbiased solutions drawn for 95\% of the confidence interval.}\relax }}{176}{figure.caption.143}\protected@file@percent }
\newlabel{fig:covAlignedExample}{{B.1}{176}{\small {Error ellipse of uncorrelated 2D positioning unbiased solutions drawn for 95\% of the confidence interval.}\relax }{figure.caption.143}{}}
\newlabel{eq:alignedCov}{{B.6}{177}{Covariance Matrix and Error Ellipse }{equation.B.2.6}{}}
\newlabel{eq:ellipse}{{B.7}{177}{Covariance Matrix and Error Ellipse }{equation.B.2.7}{}}
\@writefile{toc}{\contentsline {subsection}{\numberline {B.2.1}Eigendecomposition of Covariance}{178}{subsection.B.2.1}\protected@file@percent }
\@writefile{lof}{\contentsline {figure}{\numberline {B.2}{\ignorespaces \relax \fontsize  {10}{12}\selectfont  \abovedisplayskip 10\p@ plus2\p@ minus5\p@ \abovedisplayshortskip \z@ plus3\p@ \belowdisplayshortskip 6\p@ plus3\p@ minus3\p@ \def \leftmargin \leftmargini \parsep 4.5\p@ plus2\p@ minus\p@ \topsep 9\p@ plus3\p@ minus5\p@ \itemsep 4.5\p@ plus2\p@ minus\p@ {\leftmargin \leftmargini \topsep 6\p@ plus2\p@ minus2\p@ \parsep 3\p@ plus2\p@ minus\p@ \itemsep \parsep }\belowdisplayskip \abovedisplayskip {Error ellipses of correlated 2D positioning solutions shown for 5 confidence intervals indicated in the legend. Eigenvector are multiplied by the respective eigenvalue with a factor $2$ to reach $95$\% confidence value.}\relax }}{178}{figure.caption.144}\protected@file@percent }
\newlabel{fig:covExample}{{B.2}{178}{\small {Error ellipses of correlated 2D positioning solutions shown for 5 confidence intervals indicated in the legend. Eigenvector are multiplied by the respective eigenvalue with a factor $2$ to reach $95$\% confidence value.}\relax }{figure.caption.144}{}}
\newlabel{eq:ellipseRot}{{B.8}{179}{Eigendecomposition of Covariance}{equation.B.2.8}{}}
\@writefile{loa}{\contentsline {algorithm}{\numberline {}{\ignorespaces Pseudocode for the generation of error ellipses\relax }}{179}{algorithm.2}\protected@file@percent }
\newlabel{alg:ellipseAlgorithm}{{}{179}{Pseudocode for the generation of error ellipses\relax }{algorithm.2}{}}
\@writefile{toc}{\contentsline {subsection}{\numberline {B.2.2}Covariance conversion between reference frames}{179}{subsection.B.2.2}\protected@file@percent }
\acronymused{ECEF}
\acronymused{ENU}
\acronymused{PF}
\acronymused{KF}
\@setckpt{Appendix1/appendix1}{
\setcounter{page}{180}
\setcounter{equation}{10}
\setcounter{enumi}{2}
\setcounter{enumii}{0}
\setcounter{enumiii}{0}
\setcounter{enumiv}{0}
\setcounter{footnote}{0}
\setcounter{mpfootnote}{0}
\setcounter{part}{0}
\setcounter{chapter}{2}
\setcounter{section}{2}
\setcounter{subsection}{2}
\setcounter{subsubsection}{0}
\setcounter{paragraph}{0}
\setcounter{subparagraph}{0}
\setcounter{figure}{2}
\setcounter{table}{0}
\setcounter{SDpage}{0}
\setcounter{NumberSD}{0}
\setcounter{tomo}{0}
\setcounter{parentequation}{0}
\setcounter{caption@flags}{2}
\setcounter{ContinuedFloat}{0}
\setcounter{subfigure}{0}
\setcounter{subtable}{0}
\setcounter{float@type}{16}
\setcounter{tabx@nest}{0}
\setcounter{listtotal}{0}
\setcounter{listcount}{0}
\setcounter{liststart}{0}
\setcounter{liststop}{0}
\setcounter{citecount}{0}
\setcounter{citetotal}{0}
\setcounter{multicitecount}{0}
\setcounter{multicitetotal}{0}
\setcounter{instcount}{403}
\setcounter{maxnames}{3}
\setcounter{minnames}{1}
\setcounter{maxitems}{3}
\setcounter{minitems}{1}
\setcounter{citecounter}{0}
\setcounter{maxcitecounter}{0}
\setcounter{savedcitecounter}{0}
\setcounter{uniquelist}{0}
\setcounter{uniquename}{0}
\setcounter{refsection}{0}
\setcounter{refsegment}{0}
\setcounter{maxextratitle}{0}
\setcounter{maxextratitleyear}{0}
\setcounter{maxextraname}{5}
\setcounter{maxextradate}{0}
\setcounter{maxextraalpha}{0}
\setcounter{abbrvpenalty}{50}
\setcounter{highnamepenalty}{50}
\setcounter{lownamepenalty}{25}
\setcounter{maxparens}{3}
\setcounter{parenlevel}{0}
\setcounter{mincomprange}{10}
\setcounter{maxcomprange}{100000}
\setcounter{mincompwidth}{1}
\setcounter{afterword}{0}
\setcounter{savedafterword}{0}
\setcounter{annotator}{0}
\setcounter{savedannotator}{0}
\setcounter{author}{0}
\setcounter{savedauthor}{0}
\setcounter{bookauthor}{0}
\setcounter{savedbookauthor}{0}
\setcounter{commentator}{0}
\setcounter{savedcommentator}{0}
\setcounter{editor}{0}
\setcounter{savededitor}{0}
\setcounter{editora}{0}
\setcounter{savededitora}{0}
\setcounter{editorb}{0}
\setcounter{savededitorb}{0}
\setcounter{editorc}{0}
\setcounter{savededitorc}{0}
\setcounter{foreword}{0}
\setcounter{savedforeword}{0}
\setcounter{holder}{0}
\setcounter{savedholder}{0}
\setcounter{introduction}{0}
\setcounter{savedintroduction}{0}
\setcounter{namea}{0}
\setcounter{savednamea}{0}
\setcounter{nameb}{0}
\setcounter{savednameb}{0}
\setcounter{namec}{0}
\setcounter{savednamec}{0}
\setcounter{translator}{0}
\setcounter{savedtranslator}{0}
\setcounter{shortauthor}{0}
\setcounter{savedshortauthor}{0}
\setcounter{shorteditor}{0}
\setcounter{savedshorteditor}{0}
\setcounter{labelname}{0}
\setcounter{savedlabelname}{0}
\setcounter{institution}{0}
\setcounter{savedinstitution}{0}
\setcounter{lista}{0}
\setcounter{savedlista}{0}
\setcounter{listb}{0}
\setcounter{savedlistb}{0}
\setcounter{listc}{0}
\setcounter{savedlistc}{0}
\setcounter{listd}{0}
\setcounter{savedlistd}{0}
\setcounter{liste}{0}
\setcounter{savedliste}{0}
\setcounter{listf}{0}
\setcounter{savedlistf}{0}
\setcounter{location}{0}
\setcounter{savedlocation}{0}
\setcounter{organization}{0}
\setcounter{savedorganization}{0}
\setcounter{origlocation}{0}
\setcounter{savedoriglocation}{0}
\setcounter{origpublisher}{0}
\setcounter{savedorigpublisher}{0}
\setcounter{publisher}{0}
\setcounter{savedpublisher}{0}
\setcounter{language}{0}
\setcounter{savedlanguage}{0}
\setcounter{origlanguage}{0}
\setcounter{savedoriglanguage}{0}
\setcounter{pageref}{0}
\setcounter{savedpageref}{0}
\setcounter{textcitecount}{0}
\setcounter{textcitetotal}{0}
\setcounter{textcitemaxnames}{0}
\setcounter{biburlnumpenalty}{0}
\setcounter{biburlucpenalty}{0}
\setcounter{biburllcpenalty}{0}
\setcounter{smartand}{1}
\setcounter{bbx:relatedcount}{0}
\setcounter{bbx:relatedtotal}{0}
\setcounter{Item}{11}
\setcounter{Hfootnote}{4}
\setcounter{bookmark@seq@number}{128}
\setcounter{nlinenum}{0}
\setcounter{algorithm}{2}
\setcounter{ALC@unique}{12}
\setcounter{ALC@line}{6}
\setcounter{ALC@rem}{0}
\setcounter{ALC@depth}{0}
\setcounter{@todonotes@numberoftodonotes}{0}
\setcounter{Changes@AuthorCount}{2}
\setcounter{Changes@Author}{2}
\setcounter{Changes@addedCount}{1}
\setcounter{Changes@deletedCount}{0}
\setcounter{Changes@replacedCount}{2}
\setcounter{Changes@highlightCount}{0}
\setcounter{Changes@commentCount}{0}
\setcounter{authorcommentcount}{0}
\setcounter{Changes@addedCount1}{41}
\setcounter{Changes@deletedCount1}{3}
\setcounter{Changes@replacedCount1}{9}
\setcounter{Changes@highlightCount1}{0}
\setcounter{Changes@commentCount1}{0}
\setcounter{lstnumber}{1}
\setcounter{FancyVerbLine}{0}
\setcounter{section@level}{0}
\setcounter{lstlisting}{0}
}
