%!PS-Adobe-3.0 EPSF-3.0
%%Creator: (MATLAB, The Mathworks, Inc. Version 9.5.0.944444 \(R2018b\). Operating System: Windows 10)
%%Title: (C:/Users/Alex/Documents/PhD Docs/01. GIT/my_phd_thesis/Chapter8/Figures/VTC/staticIFENSim2.eps)
%%CreationDate: 2019-10-31T11:17:15
%%Pages: (atend)
%%BoundingBox: 0 0 648 362
%%LanguageLevel: 3
%%EndComments
%%BeginProlog
%%BeginResource: procset (Apache XML Graphics Std ProcSet) 1.2 0
%%Version: 1.2 0
%%Copyright: (Copyright 2001-2003,2010 The Apache Software Foundation. License terms: http://www.apache.org/licenses/LICENSE-2.0)
/bd{bind def}bind def
/ld{load def}bd
/GR/grestore ld
/GS/gsave ld
/RM/rmoveto ld
/C/curveto ld
/t/show ld
/L/lineto ld
/ML/setmiterlimit ld
/CT/concat ld
/f/fill ld
/N/newpath ld
/S/stroke ld
/CC/setcmykcolor ld
/A/ashow ld
/cp/closepath ld
/RC/setrgbcolor ld
/LJ/setlinejoin ld
/GC/setgray ld
/LW/setlinewidth ld
/M/moveto ld
/re {4 2 roll M
1 index 0 rlineto
0 exch rlineto
neg 0 rlineto
cp } bd
/_ctm matrix def
/_tm matrix def
/BT { _ctm currentmatrix pop matrix _tm copy pop 0 0 moveto } bd
/ET { _ctm setmatrix } bd
/iTm { _ctm setmatrix _tm concat } bd
/Tm { _tm astore pop iTm 0 0 moveto } bd
/ux 0.0 def
/uy 0.0 def
/F {
  /Tp exch def
  /Tf exch def
  Tf findfont Tp scalefont setfont
  /cf Tf def  /cs Tp def
} bd
/ULS {currentpoint /uy exch def /ux exch def} bd
/ULE {
  /Tcx currentpoint pop def
  gsave
  newpath
  cf findfont cs scalefont dup
  /FontMatrix get 0 get /Ts exch def /FontInfo get dup
  /UnderlinePosition get Ts mul /To exch def
  /UnderlineThickness get Ts mul /Tt exch def
  ux uy To add moveto  Tcx uy To add lineto
  Tt setlinewidth stroke
  grestore
} bd
/OLE {
  /Tcx currentpoint pop def
  gsave
  newpath
  cf findfont cs scalefont dup
  /FontMatrix get 0 get /Ts exch def /FontInfo get dup
  /UnderlinePosition get Ts mul /To exch def
  /UnderlineThickness get Ts mul /Tt exch def
  ux uy To add cs add moveto Tcx uy To add cs add lineto
  Tt setlinewidth stroke
  grestore
} bd
/SOE {
  /Tcx currentpoint pop def
  gsave
  newpath
  cf findfont cs scalefont dup
  /FontMatrix get 0 get /Ts exch def /FontInfo get dup
  /UnderlinePosition get Ts mul /To exch def
  /UnderlineThickness get Ts mul /Tt exch def
  ux uy To add cs 10 mul 26 idiv add moveto Tcx uy To add cs 10 mul 26 idiv add lineto
  Tt setlinewidth stroke
  grestore
} bd
/QT {
/Y22 exch store
/X22 exch store
/Y21 exch store
/X21 exch store
currentpoint
/Y21 load 2 mul add 3 div exch
/X21 load 2 mul add 3 div exch
/X21 load 2 mul /X22 load add 3 div
/Y21 load 2 mul /Y22 load add 3 div
/X22 load /Y22 load curveto
} bd
/SSPD {
dup length /d exch dict def
{
/v exch def
/k exch def
currentpagedevice k known {
/cpdv currentpagedevice k get def
v cpdv ne {
/upd false def
/nullv v type /nulltype eq def
/nullcpdv cpdv type /nulltype eq def
nullv nullcpdv or
{
/upd true def
} {
/sametype v type cpdv type eq def
sametype {
v type /arraytype eq {
/vlen v length def
/cpdvlen cpdv length def
vlen cpdvlen eq {
0 1 vlen 1 sub {
/i exch def
/obj v i get def
/cpdobj cpdv i get def
obj cpdobj ne {
/upd true def
exit
} if
} for
} {
/upd true def
} ifelse
} {
v type /dicttype eq {
v {
/dv exch def
/dk exch def
/cpddv cpdv dk get def
dv cpddv ne {
/upd true def
exit
} if
} forall
} {
/upd true def
} ifelse
} ifelse
} if
} ifelse
upd true eq {
d k v put
} if
} if
} if
} forall
d length 0 gt {
d setpagedevice
} if
} bd
/RE { % /NewFontName [NewEncodingArray] /FontName RE -
  findfont dup length dict begin
  {
    1 index /FID ne
    {def} {pop pop} ifelse
  } forall
  /Encoding exch def
  /FontName 1 index def
  currentdict definefont pop
  end
} bind def
%%EndResource
%%BeginResource: procset (Apache XML Graphics EPS ProcSet) 1.0 0
%%Version: 1.0 0
%%Copyright: (Copyright 2002-2003 The Apache Software Foundation. License terms: http://www.apache.org/licenses/LICENSE-2.0)
/BeginEPSF { %def
/b4_Inc_state save def         % Save state for cleanup
/dict_count countdictstack def % Count objects on dict stack
/op_count count 1 sub def      % Count objects on operand stack
userdict begin                 % Push userdict on dict stack
/showpage { } def              % Redefine showpage, { } = null proc
0 setgray 0 setlinecap         % Prepare graphics state
1 setlinewidth 0 setlinejoin
10 setmiterlimit [ ] 0 setdash newpath
/languagelevel where           % If level not equal to 1 then
{pop languagelevel             % set strokeadjust and
1 ne                           % overprint to their defaults.
{false setstrokeadjust false setoverprint
} if
} if
} bd
/EndEPSF { %def
count op_count sub {pop} repeat            % Clean up stacks
countdictstack dict_count sub {end} repeat
b4_Inc_state restore
} bd
%%EndResource
%FOPBeginFontDict
%%IncludeResource: font Courier-Oblique
%%IncludeResource: font Courier-BoldOblique
%%IncludeResource: font Courier-Bold
%%IncludeResource: font ZapfDingbats
%%IncludeResource: font Symbol
%%IncludeResource: font Helvetica
%%IncludeResource: font Helvetica-Oblique
%%IncludeResource: font Helvetica-Bold
%%IncludeResource: font Helvetica-BoldOblique
%%IncludeResource: font Times-Roman
%%IncludeResource: font Times-Italic
%%IncludeResource: font Times-Bold
%%IncludeResource: font Times-BoldItalic
%%IncludeResource: font Courier
%FOPEndFontDict
%%BeginResource: encoding WinAnsiEncoding
/WinAnsiEncoding [
/.notdef /.notdef /.notdef /.notdef /.notdef
/.notdef /.notdef /.notdef /.notdef /.notdef
/.notdef /.notdef /.notdef /.notdef /.notdef
/.notdef /.notdef /.notdef /.notdef /.notdef
/.notdef /.notdef /.notdef /.notdef /.notdef
/.notdef /.notdef /.notdef /.notdef /.notdef
/.notdef /.notdef /space /exclam /quotedbl
/numbersign /dollar /percent /ampersand /quotesingle
/parenleft /parenright /asterisk /plus /comma
/hyphen /period /slash /zero /one
/two /three /four /five /six
/seven /eight /nine /colon /semicolon
/less /equal /greater /question /at
/A /B /C /D /E
/F /G /H /I /J
/K /L /M /N /O
/P /Q /R /S /T
/U /V /W /X /Y
/Z /bracketleft /backslash /bracketright /asciicircum
/underscore /quoteleft /a /b /c
/d /e /f /g /h
/i /j /k /l /m
/n /o /p /q /r
/s /t /u /v /w
/x /y /z /braceleft /bar
/braceright /asciitilde /bullet /Euro /bullet
/quotesinglbase /florin /quotedblbase /ellipsis /dagger
/daggerdbl /circumflex /perthousand /Scaron /guilsinglleft
/OE /bullet /Zcaron /bullet /bullet
/quoteleft /quoteright /quotedblleft /quotedblright /bullet
/endash /emdash /asciitilde /trademark /scaron
/guilsinglright /oe /bullet /zcaron /Ydieresis
/space /exclamdown /cent /sterling /currency
/yen /brokenbar /section /dieresis /copyright
/ordfeminine /guillemotleft /logicalnot /sfthyphen /registered
/macron /degree /plusminus /twosuperior /threesuperior
/acute /mu /paragraph /middot /cedilla
/onesuperior /ordmasculine /guillemotright /onequarter /onehalf
/threequarters /questiondown /Agrave /Aacute /Acircumflex
/Atilde /Adieresis /Aring /AE /Ccedilla
/Egrave /Eacute /Ecircumflex /Edieresis /Igrave
/Iacute /Icircumflex /Idieresis /Eth /Ntilde
/Ograve /Oacute /Ocircumflex /Otilde /Odieresis
/multiply /Oslash /Ugrave /Uacute /Ucircumflex
/Udieresis /Yacute /Thorn /germandbls /agrave
/aacute /acircumflex /atilde /adieresis /aring
/ae /ccedilla /egrave /eacute /ecircumflex
/edieresis /igrave /iacute /icircumflex /idieresis
/eth /ntilde /ograve /oacute /ocircumflex
/otilde /odieresis /divide /oslash /ugrave
/uacute /ucircumflex /udieresis /yacute /thorn
/ydieresis
] def
%%EndResource
%FOPBeginFontReencode
/Courier-Oblique findfont
dup length dict begin
  {1 index /FID ne {def} {pop pop} ifelse} forall
  /Encoding WinAnsiEncoding def
  currentdict
end
/Courier-Oblique exch definefont pop
/Courier-BoldOblique findfont
dup length dict begin
  {1 index /FID ne {def} {pop pop} ifelse} forall
  /Encoding WinAnsiEncoding def
  currentdict
end
/Courier-BoldOblique exch definefont pop
/Courier-Bold findfont
dup length dict begin
  {1 index /FID ne {def} {pop pop} ifelse} forall
  /Encoding WinAnsiEncoding def
  currentdict
end
/Courier-Bold exch definefont pop
/Helvetica findfont
dup length dict begin
  {1 index /FID ne {def} {pop pop} ifelse} forall
  /Encoding WinAnsiEncoding def
  currentdict
end
/Helvetica exch definefont pop
/Helvetica-Oblique findfont
dup length dict begin
  {1 index /FID ne {def} {pop pop} ifelse} forall
  /Encoding WinAnsiEncoding def
  currentdict
end
/Helvetica-Oblique exch definefont pop
/Helvetica-Bold findfont
dup length dict begin
  {1 index /FID ne {def} {pop pop} ifelse} forall
  /Encoding WinAnsiEncoding def
  currentdict
end
/Helvetica-Bold exch definefont pop
/Helvetica-BoldOblique findfont
dup length dict begin
  {1 index /FID ne {def} {pop pop} ifelse} forall
  /Encoding WinAnsiEncoding def
  currentdict
end
/Helvetica-BoldOblique exch definefont pop
/Times-Roman findfont
dup length dict begin
  {1 index /FID ne {def} {pop pop} ifelse} forall
  /Encoding WinAnsiEncoding def
  currentdict
end
/Times-Roman exch definefont pop
/Times-Italic findfont
dup length dict begin
  {1 index /FID ne {def} {pop pop} ifelse} forall
  /Encoding WinAnsiEncoding def
  currentdict
end
/Times-Italic exch definefont pop
/Times-Bold findfont
dup length dict begin
  {1 index /FID ne {def} {pop pop} ifelse} forall
  /Encoding WinAnsiEncoding def
  currentdict
end
/Times-Bold exch definefont pop
/Times-BoldItalic findfont
dup length dict begin
  {1 index /FID ne {def} {pop pop} ifelse} forall
  /Encoding WinAnsiEncoding def
  currentdict
end
/Times-BoldItalic exch definefont pop
/Courier findfont
dup length dict begin
  {1 index /FID ne {def} {pop pop} ifelse} forall
  /Encoding WinAnsiEncoding def
  currentdict
end
/Courier exch definefont pop
%FOPEndFontReencode
%%EndProlog
%%Page: 1 1
%%PageBoundingBox: 0 0 648 362
%%BeginPageSetup
[1 0 0 -1 0 362] CT
%%EndPageSetup
GS
[0.75 0 0 0.75 0 -0.25] CT
N
0 0 M
864 0 L
864 483 L
0 483 L
0 0 L
cp
clip
1 GC
N
0 0 864 483 re
f
GR
GS
[0.75 0 0 0.75 0 -0.25] CT
1 GC
N
0 0 864 483 re
f
GR
GS
[0.75 0 0 0.75 0 -0.25] CT
1 GC
N
112 410 M
782 410 L
782 36 L
112 36 L
cp
f
GR
GS
[0.75 0 0 0.75 0 -0.25] CT
0.149 GC
2 setlinecap
1 LJ
0.667 LW
N
112 410 M
782 410 L
S
GR
GS
[0.75 0 0 0.75 0 -0.25] CT
0.149 GC
2 setlinecap
1 LJ
0.667 LW
N
112 36 M
782 36 L
S
GR
GS
[0.75 0 0 0.75 0 -0.25] CT
0.149 GC
2 setlinecap
1 LJ
0.667 LW
N
112 410 M
112 403.3 L
S
GR
GS
[0.75 0 0 0.75 0 -0.25] CT
0.149 GC
2 setlinecap
1 LJ
0.667 LW
N
205.056 410 M
205.056 403.3 L
S
GR
GS
[0.75 0 0 0.75 0 -0.25] CT
0.149 GC
2 setlinecap
1 LJ
0.667 LW
N
298.111 410 M
298.111 403.3 L
S
GR
GS
[0.75 0 0 0.75 0 -0.25] CT
0.149 GC
2 setlinecap
1 LJ
0.667 LW
N
391.167 410 M
391.167 403.3 L
S
GR
GS
[0.75 0 0 0.75 0 -0.25] CT
0.149 GC
2 setlinecap
1 LJ
0.667 LW
N
484.222 410 M
484.222 403.3 L
S
GR
GS
[0.75 0 0 0.75 0 -0.25] CT
0.149 GC
2 setlinecap
1 LJ
0.667 LW
N
577.278 410 M
577.278 403.3 L
S
GR
GS
[0.75 0 0 0.75 0 -0.25] CT
0.149 GC
2 setlinecap
1 LJ
0.667 LW
N
670.333 410 M
670.333 403.3 L
S
GR
GS
[0.75 0 0 0.75 0 -0.25] CT
0.149 GC
2 setlinecap
1 LJ
0.667 LW
N
763.389 410 M
763.389 403.3 L
S
GR
GS
[0.75 0 0 0.75 0 -0.25] CT
0.149 GC
2 setlinecap
1 LJ
0.667 LW
N
112 36 M
112 42.7 L
S
GR
GS
[0.75 0 0 0.75 0 -0.25] CT
0.149 GC
2 setlinecap
1 LJ
0.667 LW
N
205.056 36 M
205.056 42.7 L
S
GR
GS
[0.75 0 0 0.75 0 -0.25] CT
0.149 GC
2 setlinecap
1 LJ
0.667 LW
N
298.111 36 M
298.111 42.7 L
S
GR
GS
[0.75 0 0 0.75 0 -0.25] CT
0.149 GC
2 setlinecap
1 LJ
0.667 LW
N
391.167 36 M
391.167 42.7 L
S
GR
GS
[0.75 0 0 0.75 0 -0.25] CT
0.149 GC
2 setlinecap
1 LJ
0.667 LW
N
484.222 36 M
484.222 42.7 L
S
GR
GS
[0.75 0 0 0.75 0 -0.25] CT
0.149 GC
2 setlinecap
1 LJ
0.667 LW
N
577.278 36 M
577.278 42.7 L
S
GR
GS
[0.75 0 0 0.75 0 -0.25] CT
0.149 GC
2 setlinecap
1 LJ
0.667 LW
N
670.333 36 M
670.333 42.7 L
S
GR
GS
[0.75 0 0 0.75 0 -0.25] CT
0.149 GC
2 setlinecap
1 LJ
0.667 LW
N
763.389 36 M
763.389 42.7 L
S
GR
GS
[0.75 0 0 0.75 84 312.85001] CT
0.149 GC
/Helvetica 24 F
GS
[1 0 0 1 0 0] CT
-7 25 moveto 
1 -1 scale
(0) t 
GR
GR
GS
[0.75 0 0 0.75 153.79167 312.85001] CT
0.149 GC
/Helvetica 24 F
GS
[1 0 0 1 0 0] CT
-13.5 25 moveto 
1 -1 scale
(50) t 
GR
GR
GS
[0.75 0 0 0.75 223.58334 312.85001] CT
0.149 GC
/Helvetica 24 F
GS
[1 0 0 1 0 0] CT
-20.5 25 moveto 
1 -1 scale
(100) t 
GR
GR
GS
[0.75 0 0 0.75 293.37499 312.85001] CT
0.149 GC
/Helvetica 24 F
GS
[1 0 0 1 0 0] CT
-20.5 25 moveto 
1 -1 scale
(150) t 
GR
GR
GS
[0.75 0 0 0.75 363.16667 312.85001] CT
0.149 GC
/Helvetica 24 F
GS
[1 0 0 1 0 0] CT
-20.5 25 moveto 
1 -1 scale
(200) t 
GR
GR
GS
[0.75 0 0 0.75 432.95833 312.85001] CT
0.149 GC
/Helvetica 24 F
GS
[1 0 0 1 0 0] CT
-20.5 25 moveto 
1 -1 scale
(250) t 
GR
GR
GS
[0.75 0 0 0.75 502.74998 312.85001] CT
0.149 GC
/Helvetica 24 F
GS
[1 0 0 1 0 0] CT
-20.5 25 moveto 
1 -1 scale
(300) t 
GR
GR
GS
[0.75 0 0 0.75 572.54169 312.85001] CT
0.149 GC
/Helvetica 24 F
GS
[1 0 0 1 0 0] CT
-20.5 25 moveto 
1 -1 scale
(350) t 
GR
GR
GS
[0.75 0 0 0.75 335.25023 337.09999] CT
0.149 GC
/Helvetica 26.4 F
GS
[1 0 0 1 0 0] CT
-56.5 27 moveto 
1 -1 scale
(Epoch \(s\)) t 
GR
GR
GS
[0.75 0 0 0.75 0 -0.25] CT
0.149 GC
2 setlinecap
1 LJ
0.667 LW
N
112 410 M
112 36 L
S
GR
GS
[0.75 0 0 0.75 0 -0.25] CT
0.149 GC
2 setlinecap
1 LJ
0.667 LW
N
782 410 M
782 36 L
S
GR
GS
[0.75 0 0 0.75 0 -0.25] CT
0.149 GC
2 setlinecap
1 LJ
0.667 LW
N
112 410 M
118.7 410 L
S
GR
GS
[0.75 0 0 0.75 0 -0.25] CT
0.149 GC
2 setlinecap
1 LJ
0.667 LW
N
112 335.2 M
118.7 335.2 L
S
GR
GS
[0.75 0 0 0.75 0 -0.25] CT
0.149 GC
2 setlinecap
1 LJ
0.667 LW
N
112 260.4 M
118.7 260.4 L
S
GR
GS
[0.75 0 0 0.75 0 -0.25] CT
0.149 GC
2 setlinecap
1 LJ
0.667 LW
N
112 185.6 M
118.7 185.6 L
S
GR
GS
[0.75 0 0 0.75 0 -0.25] CT
0.149 GC
2 setlinecap
1 LJ
0.667 LW
N
112 110.8 M
118.7 110.8 L
S
GR
GS
[0.75 0 0 0.75 0 -0.25] CT
0.149 GC
2 setlinecap
1 LJ
0.667 LW
N
112 36 M
118.7 36 L
S
GR
GS
[0.75 0 0 0.75 0 -0.25] CT
0.149 GC
2 setlinecap
1 LJ
0.667 LW
N
782 410 M
775.3 410 L
S
GR
GS
[0.75 0 0 0.75 0 -0.25] CT
0.149 GC
2 setlinecap
1 LJ
0.667 LW
N
782 335.2 M
775.3 335.2 L
S
GR
GS
[0.75 0 0 0.75 0 -0.25] CT
0.149 GC
2 setlinecap
1 LJ
0.667 LW
N
782 260.4 M
775.3 260.4 L
S
GR
GS
[0.75 0 0 0.75 0 -0.25] CT
0.149 GC
2 setlinecap
1 LJ
0.667 LW
N
782 185.6 M
775.3 185.6 L
S
GR
GS
[0.75 0 0 0.75 0 -0.25] CT
0.149 GC
2 setlinecap
1 LJ
0.667 LW
N
782 110.8 M
775.3 110.8 L
S
GR
GS
[0.75 0 0 0.75 0 -0.25] CT
0.149 GC
2 setlinecap
1 LJ
0.667 LW
N
782 36 M
775.3 36 L
S
GR
GS
[0.75 0 0 0.75 78.4 307.25] CT
0.149 GC
/Helvetica 24 F
GS
[1 0 0 1 0 0] CT
-14 9.5 moveto 
1 -1 scale
(0) t 
GR
GR
GS
[0.75 0 0 0.75 78.4 251.15001] CT
0.149 GC
/Helvetica 24 F
GS
[1 0 0 1 0 0] CT
-27 9.5 moveto 
1 -1 scale
(10) t 
GR
GR
GS
[0.75 0 0 0.75 78.4 195.05] CT
0.149 GC
/Helvetica 24 F
GS
[1 0 0 1 0 0] CT
-27 9.5 moveto 
1 -1 scale
(20) t 
GR
GR
GS
[0.75 0 0 0.75 78.4 138.95] CT
0.149 GC
/Helvetica 24 F
GS
[1 0 0 1 0 0] CT
-27 9.5 moveto 
1 -1 scale
(30) t 
GR
GR
GS
[0.75 0 0 0.75 78.4 82.85] CT
0.149 GC
/Helvetica 24 F
GS
[1 0 0 1 0 0] CT
-27 9.5 moveto 
1 -1 scale
(40) t 
GR
GR
GS
[0.75 0 0 0.75 78.4 26.75] CT
0.149 GC
/Helvetica 24 F
GS
[1 0 0 1 0 0] CT
-27 9.5 moveto 
1 -1 scale
(50) t 
GR
GR
GS
[0 -0.75 0.75 0 48.23551 168.04989] CT
0.149 GC
/Helvetica 26.667 F
GS
[1 0 0 1 0 0] CT
-148.5 -6 moveto 
1 -1 scale
(Baseline length Error \(m\)) t 
GR
GR
GS
[0.75 0 0 0.75 0 -0.25] CT
0 0.447 0.741 RC
1 LJ
2.667 LW
N
113.861 404.419 M
115.722 389.286 L
117.583 389.613 L
119.444 383.08 L
121.306 389.664 L
123.167 388.694 L
125.028 390.71 L
126.889 389.512 L
128.75 388.006 L
130.611 375.047 L
132.472 368.743 L
134.333 369.074 L
136.194 368.753 L
138.056 375.084 L
139.917 387.111 L
141.778 390.068 L
143.639 385.268 L
145.5 384.292 L
147.361 383.548 L
149.222 381.09 L
151.083 372.534 L
152.944 372.524 L
154.806 368.897 L
156.667 368.646 L
158.528 373.826 L
160.389 382.217 L
162.25 380.358 L
164.111 382.842 L
165.972 382.638 L
167.833 374.325 L
169.694 373.181 L
171.556 370.255 L
173.417 370.715 L
175.278 362.202 L
177.139 363.056 L
179 361.753 L
180.861 369.966 L
182.722 370.279 L
184.583 377.678 L
186.444 382.354 L
188.306 382.051 L
190.167 380.998 L
192.028 385.282 L
193.889 380.878 L
195.75 381.081 L
197.611 386.883 L
199.472 382.528 L
201.333 380.306 L
203.194 385.349 L
205.056 385.005 L
206.917 384.878 L
208.778 383.642 L
210.639 382.157 L
212.5 385.061 L
214.361 387.492 L
216.222 385.201 L
218.083 394.421 L
219.944 395.692 L
221.806 393.77 L
223.667 386.579 L
225.528 391.194 L
227.389 388.866 L
229.25 390.535 L
231.111 389.212 L
232.972 393.237 L
234.833 388.356 L
236.694 384.741 L
238.556 383.905 L
240.417 383.759 L
242.278 381.595 L
244.139 377.563 L
246 375.539 L
247.861 359.605 L
249.722 361.942 L
251.583 366.378 L
253.444 366.373 L
255.306 373.092 L
257.167 390.068 L
259.028 387.817 L
260.889 384.937 L
262.75 381.84 L
264.611 376.049 L
266.472 376.892 L
268.333 379.633 L
270.194 382.165 L
272.056 390.143 L
273.917 393.991 L
275.778 392.067 L
277.639 392.719 L
279.5 391.717 L
281.361 381.179 L
283.222 379.271 L
285.083 380.042 L
286.944 375.105 L
288.806 369.88 L
290.667 374.468 L
292.528 369.56 L
294.389 369.721 L
296.25 362.505 L
298.111 359.679 L
299.972 366.822 L
301.833 373.738 L
303.694 373.691 L
305.556 382.643 L
307.417 387.078 L
309.278 386.476 L
311.139 383.521 L
313 382.418 L
314.861 375.825 L
316.722 380.606 L
318.583 376.92 L
320.444 379.838 L
322.306 380.471 L
324.167 387.487 L
326.028 387.411 L
327.889 377.381 L
329.75 374.875 L
331.611 375.005 L
333.472 376.629 L
335.333 377.342 L
337.194 393.007 L
339.056 387 L
340.917 375.542 L
342.778 374.688 L
344.639 371.462 L
346.5 366.398 L
348.361 371.636 L
350.222 383.249 L
352.083 383.302 L
353.944 378.3 L
355.806 384.588 L
357.667 387.964 L
359.528 389.155 L
361.389 391.001 L
363.25 392.111 L
365.111 390.402 L
366.972 388.309 L
368.833 386.097 L
370.694 382.192 L
372.556 387.39 L
374.417 385.136 L
376.278 383.534 L
378.139 383.529 L
380 386.75 L
381.861 381.934 L
383.722 373.874 L
385.583 378.075 L
387.444 377.248 L
389.306 369.417 L
391.167 372.04 L
393.028 383.194 L
394.889 380.522 L
396.75 382.22 L
398.611 387.508 L
400.472 383.574 L
402.333 380.546 L
404.194 379.751 L
406.056 373.831 L
407.917 374.906 L
409.778 380.425 L
411.639 381.491 L
413.5 385.57 L
415.361 390.732 L
417.222 391.124 L
419.083 388.126 L
420.944 390.889 L
422.806 390.542 L
424.667 388.597 L
426.528 386.354 L
428.389 390.712 L
430.25 384.581 L
432.111 383.071 L
433.972 380.484 L
435.833 383.578 L
437.694 385.515 L
439.556 387.704 L
441.417 389.898 L
443.278 395.806 L
445.139 393.003 L
447 391.96 L
448.861 395.477 L
450.722 392.209 L
452.583 390.943 L
454.444 385.853 L
456.306 384.772 L
458.167 380.385 L
460.028 378.678 L
461.889 381.951 L
463.75 389.286 L
465.611 384.125 L
467.472 376.292 L
469.333 371.216 L
471.194 367.268 L
473.056 360.296 L
474.917 367.602 L
476.778 367.63 L
478.639 376.929 L
480.5 377.889 L
482.361 383.681 L
484.222 380.25 L
486.083 381.859 L
487.944 378.646 L
489.806 380.001 L
491.667 377.583 L
493.528 376.983 L
495.389 382.007 L
497.25 380.31 L
499.111 371.722 L
500.972 365.49 L
502.833 366.611 L
504.694 365.824 L
506.556 368.802 L
508.417 368.923 L
510.278 377.818 L
512.139 372.556 L
514 377.009 L
515.861 377.038 L
517.722 381.792 L
519.583 375.22 L
521.444 378.717 L
523.306 377.817 L
525.167 378.375 L
527.028 377.67 L
528.889 379.609 L
530.75 382.886 L
532.611 384.926 L
534.472 383.883 L
536.333 389.487 L
538.194 396.959 L
540.056 396.224 L
541.917 394.244 L
543.778 388.793 L
545.639 386.177 L
547.5 382.338 L
549.361 382.229 L
551.222 376.656 L
553.083 381.856 L
554.944 384.004 L
556.806 383.216 L
558.667 384.908 L
560.528 392.254 L
562.389 396.502 L
564.25 397.006 L
566.111 399.665 L
567.972 396.274 L
569.833 396.002 L
571.694 392.503 L
573.556 389.474 L
575.417 379.895 L
577.278 379.717 L
579.139 371.765 L
581 373.032 L
582.861 373.32 L
584.722 381.541 L
586.583 383.648 L
588.444 390.629 L
590.306 390.676 L
592.167 392.885 L
594.028 389.895 L
595.889 389.668 L
597.75 392.429 L
599.611 393.805 L
601.472 392.622 L
603.333 398.961 L
605.194 396.287 L
607.056 391.365 L
608.917 389.448 L
610.778 388.331 L
612.639 386.014 L
614.5 385.851 L
616.361 384.985 L
618.222 381.267 L
620.083 383.252 L
621.944 380.52 L
623.806 382.799 L
625.667 384.027 L
627.528 383.399 L
629.389 381.246 L
631.25 383.061 L
633.111 376.449 L
634.972 379.855 L
636.833 385.859 L
638.694 386.832 L
640.556 388.406 L
642.417 392.803 L
644.278 391.585 L
646.139 387.517 L
648 383.458 L
649.861 381.855 L
651.722 380.716 L
653.583 375.297 L
655.444 379.19 L
657.306 383.461 L
659.167 383.353 L
661.028 380.997 L
662.889 384.117 L
664.75 383.517 L
666.611 383.473 L
668.472 377.714 L
670.333 375.854 L
672.194 376.111 L
674.056 376.947 L
675.917 377.392 L
677.778 384.869 L
679.639 390.29 L
681.5 390.598 L
683.361 389.993 L
685.222 387.322 L
687.083 382.53 L
688.944 383.569 L
690.806 380.69 L
692.667 379.185 L
694.528 380.454 L
696.389 381.01 L
698.25 378.425 L
700.111 376.687 L
701.972 377.389 L
703.833 374.281 L
705.694 366.494 L
707.556 368.662 L
709.417 368.26 L
711.278 365.06 L
713.139 365.231 L
715 376.969 L
716.861 379.517 L
718.722 386.948 L
720.583 389.766 L
722.444 393.359 L
724.306 388.353 L
726.167 386.903 L
728.028 384.239 L
729.889 379.412 L
731.75 379.158 L
733.611 386.01 L
735.472 387.359 L
737.333 385.271 L
739.194 386.781 L
741.056 386.037 L
742.917 382.884 L
744.778 382.665 L
746.639 387.384 L
748.5 389.217 L
750.361 384.715 L
752.222 383.561 L
754.083 385.808 L
755.944 382.721 L
757.806 378.794 L
759.667 375.886 L
761.528 372.136 L
763.389 356.704 L
765.25 359.296 L
767.111 360.338 L
768.972 364.916 L
770.833 367.214 L
772.694 381.915 L
774.556 382.651 L
776.417 389.806 L
778.278 391.426 L
780.139 394.201 L
782 382.633 L
S
GR
GS
[0.75 0 0 0.75 0 -0.25] CT
0.851 0.325 0.098 RC
1 LJ
2.667 LW
N
113.861 175.707 M
115.722 189.171 L
117.583 181.552 L
119.444 175.263 L
121.306 163.331 L
123.167 164.268 L
125.028 162.273 L
126.889 166.611 L
128.75 179.675 L
130.611 196.609 L
132.472 201.808 L
134.333 199.657 L
136.194 192.852 L
138.056 186.51 L
139.917 175.95 L
141.778 165.273 L
143.639 160.734 L
145.5 171.106 L
147.361 170.798 L
149.222 171.481 L
151.083 184.366 L
152.944 194.873 L
154.806 197.973 L
156.667 194.005 L
158.528 187.835 L
160.389 176.391 L
162.25 162.779 L
164.111 148.351 L
165.972 152.32 L
167.833 160.637 L
169.694 166.782 L
171.556 184.411 L
173.417 194.054 L
175.278 203.674 L
177.139 205.179 L
179 208.44 L
180.861 202.793 L
182.722 193.552 L
184.583 182.457 L
186.444 170.226 L
188.306 167.25 L
190.167 161.981 L
192.028 168.706 L
193.889 176.861 L
195.75 182.815 L
197.611 180.731 L
199.472 174.69 L
201.333 170.992 L
203.194 162.432 L
205.056 164.111 L
206.917 163.373 L
208.778 165.536 L
210.639 172.493 L
212.5 172.08 L
214.361 169.249 L
216.222 162.781 L
218.083 167.928 L
219.944 159.42 L
221.806 156.971 L
223.667 148.082 L
225.528 152.636 L
227.389 151.948 L
229.25 155.178 L
231.111 162.311 L
232.972 175.147 L
234.833 179.663 L
236.694 186.856 L
238.556 188.347 L
240.417 186.916 L
242.278 186.802 L
244.139 173.352 L
246 159.189 L
247.861 140.079 L
249.722 135.266 L
251.583 127.885 L
253.444 145.956 L
255.306 153.349 L
257.167 170.987 L
259.028 177.901 L
260.889 182.814 L
262.75 183.961 L
264.611 178.207 L
266.472 179.559 L
268.333 173.015 L
270.194 170.907 L
272.056 159.38 L
273.917 164.212 L
275.778 166.969 L
277.639 168.178 L
279.5 171.787 L
281.361 186.928 L
283.222 192.731 L
285.083 191.32 L
286.944 195.924 L
288.806 183.438 L
290.667 160.038 L
292.528 146.288 L
294.389 145.945 L
296.25 129.634 L
298.111 126.493 L
299.972 136.928 L
301.833 147.397 L
303.694 146.71 L
305.556 161.354 L
307.417 166.402 L
309.278 169.295 L
311.139 164.47 L
313 167.816 L
314.861 155.601 L
316.722 160.645 L
318.583 161.985 L
320.444 169.986 L
322.306 163.489 L
324.167 172.542 L
326.028 175.434 L
327.889 153.684 L
329.75 144.951 L
331.611 150.157 L
333.472 150.204 L
335.333 149.804 L
337.194 167.893 L
339.056 184.204 L
340.917 194.282 L
342.778 198.137 L
344.639 201.97 L
346.5 193.997 L
348.361 175.632 L
350.222 165.533 L
352.083 164.845 L
353.944 170.418 L
355.806 177.692 L
357.667 183.575 L
359.528 179.156 L
361.389 176.379 L
363.25 158.219 L
365.111 159.248 L
366.972 164.465 L
368.833 169.287 L
370.694 175.364 L
372.556 183.264 L
374.417 178.469 L
376.278 169.128 L
378.139 167.434 L
380 160.59 L
381.861 151.671 L
383.722 141.717 L
385.583 143.746 L
387.444 144.196 L
389.306 137.022 L
391.167 141.187 L
393.028 153.283 L
394.889 162.271 L
396.75 158.59 L
398.611 170.57 L
400.472 185.028 L
402.333 190.729 L
404.194 191.108 L
406.056 200.513 L
407.917 194.366 L
409.778 188.35 L
411.639 186.04 L
413.5 177.871 L
415.361 173.63 L
417.222 178.847 L
419.083 167.877 L
420.944 164.733 L
422.806 164.246 L
424.667 155.041 L
426.528 156.132 L
428.389 162.668 L
430.25 159.166 L
432.111 164.503 L
433.972 177.516 L
435.833 174.972 L
437.694 174.663 L
439.556 182.666 L
441.417 181.398 L
443.278 172.529 L
445.139 167.363 L
447 170.375 L
448.861 166.711 L
450.722 161.033 L
452.583 159.084 L
454.444 153.448 L
456.306 148.804 L
458.167 153.112 L
460.028 161.932 L
461.889 165.262 L
463.75 177.641 L
465.611 188.6 L
467.472 196.692 L
469.333 201.707 L
471.194 203.883 L
473.056 191.499 L
474.917 183.512 L
476.778 182.616 L
478.639 174.706 L
480.5 172.061 L
482.361 181.585 L
484.222 185.924 L
486.083 162.245 L
487.944 154.899 L
489.806 157.605 L
491.667 163.899 L
493.528 162.692 L
495.389 181.278 L
497.25 194.066 L
499.111 202.261 L
500.972 207.135 L
502.833 200.012 L
504.694 186.03 L
506.556 176.692 L
508.417 174.602 L
510.278 162.426 L
512.139 156.486 L
514 162.679 L
515.861 165.778 L
517.722 153.714 L
519.583 145.146 L
521.444 149.589 L
523.306 153.245 L
525.167 153.483 L
527.028 161.83 L
528.889 179.437 L
530.75 186.592 L
532.611 185.126 L
534.472 184.972 L
536.333 180.365 L
538.194 172.082 L
540.056 171.832 L
541.917 175.092 L
543.778 165.086 L
545.639 167.085 L
547.5 168.945 L
549.361 170.345 L
551.222 175.715 L
553.083 189.95 L
554.944 186.719 L
556.806 180.306 L
558.667 178.812 L
560.528 167.728 L
562.389 161.083 L
564.25 162.002 L
566.111 169.137 L
567.972 172.42 L
569.833 171.523 L
571.694 175.242 L
573.556 172.292 L
575.417 158.904 L
577.278 148.879 L
579.139 161.475 L
581 159.644 L
582.861 165.821 L
584.722 180.186 L
586.583 186.331 L
588.444 179.239 L
590.306 181.584 L
592.167 178.239 L
594.028 168.134 L
595.889 164.303 L
597.75 160.365 L
599.611 158.925 L
601.472 157.673 L
603.333 164.452 L
605.194 160.849 L
607.056 155.952 L
608.917 157.144 L
610.778 162.217 L
612.639 165.129 L
614.5 177.905 L
616.361 188.633 L
618.222 180.123 L
620.083 175.373 L
621.944 178.281 L
623.806 170.388 L
625.667 170.781 L
627.528 179.685 L
629.389 182.132 L
631.25 178.03 L
633.111 168.717 L
634.972 161.553 L
636.833 156.138 L
638.694 158.145 L
640.556 158.308 L
642.417 164.769 L
644.278 163.177 L
646.139 159.398 L
648 162.251 L
649.861 163.553 L
651.722 174.927 L
653.583 186.836 L
655.444 195.137 L
657.306 192.151 L
659.167 187.38 L
661.028 171.638 L
662.889 158.315 L
664.75 158.314 L
666.611 157.546 L
668.472 165.274 L
670.333 183.972 L
672.194 191.857 L
674.056 190.107 L
675.917 186.593 L
677.778 178.178 L
679.639 173.587 L
681.5 173.567 L
683.361 174.734 L
685.222 175.029 L
687.083 173.153 L
688.944 165.458 L
690.806 157.405 L
692.667 151.9 L
694.528 151.597 L
696.389 160.505 L
698.25 166.845 L
700.111 180.52 L
701.972 183.233 L
703.833 180.529 L
705.694 162.629 L
707.556 152.74 L
709.417 152.874 L
711.278 158.598 L
713.139 167.925 L
715 179.158 L
716.861 183.19 L
718.722 176.298 L
720.583 170.421 L
722.444 164.925 L
724.306 159.115 L
726.167 159.858 L
728.028 153.468 L
729.889 147.303 L
731.75 145.898 L
733.611 154.05 L
735.472 158.227 L
737.333 168.946 L
739.194 170.143 L
741.056 170.551 L
742.917 165.886 L
744.778 160.641 L
746.639 155.734 L
748.5 161.322 L
750.361 154.126 L
752.222 154.894 L
754.083 156.094 L
755.944 160.199 L
757.806 169.562 L
759.667 188.237 L
761.528 198.558 L
763.389 212.865 L
765.25 205.839 L
767.111 189.156 L
768.972 173.486 L
770.833 170.102 L
772.694 157.077 L
774.556 156.975 L
776.417 164.315 L
778.278 166.47 L
780.139 159.019 L
782 151.293 L
S
GR
GS
[0.75 0 0 0.75 0 -0.25] CT
0 0.447 0.741 RC
1 LJ
0.667 LW
N
113.861 381.703 M
115.722 381.703 L
117.583 381.703 L
119.444 381.703 L
121.306 381.703 L
123.167 381.703 L
125.028 381.703 L
126.889 381.703 L
128.75 381.703 L
130.611 381.703 L
132.472 381.703 L
134.333 381.703 L
136.194 381.703 L
138.056 381.703 L
139.917 381.703 L
141.778 381.703 L
143.639 381.703 L
145.5 381.703 L
147.361 381.703 L
149.222 381.703 L
151.083 381.703 L
152.944 381.703 L
154.806 381.703 L
156.667 381.703 L
158.528 381.703 L
160.389 381.703 L
162.25 381.703 L
164.111 381.703 L
165.972 381.703 L
167.833 381.703 L
169.694 381.703 L
171.556 381.703 L
173.417 381.703 L
175.278 381.703 L
177.139 381.703 L
179 381.703 L
180.861 381.703 L
182.722 381.703 L
184.583 381.703 L
186.444 381.703 L
188.306 381.703 L
190.167 381.703 L
192.028 381.703 L
193.889 381.703 L
195.75 381.703 L
197.611 381.703 L
199.472 381.703 L
201.333 381.703 L
203.194 381.703 L
205.056 381.703 L
206.917 381.703 L
208.778 381.703 L
210.639 381.703 L
212.5 381.703 L
214.361 381.703 L
216.222 381.703 L
218.083 381.703 L
219.944 381.703 L
221.806 381.703 L
223.667 381.703 L
225.528 381.703 L
227.389 381.703 L
229.25 381.703 L
231.111 381.703 L
232.972 381.703 L
234.833 381.703 L
236.694 381.703 L
238.556 381.703 L
240.417 381.703 L
242.278 381.703 L
244.139 381.703 L
246 381.703 L
247.861 381.703 L
249.722 381.703 L
251.583 381.703 L
253.444 381.703 L
255.306 381.703 L
257.167 381.703 L
259.028 381.703 L
260.889 381.703 L
262.75 381.703 L
264.611 381.703 L
266.472 381.703 L
268.333 381.703 L
270.194 381.703 L
272.056 381.703 L
273.917 381.703 L
275.778 381.703 L
277.639 381.703 L
279.5 381.703 L
281.361 381.703 L
283.222 381.703 L
285.083 381.703 L
286.944 381.703 L
288.806 381.703 L
290.667 381.703 L
292.528 381.703 L
294.389 381.703 L
296.25 381.703 L
298.111 381.703 L
299.972 381.703 L
301.833 381.703 L
303.694 381.703 L
305.556 381.703 L
307.417 381.703 L
309.278 381.703 L
311.139 381.703 L
313 381.703 L
314.861 381.703 L
316.722 381.703 L
318.583 381.703 L
320.444 381.703 L
322.306 381.703 L
324.167 381.703 L
326.028 381.703 L
327.889 381.703 L
329.75 381.703 L
331.611 381.703 L
333.472 381.703 L
335.333 381.703 L
337.194 381.703 L
339.056 381.703 L
340.917 381.703 L
342.778 381.703 L
344.639 381.703 L
346.5 381.703 L
348.361 381.703 L
350.222 381.703 L
352.083 381.703 L
353.944 381.703 L
355.806 381.703 L
357.667 381.703 L
359.528 381.703 L
361.389 381.703 L
363.25 381.703 L
365.111 381.703 L
366.972 381.703 L
368.833 381.703 L
370.694 381.703 L
372.556 381.703 L
374.417 381.703 L
376.278 381.703 L
378.139 381.703 L
380 381.703 L
381.861 381.703 L
383.722 381.703 L
385.583 381.703 L
387.444 381.703 L
389.306 381.703 L
391.167 381.703 L
393.028 381.703 L
394.889 381.703 L
396.75 381.703 L
398.611 381.703 L
400.472 381.703 L
402.333 381.703 L
404.194 381.703 L
406.056 381.703 L
407.917 381.703 L
409.778 381.703 L
411.639 381.703 L
413.5 381.703 L
415.361 381.703 L
417.222 381.703 L
419.083 381.703 L
420.944 381.703 L
422.806 381.703 L
424.667 381.703 L
426.528 381.703 L
428.389 381.703 L
430.25 381.703 L
432.111 381.703 L
433.972 381.703 L
435.833 381.703 L
437.694 381.703 L
439.556 381.703 L
441.417 381.703 L
443.278 381.703 L
445.139 381.703 L
447 381.703 L
448.861 381.703 L
450.722 381.703 L
452.583 381.703 L
454.444 381.703 L
456.306 381.703 L
458.167 381.703 L
460.028 381.703 L
461.889 381.703 L
463.75 381.703 L
465.611 381.703 L
467.472 381.703 L
469.333 381.703 L
471.194 381.703 L
473.056 381.703 L
474.917 381.703 L
476.778 381.703 L
478.639 381.703 L
480.5 381.703 L
482.361 381.703 L
484.222 381.703 L
486.083 381.703 L
487.944 381.703 L
489.806 381.703 L
491.667 381.703 L
493.528 381.703 L
495.389 381.703 L
497.25 381.703 L
499.111 381.703 L
500.972 381.703 L
502.833 381.703 L
504.694 381.703 L
506.556 381.703 L
508.417 381.703 L
510.278 381.703 L
512.139 381.703 L
514 381.703 L
515.861 381.703 L
517.722 381.703 L
519.583 381.703 L
521.444 381.703 L
523.306 381.703 L
525.167 381.703 L
527.028 381.703 L
528.889 381.703 L
530.75 381.703 L
532.611 381.703 L
534.472 381.703 L
536.333 381.703 L
538.194 381.703 L
540.056 381.703 L
541.917 381.703 L
543.778 381.703 L
545.639 381.703 L
547.5 381.703 L
549.361 381.703 L
551.222 381.703 L
553.083 381.703 L
554.944 381.703 L
556.806 381.703 L
558.667 381.703 L
560.528 381.703 L
562.389 381.703 L
564.25 381.703 L
566.111 381.703 L
567.972 381.703 L
569.833 381.703 L
571.694 381.703 L
573.556 381.703 L
575.417 381.703 L
577.278 381.703 L
579.139 381.703 L
581 381.703 L
582.861 381.703 L
584.722 381.703 L
586.583 381.703 L
588.444 381.703 L
590.306 381.703 L
592.167 381.703 L
594.028 381.703 L
595.889 381.703 L
597.75 381.703 L
599.611 381.703 L
601.472 381.703 L
603.333 381.703 L
605.194 381.703 L
607.056 381.703 L
608.917 381.703 L
610.778 381.703 L
612.639 381.703 L
614.5 381.703 L
616.361 381.703 L
618.222 381.703 L
620.083 381.703 L
621.944 381.703 L
623.806 381.703 L
625.667 381.703 L
627.528 381.703 L
629.389 381.703 L
631.25 381.703 L
633.111 381.703 L
634.972 381.703 L
636.833 381.703 L
638.694 381.703 L
640.556 381.703 L
642.417 381.703 L
644.278 381.703 L
646.139 381.703 L
648 381.703 L
649.861 381.703 L
651.722 381.703 L
653.583 381.703 L
655.444 381.703 L
657.306 381.703 L
659.167 381.703 L
661.028 381.703 L
662.889 381.703 L
664.75 381.703 L
666.611 381.703 L
668.472 381.703 L
670.333 381.703 L
672.194 381.703 L
674.056 381.703 L
675.917 381.703 L
677.778 381.703 L
679.639 381.703 L
681.5 381.703 L
683.361 381.703 L
685.222 381.703 L
687.083 381.703 L
688.944 381.703 L
690.806 381.703 L
692.667 381.703 L
694.528 381.703 L
696.389 381.703 L
698.25 381.703 L
700.111 381.703 L
701.972 381.703 L
703.833 381.703 L
705.694 381.703 L
707.556 381.703 L
709.417 381.703 L
711.278 381.703 L
713.139 381.703 L
715 381.703 L
716.861 381.703 L
718.722 381.703 L
720.583 381.703 L
722.444 381.703 L
724.306 381.703 L
726.167 381.703 L
728.028 381.703 L
729.889 381.703 L
731.75 381.703 L
733.611 381.703 L
735.472 381.703 L
737.333 381.703 L
739.194 381.703 L
741.056 381.703 L
742.917 381.703 L
744.778 381.703 L
746.639 381.703 L
748.5 381.703 L
750.361 381.703 L
752.222 381.703 L
754.083 381.703 L
755.944 381.703 L
757.806 381.703 L
759.667 381.703 L
761.528 381.703 L
763.389 381.703 L
765.25 381.703 L
767.111 381.703 L
768.972 381.703 L
770.833 381.703 L
772.694 381.703 L
774.556 381.703 L
776.417 381.703 L
778.278 381.703 L
780.139 381.703 L
782 381.703 L
S
GR
GS
[0.75 0 0 0.75 0 -0.25] CT
0.851 0.325 0.098 RC
1 LJ
0.667 LW
N
113.861 170.522 M
115.722 170.522 L
117.583 170.522 L
119.444 170.522 L
121.306 170.522 L
123.167 170.522 L
125.028 170.522 L
126.889 170.522 L
128.75 170.522 L
130.611 170.522 L
132.472 170.522 L
134.333 170.522 L
136.194 170.522 L
138.056 170.522 L
139.917 170.522 L
141.778 170.522 L
143.639 170.522 L
145.5 170.522 L
147.361 170.522 L
149.222 170.522 L
151.083 170.522 L
152.944 170.522 L
154.806 170.522 L
156.667 170.522 L
158.528 170.522 L
160.389 170.522 L
162.25 170.522 L
164.111 170.522 L
165.972 170.522 L
167.833 170.522 L
169.694 170.522 L
171.556 170.522 L
173.417 170.522 L
175.278 170.522 L
177.139 170.522 L
179 170.522 L
180.861 170.522 L
182.722 170.522 L
184.583 170.522 L
186.444 170.522 L
188.306 170.522 L
190.167 170.522 L
192.028 170.522 L
193.889 170.522 L
195.75 170.522 L
197.611 170.522 L
199.472 170.522 L
201.333 170.522 L
203.194 170.522 L
205.056 170.522 L
206.917 170.522 L
208.778 170.522 L
210.639 170.522 L
212.5 170.522 L
214.361 170.522 L
216.222 170.522 L
218.083 170.522 L
219.944 170.522 L
221.806 170.522 L
223.667 170.522 L
225.528 170.522 L
227.389 170.522 L
229.25 170.522 L
231.111 170.522 L
232.972 170.522 L
234.833 170.522 L
236.694 170.522 L
238.556 170.522 L
240.417 170.522 L
242.278 170.522 L
244.139 170.522 L
246 170.522 L
247.861 170.522 L
249.722 170.522 L
251.583 170.522 L
253.444 170.522 L
255.306 170.522 L
257.167 170.522 L
259.028 170.522 L
260.889 170.522 L
262.75 170.522 L
264.611 170.522 L
266.472 170.522 L
268.333 170.522 L
270.194 170.522 L
272.056 170.522 L
273.917 170.522 L
275.778 170.522 L
277.639 170.522 L
279.5 170.522 L
281.361 170.522 L
283.222 170.522 L
285.083 170.522 L
286.944 170.522 L
288.806 170.522 L
290.667 170.522 L
292.528 170.522 L
294.389 170.522 L
296.25 170.522 L
298.111 170.522 L
299.972 170.522 L
301.833 170.522 L
303.694 170.522 L
305.556 170.522 L
307.417 170.522 L
309.278 170.522 L
311.139 170.522 L
313 170.522 L
314.861 170.522 L
316.722 170.522 L
318.583 170.522 L
320.444 170.522 L
322.306 170.522 L
324.167 170.522 L
326.028 170.522 L
327.889 170.522 L
329.75 170.522 L
331.611 170.522 L
333.472 170.522 L
335.333 170.522 L
337.194 170.522 L
339.056 170.522 L
340.917 170.522 L
342.778 170.522 L
344.639 170.522 L
346.5 170.522 L
348.361 170.522 L
350.222 170.522 L
352.083 170.522 L
353.944 170.522 L
355.806 170.522 L
357.667 170.522 L
359.528 170.522 L
361.389 170.522 L
363.25 170.522 L
365.111 170.522 L
366.972 170.522 L
368.833 170.522 L
370.694 170.522 L
372.556 170.522 L
374.417 170.522 L
376.278 170.522 L
378.139 170.522 L
380 170.522 L
381.861 170.522 L
383.722 170.522 L
385.583 170.522 L
387.444 170.522 L
389.306 170.522 L
391.167 170.522 L
393.028 170.522 L
394.889 170.522 L
396.75 170.522 L
398.611 170.522 L
400.472 170.522 L
402.333 170.522 L
404.194 170.522 L
406.056 170.522 L
407.917 170.522 L
409.778 170.522 L
411.639 170.522 L
413.5 170.522 L
415.361 170.522 L
417.222 170.522 L
419.083 170.522 L
420.944 170.522 L
422.806 170.522 L
424.667 170.522 L
426.528 170.522 L
428.389 170.522 L
430.25 170.522 L
432.111 170.522 L
433.972 170.522 L
435.833 170.522 L
437.694 170.522 L
439.556 170.522 L
441.417 170.522 L
443.278 170.522 L
445.139 170.522 L
447 170.522 L
448.861 170.522 L
450.722 170.522 L
452.583 170.522 L
454.444 170.522 L
456.306 170.522 L
458.167 170.522 L
460.028 170.522 L
461.889 170.522 L
463.75 170.522 L
465.611 170.522 L
467.472 170.522 L
469.333 170.522 L
471.194 170.522 L
473.056 170.522 L
474.917 170.522 L
476.778 170.522 L
478.639 170.522 L
480.5 170.522 L
482.361 170.522 L
484.222 170.522 L
486.083 170.522 L
487.944 170.522 L
489.806 170.522 L
491.667 170.522 L
493.528 170.522 L
495.389 170.522 L
497.25 170.522 L
499.111 170.522 L
500.972 170.522 L
502.833 170.522 L
504.694 170.522 L
506.556 170.522 L
508.417 170.522 L
510.278 170.522 L
512.139 170.522 L
514 170.522 L
515.861 170.522 L
517.722 170.522 L
519.583 170.522 L
521.444 170.522 L
523.306 170.522 L
525.167 170.522 L
527.028 170.522 L
528.889 170.522 L
530.75 170.522 L
532.611 170.522 L
534.472 170.522 L
536.333 170.522 L
538.194 170.522 L
540.056 170.522 L
541.917 170.522 L
543.778 170.522 L
545.639 170.522 L
547.5 170.522 L
549.361 170.522 L
551.222 170.522 L
553.083 170.522 L
554.944 170.522 L
556.806 170.522 L
558.667 170.522 L
560.528 170.522 L
562.389 170.522 L
564.25 170.522 L
566.111 170.522 L
567.972 170.522 L
569.833 170.522 L
571.694 170.522 L
573.556 170.522 L
575.417 170.522 L
577.278 170.522 L
579.139 170.522 L
581 170.522 L
582.861 170.522 L
584.722 170.522 L
586.583 170.522 L
588.444 170.522 L
590.306 170.522 L
592.167 170.522 L
594.028 170.522 L
595.889 170.522 L
597.75 170.522 L
599.611 170.522 L
601.472 170.522 L
603.333 170.522 L
605.194 170.522 L
607.056 170.522 L
608.917 170.522 L
610.778 170.522 L
612.639 170.522 L
614.5 170.522 L
616.361 170.522 L
618.222 170.522 L
620.083 170.522 L
621.944 170.522 L
623.806 170.522 L
625.667 170.522 L
627.528 170.522 L
629.389 170.522 L
631.25 170.522 L
633.111 170.522 L
634.972 170.522 L
636.833 170.522 L
638.694 170.522 L
640.556 170.522 L
642.417 170.522 L
644.278 170.522 L
646.139 170.522 L
648 170.522 L
649.861 170.522 L
651.722 170.522 L
653.583 170.522 L
655.444 170.522 L
657.306 170.522 L
659.167 170.522 L
661.028 170.522 L
662.889 170.522 L
664.75 170.522 L
666.611 170.522 L
668.472 170.522 L
670.333 170.522 L
672.194 170.522 L
674.056 170.522 L
675.917 170.522 L
677.778 170.522 L
679.639 170.522 L
681.5 170.522 L
683.361 170.522 L
685.222 170.522 L
687.083 170.522 L
688.944 170.522 L
690.806 170.522 L
692.667 170.522 L
694.528 170.522 L
696.389 170.522 L
698.25 170.522 L
700.111 170.522 L
701.972 170.522 L
703.833 170.522 L
705.694 170.522 L
707.556 170.522 L
709.417 170.522 L
711.278 170.522 L
713.139 170.522 L
715 170.522 L
716.861 170.522 L
718.722 170.522 L
720.583 170.522 L
722.444 170.522 L
724.306 170.522 L
726.167 170.522 L
728.028 170.522 L
729.889 170.522 L
731.75 170.522 L
733.611 170.522 L
735.472 170.522 L
737.333 170.522 L
739.194 170.522 L
741.056 170.522 L
742.917 170.522 L
744.778 170.522 L
746.639 170.522 L
748.5 170.522 L
750.361 170.522 L
752.222 170.522 L
754.083 170.522 L
755.944 170.522 L
757.806 170.522 L
759.667 170.522 L
761.528 170.522 L
763.389 170.522 L
765.25 170.522 L
767.111 170.522 L
768.972 170.522 L
770.833 170.522 L
772.694 170.522 L
774.556 170.522 L
776.417 170.522 L
778.278 170.522 L
780.139 170.522 L
782 170.522 L
S
GR
GS
[0.75 0 0 0.75 0 -0.25] CT
[1 3] 0 setdash
2 LJ
0.667 LW
N
113.861 153.872 M
115.722 153.872 L
117.583 153.872 L
119.444 153.872 L
121.306 153.872 L
123.167 153.872 L
125.028 153.872 L
126.889 153.872 L
128.75 153.872 L
130.611 153.872 L
132.472 153.872 L
134.333 153.872 L
136.194 153.872 L
138.056 153.872 L
139.917 153.872 L
141.778 153.872 L
143.639 153.872 L
145.5 153.872 L
147.361 153.872 L
149.222 153.872 L
151.083 153.872 L
152.944 153.872 L
154.806 153.872 L
156.667 153.872 L
158.528 153.872 L
160.389 153.872 L
162.25 153.872 L
164.111 153.872 L
165.972 153.872 L
167.833 153.872 L
169.694 153.872 L
171.556 153.872 L
173.417 153.872 L
175.278 153.872 L
177.139 153.872 L
179 153.872 L
180.861 153.872 L
182.722 153.872 L
184.583 153.872 L
186.444 153.872 L
188.306 153.872 L
190.167 153.872 L
192.028 153.872 L
193.889 153.872 L
195.75 153.872 L
197.611 153.872 L
199.472 153.872 L
201.333 153.872 L
203.194 153.872 L
205.056 153.872 L
206.917 153.872 L
208.778 153.872 L
210.639 153.872 L
212.5 153.872 L
214.361 153.872 L
216.222 153.872 L
218.083 153.872 L
219.944 153.872 L
221.806 153.872 L
223.667 153.872 L
225.528 153.872 L
227.389 153.872 L
229.25 153.872 L
231.111 153.872 L
232.972 153.872 L
234.833 153.872 L
236.694 153.872 L
238.556 153.872 L
240.417 153.872 L
242.278 153.872 L
244.139 153.872 L
246 153.872 L
247.861 153.872 L
249.722 153.872 L
251.583 153.872 L
253.444 153.872 L
255.306 153.872 L
257.167 153.872 L
259.028 153.872 L
260.889 153.872 L
262.75 153.872 L
264.611 153.872 L
266.472 153.872 L
268.333 153.872 L
270.194 153.872 L
272.056 153.872 L
273.917 153.872 L
275.778 153.872 L
277.639 153.872 L
279.5 153.872 L
281.361 153.872 L
283.222 153.872 L
285.083 153.872 L
286.944 153.872 L
288.806 153.872 L
290.667 153.872 L
292.528 153.872 L
294.389 153.872 L
296.25 153.872 L
298.111 153.872 L
299.972 153.872 L
301.833 153.872 L
303.694 153.872 L
305.556 153.872 L
307.417 153.872 L
309.278 153.872 L
311.139 153.872 L
313 153.872 L
314.861 153.872 L
316.722 153.872 L
318.583 153.872 L
320.444 153.872 L
322.306 153.872 L
324.167 153.872 L
326.028 153.872 L
327.889 153.872 L
329.75 153.872 L
331.611 153.872 L
333.472 153.872 L
335.333 153.872 L
337.194 153.872 L
339.056 153.872 L
340.917 153.872 L
342.778 153.872 L
344.639 153.872 L
346.5 153.872 L
348.361 153.872 L
350.222 153.872 L
352.083 153.872 L
353.944 153.872 L
355.806 153.872 L
357.667 153.872 L
359.528 153.872 L
361.389 153.872 L
363.25 153.872 L
365.111 153.872 L
366.972 153.872 L
368.833 153.872 L
370.694 153.872 L
372.556 153.872 L
374.417 153.872 L
376.278 153.872 L
378.139 153.872 L
380 153.872 L
381.861 153.872 L
383.722 153.872 L
385.583 153.872 L
387.444 153.872 L
389.306 153.872 L
391.167 153.872 L
393.028 153.872 L
394.889 153.872 L
396.75 153.872 L
398.611 153.872 L
400.472 153.872 L
402.333 153.872 L
404.194 153.872 L
406.056 153.872 L
407.917 153.872 L
409.778 153.872 L
411.639 153.872 L
413.5 153.872 L
415.361 153.872 L
417.222 153.872 L
419.083 153.872 L
420.944 153.872 L
422.806 153.872 L
424.667 153.872 L
426.528 153.872 L
428.389 153.872 L
430.25 153.872 L
432.111 153.872 L
433.972 153.872 L
435.833 153.872 L
437.694 153.872 L
439.556 153.872 L
441.417 153.872 L
443.278 153.872 L
445.139 153.872 L
447 153.872 L
448.861 153.872 L
450.722 153.872 L
452.583 153.872 L
454.444 153.872 L
456.306 153.872 L
458.167 153.872 L
460.028 153.872 L
461.889 153.872 L
463.75 153.872 L
465.611 153.872 L
467.472 153.872 L
469.333 153.872 L
471.194 153.872 L
473.056 153.872 L
474.917 153.872 L
476.778 153.872 L
478.639 153.872 L
480.5 153.872 L
482.361 153.872 L
484.222 153.872 L
486.083 153.872 L
487.944 153.872 L
489.806 153.872 L
491.667 153.872 L
493.528 153.872 L
495.389 153.872 L
497.25 153.872 L
499.111 153.872 L
500.972 153.872 L
502.833 153.872 L
504.694 153.872 L
506.556 153.872 L
508.417 153.872 L
510.278 153.872 L
512.139 153.872 L
514 153.872 L
515.861 153.872 L
517.722 153.872 L
519.583 153.872 L
521.444 153.872 L
523.306 153.872 L
525.167 153.872 L
527.028 153.872 L
528.889 153.872 L
530.75 153.872 L
532.611 153.872 L
534.472 153.872 L
536.333 153.872 L
538.194 153.872 L
540.056 153.872 L
541.917 153.872 L
543.778 153.872 L
545.639 153.872 L
547.5 153.872 L
549.361 153.872 L
551.222 153.872 L
553.083 153.872 L
554.944 153.872 L
556.806 153.872 L
558.667 153.872 L
560.528 153.872 L
562.389 153.872 L
564.25 153.872 L
566.111 153.872 L
567.972 153.872 L
569.833 153.872 L
571.694 153.872 L
573.556 153.872 L
575.417 153.872 L
577.278 153.872 L
579.139 153.872 L
581 153.872 L
582.861 153.872 L
584.722 153.872 L
586.583 153.872 L
588.444 153.872 L
590.306 153.872 L
592.167 153.872 L
594.028 153.872 L
595.889 153.872 L
597.75 153.872 L
599.611 153.872 L
601.472 153.872 L
603.333 153.872 L
605.194 153.872 L
607.056 153.872 L
608.917 153.872 L
610.778 153.872 L
612.639 153.872 L
614.5 153.872 L
616.361 153.872 L
618.222 153.872 L
620.083 153.872 L
621.944 153.872 L
623.806 153.872 L
625.667 153.872 L
627.528 153.872 L
629.389 153.872 L
631.25 153.872 L
633.111 153.872 L
634.972 153.872 L
636.833 153.872 L
638.694 153.872 L
640.556 153.872 L
642.417 153.872 L
644.278 153.872 L
646.139 153.872 L
648 153.872 L
649.861 153.872 L
651.722 153.872 L
653.583 153.872 L
655.444 153.872 L
657.306 153.872 L
659.167 153.872 L
661.028 153.872 L
662.889 153.872 L
664.75 153.872 L
666.611 153.872 L
668.472 153.872 L
670.333 153.872 L
672.194 153.872 L
674.056 153.872 L
675.917 153.872 L
677.778 153.872 L
679.639 153.872 L
681.5 153.872 L
683.361 153.872 L
685.222 153.872 L
687.083 153.872 L
688.944 153.872 L
690.806 153.872 L
692.667 153.872 L
694.528 153.872 L
696.389 153.872 L
698.25 153.872 L
700.111 153.872 L
701.972 153.872 L
703.833 153.872 L
705.694 153.872 L
707.556 153.872 L
709.417 153.872 L
711.278 153.872 L
713.139 153.872 L
715 153.872 L
716.861 153.872 L
718.722 153.872 L
720.583 153.872 L
722.444 153.872 L
724.306 153.872 L
726.167 153.872 L
728.028 153.872 L
729.889 153.872 L
731.75 153.872 L
733.611 153.872 L
735.472 153.872 L
737.333 153.872 L
739.194 153.872 L
741.056 153.872 L
742.917 153.872 L
744.778 153.872 L
746.639 153.872 L
748.5 153.872 L
750.361 153.872 L
752.222 153.872 L
754.083 153.872 L
755.944 153.872 L
757.806 153.872 L
759.667 153.872 L
761.528 153.872 L
763.389 153.872 L
765.25 153.872 L
767.111 153.872 L
768.972 153.872 L
770.833 153.872 L
772.694 153.872 L
774.556 153.872 L
776.417 153.872 L
778.278 153.872 L
780.139 153.872 L
782 153.872 L
S
GR
GS
[0.75 0 0 0.75 0 -0.25] CT
[1 3] 0 setdash
2 LJ
0.667 LW
N
113.861 187.173 M
115.722 187.173 L
117.583 187.173 L
119.444 187.173 L
121.306 187.173 L
123.167 187.173 L
125.028 187.173 L
126.889 187.173 L
128.75 187.173 L
130.611 187.173 L
132.472 187.173 L
134.333 187.173 L
136.194 187.173 L
138.056 187.173 L
139.917 187.173 L
141.778 187.173 L
143.639 187.173 L
145.5 187.173 L
147.361 187.173 L
149.222 187.173 L
151.083 187.173 L
152.944 187.173 L
154.806 187.173 L
156.667 187.173 L
158.528 187.173 L
160.389 187.173 L
162.25 187.173 L
164.111 187.173 L
165.972 187.173 L
167.833 187.173 L
169.694 187.173 L
171.556 187.173 L
173.417 187.173 L
175.278 187.173 L
177.139 187.173 L
179 187.173 L
180.861 187.173 L
182.722 187.173 L
184.583 187.173 L
186.444 187.173 L
188.306 187.173 L
190.167 187.173 L
192.028 187.173 L
193.889 187.173 L
195.75 187.173 L
197.611 187.173 L
199.472 187.173 L
201.333 187.173 L
203.194 187.173 L
205.056 187.173 L
206.917 187.173 L
208.778 187.173 L
210.639 187.173 L
212.5 187.173 L
214.361 187.173 L
216.222 187.173 L
218.083 187.173 L
219.944 187.173 L
221.806 187.173 L
223.667 187.173 L
225.528 187.173 L
227.389 187.173 L
229.25 187.173 L
231.111 187.173 L
232.972 187.173 L
234.833 187.173 L
236.694 187.173 L
238.556 187.173 L
240.417 187.173 L
242.278 187.173 L
244.139 187.173 L
246 187.173 L
247.861 187.173 L
249.722 187.173 L
251.583 187.173 L
253.444 187.173 L
255.306 187.173 L
257.167 187.173 L
259.028 187.173 L
260.889 187.173 L
262.75 187.173 L
264.611 187.173 L
266.472 187.173 L
268.333 187.173 L
270.194 187.173 L
272.056 187.173 L
273.917 187.173 L
275.778 187.173 L
277.639 187.173 L
279.5 187.173 L
281.361 187.173 L
283.222 187.173 L
285.083 187.173 L
286.944 187.173 L
288.806 187.173 L
290.667 187.173 L
292.528 187.173 L
294.389 187.173 L
296.25 187.173 L
298.111 187.173 L
299.972 187.173 L
301.833 187.173 L
303.694 187.173 L
305.556 187.173 L
307.417 187.173 L
309.278 187.173 L
311.139 187.173 L
313 187.173 L
314.861 187.173 L
316.722 187.173 L
318.583 187.173 L
320.444 187.173 L
322.306 187.173 L
324.167 187.173 L
326.028 187.173 L
327.889 187.173 L
329.75 187.173 L
331.611 187.173 L
333.472 187.173 L
335.333 187.173 L
337.194 187.173 L
339.056 187.173 L
340.917 187.173 L
342.778 187.173 L
344.639 187.173 L
346.5 187.173 L
348.361 187.173 L
350.222 187.173 L
352.083 187.173 L
353.944 187.173 L
355.806 187.173 L
357.667 187.173 L
359.528 187.173 L
361.389 187.173 L
363.25 187.173 L
365.111 187.173 L
366.972 187.173 L
368.833 187.173 L
370.694 187.173 L
372.556 187.173 L
374.417 187.173 L
376.278 187.173 L
378.139 187.173 L
380 187.173 L
381.861 187.173 L
383.722 187.173 L
385.583 187.173 L
387.444 187.173 L
389.306 187.173 L
391.167 187.173 L
393.028 187.173 L
394.889 187.173 L
396.75 187.173 L
398.611 187.173 L
400.472 187.173 L
402.333 187.173 L
404.194 187.173 L
406.056 187.173 L
407.917 187.173 L
409.778 187.173 L
411.639 187.173 L
413.5 187.173 L
415.361 187.173 L
417.222 187.173 L
419.083 187.173 L
420.944 187.173 L
422.806 187.173 L
424.667 187.173 L
426.528 187.173 L
428.389 187.173 L
430.25 187.173 L
432.111 187.173 L
433.972 187.173 L
435.833 187.173 L
437.694 187.173 L
439.556 187.173 L
441.417 187.173 L
443.278 187.173 L
445.139 187.173 L
447 187.173 L
448.861 187.173 L
450.722 187.173 L
452.583 187.173 L
454.444 187.173 L
456.306 187.173 L
458.167 187.173 L
460.028 187.173 L
461.889 187.173 L
463.75 187.173 L
465.611 187.173 L
467.472 187.173 L
469.333 187.173 L
471.194 187.173 L
473.056 187.173 L
474.917 187.173 L
476.778 187.173 L
478.639 187.173 L
480.5 187.173 L
482.361 187.173 L
484.222 187.173 L
486.083 187.173 L
487.944 187.173 L
489.806 187.173 L
491.667 187.173 L
493.528 187.173 L
495.389 187.173 L
497.25 187.173 L
499.111 187.173 L
500.972 187.173 L
502.833 187.173 L
504.694 187.173 L
506.556 187.173 L
508.417 187.173 L
510.278 187.173 L
512.139 187.173 L
514 187.173 L
515.861 187.173 L
517.722 187.173 L
519.583 187.173 L
521.444 187.173 L
523.306 187.173 L
525.167 187.173 L
527.028 187.173 L
528.889 187.173 L
530.75 187.173 L
532.611 187.173 L
534.472 187.173 L
536.333 187.173 L
538.194 187.173 L
540.056 187.173 L
541.917 187.173 L
543.778 187.173 L
545.639 187.173 L
547.5 187.173 L
549.361 187.173 L
551.222 187.173 L
553.083 187.173 L
554.944 187.173 L
556.806 187.173 L
558.667 187.173 L
560.528 187.173 L
562.389 187.173 L
564.25 187.173 L
566.111 187.173 L
567.972 187.173 L
569.833 187.173 L
571.694 187.173 L
573.556 187.173 L
575.417 187.173 L
577.278 187.173 L
579.139 187.173 L
581 187.173 L
582.861 187.173 L
584.722 187.173 L
586.583 187.173 L
588.444 187.173 L
590.306 187.173 L
592.167 187.173 L
594.028 187.173 L
595.889 187.173 L
597.75 187.173 L
599.611 187.173 L
601.472 187.173 L
603.333 187.173 L
605.194 187.173 L
607.056 187.173 L
608.917 187.173 L
610.778 187.173 L
612.639 187.173 L
614.5 187.173 L
616.361 187.173 L
618.222 187.173 L
620.083 187.173 L
621.944 187.173 L
623.806 187.173 L
625.667 187.173 L
627.528 187.173 L
629.389 187.173 L
631.25 187.173 L
633.111 187.173 L
634.972 187.173 L
636.833 187.173 L
638.694 187.173 L
640.556 187.173 L
642.417 187.173 L
644.278 187.173 L
646.139 187.173 L
648 187.173 L
649.861 187.173 L
651.722 187.173 L
653.583 187.173 L
655.444 187.173 L
657.306 187.173 L
659.167 187.173 L
661.028 187.173 L
662.889 187.173 L
664.75 187.173 L
666.611 187.173 L
668.472 187.173 L
670.333 187.173 L
672.194 187.173 L
674.056 187.173 L
675.917 187.173 L
677.778 187.173 L
679.639 187.173 L
681.5 187.173 L
683.361 187.173 L
685.222 187.173 L
687.083 187.173 L
688.944 187.173 L
690.806 187.173 L
692.667 187.173 L
694.528 187.173 L
696.389 187.173 L
698.25 187.173 L
700.111 187.173 L
701.972 187.173 L
703.833 187.173 L
705.694 187.173 L
707.556 187.173 L
709.417 187.173 L
711.278 187.173 L
713.139 187.173 L
715 187.173 L
716.861 187.173 L
718.722 187.173 L
720.583 187.173 L
722.444 187.173 L
724.306 187.173 L
726.167 187.173 L
728.028 187.173 L
729.889 187.173 L
731.75 187.173 L
733.611 187.173 L
735.472 187.173 L
737.333 187.173 L
739.194 187.173 L
741.056 187.173 L
742.917 187.173 L
744.778 187.173 L
746.639 187.173 L
748.5 187.173 L
750.361 187.173 L
752.222 187.173 L
754.083 187.173 L
755.944 187.173 L
757.806 187.173 L
759.667 187.173 L
761.528 187.173 L
763.389 187.173 L
765.25 187.173 L
767.111 187.173 L
768.972 187.173 L
770.833 187.173 L
772.694 187.173 L
774.556 187.173 L
776.417 187.173 L
778.278 187.173 L
780.139 187.173 L
782 187.173 L
S
GR
GS
[0.75 0 0 0.75 0 -0.25] CT
[1 3] 0 setdash
2 LJ
0.667 LW
N
113.861 365.053 M
115.722 365.053 L
117.583 365.053 L
119.444 365.053 L
121.306 365.053 L
123.167 365.053 L
125.028 365.053 L
126.889 365.053 L
128.75 365.053 L
130.611 365.053 L
132.472 365.053 L
134.333 365.053 L
136.194 365.053 L
138.056 365.053 L
139.917 365.053 L
141.778 365.053 L
143.639 365.053 L
145.5 365.053 L
147.361 365.053 L
149.222 365.053 L
151.083 365.053 L
152.944 365.053 L
154.806 365.053 L
156.667 365.053 L
158.528 365.053 L
160.389 365.053 L
162.25 365.053 L
164.111 365.053 L
165.972 365.053 L
167.833 365.053 L
169.694 365.053 L
171.556 365.053 L
173.417 365.053 L
175.278 365.053 L
177.139 365.053 L
179 365.053 L
180.861 365.053 L
182.722 365.053 L
184.583 365.053 L
186.444 365.053 L
188.306 365.053 L
190.167 365.053 L
192.028 365.053 L
193.889 365.053 L
195.75 365.053 L
197.611 365.053 L
199.472 365.053 L
201.333 365.053 L
203.194 365.053 L
205.056 365.053 L
206.917 365.053 L
208.778 365.053 L
210.639 365.053 L
212.5 365.053 L
214.361 365.053 L
216.222 365.053 L
218.083 365.053 L
219.944 365.053 L
221.806 365.053 L
223.667 365.053 L
225.528 365.053 L
227.389 365.053 L
229.25 365.053 L
231.111 365.053 L
232.972 365.053 L
234.833 365.053 L
236.694 365.053 L
238.556 365.053 L
240.417 365.053 L
242.278 365.053 L
244.139 365.053 L
246 365.053 L
247.861 365.053 L
249.722 365.053 L
251.583 365.053 L
253.444 365.053 L
255.306 365.053 L
257.167 365.053 L
259.028 365.053 L
260.889 365.053 L
262.75 365.053 L
264.611 365.053 L
266.472 365.053 L
268.333 365.053 L
270.194 365.053 L
272.056 365.053 L
273.917 365.053 L
275.778 365.053 L
277.639 365.053 L
279.5 365.053 L
281.361 365.053 L
283.222 365.053 L
285.083 365.053 L
286.944 365.053 L
288.806 365.053 L
290.667 365.053 L
292.528 365.053 L
294.389 365.053 L
296.25 365.053 L
298.111 365.053 L
299.972 365.053 L
301.833 365.053 L
303.694 365.053 L
305.556 365.053 L
307.417 365.053 L
309.278 365.053 L
311.139 365.053 L
313 365.053 L
314.861 365.053 L
316.722 365.053 L
318.583 365.053 L
320.444 365.053 L
322.306 365.053 L
324.167 365.053 L
326.028 365.053 L
327.889 365.053 L
329.75 365.053 L
331.611 365.053 L
333.472 365.053 L
335.333 365.053 L
337.194 365.053 L
339.056 365.053 L
340.917 365.053 L
342.778 365.053 L
344.639 365.053 L
346.5 365.053 L
348.361 365.053 L
350.222 365.053 L
352.083 365.053 L
353.944 365.053 L
355.806 365.053 L
357.667 365.053 L
359.528 365.053 L
361.389 365.053 L
363.25 365.053 L
365.111 365.053 L
366.972 365.053 L
368.833 365.053 L
370.694 365.053 L
372.556 365.053 L
374.417 365.053 L
376.278 365.053 L
378.139 365.053 L
380 365.053 L
381.861 365.053 L
383.722 365.053 L
385.583 365.053 L
387.444 365.053 L
389.306 365.053 L
391.167 365.053 L
393.028 365.053 L
394.889 365.053 L
396.75 365.053 L
398.611 365.053 L
400.472 365.053 L
402.333 365.053 L
404.194 365.053 L
406.056 365.053 L
407.917 365.053 L
409.778 365.053 L
411.639 365.053 L
413.5 365.053 L
415.361 365.053 L
417.222 365.053 L
419.083 365.053 L
420.944 365.053 L
422.806 365.053 L
424.667 365.053 L
426.528 365.053 L
428.389 365.053 L
430.25 365.053 L
432.111 365.053 L
433.972 365.053 L
435.833 365.053 L
437.694 365.053 L
439.556 365.053 L
441.417 365.053 L
443.278 365.053 L
445.139 365.053 L
447 365.053 L
448.861 365.053 L
450.722 365.053 L
452.583 365.053 L
454.444 365.053 L
456.306 365.053 L
458.167 365.053 L
460.028 365.053 L
461.889 365.053 L
463.75 365.053 L
465.611 365.053 L
467.472 365.053 L
469.333 365.053 L
471.194 365.053 L
473.056 365.053 L
474.917 365.053 L
476.778 365.053 L
478.639 365.053 L
480.5 365.053 L
482.361 365.053 L
484.222 365.053 L
486.083 365.053 L
487.944 365.053 L
489.806 365.053 L
491.667 365.053 L
493.528 365.053 L
495.389 365.053 L
497.25 365.053 L
499.111 365.053 L
500.972 365.053 L
502.833 365.053 L
504.694 365.053 L
506.556 365.053 L
508.417 365.053 L
510.278 365.053 L
512.139 365.053 L
514 365.053 L
515.861 365.053 L
517.722 365.053 L
519.583 365.053 L
521.444 365.053 L
523.306 365.053 L
525.167 365.053 L
527.028 365.053 L
528.889 365.053 L
530.75 365.053 L
532.611 365.053 L
534.472 365.053 L
536.333 365.053 L
538.194 365.053 L
540.056 365.053 L
541.917 365.053 L
543.778 365.053 L
545.639 365.053 L
547.5 365.053 L
549.361 365.053 L
551.222 365.053 L
553.083 365.053 L
554.944 365.053 L
556.806 365.053 L
558.667 365.053 L
560.528 365.053 L
562.389 365.053 L
564.25 365.053 L
566.111 365.053 L
567.972 365.053 L
569.833 365.053 L
571.694 365.053 L
573.556 365.053 L
575.417 365.053 L
577.278 365.053 L
579.139 365.053 L
581 365.053 L
582.861 365.053 L
584.722 365.053 L
586.583 365.053 L
588.444 365.053 L
590.306 365.053 L
592.167 365.053 L
594.028 365.053 L
595.889 365.053 L
597.75 365.053 L
599.611 365.053 L
601.472 365.053 L
603.333 365.053 L
605.194 365.053 L
607.056 365.053 L
608.917 365.053 L
610.778 365.053 L
612.639 365.053 L
614.5 365.053 L
616.361 365.053 L
618.222 365.053 L
620.083 365.053 L
621.944 365.053 L
623.806 365.053 L
625.667 365.053 L
627.528 365.053 L
629.389 365.053 L
631.25 365.053 L
633.111 365.053 L
634.972 365.053 L
636.833 365.053 L
638.694 365.053 L
640.556 365.053 L
642.417 365.053 L
644.278 365.053 L
646.139 365.053 L
648 365.053 L
649.861 365.053 L
651.722 365.053 L
653.583 365.053 L
655.444 365.053 L
657.306 365.053 L
659.167 365.053 L
661.028 365.053 L
662.889 365.053 L
664.75 365.053 L
666.611 365.053 L
668.472 365.053 L
670.333 365.053 L
672.194 365.053 L
674.056 365.053 L
675.917 365.053 L
677.778 365.053 L
679.639 365.053 L
681.5 365.053 L
683.361 365.053 L
685.222 365.053 L
687.083 365.053 L
688.944 365.053 L
690.806 365.053 L
692.667 365.053 L
694.528 365.053 L
696.389 365.053 L
698.25 365.053 L
700.111 365.053 L
701.972 365.053 L
703.833 365.053 L
705.694 365.053 L
707.556 365.053 L
709.417 365.053 L
711.278 365.053 L
713.139 365.053 L
715 365.053 L
716.861 365.053 L
718.722 365.053 L
720.583 365.053 L
722.444 365.053 L
724.306 365.053 L
726.167 365.053 L
728.028 365.053 L
729.889 365.053 L
731.75 365.053 L
733.611 365.053 L
735.472 365.053 L
737.333 365.053 L
739.194 365.053 L
741.056 365.053 L
742.917 365.053 L
744.778 365.053 L
746.639 365.053 L
748.5 365.053 L
750.361 365.053 L
752.222 365.053 L
754.083 365.053 L
755.944 365.053 L
757.806 365.053 L
759.667 365.053 L
761.528 365.053 L
763.389 365.053 L
765.25 365.053 L
767.111 365.053 L
768.972 365.053 L
770.833 365.053 L
772.694 365.053 L
774.556 365.053 L
776.417 365.053 L
778.278 365.053 L
780.139 365.053 L
782 365.053 L
S
GR
GS
[0.75 0 0 0.75 0 -0.25] CT
[1 3] 0 setdash
2 LJ
0.667 LW
N
113.861 398.353 M
115.722 398.353 L
117.583 398.353 L
119.444 398.353 L
121.306 398.353 L
123.167 398.353 L
125.028 398.353 L
126.889 398.353 L
128.75 398.353 L
130.611 398.353 L
132.472 398.353 L
134.333 398.353 L
136.194 398.353 L
138.056 398.353 L
139.917 398.353 L
141.778 398.353 L
143.639 398.353 L
145.5 398.353 L
147.361 398.353 L
149.222 398.353 L
151.083 398.353 L
152.944 398.353 L
154.806 398.353 L
156.667 398.353 L
158.528 398.353 L
160.389 398.353 L
162.25 398.353 L
164.111 398.353 L
165.972 398.353 L
167.833 398.353 L
169.694 398.353 L
171.556 398.353 L
173.417 398.353 L
175.278 398.353 L
177.139 398.353 L
179 398.353 L
180.861 398.353 L
182.722 398.353 L
184.583 398.353 L
186.444 398.353 L
188.306 398.353 L
190.167 398.353 L
192.028 398.353 L
193.889 398.353 L
195.75 398.353 L
197.611 398.353 L
199.472 398.353 L
201.333 398.353 L
203.194 398.353 L
205.056 398.353 L
206.917 398.353 L
208.778 398.353 L
210.639 398.353 L
212.5 398.353 L
214.361 398.353 L
216.222 398.353 L
218.083 398.353 L
219.944 398.353 L
221.806 398.353 L
223.667 398.353 L
225.528 398.353 L
227.389 398.353 L
229.25 398.353 L
231.111 398.353 L
232.972 398.353 L
234.833 398.353 L
236.694 398.353 L
238.556 398.353 L
240.417 398.353 L
242.278 398.353 L
244.139 398.353 L
246 398.353 L
247.861 398.353 L
249.722 398.353 L
251.583 398.353 L
253.444 398.353 L
255.306 398.353 L
257.167 398.353 L
259.028 398.353 L
260.889 398.353 L
262.75 398.353 L
264.611 398.353 L
266.472 398.353 L
268.333 398.353 L
270.194 398.353 L
272.056 398.353 L
273.917 398.353 L
275.778 398.353 L
277.639 398.353 L
279.5 398.353 L
281.361 398.353 L
283.222 398.353 L
285.083 398.353 L
286.944 398.353 L
288.806 398.353 L
290.667 398.353 L
292.528 398.353 L
294.389 398.353 L
296.25 398.353 L
298.111 398.353 L
299.972 398.353 L
301.833 398.353 L
303.694 398.353 L
305.556 398.353 L
307.417 398.353 L
309.278 398.353 L
311.139 398.353 L
313 398.353 L
314.861 398.353 L
316.722 398.353 L
318.583 398.353 L
320.444 398.353 L
322.306 398.353 L
324.167 398.353 L
326.028 398.353 L
327.889 398.353 L
329.75 398.353 L
331.611 398.353 L
333.472 398.353 L
335.333 398.353 L
337.194 398.353 L
339.056 398.353 L
340.917 398.353 L
342.778 398.353 L
344.639 398.353 L
346.5 398.353 L
348.361 398.353 L
350.222 398.353 L
352.083 398.353 L
353.944 398.353 L
355.806 398.353 L
357.667 398.353 L
359.528 398.353 L
361.389 398.353 L
363.25 398.353 L
365.111 398.353 L
366.972 398.353 L
368.833 398.353 L
370.694 398.353 L
372.556 398.353 L
374.417 398.353 L
376.278 398.353 L
378.139 398.353 L
380 398.353 L
381.861 398.353 L
383.722 398.353 L
385.583 398.353 L
387.444 398.353 L
389.306 398.353 L
391.167 398.353 L
393.028 398.353 L
394.889 398.353 L
396.75 398.353 L
398.611 398.353 L
400.472 398.353 L
402.333 398.353 L
404.194 398.353 L
406.056 398.353 L
407.917 398.353 L
409.778 398.353 L
411.639 398.353 L
413.5 398.353 L
415.361 398.353 L
417.222 398.353 L
419.083 398.353 L
420.944 398.353 L
422.806 398.353 L
424.667 398.353 L
426.528 398.353 L
428.389 398.353 L
430.25 398.353 L
432.111 398.353 L
433.972 398.353 L
435.833 398.353 L
437.694 398.353 L
439.556 398.353 L
441.417 398.353 L
443.278 398.353 L
445.139 398.353 L
447 398.353 L
448.861 398.353 L
450.722 398.353 L
452.583 398.353 L
454.444 398.353 L
456.306 398.353 L
458.167 398.353 L
460.028 398.353 L
461.889 398.353 L
463.75 398.353 L
465.611 398.353 L
467.472 398.353 L
469.333 398.353 L
471.194 398.353 L
473.056 398.353 L
474.917 398.353 L
476.778 398.353 L
478.639 398.353 L
480.5 398.353 L
482.361 398.353 L
484.222 398.353 L
486.083 398.353 L
487.944 398.353 L
489.806 398.353 L
491.667 398.353 L
493.528 398.353 L
495.389 398.353 L
497.25 398.353 L
499.111 398.353 L
500.972 398.353 L
502.833 398.353 L
504.694 398.353 L
506.556 398.353 L
508.417 398.353 L
510.278 398.353 L
512.139 398.353 L
514 398.353 L
515.861 398.353 L
517.722 398.353 L
519.583 398.353 L
521.444 398.353 L
523.306 398.353 L
525.167 398.353 L
527.028 398.353 L
528.889 398.353 L
530.75 398.353 L
532.611 398.353 L
534.472 398.353 L
536.333 398.353 L
538.194 398.353 L
540.056 398.353 L
541.917 398.353 L
543.778 398.353 L
545.639 398.353 L
547.5 398.353 L
549.361 398.353 L
551.222 398.353 L
553.083 398.353 L
554.944 398.353 L
556.806 398.353 L
558.667 398.353 L
560.528 398.353 L
562.389 398.353 L
564.25 398.353 L
566.111 398.353 L
567.972 398.353 L
569.833 398.353 L
571.694 398.353 L
573.556 398.353 L
575.417 398.353 L
577.278 398.353 L
579.139 398.353 L
581 398.353 L
582.861 398.353 L
584.722 398.353 L
586.583 398.353 L
588.444 398.353 L
590.306 398.353 L
592.167 398.353 L
594.028 398.353 L
595.889 398.353 L
597.75 398.353 L
599.611 398.353 L
601.472 398.353 L
603.333 398.353 L
605.194 398.353 L
607.056 398.353 L
608.917 398.353 L
610.778 398.353 L
612.639 398.353 L
614.5 398.353 L
616.361 398.353 L
618.222 398.353 L
620.083 398.353 L
621.944 398.353 L
623.806 398.353 L
625.667 398.353 L
627.528 398.353 L
629.389 398.353 L
631.25 398.353 L
633.111 398.353 L
634.972 398.353 L
636.833 398.353 L
638.694 398.353 L
640.556 398.353 L
642.417 398.353 L
644.278 398.353 L
646.139 398.353 L
648 398.353 L
649.861 398.353 L
651.722 398.353 L
653.583 398.353 L
655.444 398.353 L
657.306 398.353 L
659.167 398.353 L
661.028 398.353 L
662.889 398.353 L
664.75 398.353 L
666.611 398.353 L
668.472 398.353 L
670.333 398.353 L
672.194 398.353 L
674.056 398.353 L
675.917 398.353 L
677.778 398.353 L
679.639 398.353 L
681.5 398.353 L
683.361 398.353 L
685.222 398.353 L
687.083 398.353 L
688.944 398.353 L
690.806 398.353 L
692.667 398.353 L
694.528 398.353 L
696.389 398.353 L
698.25 398.353 L
700.111 398.353 L
701.972 398.353 L
703.833 398.353 L
705.694 398.353 L
707.556 398.353 L
709.417 398.353 L
711.278 398.353 L
713.139 398.353 L
715 398.353 L
716.861 398.353 L
718.722 398.353 L
720.583 398.353 L
722.444 398.353 L
724.306 398.353 L
726.167 398.353 L
728.028 398.353 L
729.889 398.353 L
731.75 398.353 L
733.611 398.353 L
735.472 398.353 L
737.333 398.353 L
739.194 398.353 L
741.056 398.353 L
742.917 398.353 L
744.778 398.353 L
746.639 398.353 L
748.5 398.353 L
750.361 398.353 L
752.222 398.353 L
754.083 398.353 L
755.944 398.353 L
757.806 398.353 L
759.667 398.353 L
761.528 398.353 L
763.389 398.353 L
765.25 398.353 L
767.111 398.353 L
768.972 398.353 L
770.833 398.353 L
772.694 398.353 L
774.556 398.353 L
776.417 398.353 L
778.278 398.353 L
780.139 398.353 L
782 398.353 L
S
GR
GS
[0.75 0 0 0.75 0 -0.25] CT
1 GC
N
762 119 M
762 61 L
511 61 L
511 119 L
cp
f
GR
GS
[0.75 0 0 0.75 422.99817 57.02564] CT
/Helvetica 21.333 F
GS
[1 0 0 1 0 0] CT
0 8.5 moveto 
1 -1 scale
(DC-W-DDR) t 
GR
GR
GS
[0.75 0 0 0.75 0 -0.25] CT
0 0.447 0.741 RC
1 LJ
2.667 LW
N
520.996 76.368 M
560.997 76.368 L
S
GR
GS
[0.75 0 0 0.75 422.99817 77.47436] CT
/Helvetica 21.333 F
GS
[1 0 0 1 0 0] CT
0 8.5 moveto 
1 -1 scale
(Asynchronous DDR) t 
GR
GR
GS
[0.75 0 0 0.75 0 -0.25] CT
0.851 0.325 0.098 RC
1 LJ
2.667 LW
N
520.996 103.632 M
560.997 103.632 L
S
GR
GS
[0.75 0 0 0.75 0 -0.25] CT
1 GC
10.0 ML
0.667 LW
N
511 119 M
511 61 L
762 61 L
762 119 L
cp
S
GR
GS
[0.75 0 0 0.75 0 -0.25] CT
1 GC
10.0 ML
0.667 LW
N
132.914 112.894 M
132.914 60.405 L
420 60.405 L
420 112.894 L
cp
S
GR
GS
[0.75 0 0 0.75 104.6855 48.05379] CT
0.851 0.325 0.098 RC
/Helvetica 18.667 F
GS
[1 0 0 1 0 0] CT
0 19 moveto 
1 -1 scale
(mean error = 32.22 m) t 
GR
GR
GS
[0.75 0 0 0.75 104.6855 48.05379] CT
0.851 0.325 0.098 RC
/Helvetica 18.667 F
GS
[1 0 0 1 0 0] CT
0 43 moveto 
1 -1 scale
(standard deviaton = 3.61 m) t 
GR
GR
GS
[0.75 0 0 0.75 0 -0.25] CT
0.502 GC
1 LJ
0.667 LW
N
225 176.816 M
225 371.667 L
S
GR
GS
[0.75 0 0 0.75 0 -0.25] CT
0.502 GC
1 LJ
0.667 LW
N
222.333 176.816 M
225 171.483 L
227.667 176.816 L
222.333 176.816 L
S
GR
GS
[0.75 0 0 0.75 0 -0.25] CT
0.502 GC
N
227.667 176.816 M
225 171.483 L
222.333 176.816 L
cp
f
GR
GS
[0.75 0 0 0.75 0 -0.25] CT
0.502 GC
1 LJ
0.667 LW
N
227.667 371.667 M
225 377 L
222.333 371.667 L
227.667 371.667 L
S
GR
GS
[0.75 0 0 0.75 0 -0.25] CT
0.502 GC
N
222.333 371.667 M
225 377 L
227.667 371.667 L
cp
f
GR
GS
[0.75 0 0 0.75 0 -0.25] CT
1 GC
10.0 ML
0.667 LW
N
499 359.95 M
499 307.461 L
746 307.461 L
746 359.95 L
cp
S
GR
GS
[0.75 0 0 0.75 379.25002 233.34577] CT
0 0.447 0.741 RC
/Helvetica 18.667 F
GS
[1 0 0 1 0 0] CT
0 19 moveto 
1 -1 scale
(mean error = 4.38 m) t 
GR
GR
GS
[0.75 0 0 0.75 379.25002 233.34577] CT
0 0.447 0.741 RC
/Helvetica 18.667 F
GS
[1 0 0 1 0 0] CT
0 43 moveto 
1 -1 scale
(standard deviaton = 2.32 m) t 
GR
GR
GS
[0.75 0 0 0.75 173.64799 192.5] CT
/Helvetica 18.667 F
GS
[1 0 0 1 0 0] CT
0 19 moveto 
1 -1 scale
(27.84 m) t 
GR
GR
%%Trailer
%%Pages: 1
%%EOF
