\relax 
\providecommand\hyper@newdestlabel[2]{}
\@writefile{toc}{\contentsline {chapter}{\numberline {7}GNSS-based Cooperative Positioning Implementation and Performance Analysis}{103}{chapter.7}\protected@file@percent }
\@writefile{lof}{\addvspace {10\p@ }}
\@writefile{lot}{\addvspace {10\p@ }}
\newlabel{ch:theoreticalResults}{{7}{103}{GNSS-based Cooperative Positioning Implementation and Performance Analysis}{chapter.7}{}}
\acronymused{H-LMS}
\acronymused{IAR}
\acronymused{GNSS}
\acronymused{KF}
\acronymused{CRLB}
\acronymused{H-LMS}
\acronymused{H-EKF}
\acronymused{IAR}
\acronymused{GNSS}
\acronymused{RF}
\acronymused{CP}
\acronymused{H-EKF}
\acronymused{DD}
\acronymused{EKF}
\acronymused{PF}
\@writefile{toc}{\contentsline {section}{\numberline {7.1}Multiagent collaborative IAR measurements for compensation of GNSS outages}{103}{section.7.1}\protected@file@percent }
\newlabel{sec:outagesComp}{{7.1}{103}{Multiagent collaborative IAR measurements for compensation of GNSS outages}{section.7.1}{}}
\acronymused{GNSS}
\acronymused{CP}
\acronymused{GNSS}
\acronymused{GNSS}
\acronymused{GNSS}
\acronymused{LMS}
\acronymused{KF}
\acronymused{IAR}
\acronymused{H-LMS}
\acronymused{GNSS}
\acronymused{PVT}
\acronymused{LMS}
\acronymused{PVT}
\@writefile{toc}{\contentsline {subsection}{\numberline {7.1.1}Pseudo-IAR-based Robust Collaborative Algorithm}{104}{subsection.7.1.1}\protected@file@percent }
\acronymused{GNSS}
\acronymused{IAR}
\acronymused{GNSS}
\acronymused{LoS}
\acronymused{GNSS}
\@writefile{toc}{\contentsline {subsubsection}{Kalman state prediction as a-priori state estimate}{104}{subsection.7.1.1}\protected@file@percent }
\@writefile{lof}{\contentsline {figure}{\numberline {7.1}{\ignorespaces {\relax \fontsize  {10}{12}\selectfont  \abovedisplayskip 10\p@ plus2\p@ minus5\p@ \abovedisplayshortskip \z@ plus3\p@ \belowdisplayshortskip 6\p@ plus3\p@ minus3\p@ \def \leftmargin \leftmargini \parsep 4.5\p@ plus2\p@ minus\p@ \topsep 9\p@ plus3\p@ minus5\p@ \itemsep 4.5\p@ plus2\p@ minus\p@ {\leftmargin \leftmargini \topsep 6\p@ plus2\p@ minus2\p@ \parsep 3\p@ plus2\p@ minus\p@ \itemsep \parsep }\belowdisplayskip \abovedisplayskip \ac {KF} Loop for the smoothing of hybrid \ac {PVT} solutions.}\relax }}{104}{figure.caption.70}\protected@file@percent }
\acronymused{KF}
\acronymused{PVT}
\newlabel{fig:kalmanPoseTight}{{7.1}{104}{{\small \ac {KF} Loop for the smoothing of hybrid \ac {PVT} solutions.}\relax }{figure.caption.70}{}}
\acronymused{KF}
\acronymused{H-LMS}
\acronymused{GNSS}
\acronymused{PVT}
\acronymused{KF}
\acronymused{GNSS}
\acronymused{KF}
\acronymused{GNSS}
\acronymused{KF}
\acronymused{PVT}
\acronymused{KF}
\acronymused{IAR}
\acronymused{KF}
\acronymused{GNSS}
\acronymused{IAR}
\AC@undonewlabel{acro:RTT}
\newlabel{acro:RTT}{{7.1.1}{105}{Kalman state prediction as a-priori state estimate}{figure.caption.70}{}}
\acronymused{RTT}
\@writefile{toc}{\contentsline {subsubsection}{Displacement vector and pseudo-position as a virtual landmark}{105}{figure.caption.70}\protected@file@percent }
\acronymused{IAR}
\newlabel{eq:displacement_vec}{{7.1}{105}{Displacement vector and pseudo-position as a virtual landmark}{equation.7.1.1}{}}
\newlabel{eq:alpha}{{7.2}{105}{Displacement vector and pseudo-position as a virtual landmark}{equation.7.1.2}{}}
\acronymused{IAR}
\acronymused{GNSS}
\acronymused{IAR}
\@writefile{toc}{\contentsline {subsubsection}{CP algorithm implementation and simulation parameters}{105}{equation.7.1.2}\protected@file@percent }
\acronymused{GNSS}
\acronymused{INS}
\@writefile{loc}{\ChangesListline {added}{Added~(1)}{\textbf  {H-LMS IAR algorithm}}{105}}
\@writefile{loa}{\contentsline {algorithm}{\numberline {}{\ignorespaces Basic cooperative positioning algorithms between agents sharing raw pseudorange measurements\relax }}{106}{algorithm.1}\protected@file@percent }
\acronymused{IAR}
\acronymused{H-LMS}
\newlabel{alg:algorithm1}{{}{106}{Basic cooperative positioning algorithms between agents sharing raw pseudorange measurements\relax }{ALC@unique.6}{}}
\@writefile{loc}{\ChangesListline {added}{Added~(1)}{The random displacement generated by agent $B$ foreseen the generation of a vector directed towards a random direction with a reasonable magnitude. The magnitude can be established according to the specific application.}{106}}
\@writefile{loc}{\ChangesListline {added}{Added~(1)}{The simulation scenario includes a set of agents, $\mathcal  {C}$, and a set of visible satellites, $\mathcal  {S}$}{106}}
\acronymused{ECEF}
\@writefile{lot}{\contentsline {table}{\numberline {7.1}{\ignorespaces Simulation parameters.\relax }}{106}{table.caption.71}\protected@file@percent }
\newlabel{tab:parametersForOutageMultiagent}{{7.1}{106}{Simulation parameters.\relax }{table.caption.71}{}}
\acronymused{LMS}
\acronymused{SAIA}
\@writefile{toc}{\contentsline {subsection}{\numberline {7.1.2}Numerical Results}{106}{subsection.7.1.2}\protected@file@percent }
\acronymused{GNSS}
\acronymused{GNSS}
\acronymused{GNSS}
\acronymused{PVT}
\acronymused{IAR}
\acronymused{IAR}
\acronymused{SAIA}
\acronymused{PVT}
\acronymused{PVT}
\acronymused{IAR}
\acronymused{IAR}
\acronymused{GNSS}
\acronymused{CP}
\acronymused{GNSS}
\acronymused{PVT}
\acronymused{PVT}
\acronymused{LMS}
\acronymused{PVT}
\acronymused{GNSS}
\acronymused{IAR}
\acronymused{GNSS}
\acronymused{H-LMS}
\@writefile{toc}{\contentsline {subsection}{\numberline {7.1.3}Remarks on \ac {H-LMS} smoothed solution}{107}{subsection.7.1.3}\protected@file@percent }
\acronymused{KF}
\acronymused{CP}
\acronymused{GNSS}
\acronymused{KF}
\acronymused{H-LMS}
\@writefile{toc}{\contentsline {section}{\numberline {7.2}Precision GNSS and Collaborative Relative Ranges Integration}{107}{section.7.2}\protected@file@percent }
\newlabel{sec:CRLBsec}{{7.2}{107}{Precision GNSS and Collaborative Relative Ranges Integration}{section.7.2}{}}
\acronymused{GNSS}
\acronymused{CP}
\acronymused{FIM}
\acronymused{W-IAR}
\acronymused{H-LMS}
\acronymused{ECEF}
\acronymused{GNSS}
\newlabel{fig:errOutage}{{7.2a}{108}{Position Error in \ac {ECEF} reference frame. Blue dots indicate \ac {GNSS} denied instants.\relax }{figure.caption.72}{}}
\newlabel{sub@fig:errOutage}{{a}{108}{Position Error in \ac {ECEF} reference frame. Blue dots indicate \ac {GNSS} denied instants.\relax }{figure.caption.72}{}}
\newlabel{fig:trajOutage}{{7.2b}{108}{\relax }{figure.caption.72}{}}
\newlabel{sub@fig:trajOutage}{{b}{108}{\relax }{figure.caption.72}{}}
\@writefile{lof}{\contentsline {figure}{\numberline {7.2}{\ignorespaces {\relax \fontsize  {10}{12}\selectfont  \abovedisplayskip 10\p@ plus2\p@ minus5\p@ \abovedisplayshortskip \z@ plus3\p@ \belowdisplayshortskip 6\p@ plus3\p@ minus3\p@ \def \leftmargin \leftmargini \parsep 4.5\p@ plus2\p@ minus\p@ \topsep 9\p@ plus3\p@ minus5\p@ \itemsep 4.5\p@ plus2\p@ minus\p@ {\leftmargin \leftmargini \topsep 6\p@ plus2\p@ minus2\p@ \parsep 3\p@ plus2\p@ minus\p@ \itemsep \parsep }\belowdisplayskip \abovedisplayskip Error of the positioning solution of a given agent (a). Random motion trajectory for the same agent with positioning failures (red marker) in which the positioning solution is guaranteed by the hybrid navigation filter (b).}\relax }}{108}{figure.caption.72}\protected@file@percent }
\newlabel{fig:outageSet}{{7.2}{108}{{\small Error of the positioning solution of a given agent (a). Random motion trajectory for the same agent with positioning failures (red marker) in which the positioning solution is guaranteed by the hybrid navigation filter (b).}\relax }{figure.caption.72}{}}
\acronymused{CRLB}
\@writefile{toc}{\contentsline {subsection}{\numberline {7.2.1}Methodology}{108}{subsection.7.2.1}\protected@file@percent }
\newlabel{sec:method}{{7.2.1}{108}{Methodology}{subsection.7.2.1}{}}
\acronymused{GNSS}
\acronymused{CRLB}
\@writefile{lof}{\contentsline {figure}{\numberline {7.3}{\ignorespaces {\relax \fontsize  {10}{12}\selectfont  \abovedisplayskip 10\p@ plus2\p@ minus5\p@ \abovedisplayshortskip \z@ plus3\p@ \belowdisplayshortskip 6\p@ plus3\p@ minus3\p@ \def \leftmargin \leftmargini \parsep 4.5\p@ plus2\p@ minus\p@ \topsep 9\p@ plus3\p@ minus5\p@ \itemsep 4.5\p@ plus2\p@ minus\p@ {\leftmargin \leftmargini \topsep 6\p@ plus2\p@ minus2\p@ \parsep 3\p@ plus2\p@ minus\p@ \itemsep \parsep }\belowdisplayskip \abovedisplayskip Block scheme of numerical simulations. The outputs of the \ac {LMS} blocks were compared to assess the positioning performance. $\mathbf  {X}_s$ indicates the positions matrix of the visible satellites}.\relax }}{109}{figure.caption.73}\protected@file@percent }
\acronymused{LMS}
\newlabel{fig:simulationScheme}{{7.3}{109}{{\small Block scheme of numerical simulations. The outputs of the \ac {LMS} blocks were compared to assess the positioning performance. $\mathbf {X}_s$ indicates the positions matrix of the visible satellites}.\relax }{figure.caption.73}{}}
\acronymused{IAR}
\acronymused{GNSS}
\acronymused{LMS}
\acronymused{LMS}
\acronymused{WLS}
\acronymused{H-LMS}
\acronymused{CRLB}
\acronymused{IAR}
\acronymused{WGN}
\newlabel{eq:covEstimation}{{7.3}{109}{Methodology}{equation.7.2.3}{}}
\newlabel{eq:biasEstimation}{{7.4}{110}{Methodology}{equation.7.2.4}{}}
\acronymused{PCC}
\newlabel{eq:corrCoeff}{{7.5}{110}{Methodology}{equation.7.2.5}{}}
\acronymused{H-LMS}
\acronymused{CRLB}
\@writefile{toc}{\contentsline {subsection}{\numberline {7.2.2}H-LMS Positioning on Bernoullian Trajectory}{110}{subsection.7.2.2}\protected@file@percent }
\@writefile{lof}{\contentsline {figure}{\numberline {7.4}{\ignorespaces {\relax \fontsize  {10}{12}\selectfont  \abovedisplayskip 10\p@ plus2\p@ minus5\p@ \abovedisplayshortskip \z@ plus3\p@ \belowdisplayshortskip 6\p@ plus3\p@ minus3\p@ \def \leftmargin \leftmargini \parsep 4.5\p@ plus2\p@ minus\p@ \topsep 9\p@ plus3\p@ minus5\p@ \itemsep 4.5\p@ plus2\p@ minus\p@ {\leftmargin \leftmargini \topsep 6\p@ plus2\p@ minus2\p@ \parsep 3\p@ plus2\p@ minus\p@ \itemsep \parsep }\belowdisplayskip \abovedisplayskip Example of a Bernoullian lemniscate path of $1046.7$ m travelled at an average speed of $26.15$ m/s. The dashed lines represent the collaborative terrestrial ranges provided according to the \ac {W-IAR} method. }\relax }}{110}{figure.caption.74}\protected@file@percent }
\acronymused{W-IAR}
\newlabel{fig:trajectory}{{7.4}{110}{{\small Example of a Bernoullian lemniscate path of $1046.7$ m travelled at an average speed of $26.15$ m/s. The dashed lines represent the collaborative terrestrial ranges provided according to the \ac {W-IAR} method. }\relax }{figure.caption.74}{}}
\@writefile{toc}{\contentsline {subsubsection}{Statistics of collaborative IAR measurements}{110}{figure.caption.75}\protected@file@percent }
\acronymused{W-IAR}
\@writefile{lof}{\contentsline {figure}{\numberline {7.5}{\ignorespaces {\relax \fontsize  {10}{12}\selectfont  \abovedisplayskip 10\p@ plus2\p@ minus5\p@ \abovedisplayshortskip \z@ plus3\p@ \belowdisplayshortskip 6\p@ plus3\p@ minus3\p@ \def \leftmargin \leftmargini \parsep 4.5\p@ plus2\p@ minus\p@ \topsep 9\p@ plus3\p@ minus5\p@ \itemsep 4.5\p@ plus2\p@ minus\p@ {\leftmargin \leftmargini \topsep 6\p@ plus2\p@ minus2\p@ \parsep 3\p@ plus2\p@ minus\p@ \itemsep \parsep }\belowdisplayskip \abovedisplayskip Skyplot of the relative azimuth, $\phi $, and elevation, $\alpha $, of the satellites and the aiding agent w.r.t. the target agent position at different time instants $t_k$ where $k\in (1,2,3,4,5)$.}\relax }}{111}{figure.caption.75}\protected@file@percent }
\newlabel{fig:skyPlot}{{7.5}{111}{{\small Skyplot of the relative azimuth, $\phi $, and elevation, $\alpha $, of the satellites and the aiding agent w.r.t. the target agent position at different time instants $t_k$ where $k\in (1,2,3,4,5)$.}\relax }{figure.caption.75}{}}
\acronymused{W-IAR}
\acronymused{BIC}
\acronymused{W-IAR}
\acronymused{CRLB}
\acronymused{BIC}
\acronymused{FIM}
\acronymused{GEV}
\@writefile{toc}{\contentsline {subsubsection}{On the comparison of theoretical and experimental limits}{111}{figure.caption.77}\protected@file@percent }
\newlabel{subsec:CRLBresults}{{7.2.2}{111}{On the comparison of theoretical and experimental limits}{figure.caption.77}{}}
\acronymused{LMS}
\acronymused{H-LMS}
\acronymused{W-IAR}
\newlabel{fig:gaussIAR}{{7.6a}{112}{\relax }{figure.caption.76}{}}
\newlabel{sub@fig:gaussIAR}{{a}{112}{\relax }{figure.caption.76}{}}
\newlabel{fig:gaussBar}{{7.6b}{112}{\relax }{figure.caption.76}{}}
\newlabel{sub@fig:gaussBar}{{b}{112}{\relax }{figure.caption.76}{}}
\@writefile{lof}{\contentsline {figure}{\numberline {7.6}{\ignorespaces {\relax \fontsize  {10}{12}\selectfont  \abovedisplayskip 10\p@ plus2\p@ minus5\p@ \abovedisplayshortskip \z@ plus3\p@ \belowdisplayshortskip 6\p@ plus3\p@ minus3\p@ \def \leftmargin \leftmargini \parsep 4.5\p@ plus2\p@ minus\p@ \topsep 9\p@ plus3\p@ minus5\p@ \itemsep 4.5\p@ plus2\p@ minus\p@ {\leftmargin \leftmargini \topsep 6\p@ plus2\p@ minus2\p@ \parsep 3\p@ plus2\p@ minus\p@ \itemsep \parsep }\belowdisplayskip \abovedisplayskip Discrete time series of \ac {IAR} error \ac {PDF}s evaluated in a set of time instants along the Bernoullian trajectory (a). Occurrences percentage of \ac {BIC} best fits of the \ac {W-IAR} error w.r.t. to a set of known statistical distributions (b).}\relax }}{112}{figure.caption.76}\protected@file@percent }
\acronymused{IAR}
\acronymused{PDF}
\acronymused{BIC}
\acronymused{W-IAR}
\newlabel{fig:affdsg}{{7.6}{112}{{\small Discrete time series of \ac {IAR} error \ac {PDF}s evaluated in a set of time instants along the Bernoullian trajectory (a). Occurrences percentage of \ac {BIC} best fits of the \ac {W-IAR} error w.r.t. to a set of known statistical distributions (b).}\relax }{figure.caption.76}{}}
\acronymused{CDF}
\AC@undonewlabel{acro:RMS}
\newlabel{acro:RMS}{{7.2.2}{112}{On the comparison of theoretical and experimental limits}{figure.caption.78}{}}
\acronymused{RMS}
\acronymused{GNSS}
\acronymused{W-IAR}
\newlabel{fig:asdf}{{7.7a}{113}{\relax }{figure.caption.77}{}}
\newlabel{sub@fig:asdf}{{a}{113}{\relax }{figure.caption.77}{}}
\newlabel{fig:asdfg}{{7.7b}{113}{\relax }{figure.caption.77}{}}
\newlabel{sub@fig:asdfg}{{b}{113}{\relax }{figure.caption.77}{}}
\@writefile{lof}{\contentsline {figure}{\numberline {7.7}{\ignorespaces \relax \fontsize  {10}{12}\selectfont  \abovedisplayskip 10\p@ plus2\p@ minus5\p@ \abovedisplayshortskip \z@ plus3\p@ \belowdisplayshortskip 6\p@ plus3\p@ minus3\p@ \def \leftmargin \leftmargini \parsep 4.5\p@ plus2\p@ minus\p@ \topsep 9\p@ plus3\p@ minus5\p@ \itemsep 4.5\p@ plus2\p@ minus\p@ {\leftmargin \leftmargini \topsep 6\p@ plus2\p@ minus2\p@ \parsep 3\p@ plus2\p@ minus\p@ \itemsep \parsep }\belowdisplayskip \abovedisplayskip Estimated positioning solutions according to the scenario in Figure \ref  {fig:trajectory}. The information ellipses describe the horizontal standard deviation at $90\%$, $99\%$ and $99.9\%$ of confidence interval, obtained from the eigenvalues of the matrix ${P}_\mathbf  {x}^{(k)}$ in a subset of time instants, $t_k$. Results from a Monte Carlo simulation with parameters $W=10000$, $\sigma _{sA}^{(k)}=1 \forall k$, $max(d_{AB}^{(k)})=200$ m. \relax }}{113}{figure.caption.77}\protected@file@percent }
\newlabel{fig:trajEstimation}{{7.7}{113}{\small Estimated positioning solutions according to the scenario in Figure \ref {fig:trajectory}. The information ellipses describe the horizontal standard deviation at $90\%$, $99\%$ and $99.9\%$ of confidence interval, obtained from the eigenvalues of the matrix ${P}_\mathbf {x}^{(k)}$ in a subset of time instants, $t_k$. Results from a Monte Carlo simulation with parameters $W=10000$, $\sigma _{sA}^{(k)}=1 \forall k$, $max(d_{AB}^{(k)})=200$ m. \relax }{figure.caption.77}{}}
\acronymused{H-LMS}
\acronymused{CRLB}
\acronymused{WLS}
\acronymused{CRLB}
\acronymused{H-LMS}
\acronymused{IAR}
\acronymused{H-LMS}
\acronymused{CRLB}
\acronymused{H-LMS}
\acronymused{LMS}
\acronymused{CRLB}
\@writefile{loc}{\ChangesListline {added}{Added~(1)}{Standard deviation of the position error in ENU frame.}{114}}
\newlabel{fig:experimentalSTD}{{7.8a}{114}{\added [id=1]{Standard deviation of the position error in ENU frame.}\relax }{figure.caption.78}{}}
\newlabel{sub@fig:experimentalSTD}{{a}{114}{\added [id=1]{Standard deviation of the position error in ENU frame.}\relax }{figure.caption.78}{}}
\@writefile{loc}{\ChangesListline {added}{Added~(1)}{Mean bias of the position error in ENU frame.}{114}}
\newlabel{fig:experimentalBias}{{7.8b}{114}{\added [id=1]{Mean bias of the position error in ENU frame.}\relax }{figure.caption.78}{}}
\newlabel{sub@fig:experimentalBias}{{b}{114}{\added [id=1]{Mean bias of the position error in ENU frame.}\relax }{figure.caption.78}{}}
\@writefile{lof}{\contentsline {figure}{\numberline {7.8}{\ignorespaces \relax \fontsize  {10}{12}\selectfont  \abovedisplayskip 10\p@ plus2\p@ minus5\p@ \abovedisplayshortskip \z@ plus3\p@ \belowdisplayshortskip 6\p@ plus3\p@ minus3\p@ \def \leftmargin \leftmargini \parsep 4.5\p@ plus2\p@ minus\p@ \topsep 9\p@ plus3\p@ minus5\p@ \itemsep 4.5\p@ plus2\p@ minus\p@ {\leftmargin \leftmargini \topsep 6\p@ plus2\p@ minus2\p@ \parsep 3\p@ plus2\p@ minus\p@ \itemsep \parsep }\belowdisplayskip \abovedisplayskip Statistical analysis of experimental biases and standard deviations of standalone and hybrid positioning solutions by means of Monte Carlo simulations.\relax }}{114}{figure.caption.78}\protected@file@percent }
\newlabel{fig:statisticalAnalysis}{{7.8}{114}{\small Statistical analysis of experimental biases and standard deviations of standalone and hybrid positioning solutions by means of Monte Carlo simulations.\relax }{figure.caption.78}{}}
\@writefile{lof}{\contentsline {figure}{\numberline {7.9}{\ignorespaces {\relax \fontsize  {10}{12}\selectfont  \abovedisplayskip 10\p@ plus2\p@ minus5\p@ \abovedisplayshortskip \z@ plus3\p@ \belowdisplayshortskip 6\p@ plus3\p@ minus3\p@ \def \leftmargin \leftmargini \parsep 4.5\p@ plus2\p@ minus\p@ \topsep 9\p@ plus3\p@ minus5\p@ \itemsep 4.5\p@ plus2\p@ minus\p@ {\leftmargin \leftmargini \topsep 6\p@ plus2\p@ minus2\p@ \parsep 3\p@ plus2\p@ minus\p@ \itemsep \parsep }\belowdisplayskip \abovedisplayskip Empirical \ac {CDF} of the positioning error $\mathaccentV {hat}05E{\xi }_\mathbf  {x}$ for each time instant $t_k$.}\relax }}{114}{figure.caption.79}\protected@file@percent }
\acronymused{CDF}
\newlabel{fig:biasCDF}{{7.9}{114}{{\small Empirical \ac {CDF} of the positioning error $\hat {\xi }_\mathbf {x}$ for each time instant $t_k$.}\relax }{figure.caption.79}{}}
\acronymused{GNSS}
\@writefile{lof}{\contentsline {figure}{\numberline {7.10}{\ignorespaces {\relax \fontsize  {10}{12}\selectfont  \abovedisplayskip 10\p@ plus2\p@ minus5\p@ \abovedisplayshortskip \z@ plus3\p@ \belowdisplayshortskip 6\p@ plus3\p@ minus3\p@ \def \leftmargin \leftmargini \parsep 4.5\p@ plus2\p@ minus\p@ \topsep 9\p@ plus3\p@ minus5\p@ \itemsep 4.5\p@ plus2\p@ minus\p@ {\leftmargin \leftmargini \topsep 6\p@ plus2\p@ minus2\p@ \parsep 3\p@ plus2\p@ minus\p@ \itemsep \parsep }\belowdisplayskip \abovedisplayskip Comparison of measured axial standard deviations and estimated standard deviations from the \ac {CRLB} for \ac {LMS} positioning and \ac {H-LMS} by Monte Carlo simulations.}\relax }}{115}{figure.caption.80}\protected@file@percent }
\acronymused{CRLB}
\acronymused{LMS}
\acronymused{H-LMS}
\newlabel{fig:comparisonExpvsCRLB}{{7.10}{115}{{\small Comparison of measured axial standard deviations and estimated standard deviations from the \ac {CRLB} for \ac {LMS} positioning and \ac {H-LMS} by Monte Carlo simulations.}\relax }{figure.caption.80}{}}
\acronymused{CRLB}
\acronymused{CRLB}
\@writefile{lof}{\contentsline {figure}{\numberline {7.11}{\ignorespaces {\relax \fontsize  {10}{12}\selectfont  \abovedisplayskip 10\p@ plus2\p@ minus5\p@ \abovedisplayshortskip \z@ plus3\p@ \belowdisplayshortskip 6\p@ plus3\p@ minus3\p@ \def \leftmargin \leftmargini \parsep 4.5\p@ plus2\p@ minus\p@ \topsep 9\p@ plus3\p@ minus5\p@ \itemsep 4.5\p@ plus2\p@ minus\p@ {\leftmargin \leftmargini \topsep 6\p@ plus2\p@ minus2\p@ \parsep 3\p@ plus2\p@ minus\p@ \itemsep \parsep }\belowdisplayskip \abovedisplayskip Matrices of \ac {PCC} \textup  {\hbox {\mathsurround \z@ \normalfont  (\ignorespaces \ref  {eq:corrCoeff}\unskip \@@italiccorr )}} computed for the measurement error covariance $\mathbf  {R}_\rho $, and observed at sample time instants $t_k$, where $k \in \left \delimiter "4266308 1,5 \right \delimiter "5267309 $.}\relax }}{115}{figure.caption.81}\protected@file@percent }
\acronymused{PCC}
\newlabel{fig:R_matrix}{{7.11}{115}{{\small Matrices of \ac {PCC} \eqref {eq:corrCoeff} computed for the measurement error covariance $\mathbf {R}_\rho $, and observed at sample time instants $t_k$, where $k \in \left \lbrace 1,5 \right \rbrace $.}\relax }{figure.caption.81}{}}
\@writefile{toc}{\contentsline {subsection}{\numberline {7.2.3}H-LMS Estimation on Other Trajectories}{115}{subsection.7.2.3}\protected@file@percent }
\acronymused{MSE}
\acronymused{CRLB}
\acronymused{H-LMS}
\acronymused{CRLB}
\acronymused{H-LMS}
\@writefile{lof}{\contentsline {figure}{\numberline {7.12}{\ignorespaces {\relax \fontsize  {10}{12}\selectfont  \abovedisplayskip 10\p@ plus2\p@ minus5\p@ \abovedisplayshortskip \z@ plus3\p@ \belowdisplayshortskip 6\p@ plus3\p@ minus3\p@ \def \leftmargin \leftmargini \parsep 4.5\p@ plus2\p@ minus\p@ \topsep 9\p@ plus3\p@ minus5\p@ \itemsep 4.5\p@ plus2\p@ minus\p@ {\leftmargin \leftmargini \topsep 6\p@ plus2\p@ minus2\p@ \parsep 3\p@ plus2\p@ minus\p@ \itemsep \parsep }\belowdisplayskip \abovedisplayskip Horizontal \ac {CRLB} computed for \ac {H-LMS} in different elementary geometrical trajectories vs. horizontal \ac {CRLB} computed for \ac {LMS}.}\relax }}{116}{figure.caption.82}\protected@file@percent }
\acronymused{CRLB}
\acronymused{H-LMS}
\acronymused{CRLB}
\acronymused{LMS}
\newlabel{fig:trajCRLBs}{{7.12}{116}{{\small Horizontal \ac {CRLB} computed for \ac {H-LMS} in different elementary geometrical trajectories vs. horizontal \ac {CRLB} computed for \ac {LMS}.}\relax }{figure.caption.82}{}}
\@writefile{lot}{\contentsline {table}{\numberline {7.2}{\ignorespaces Comparison of profitability of \ac {H-LMS} for other elementary geometrical trajectories\relax }}{116}{table.caption.83}\protected@file@percent }
\acronymused{H-LMS}
\newlabel{tab:trajectories}{{7.2}{116}{Comparison of profitability of \ac {H-LMS} for other elementary geometrical trajectories\relax }{table.caption.83}{}}
\@writefile{toc}{\contentsline {subsection}{\numberline {7.2.4}H-EKF Estimation on a Bernoullian Trajectory}{116}{subsection.7.2.4}\protected@file@percent }
\acronymused{H-EKF}
\acronymused{H-LMS}
\acronymused{H-EKF}
\acronymused{CRLB}
\acronymused{H-EKF}
\@writefile{lof}{\contentsline {figure}{\numberline {7.13}{\ignorespaces {\relax \fontsize  {10}{12}\selectfont  \abovedisplayskip 10\p@ plus2\p@ minus5\p@ \abovedisplayshortskip \z@ plus3\p@ \belowdisplayshortskip 6\p@ plus3\p@ minus3\p@ \def \leftmargin \leftmargini \parsep 4.5\p@ plus2\p@ minus\p@ \topsep 9\p@ plus3\p@ minus5\p@ \itemsep 4.5\p@ plus2\p@ minus\p@ {\leftmargin \leftmargini \topsep 6\p@ plus2\p@ minus2\p@ \parsep 3\p@ plus2\p@ minus\p@ \itemsep \parsep }\belowdisplayskip \abovedisplayskip Estimated EKF and H-EKF positioning solutions according to the scenario depicted in Figure \ref  {fig:trajectory}. The information ellipses describe the horizontal standard deviation at $90\%$, $99\%$ and $99.9\%$ confidence intervals, obtained from the eigenvalues of the matrix $P_\mathbf  {x}$ in a subset of time instants, $t_k$. Results from a Monte Carlo simulation with parameters $W=10000$, $\sigma _{sA}=1$, $max(d_{AB})=300$ m. }\relax }}{117}{figure.caption.84}\protected@file@percent }
\newlabel{fig:trajEstimation_EKF}{{7.13}{117}{{\small Estimated EKF and H-EKF positioning solutions according to the scenario depicted in Figure \ref {fig:trajectory}. The information ellipses describe the horizontal standard deviation at $90\%$, $99\%$ and $99.9\%$ confidence intervals, obtained from the eigenvalues of the matrix $P_\mathbf {x}$ in a subset of time instants, $t_k$. Results from a Monte Carlo simulation with parameters $W=10000$, $\sigma _{sA}=1$, $max(d_{AB})=300$ m. }\relax }{figure.caption.84}{}}
\@writefile{lof}{\contentsline {figure}{\numberline {7.14}{\ignorespaces {\relax \fontsize  {10}{12}\selectfont  \abovedisplayskip 10\p@ plus2\p@ minus5\p@ \abovedisplayshortskip \z@ plus3\p@ \belowdisplayshortskip 6\p@ plus3\p@ minus3\p@ \def \leftmargin \leftmargini \parsep 4.5\p@ plus2\p@ minus\p@ \topsep 9\p@ plus3\p@ minus5\p@ \itemsep 4.5\p@ plus2\p@ minus\p@ {\leftmargin \leftmargini \topsep 6\p@ plus2\p@ minus2\p@ \parsep 3\p@ plus2\p@ minus\p@ \itemsep \parsep }\belowdisplayskip \abovedisplayskip CRLB computed for EKF and H-EKF compared to the statistical values of the trace of the error covariance of the position obtained from the Monte Carlo simulation. The ordinate axis is logarithmic scale for improved readability.}\relax }}{117}{figure.caption.85}\protected@file@percent }
\newlabel{fig:CRLBekf}{{7.14}{117}{{\small CRLB computed for EKF and H-EKF compared to the statistical values of the trace of the error covariance of the position obtained from the Monte Carlo simulation. The ordinate axis is logarithmic scale for improved readability.}\relax }{figure.caption.85}{}}
\@writefile{toc}{\contentsline {subsection}{\numberline {7.2.5}Remarks on hybrid positioning solution}{117}{subsection.7.2.5}\protected@file@percent }
\newlabel{sec:remarks}{{7.2.5}{117}{Remarks on hybrid positioning solution}{subsection.7.2.5}{}}
\acronymused{GNSS}
\acronymused{IAR}
\acronymused{LMS}
\acronymused{CRLB}
\acronymused{CRLB}
\acronymused{CRLB}
\acronymused{W-IAR}
\acronymused{CRLB}
\acronymused{GNSS}
\acronymused{GNSS}
\@writefile{toc}{\contentsline {section}{\numberline {7.3}Accuracy Improvement of Position Estimation through \ac {GNSS}-only Collaborative Navigation Systems}{118}{section.7.3}\protected@file@percent }
\newlabel{sec:accuracySec}{{7.3}{118}{Accuracy Improvement of Position Estimation through \ac {GNSS}-only Collaborative Navigation Systems}{section.7.3}{}}
\acronymused{GNSS}
\acronymused{DD}
\acronymused{IAR}
\@writefile{toc}{\contentsline {subsection}{\numberline {7.3.1}Simulated scenario and experimental setup}{118}{subsection.7.3.1}\protected@file@percent }
\newlabel{sec:sim}{{7.3.1}{118}{Simulated scenario and experimental setup}{subsection.7.3.1}{}}
\@writefile{lof}{\contentsline {figure}{\numberline {7.15}{\ignorespaces {\relax \fontsize  {10}{12}\selectfont  \abovedisplayskip 10\p@ plus2\p@ minus5\p@ \abovedisplayshortskip \z@ plus3\p@ \belowdisplayshortskip 6\p@ plus3\p@ minus3\p@ \def \leftmargin \leftmargini \parsep 4.5\p@ plus2\p@ minus\p@ \topsep 9\p@ plus3\p@ minus5\p@ \itemsep 4.5\p@ plus2\p@ minus\p@ {\leftmargin \leftmargini \topsep 6\p@ plus2\p@ minus2\p@ \parsep 3\p@ plus2\p@ minus\p@ \itemsep \parsep }\belowdisplayskip \abovedisplayskip High-level block scheme of the experimental setup.}\relax }}{118}{figure.caption.86}\protected@file@percent }
\newlabel{fig:HLlabSetup}{{7.15}{118}{{\small High-level block scheme of the experimental setup.}\relax }{figure.caption.86}{}}
\acronymused{GNSS}
\acronymused{GPS}
\acronymused{GNSS}
\acronymused{RFCS}
\acronymused{GNSS}
\acronymused{GPS}
\acronymused{GNSS}
\@writefile{lof}{\contentsline {figure}{\numberline {7.16}{\ignorespaces {\relax \fontsize  {10}{12}\selectfont  \abovedisplayskip 10\p@ plus2\p@ minus5\p@ \abovedisplayshortskip \z@ plus3\p@ \belowdisplayshortskip 6\p@ plus3\p@ minus3\p@ \def \leftmargin \leftmargini \parsep 4.5\p@ plus2\p@ minus\p@ \topsep 9\p@ plus3\p@ minus5\p@ \itemsep 4.5\p@ plus2\p@ minus\p@ {\leftmargin \leftmargini \topsep 6\p@ plus2\p@ minus2\p@ \parsep 3\p@ plus2\p@ minus\p@ \itemsep \parsep }\belowdisplayskip \abovedisplayskip Snapshot of simulated satellites positions by IFEN\textsuperscript  {\relax \fontsize  {6}{7}\selectfont  \textregistered } NavX.}\relax }}{119}{figure.caption.87}\protected@file@percent }
\newlabel{fig:skyplot}{{7.16}{119}{{\small Snapshot of simulated satellites positions by IFEN\textsuperscript {\tiny \textregistered } NavX.}\relax }{figure.caption.87}{}}
\acronymused{RFCS}
\@writefile{loc}{\ChangesListline {replaced}{Replaced}{sampled}{119}}
\acronymused{USRP}
\acronymused{OCXO}
\@writefile{toc}{\contentsline {subsection}{\numberline {7.3.2}Scenario generation}{119}{subsection.7.3.2}\protected@file@percent }
\acronymused{RFCS}
\@writefile{lof}{\contentsline {figure}{\numberline {7.17}{\ignorespaces {\relax \fontsize  {10}{12}\selectfont  \abovedisplayskip 10\p@ plus2\p@ minus5\p@ \abovedisplayshortskip \z@ plus3\p@ \belowdisplayshortskip 6\p@ plus3\p@ minus3\p@ \def \leftmargin \leftmargini \parsep 4.5\p@ plus2\p@ minus\p@ \topsep 9\p@ plus3\p@ minus5\p@ \itemsep 4.5\p@ plus2\p@ minus\p@ {\leftmargin \leftmargini \topsep 6\p@ plus2\p@ minus2\p@ \parsep 3\p@ plus2\p@ minus\p@ \itemsep \parsep }\belowdisplayskip \abovedisplayskip Multi-agent simulation scenario. 7 fixed GNSS receivers and a Target agent moving on a Bernoullian trajectory with lobes of radius $r_{{\mathcal  {L}}} = 500$. Heading information indicates the motion direction.}\relax }}{120}{figure.caption.88}\protected@file@percent }
\newlabel{fig:scenarioSim}{{7.17}{120}{{\small Multi-agent simulation scenario. 7 fixed GNSS receivers and a Target agent moving on a Bernoullian trajectory with lobes of radius $r_{{\mathcal {L}}} = 500$. Heading information indicates the motion direction.}\relax }{figure.caption.88}{}}
\@writefile{lof}{\contentsline {figure}{\numberline {7.18}{\ignorespaces {\relax \fontsize  {10}{12}\selectfont  \abovedisplayskip 10\p@ plus2\p@ minus5\p@ \abovedisplayshortskip \z@ plus3\p@ \belowdisplayshortskip 6\p@ plus3\p@ minus3\p@ \def \leftmargin \leftmargini \parsep 4.5\p@ plus2\p@ minus\p@ \topsep 9\p@ plus3\p@ minus5\p@ \itemsep 4.5\p@ plus2\p@ minus\p@ {\leftmargin \leftmargini \topsep 6\p@ plus2\p@ minus2\p@ \parsep 3\p@ plus2\p@ minus\p@ \itemsep \parsep }\belowdisplayskip \abovedisplayskip Simulated dynamics of the target agent.}\relax }}{120}{figure.caption.89}\protected@file@percent }
\newlabel{fig:targetDynamics}{{7.18}{120}{{\small Simulated dynamics of the target agent.}\relax }{figure.caption.89}{}}
\@writefile{lof}{\contentsline {figure}{\numberline {7.19}{\ignorespaces {\relax \fontsize  {10}{12}\selectfont  \abovedisplayskip 10\p@ plus2\p@ minus5\p@ \abovedisplayshortskip \z@ plus3\p@ \belowdisplayshortskip 6\p@ plus3\p@ minus3\p@ \def \leftmargin \leftmargini \parsep 4.5\p@ plus2\p@ minus\p@ \topsep 9\p@ plus3\p@ minus5\p@ \itemsep 4.5\p@ plus2\p@ minus\p@ {\leftmargin \leftmargini \topsep 6\p@ plus2\p@ minus2\p@ \parsep 3\p@ plus2\p@ minus\p@ \itemsep \parsep }\belowdisplayskip \abovedisplayskip Simulated relative dynamics of the agents w.r.t. the target agent.}\relax }}{120}{figure.caption.90}\protected@file@percent }
\newlabel{fig:relDynamics}{{7.19}{120}{{\small Simulated relative dynamics of the agents w.r.t. the target agent.}\relax }{figure.caption.90}{}}
\acronymused{DD}
\acronymused{GNSS}
\@writefile{toc}{\contentsline {subsection}{\numberline {7.3.3}Epochs misalignment}{121}{subsection.7.3.3}\protected@file@percent }
\acronymused{GNSS}
\@writefile{lof}{\contentsline {figure}{\numberline {7.20}{\ignorespaces {\relax \fontsize  {10}{12}\selectfont  \abovedisplayskip 10\p@ plus2\p@ minus5\p@ \abovedisplayshortskip \z@ plus3\p@ \belowdisplayshortskip 6\p@ plus3\p@ minus3\p@ \def \leftmargin \leftmargini \parsep 4.5\p@ plus2\p@ minus\p@ \topsep 9\p@ plus3\p@ minus5\p@ \itemsep 4.5\p@ plus2\p@ minus\p@ {\leftmargin \leftmargini \topsep 6\p@ plus2\p@ minus2\p@ \parsep 3\p@ plus2\p@ minus\p@ \itemsep \parsep }\belowdisplayskip \abovedisplayskip Epochs misalignment for 8 asynchronous, independent GNSS receivers observed at 10 Hz w.r.t. to the reference GPS time scale.}\relax }}{121}{figure.caption.91}\protected@file@percent }
\newlabel{fig:epochsMis}{{7.20}{121}{{\small Epochs misalignment for 8 asynchronous, independent GNSS receivers observed at 10 Hz w.r.t. to the reference GPS time scale.}\relax }{figure.caption.91}{}}
\@writefile{loc}{\ChangesListline {added}{Added~(1)}{The Doppler shift factor reported on the $x$-axis is expressed as a fraction of the Doppler value estimated by the target receivers.}{121}}
\@writefile{lof}{\contentsline {figure}{\numberline {7.21}{\ignorespaces {\relax \fontsize  {10}{12}\selectfont  \abovedisplayskip 10\p@ plus2\p@ minus5\p@ \abovedisplayshortskip \z@ plus3\p@ \belowdisplayshortskip 6\p@ plus3\p@ minus3\p@ \def \leftmargin \leftmargini \parsep 4.5\p@ plus2\p@ minus\p@ \topsep 9\p@ plus3\p@ minus5\p@ \itemsep 4.5\p@ plus2\p@ minus\p@ {\leftmargin \leftmargini \topsep 6\p@ plus2\p@ minus2\p@ \parsep 3\p@ plus2\p@ minus\p@ \itemsep \parsep }\belowdisplayskip \abovedisplayskip Mean error trend on a single inter-agent GNSS-based measurement in case of underestimation of the Doppler shift by the target receiver.}\relax }}{121}{figure.caption.92}\protected@file@percent }
\newlabel{fig:errortrend}{{7.21}{121}{{\small Mean error trend on a single inter-agent GNSS-based measurement in case of underestimation of the Doppler shift by the target receiver.}\relax }{figure.caption.92}{}}
\@writefile{toc}{\contentsline {subsection}{\numberline {7.3.4}Results}{121}{subsection.7.3.4}\protected@file@percent }
\acronymused{DD}
\@writefile{lof}{\contentsline {figure}{\numberline {7.22}{\ignorespaces {\relax \fontsize  {10}{12}\selectfont  \abovedisplayskip 10\p@ plus2\p@ minus5\p@ \abovedisplayshortskip \z@ plus3\p@ \belowdisplayshortskip 6\p@ plus3\p@ minus3\p@ \def \leftmargin \leftmargini \parsep 4.5\p@ plus2\p@ minus\p@ \topsep 9\p@ plus3\p@ minus5\p@ \itemsep 4.5\p@ plus2\p@ minus\p@ {\leftmargin \leftmargini \topsep 6\p@ plus2\p@ minus2\p@ \parsep 3\p@ plus2\p@ minus\p@ \itemsep \parsep }\belowdisplayskip \abovedisplayskip Example of standalone vs. hybrid CDF on the positioning error evaluated on a long path (280 s) with $S=6$ and $C=4$ in Earth Centered Earth Fixed (ECEF) reference frame.}\relax }}{122}{figure.caption.93}\protected@file@percent }
\newlabel{fig:trajCDF}{{7.22}{122}{{\small Example of standalone vs. hybrid CDF on the positioning error evaluated on a long path (280 s) with $S=6$ and $C=4$ in Earth Centered Earth Fixed (ECEF) reference frame.}\relax }{figure.caption.93}{}}
\newlabel{sec:res}{{7.3.4}{122}{Results}{subsection.7.3.4}{}}
\@writefile{toc}{\contentsline {subsubsection}{Performance metrics for positioning assessment}{122}{figure.caption.95}\protected@file@percent }
\acronymused{RFCS}
\newlabel{eq:errorfun}{{7.7}{122}{Performance metrics for positioning assessment}{equation.7.3.7}{}}
\acronymused{CDF}
\acronymused{GNSS}
\newlabel{fig:trend01}{{7.23a}{123}{\relax }{figure.caption.94}{}}
\newlabel{sub@fig:trend01}{{a}{123}{\relax }{figure.caption.94}{}}
\newlabel{fig:trend02}{{7.23b}{123}{\relax }{figure.caption.94}{}}
\newlabel{sub@fig:trend02}{{b}{123}{\relax }{figure.caption.94}{}}
\@writefile{lof}{\contentsline {figure}{\numberline {7.23}{\ignorespaces \relax \fontsize  {10}{12}\selectfont  \abovedisplayskip 10\p@ plus2\p@ minus5\p@ \abovedisplayshortskip \z@ plus3\p@ \belowdisplayshortskip 6\p@ plus3\p@ minus3\p@ \def \leftmargin \leftmargini \parsep 4.5\p@ plus2\p@ minus\p@ \topsep 9\p@ plus3\p@ minus5\p@ \itemsep 4.5\p@ plus2\p@ minus\p@ {\leftmargin \leftmargini \topsep 6\p@ plus2\p@ minus2\p@ \parsep 3\p@ plus2\p@ minus\p@ \itemsep \parsep }\belowdisplayskip \abovedisplayskip Percentiles extracted from the position error CDF. Position errors computed in \textit  {high relative dynamics} (\ref  {fig:trend01}) and \textit  {low relative dynamic} (\ref  {fig:trend02}).\relax }}{123}{figure.caption.94}\protected@file@percent }
\newlabel{fig:asfdf}{{7.23}{123}{\small Percentiles extracted from the position error CDF. Position errors computed in \textit {high relative dynamics} (\ref {fig:trend01}) and \textit {low relative dynamic} (\ref {fig:trend02}).\relax }{figure.caption.94}{}}
\@writefile{toc}{\contentsline {subsubsection}{Experimental results}{123}{equation.7.3.9}\protected@file@percent }
\@writefile{lof}{\contentsline {figure}{\numberline {7.24}{\ignorespaces {\relax \fontsize  {10}{12}\selectfont  \abovedisplayskip 10\p@ plus2\p@ minus5\p@ \abovedisplayshortskip \z@ plus3\p@ \belowdisplayshortskip 6\p@ plus3\p@ minus3\p@ \def \leftmargin \leftmargini \parsep 4.5\p@ plus2\p@ minus\p@ \topsep 9\p@ plus3\p@ minus5\p@ \itemsep 4.5\p@ plus2\p@ minus\p@ {\leftmargin \leftmargini \topsep 6\p@ plus2\p@ minus2\p@ \parsep 3\p@ plus2\p@ minus\p@ \itemsep \parsep }\belowdisplayskip \abovedisplayskip Average Performance improvement varying the number of satellites (available channels) and the number of aiding agents (color-scale).}\relax }}{124}{figure.caption.95}\protected@file@percent }
\newlabel{fig:comparison}{{7.24}{124}{{\small Average Performance improvement varying the number of satellites (available channels) and the number of aiding agents (color-scale).}\relax }{figure.caption.95}{}}
\acronymused{CDF}
\@writefile{toc}{\contentsline {subsubsection}{High relative dynamics}{124}{equation.7.3.9}\protected@file@percent }
\@writefile{toc}{\contentsline {subsubsection}{Low relative dynamics}{124}{equation.7.3.9}\protected@file@percent }
\acronymused{GNSS}
\@writefile{toc}{\contentsline {subsection}{\numberline {7.3.5}Data fitting of Mean Aggregated Improvement}{125}{subsection.7.3.5}\protected@file@percent }
\@writefile{lot}{\contentsline {table}{\numberline {7.3}{\ignorespaces Goodness of fit of the average accuracy improvement with \ac {SSE} and related quality metrics.\relax }}{125}{table.caption.96}\protected@file@percent }
\acronymused{SSE}
\newlabel{tab:goodnessOfFit}{{7.3}{125}{Goodness of fit of the average accuracy improvement with \ac {SSE} and related quality metrics.\relax }{table.caption.96}{}}
\@writefile{toc}{\contentsline {subsection}{\numberline {7.3.6}Remarks on the accuracy improvement}{125}{subsection.7.3.6}\protected@file@percent }
\acronymused{EKF}
\acronymused{EKF}
\acronymused{EKF}
\acronymused{GNSS}
\acronymused{DD}
\@writefile{lof}{\contentsline {figure}{\numberline {7.25}{\ignorespaces {\relax \fontsize  {10}{12}\selectfont  \abovedisplayskip 10\p@ plus2\p@ minus5\p@ \abovedisplayshortskip \z@ plus3\p@ \belowdisplayshortskip 6\p@ plus3\p@ minus3\p@ \def \leftmargin \leftmargini \parsep 4.5\p@ plus2\p@ minus\p@ \topsep 9\p@ plus3\p@ minus5\p@ \itemsep 4.5\p@ plus2\p@ minus\p@ {\leftmargin \leftmargini \topsep 6\p@ plus2\p@ minus2\p@ \parsep 3\p@ plus2\p@ minus\p@ \itemsep \parsep }\belowdisplayskip \abovedisplayskip $X$-$Y$ $3^\text  {rd}$ order data fitting with multi-dimensional polynomial showing the trend of the average accuracy improvement in \textit  {high relative dynamics} varying the number of satellites and aiding agents in high relative dynamics.}\relax }}{126}{figure.caption.97}\protected@file@percent }
\newlabel{fig:generalTrend}{{7.25}{126}{{\small $X$-$Y$ $3^\text {rd}$ order data fitting with multi-dimensional polynomial showing the trend of the average accuracy improvement in \textit {high relative dynamics} varying the number of satellites and aiding agents in high relative dynamics.}\relax }{figure.caption.97}{}}
\@writefile{toc}{\contentsline {section}{\numberline {7.4}Assessment of the computational complexity of Bayesian positioning estimation in EKF and PF}{126}{section.7.4}\protected@file@percent }
\newlabel{sec:ekf_pfSec}{{7.4}{126}{Assessment of the computational complexity of Bayesian positioning estimation in EKF and PF}{section.7.4}{}}
\acronymused{PVT}
\acronymused{PF}
\acronymused{EKF}
\acronymused{PF}
\AC@undonewlabel{acro:s-PF}
\newlabel{acro:s-PF}{{7.4}{126}{Assessment of the computational complexity of Bayesian positioning estimation in EKF and PF}{section.7.4}{}}
\acronymused{s-PF}
\acronymused{GNSS}
\acronymused{CP}
\@writefile{toc}{\contentsline {subsubsection}{Suboptimal implementation of a Particle Filter (s-PF)}{126}{section.7.4}\protected@file@percent }
\AC@undonewlabel{acro:EPF}
\newlabel{acro:EPF}{{7.4}{126}{Suboptimal implementation of a Particle Filter (s-PF)}{section.7.4}{}}
\acronymused{EPF}
\acronymused{PF}
\acronymused{EKF}
\acronymused{PF}
\acronymused{EKF}
\acronymused{PF}
\acronymused{PF}
\@writefile{toc}{\contentsline {subsection}{\numberline {7.4.1}Computational complexity of Bayesian Estimation}{127}{subsection.7.4.1}\protected@file@percent }
\acronymused{EKF}
\acronymused{PF}
\acronymused{PF}
\@writefile{loc}{\ChangesListline {added}{Added~(1)}{and $N$ the number of particles used in the \ac {PF}}{127}}
\acronymused{EKF}
\acronymused{PF}
\@writefile{loc}{\ChangesListline {deleted}{Deleted~(1)}{y}{127}}
\acronymused{PF}
\acronymused{EKF}
\acronymused{PF}
\@writefile{toc}{\contentsline {subsection}{\numberline {7.4.2}Test Scenario}{127}{subsection.7.4.2}\protected@file@percent }
\newlabel{sec:scenario}{{7.4.2}{127}{Test Scenario}{subsection.7.4.2}{}}
\@writefile{lof}{\contentsline {figure}{\numberline {7.26}{\ignorespaces {\relax \fontsize  {10}{12}\selectfont  \abovedisplayskip 10\p@ plus2\p@ minus5\p@ \abovedisplayshortskip \z@ plus3\p@ \belowdisplayshortskip 6\p@ plus3\p@ minus3\p@ \def \leftmargin \leftmargini \parsep 4.5\p@ plus2\p@ minus\p@ \topsep 9\p@ plus3\p@ minus5\p@ \itemsep 4.5\p@ plus2\p@ minus\p@ {\leftmargin \leftmargini \topsep 6\p@ plus2\p@ minus2\p@ \parsep 3\p@ plus2\p@ minus\p@ \itemsep \parsep }\belowdisplayskip \abovedisplayskip Bernoullian Lemniscate test trajectory. The results are referred to the S-shaped portion included between instants $t_s$ and $t_{e}$ and crossing the location of agent $C_1$.}\relax }}{127}{figure.caption.98}\protected@file@percent }
\newlabel{fig:scene}{{7.26}{127}{{\small Bernoullian Lemniscate test trajectory. The results are referred to the S-shaped portion included between instants $t_s$ and $t_{e}$ and crossing the location of agent $C_1$.}\relax }{figure.caption.98}{}}
\@writefile{lot}{\contentsline {table}{\numberline {7.4}{\ignorespaces Satellite visibility in the simulation scenario.\relax }}{128}{table.caption.99}\protected@file@percent }
\newlabel{tab:vis}{{7.4}{128}{Satellite visibility in the simulation scenario.\relax }{table.caption.99}{}}
\@writefile{lof}{\contentsline {figure}{\numberline {7.27}{\ignorespaces {\relax \fontsize  {10}{12}\selectfont  \abovedisplayskip 10\p@ plus2\p@ minus5\p@ \abovedisplayshortskip \z@ plus3\p@ \belowdisplayshortskip 6\p@ plus3\p@ minus3\p@ \def \leftmargin \leftmargini \parsep 4.5\p@ plus2\p@ minus\p@ \topsep 9\p@ plus3\p@ minus5\p@ \itemsep 4.5\p@ plus2\p@ minus\p@ {\leftmargin \leftmargini \topsep 6\p@ plus2\p@ minus2\p@ \parsep 3\p@ plus2\p@ minus\p@ \itemsep \parsep }\belowdisplayskip \abovedisplayskip CDFs of the estimated trajectory with plain s-PF ($N=1000$) and EKF navigation filters.}\relax }}{128}{figure.caption.100}\protected@file@percent }
\newlabel{fig:PFwin}{{7.27}{128}{{\small CDFs of the estimated trajectory with plain s-PF ($N=1000$) and EKF navigation filters.}\relax }{figure.caption.100}{}}
\acronymused{CDF}
\@writefile{lof}{\contentsline {figure}{\numberline {7.28}{\ignorespaces {\relax \fontsize  {10}{12}\selectfont  \abovedisplayskip 10\p@ plus2\p@ minus5\p@ \abovedisplayshortskip \z@ plus3\p@ \belowdisplayshortskip 6\p@ plus3\p@ minus3\p@ \def \leftmargin \leftmargini \parsep 4.5\p@ plus2\p@ minus\p@ \topsep 9\p@ plus3\p@ minus5\p@ \itemsep 4.5\p@ plus2\p@ minus\p@ {\leftmargin \leftmargini \topsep 6\p@ plus2\p@ minus2\p@ \parsep 3\p@ plus2\p@ minus\p@ \itemsep \parsep }\belowdisplayskip \abovedisplayskip CDFs of the estimated trajectory with Hybrid s-PF using different numbers of particles and varying the number of collaborative contributions.}\relax }}{129}{figure.caption.101}\protected@file@percent }
\newlabel{fig:PF_iar}{{7.28}{129}{{\small CDFs of the estimated trajectory with Hybrid s-PF using different numbers of particles and varying the number of collaborative contributions.}\relax }{figure.caption.101}{}}
\@writefile{lof}{\contentsline {figure}{\numberline {7.29}{\ignorespaces {\relax \fontsize  {10}{12}\selectfont  \abovedisplayskip 10\p@ plus2\p@ minus5\p@ \abovedisplayshortskip \z@ plus3\p@ \belowdisplayshortskip 6\p@ plus3\p@ minus3\p@ \def \leftmargin \leftmargini \parsep 4.5\p@ plus2\p@ minus\p@ \topsep 9\p@ plus3\p@ minus5\p@ \itemsep 4.5\p@ plus2\p@ minus\p@ {\leftmargin \leftmargini \topsep 6\p@ plus2\p@ minus2\p@ \parsep 3\p@ plus2\p@ minus\p@ \itemsep \parsep }\belowdisplayskip \abovedisplayskip CDF of EKF and PF trajectory estimation varying the number of particles and the number of collaborative contributions in good satellite visibility.}\relax }}{129}{figure.caption.102}\protected@file@percent }
\newlabel{fig:10CH}{{7.29}{129}{{\small CDF of EKF and PF trajectory estimation varying the number of particles and the number of collaborative contributions in good satellite visibility.}\relax }{figure.caption.102}{}}
\@writefile{toc}{\contentsline {subsection}{\numberline {7.4.3}Final remarks}{129}{subsection.7.4.3}\protected@file@percent }
\acronymused{GNSS}
\acronymused{EKF}
\acronymused{PF}
\acronymused{s-PF}
\acronymused{EKF}
\@writefile{lof}{\contentsline {figure}{\numberline {7.30}{\ignorespaces {\relax \fontsize  {10}{12}\selectfont  \abovedisplayskip 10\p@ plus2\p@ minus5\p@ \abovedisplayshortskip \z@ plus3\p@ \belowdisplayshortskip 6\p@ plus3\p@ minus3\p@ \def \leftmargin \leftmargini \parsep 4.5\p@ plus2\p@ minus\p@ \topsep 9\p@ plus3\p@ minus5\p@ \itemsep 4.5\p@ plus2\p@ minus\p@ {\leftmargin \leftmargini \topsep 6\p@ plus2\p@ minus2\p@ \parsep 3\p@ plus2\p@ minus\p@ \itemsep \parsep }\belowdisplayskip \abovedisplayskip CDF of EKF and PF trajectory estimation varying the number of particles and the number of collaborative contributions in poor satellite visibility.}\relax }}{130}{figure.caption.103}\protected@file@percent }
\newlabel{fig:4CH}{{7.30}{130}{{\small CDF of EKF and PF trajectory estimation varying the number of particles and the number of collaborative contributions in poor satellite visibility.}\relax }{figure.caption.103}{}}
\acronymused{PF}
\acronymused{EKF}
\acronymused{s-PF}
\@setckpt{Chapter7/chapter7}{
\setcounter{page}{131}
\setcounter{equation}{9}
\setcounter{enumi}{5}
\setcounter{enumii}{0}
\setcounter{enumiii}{0}
\setcounter{enumiv}{0}
\setcounter{footnote}{0}
\setcounter{mpfootnote}{0}
\setcounter{part}{0}
\setcounter{chapter}{7}
\setcounter{section}{4}
\setcounter{subsection}{3}
\setcounter{subsubsection}{0}
\setcounter{paragraph}{0}
\setcounter{subparagraph}{0}
\setcounter{figure}{30}
\setcounter{table}{4}
\setcounter{SDpage}{0}
\setcounter{NumberSD}{0}
\setcounter{tomo}{0}
\setcounter{parentequation}{0}
\setcounter{caption@flags}{0}
\setcounter{ContinuedFloat}{0}
\setcounter{subfigure}{0}
\setcounter{subtable}{0}
\setcounter{float@type}{16}
\setcounter{tabx@nest}{0}
\setcounter{listtotal}{0}
\setcounter{listcount}{0}
\setcounter{liststart}{0}
\setcounter{liststop}{0}
\setcounter{citecount}{0}
\setcounter{citetotal}{0}
\setcounter{multicitecount}{0}
\setcounter{multicitetotal}{0}
\setcounter{instcount}{358}
\setcounter{maxnames}{3}
\setcounter{minnames}{1}
\setcounter{maxitems}{3}
\setcounter{minitems}{1}
\setcounter{citecounter}{0}
\setcounter{maxcitecounter}{0}
\setcounter{savedcitecounter}{0}
\setcounter{uniquelist}{0}
\setcounter{uniquename}{0}
\setcounter{refsection}{0}
\setcounter{refsegment}{0}
\setcounter{maxextratitle}{0}
\setcounter{maxextratitleyear}{0}
\setcounter{maxextraname}{5}
\setcounter{maxextradate}{0}
\setcounter{maxextraalpha}{0}
\setcounter{abbrvpenalty}{50}
\setcounter{highnamepenalty}{50}
\setcounter{lownamepenalty}{25}
\setcounter{maxparens}{3}
\setcounter{parenlevel}{0}
\setcounter{mincomprange}{10}
\setcounter{maxcomprange}{100000}
\setcounter{mincompwidth}{1}
\setcounter{afterword}{0}
\setcounter{savedafterword}{0}
\setcounter{annotator}{0}
\setcounter{savedannotator}{0}
\setcounter{author}{0}
\setcounter{savedauthor}{0}
\setcounter{bookauthor}{0}
\setcounter{savedbookauthor}{0}
\setcounter{commentator}{0}
\setcounter{savedcommentator}{0}
\setcounter{editor}{0}
\setcounter{savededitor}{0}
\setcounter{editora}{0}
\setcounter{savededitora}{0}
\setcounter{editorb}{0}
\setcounter{savededitorb}{0}
\setcounter{editorc}{0}
\setcounter{savededitorc}{0}
\setcounter{foreword}{0}
\setcounter{savedforeword}{0}
\setcounter{holder}{0}
\setcounter{savedholder}{0}
\setcounter{introduction}{0}
\setcounter{savedintroduction}{0}
\setcounter{namea}{0}
\setcounter{savednamea}{0}
\setcounter{nameb}{0}
\setcounter{savednameb}{0}
\setcounter{namec}{0}
\setcounter{savednamec}{0}
\setcounter{translator}{0}
\setcounter{savedtranslator}{0}
\setcounter{shortauthor}{0}
\setcounter{savedshortauthor}{0}
\setcounter{shorteditor}{0}
\setcounter{savedshorteditor}{0}
\setcounter{labelname}{0}
\setcounter{savedlabelname}{0}
\setcounter{institution}{0}
\setcounter{savedinstitution}{0}
\setcounter{lista}{0}
\setcounter{savedlista}{0}
\setcounter{listb}{0}
\setcounter{savedlistb}{0}
\setcounter{listc}{0}
\setcounter{savedlistc}{0}
\setcounter{listd}{0}
\setcounter{savedlistd}{0}
\setcounter{liste}{0}
\setcounter{savedliste}{0}
\setcounter{listf}{0}
\setcounter{savedlistf}{0}
\setcounter{location}{0}
\setcounter{savedlocation}{0}
\setcounter{organization}{0}
\setcounter{savedorganization}{0}
\setcounter{origlocation}{0}
\setcounter{savedoriglocation}{0}
\setcounter{origpublisher}{0}
\setcounter{savedorigpublisher}{0}
\setcounter{publisher}{0}
\setcounter{savedpublisher}{0}
\setcounter{language}{0}
\setcounter{savedlanguage}{0}
\setcounter{origlanguage}{0}
\setcounter{savedoriglanguage}{0}
\setcounter{pageref}{0}
\setcounter{savedpageref}{0}
\setcounter{textcitecount}{0}
\setcounter{textcitetotal}{0}
\setcounter{textcitemaxnames}{0}
\setcounter{biburlnumpenalty}{0}
\setcounter{biburlucpenalty}{0}
\setcounter{biburllcpenalty}{0}
\setcounter{smartand}{1}
\setcounter{bbx:relatedcount}{0}
\setcounter{bbx:relatedtotal}{0}
\setcounter{Item}{5}
\setcounter{Hfootnote}{0}
\setcounter{bookmark@seq@number}{98}
\setcounter{nlinenum}{0}
\setcounter{algorithm}{1}
\setcounter{ALC@unique}{6}
\setcounter{ALC@line}{6}
\setcounter{ALC@rem}{0}
\setcounter{ALC@depth}{0}
\setcounter{@todonotes@numberoftodonotes}{0}
\setcounter{Changes@AuthorCount}{2}
\setcounter{Changes@Author}{2}
\setcounter{Changes@addedCount}{1}
\setcounter{Changes@deletedCount}{0}
\setcounter{Changes@replacedCount}{2}
\setcounter{Changes@highlightCount}{0}
\setcounter{Changes@commentCount}{0}
\setcounter{authorcommentcount}{0}
\setcounter{Changes@addedCount1}{39}
\setcounter{Changes@deletedCount1}{3}
\setcounter{Changes@replacedCount1}{7}
\setcounter{Changes@highlightCount1}{0}
\setcounter{Changes@commentCount1}{0}
\setcounter{lstnumber}{1}
\setcounter{FancyVerbLine}{0}
\setcounter{section@level}{0}
\setcounter{lstlisting}{0}
}
