%!PS-Adobe-3.0 EPSF-3.0
%%Creator: (MATLAB, The Mathworks, Inc. Version 9.2.0.556344 \(R2017a\). Operating System: Windows 8)
%%Title: (C:/Users/Alex/Dropbox/Paper IAR - Official/fig/Static0_ERROR.eps)
%%CreationDate: 2018-10-17T15:23:48
%%Pages: (atend)
%%BoundingBox: 0 0 987 328
%%LanguageLevel: 3
%%EndComments
%%BeginProlog
%%BeginResource: procset (Apache XML Graphics Std ProcSet) 1.2 0
%%Version: 1.2 0
%%Copyright: (Copyright 2001-2003,2010 The Apache Software Foundation. License terms: http://www.apache.org/licenses/LICENSE-2.0)
/bd{bind def}bind def
/ld{load def}bd
/GR/grestore ld
/M/moveto ld
/LJ/setlinejoin ld
/C/curveto ld
/f/fill ld
/LW/setlinewidth ld
/GC/setgray ld
/t/show ld
/N/newpath ld
/CT/concat ld
/cp/closepath ld
/S/stroke ld
/L/lineto ld
/CC/setcmykcolor ld
/A/ashow ld
/GS/gsave ld
/RC/setrgbcolor ld
/RM/rmoveto ld
/ML/setmiterlimit ld
/re {4 2 roll M
1 index 0 rlineto
0 exch rlineto
neg 0 rlineto
cp } bd
/_ctm matrix def
/_tm matrix def
/BT { _ctm currentmatrix pop matrix _tm copy pop 0 0 moveto } bd
/ET { _ctm setmatrix } bd
/iTm { _ctm setmatrix _tm concat } bd
/Tm { _tm astore pop iTm 0 0 moveto } bd
/ux 0.0 def
/uy 0.0 def
/F {
  /Tp exch def
  /Tf exch def
  Tf findfont Tp scalefont setfont
  /cf Tf def  /cs Tp def
} bd
/ULS {currentpoint /uy exch def /ux exch def} bd
/ULE {
  /Tcx currentpoint pop def
  gsave
  newpath
  cf findfont cs scalefont dup
  /FontMatrix get 0 get /Ts exch def /FontInfo get dup
  /UnderlinePosition get Ts mul /To exch def
  /UnderlineThickness get Ts mul /Tt exch def
  ux uy To add moveto  Tcx uy To add lineto
  Tt setlinewidth stroke
  grestore
} bd
/OLE {
  /Tcx currentpoint pop def
  gsave
  newpath
  cf findfont cs scalefont dup
  /FontMatrix get 0 get /Ts exch def /FontInfo get dup
  /UnderlinePosition get Ts mul /To exch def
  /UnderlineThickness get Ts mul /Tt exch def
  ux uy To add cs add moveto Tcx uy To add cs add lineto
  Tt setlinewidth stroke
  grestore
} bd
/SOE {
  /Tcx currentpoint pop def
  gsave
  newpath
  cf findfont cs scalefont dup
  /FontMatrix get 0 get /Ts exch def /FontInfo get dup
  /UnderlinePosition get Ts mul /To exch def
  /UnderlineThickness get Ts mul /Tt exch def
  ux uy To add cs 10 mul 26 idiv add moveto Tcx uy To add cs 10 mul 26 idiv add lineto
  Tt setlinewidth stroke
  grestore
} bd
/QT {
/Y22 exch store
/X22 exch store
/Y21 exch store
/X21 exch store
currentpoint
/Y21 load 2 mul add 3 div exch
/X21 load 2 mul add 3 div exch
/X21 load 2 mul /X22 load add 3 div
/Y21 load 2 mul /Y22 load add 3 div
/X22 load /Y22 load curveto
} bd
/SSPD {
dup length /d exch dict def
{
/v exch def
/k exch def
currentpagedevice k known {
/cpdv currentpagedevice k get def
v cpdv ne {
/upd false def
/nullv v type /nulltype eq def
/nullcpdv cpdv type /nulltype eq def
nullv nullcpdv or
{
/upd true def
} {
/sametype v type cpdv type eq def
sametype {
v type /arraytype eq {
/vlen v length def
/cpdvlen cpdv length def
vlen cpdvlen eq {
0 1 vlen 1 sub {
/i exch def
/obj v i get def
/cpdobj cpdv i get def
obj cpdobj ne {
/upd true def
exit
} if
} for
} {
/upd true def
} ifelse
} {
v type /dicttype eq {
v {
/dv exch def
/dk exch def
/cpddv cpdv dk get def
dv cpddv ne {
/upd true def
exit
} if
} forall
} {
/upd true def
} ifelse
} ifelse
} if
} ifelse
upd true eq {
d k v put
} if
} if
} if
} forall
d length 0 gt {
d setpagedevice
} if
} bd
/RE { % /NewFontName [NewEncodingArray] /FontName RE -
  findfont dup length dict begin
  {
    1 index /FID ne
    {def} {pop pop} ifelse
  } forall
  /Encoding exch def
  /FontName 1 index def
  currentdict definefont pop
  end
} bind def
%%EndResource
%%BeginResource: procset (Apache XML Graphics EPS ProcSet) 1.0 0
%%Version: 1.0 0
%%Copyright: (Copyright 2002-2003 The Apache Software Foundation. License terms: http://www.apache.org/licenses/LICENSE-2.0)
/BeginEPSF { %def
/b4_Inc_state save def         % Save state for cleanup
/dict_count countdictstack def % Count objects on dict stack
/op_count count 1 sub def      % Count objects on operand stack
userdict begin                 % Push userdict on dict stack
/showpage { } def              % Redefine showpage, { } = null proc
0 setgray 0 setlinecap         % Prepare graphics state
1 setlinewidth 0 setlinejoin
10 setmiterlimit [ ] 0 setdash newpath
/languagelevel where           % If level not equal to 1 then
{pop languagelevel             % set strokeadjust and
1 ne                           % overprint to their defaults.
{false setstrokeadjust false setoverprint
} if
} if
} bd
/EndEPSF { %def
count op_count sub {pop} repeat            % Clean up stacks
countdictstack dict_count sub {end} repeat
b4_Inc_state restore
} bd
%%EndResource
%FOPBeginFontDict
%%IncludeResource: font Courier-Bold
%%IncludeResource: font Helvetica
%%IncludeResource: font Courier-BoldOblique
%%IncludeResource: font Courier-Oblique
%%IncludeResource: font Times-Roman
%%IncludeResource: font Helvetica-BoldOblique
%%IncludeResource: font Helvetica-Bold
%%IncludeResource: font Helvetica-Oblique
%%IncludeResource: font Times-BoldItalic
%%IncludeResource: font Courier
%%IncludeResource: font Times-Italic
%%IncludeResource: font Times-Bold
%%IncludeResource: font Symbol
%%IncludeResource: font ZapfDingbats
%FOPEndFontDict
%%BeginResource: encoding WinAnsiEncoding
/WinAnsiEncoding [
/.notdef /.notdef /.notdef /.notdef /.notdef
/.notdef /.notdef /.notdef /.notdef /.notdef
/.notdef /.notdef /.notdef /.notdef /.notdef
/.notdef /.notdef /.notdef /.notdef /.notdef
/.notdef /.notdef /.notdef /.notdef /.notdef
/.notdef /.notdef /.notdef /.notdef /.notdef
/.notdef /.notdef /space /exclam /quotedbl
/numbersign /dollar /percent /ampersand /quotesingle
/parenleft /parenright /asterisk /plus /comma
/hyphen /period /slash /zero /one
/two /three /four /five /six
/seven /eight /nine /colon /semicolon
/less /equal /greater /question /at
/A /B /C /D /E
/F /G /H /I /J
/K /L /M /N /O
/P /Q /R /S /T
/U /V /W /X /Y
/Z /bracketleft /backslash /bracketright /asciicircum
/underscore /quoteleft /a /b /c
/d /e /f /g /h
/i /j /k /l /m
/n /o /p /q /r
/s /t /u /v /w
/x /y /z /braceleft /bar
/braceright /asciitilde /bullet /Euro /bullet
/quotesinglbase /florin /quotedblbase /ellipsis /dagger
/daggerdbl /circumflex /perthousand /Scaron /guilsinglleft
/OE /bullet /Zcaron /bullet /bullet
/quoteleft /quoteright /quotedblleft /quotedblright /bullet
/endash /emdash /asciitilde /trademark /scaron
/guilsinglright /oe /bullet /zcaron /Ydieresis
/space /exclamdown /cent /sterling /currency
/yen /brokenbar /section /dieresis /copyright
/ordfeminine /guillemotleft /logicalnot /sfthyphen /registered
/macron /degree /plusminus /twosuperior /threesuperior
/acute /mu /paragraph /middot /cedilla
/onesuperior /ordmasculine /guillemotright /onequarter /onehalf
/threequarters /questiondown /Agrave /Aacute /Acircumflex
/Atilde /Adieresis /Aring /AE /Ccedilla
/Egrave /Eacute /Ecircumflex /Edieresis /Igrave
/Iacute /Icircumflex /Idieresis /Eth /Ntilde
/Ograve /Oacute /Ocircumflex /Otilde /Odieresis
/multiply /Oslash /Ugrave /Uacute /Ucircumflex
/Udieresis /Yacute /Thorn /germandbls /agrave
/aacute /acircumflex /atilde /adieresis /aring
/ae /ccedilla /egrave /eacute /ecircumflex
/edieresis /igrave /iacute /icircumflex /idieresis
/eth /ntilde /ograve /oacute /ocircumflex
/otilde /odieresis /divide /oslash /ugrave
/uacute /ucircumflex /udieresis /yacute /thorn
/ydieresis
] def
%%EndResource
%FOPBeginFontReencode
/Courier-Bold findfont
dup length dict begin
  {1 index /FID ne {def} {pop pop} ifelse} forall
  /Encoding WinAnsiEncoding def
  currentdict
end
/Courier-Bold exch definefont pop
/Helvetica findfont
dup length dict begin
  {1 index /FID ne {def} {pop pop} ifelse} forall
  /Encoding WinAnsiEncoding def
  currentdict
end
/Helvetica exch definefont pop
/Courier-BoldOblique findfont
dup length dict begin
  {1 index /FID ne {def} {pop pop} ifelse} forall
  /Encoding WinAnsiEncoding def
  currentdict
end
/Courier-BoldOblique exch definefont pop
/Courier-Oblique findfont
dup length dict begin
  {1 index /FID ne {def} {pop pop} ifelse} forall
  /Encoding WinAnsiEncoding def
  currentdict
end
/Courier-Oblique exch definefont pop
/Times-Roman findfont
dup length dict begin
  {1 index /FID ne {def} {pop pop} ifelse} forall
  /Encoding WinAnsiEncoding def
  currentdict
end
/Times-Roman exch definefont pop
/Helvetica-BoldOblique findfont
dup length dict begin
  {1 index /FID ne {def} {pop pop} ifelse} forall
  /Encoding WinAnsiEncoding def
  currentdict
end
/Helvetica-BoldOblique exch definefont pop
/Helvetica-Bold findfont
dup length dict begin
  {1 index /FID ne {def} {pop pop} ifelse} forall
  /Encoding WinAnsiEncoding def
  currentdict
end
/Helvetica-Bold exch definefont pop
/Helvetica-Oblique findfont
dup length dict begin
  {1 index /FID ne {def} {pop pop} ifelse} forall
  /Encoding WinAnsiEncoding def
  currentdict
end
/Helvetica-Oblique exch definefont pop
/Times-BoldItalic findfont
dup length dict begin
  {1 index /FID ne {def} {pop pop} ifelse} forall
  /Encoding WinAnsiEncoding def
  currentdict
end
/Times-BoldItalic exch definefont pop
/Courier findfont
dup length dict begin
  {1 index /FID ne {def} {pop pop} ifelse} forall
  /Encoding WinAnsiEncoding def
  currentdict
end
/Courier exch definefont pop
/Times-Italic findfont
dup length dict begin
  {1 index /FID ne {def} {pop pop} ifelse} forall
  /Encoding WinAnsiEncoding def
  currentdict
end
/Times-Italic exch definefont pop
/Times-Bold findfont
dup length dict begin
  {1 index /FID ne {def} {pop pop} ifelse} forall
  /Encoding WinAnsiEncoding def
  currentdict
end
/Times-Bold exch definefont pop
%FOPEndFontReencode
%%EndProlog
%%Page: 1 1
%%PageBoundingBox: 0 0 987 328
%%BeginPageSetup
[1 0 0 -1 0 328] CT
%%EndPageSetup
GS
[0.75 0 0 0.75 0 0.25] CT
1 GC
N
0 0 1316 437 re
f
GR
GS
[0.75 0 0 0.75 0 0.25] CT
1 GC
N
0 0 1316 437 re
f
GR
GS
[0.75 0 0 0.75 0 0.25] CT
1 GC
N
171 389 M
1191 389 L
1191 33 L
171 33 L
cp
f
GR
GS
[0.75 0 0 0.75 0 0.25] CT
0.873 GC
1 LJ
0.667 LW
N
171 389 M
171 33 L
S
GR
GS
[0.75 0 0 0.75 0 0.25] CT
0.873 GC
1 LJ
0.667 LW
N
316.714 389 M
316.714 33 L
S
GR
GS
[0.75 0 0 0.75 0 0.25] CT
0.873 GC
1 LJ
0.667 LW
N
462.429 389 M
462.429 33 L
S
GR
GS
[0.75 0 0 0.75 0 0.25] CT
0.873 GC
1 LJ
0.667 LW
N
608.143 389 M
608.143 33 L
S
GR
GS
[0.75 0 0 0.75 0 0.25] CT
0.873 GC
1 LJ
0.667 LW
N
753.857 389 M
753.857 33 L
S
GR
GS
[0.75 0 0 0.75 0 0.25] CT
0.873 GC
1 LJ
0.667 LW
N
899.571 389 M
899.571 33 L
S
GR
GS
[0.75 0 0 0.75 0 0.25] CT
0.873 GC
1 LJ
0.667 LW
N
1045.286 389 M
1045.286 33 L
S
GR
GS
[0.75 0 0 0.75 0 0.25] CT
0.873 GC
1 LJ
0.667 LW
N
1191 389 M
1191 33 L
S
GR
GS
[0.75 0 0 0.75 0 0.25] CT
0.873 GC
1 LJ
0.667 LW
N
1191 389 M
171 389 L
S
GR
GS
[0.75 0 0 0.75 0 0.25] CT
0.873 GC
1 LJ
0.667 LW
N
1191 317.8 M
171 317.8 L
S
GR
GS
[0.75 0 0 0.75 0 0.25] CT
0.873 GC
1 LJ
0.667 LW
N
1191 246.6 M
171 246.6 L
S
GR
GS
[0.75 0 0 0.75 0 0.25] CT
0.873 GC
1 LJ
0.667 LW
N
1191 175.4 M
171 175.4 L
S
GR
GS
[0.75 0 0 0.75 0 0.25] CT
0.873 GC
1 LJ
0.667 LW
N
1191 104.2 M
171 104.2 L
S
GR
GS
[0.75 0 0 0.75 0 0.25] CT
0.873 GC
1 LJ
0.667 LW
N
1191 33 M
171 33 L
S
GR
GS
[0.75 0 0 0.75 0 0.25] CT
0.149 GC
2 setlinecap
1 LJ
0.667 LW
N
171 389 M
1191 389 L
S
GR
GS
[0.75 0 0 0.75 0 0.25] CT
0.149 GC
2 setlinecap
1 LJ
0.667 LW
N
171 33 M
1191 33 L
S
GR
GS
[0.75 0 0 0.75 0 0.25] CT
0.149 GC
2 setlinecap
1 LJ
0.667 LW
N
171 389 M
171 378.8 L
S
GR
GS
[0.75 0 0 0.75 0 0.25] CT
0.149 GC
2 setlinecap
1 LJ
0.667 LW
N
316.714 389 M
316.714 378.8 L
S
GR
GS
[0.75 0 0 0.75 0 0.25] CT
0.149 GC
2 setlinecap
1 LJ
0.667 LW
N
462.429 389 M
462.429 378.8 L
S
GR
GS
[0.75 0 0 0.75 0 0.25] CT
0.149 GC
2 setlinecap
1 LJ
0.667 LW
N
608.143 389 M
608.143 378.8 L
S
GR
GS
[0.75 0 0 0.75 0 0.25] CT
0.149 GC
2 setlinecap
1 LJ
0.667 LW
N
753.857 389 M
753.857 378.8 L
S
GR
GS
[0.75 0 0 0.75 0 0.25] CT
0.149 GC
2 setlinecap
1 LJ
0.667 LW
N
899.571 389 M
899.571 378.8 L
S
GR
GS
[0.75 0 0 0.75 0 0.25] CT
0.149 GC
2 setlinecap
1 LJ
0.667 LW
N
1045.286 389 M
1045.286 378.8 L
S
GR
GS
[0.75 0 0 0.75 0 0.25] CT
0.149 GC
2 setlinecap
1 LJ
0.667 LW
N
1191 389 M
1191 378.8 L
S
GR
GS
[0.75 0 0 0.75 0 0.25] CT
0.149 GC
2 setlinecap
1 LJ
0.667 LW
N
171 33 M
171 43.2 L
S
GR
GS
[0.75 0 0 0.75 0 0.25] CT
0.149 GC
2 setlinecap
1 LJ
0.667 LW
N
316.714 33 M
316.714 43.2 L
S
GR
GS
[0.75 0 0 0.75 0 0.25] CT
0.149 GC
2 setlinecap
1 LJ
0.667 LW
N
462.429 33 M
462.429 43.2 L
S
GR
GS
[0.75 0 0 0.75 0 0.25] CT
0.149 GC
2 setlinecap
1 LJ
0.667 LW
N
608.143 33 M
608.143 43.2 L
S
GR
GS
[0.75 0 0 0.75 0 0.25] CT
0.149 GC
2 setlinecap
1 LJ
0.667 LW
N
753.857 33 M
753.857 43.2 L
S
GR
GS
[0.75 0 0 0.75 0 0.25] CT
0.149 GC
2 setlinecap
1 LJ
0.667 LW
N
899.571 33 M
899.571 43.2 L
S
GR
GS
[0.75 0 0 0.75 0 0.25] CT
0.149 GC
2 setlinecap
1 LJ
0.667 LW
N
1045.286 33 M
1045.286 43.2 L
S
GR
GS
[0.75 0 0 0.75 0 0.25] CT
0.149 GC
2 setlinecap
1 LJ
0.667 LW
N
1191 33 M
1191 43.2 L
S
GR
GS
[0.75 0 0 0.75 128.25 296.8] CT
0.149 GC
N
0.083 16.102 M
-2.245 16.102 -3.081 14.18 QT
-3.917 12.258 -3.917 9.617 QT
-3.917 7.977 -3.62 6.516 QT
-3.323 5.055 -2.424 4.039 QT
-1.526 3.024 0.083 3.024 QT
1.333 3.024 2.13 3.633 QT
2.927 4.242 3.349 5.219 QT
3.771 6.196 3.919 7.297 QT
4.068 8.399 4.068 9.617 QT
4.068 11.258 3.771 12.68 QT
3.474 14.102 2.591 15.102 QT
1.708 16.102 0.083 16.102 QT
cp
0.083 15.602 M
1.146 15.602 1.661 14.516 QT
2.177 13.43 2.302 12.117 QT
2.427 10.805 2.427 9.321 QT
2.427 7.883 2.302 6.68 QT
2.177 5.477 1.661 4.5 QT
1.146 3.524 0.083 3.524 QT
-0.995 3.524 -1.51 4.5 QT
-2.026 5.477 -2.151 6.68 QT
-2.276 7.883 -2.276 9.321 QT
-2.276 10.367 -2.221 11.305 QT
-2.167 12.242 -1.948 13.242 QT
-1.729 14.242 -1.229 14.922 QT
-0.729 15.602 0.083 15.602 QT
cp
f
GR
GS
[0.75 0 0 0.75 237.53572 296.8] CT
0.149 GC
N
-3.01 13.524 M
-2.823 14.071 -2.417 14.524 QT
-2.01 14.977 -1.464 15.235 QT
-0.917 15.492 -0.323 15.492 QT
1.052 15.492 1.576 14.43 QT
2.099 13.367 2.099 11.836 QT
2.099 11.18 2.076 10.727 QT
2.052 10.274 1.943 9.867 QT
1.771 9.196 1.333 8.696 QT
0.896 8.196 0.255 8.196 QT
-0.385 8.196 -0.846 8.391 QT
-1.307 8.586 -1.596 8.844 QT
-1.885 9.102 -2.104 9.391 QT
-2.323 9.68 -2.385 9.696 QT
-2.604 9.696 L
-2.651 9.696 -2.714 9.633 QT
-2.776 9.571 -2.776 9.524 QT
-2.776 3.18 L
-2.776 3.133 -2.721 3.078 QT
-2.667 3.024 -2.604 3.024 QT
-2.542 3.024 L
-1.26 3.633 0.177 3.633 QT
1.583 3.633 2.896 3.024 QT
2.943 3.024 L
3.021 3.024 3.076 3.071 QT
3.13 3.117 3.13 3.18 QT
3.13 3.352 L
3.13 3.446 3.083 3.446 QT
2.443 4.305 1.466 4.789 QT
0.49 5.274 -0.573 5.274 QT
-1.323 5.274 -2.12 5.055 QT
-2.12 8.649 L
-1.495 8.133 -0.995 7.914 QT
-0.495 7.696 0.271 7.696 QT
1.318 7.696 2.146 8.305 QT
2.974 8.914 3.419 9.883 QT
3.865 10.852 3.865 11.852 QT
3.865 12.992 3.302 13.969 QT
2.74 14.946 1.779 15.524 QT
0.818 16.102 -0.323 16.102 QT
-1.245 16.102 -2.034 15.617 QT
-2.823 15.133 -3.268 14.313 QT
-3.714 13.492 -3.714 12.586 QT
-3.714 12.149 -3.44 11.883 QT
-3.167 11.617 -2.745 11.617 QT
-2.323 11.617 -2.042 11.891 QT
-1.76 12.164 -1.76 12.586 QT
-1.76 12.992 -2.042 13.274 QT
-2.323 13.555 -2.745 13.555 QT
-2.807 13.555 -2.893 13.539 QT
-2.979 13.524 -3.01 13.524 QT
cp
f
GR
GS
[0.75 0 0 0.75 346.82142 296.8] CT
0.149 GC
N
-7.568 15.68 M
-7.568 15.008 L
-5.193 15.008 -5.193 14.414 QT
-5.193 4.43 L
-6.177 4.914 -7.677 4.914 QT
-7.677 4.242 L
-5.349 4.242 -4.161 3.024 QT
-3.896 3.024 L
-3.833 3.024 -3.771 3.078 QT
-3.708 3.133 -3.708 3.196 QT
-3.708 14.414 L
-3.708 15.008 -1.333 15.008 QT
-1.333 15.68 L
-7.568 15.68 L
cp
f
GR
GS
[0.75 0 0 0.75 346.82142 296.8] CT
0.149 GC
N
4.75 16.102 M
2.422 16.102 1.586 14.18 QT
0.75 12.258 0.75 9.617 QT
0.75 7.977 1.047 6.516 QT
1.344 5.055 2.242 4.039 QT
3.141 3.024 4.75 3.024 QT
6 3.024 6.797 3.633 QT
7.594 4.242 8.016 5.219 QT
8.438 6.196 8.586 7.297 QT
8.734 8.399 8.734 9.617 QT
8.734 11.258 8.438 12.68 QT
8.141 14.102 7.258 15.102 QT
6.375 16.102 4.75 16.102 QT
cp
4.75 15.602 M
5.813 15.602 6.328 14.516 QT
6.844 13.43 6.969 12.117 QT
7.094 10.805 7.094 9.321 QT
7.094 7.883 6.969 6.68 QT
6.844 5.477 6.328 4.5 QT
5.813 3.524 4.75 3.524 QT
3.672 3.524 3.156 4.5 QT
2.641 5.477 2.516 6.68 QT
2.391 7.883 2.391 9.321 QT
2.391 10.367 2.445 11.305 QT
2.5 12.242 2.719 13.242 QT
2.938 14.242 3.438 14.922 QT
3.938 15.602 4.75 15.602 QT
cp
f
GR
GS
[0.75 0 0 0.75 456.10716 296.8] CT
0.149 GC
N
/f550733744{-7.568 15.68 M
-7.568 15.008 L
-5.193 15.008 -5.193 14.414 QT
-5.193 4.43 L
-6.177 4.914 -7.677 4.914 QT
-7.677 4.242 L
-5.349 4.242 -4.161 3.024 QT
-3.896 3.024 L
-3.833 3.024 -3.771 3.078 QT
-3.708 3.133 -3.708 3.196 QT
-3.708 14.414 L
-3.708 15.008 -1.333 15.008 QT
-1.333 15.68 L
-7.568 15.68 L
cp}def
f550733744
f
GR
GS
[0.75 0 0 0.75 456.10716 296.8] CT
0.149 GC
N
/f424309639{1.656 13.524 M
1.844 14.071 2.25 14.524 QT
2.656 14.977 3.203 15.235 QT
3.75 15.492 4.344 15.492 QT
5.719 15.492 6.242 14.43 QT
6.766 13.367 6.766 11.836 QT
6.766 11.18 6.742 10.727 QT
6.719 10.274 6.609 9.867 QT
6.438 9.196 6 8.696 QT
5.563 8.196 4.922 8.196 QT
4.281 8.196 3.82 8.391 QT
3.359 8.586 3.07 8.844 QT
2.781 9.102 2.563 9.391 QT
2.344 9.68 2.281 9.696 QT
2.063 9.696 L
2.016 9.696 1.953 9.633 QT
1.891 9.571 1.891 9.524 QT
1.891 3.18 L
1.891 3.133 1.945 3.078 QT
2 3.024 2.063 3.024 QT
2.125 3.024 L
3.406 3.633 4.844 3.633 QT
6.25 3.633 7.563 3.024 QT
7.609 3.024 L
7.688 3.024 7.742 3.071 QT
7.797 3.117 7.797 3.18 QT
7.797 3.352 L
7.797 3.446 7.75 3.446 QT
7.109 4.305 6.133 4.789 QT
5.156 5.274 4.094 5.274 QT
3.344 5.274 2.547 5.055 QT
2.547 8.649 L
3.172 8.133 3.672 7.914 QT
4.172 7.696 4.938 7.696 QT
5.984 7.696 6.813 8.305 QT
7.641 8.914 8.086 9.883 QT
8.531 10.852 8.531 11.852 QT
8.531 12.992 7.969 13.969 QT
7.406 14.946 6.445 15.524 QT
5.484 16.102 4.344 16.102 QT
3.422 16.102 2.633 15.617 QT
1.844 15.133 1.398 14.313 QT
0.953 13.492 0.953 12.586 QT
0.953 12.149 1.227 11.883 QT
1.5 11.617 1.922 11.617 QT
2.344 11.617 2.625 11.891 QT
2.906 12.164 2.906 12.586 QT
2.906 12.992 2.625 13.274 QT
2.344 13.555 1.922 13.555 QT
1.859 13.555 1.773 13.539 QT
1.688 13.524 1.656 13.524 QT
cp}def
f424309639
f
GR
GS
[0.75 0 0 0.75 565.39284 296.8] CT
0.149 GC
N
/f-421612205{-8.38 15.68 M
-8.38 15.164 L
-8.38 15.117 -8.349 15.071 QT
-5.396 11.805 L
-4.724 11.071 -4.31 10.586 QT
-3.896 10.102 -3.49 9.461 QT
-3.083 8.821 -2.849 8.156 QT
-2.615 7.492 -2.615 6.742 QT
-2.615 5.961 -2.896 5.25 QT
-3.177 4.539 -3.747 4.117 QT
-4.318 3.696 -5.13 3.696 QT
-5.958 3.696 -6.615 4.188 QT
-7.271 4.68 -7.536 5.477 QT
-7.474 5.461 -7.333 5.461 QT
-6.911 5.461 -6.607 5.742 QT
-6.302 6.024 -6.302 6.492 QT
-6.302 6.914 -6.607 7.219 QT
-6.911 7.524 -7.333 7.524 QT
-7.786 7.524 -8.083 7.211 QT
-8.38 6.899 -8.38 6.492 QT
-8.38 5.774 -8.115 5.149 QT
-7.849 4.524 -7.341 4.031 QT
-6.833 3.539 -6.201 3.281 QT
-5.568 3.024 -4.849 3.024 QT
-3.771 3.024 -2.833 3.485 QT
-1.896 3.946 -1.349 4.781 QT
-0.802 5.617 -0.802 6.742 QT
-0.802 7.571 -1.161 8.313 QT
-1.521 9.055 -2.083 9.664 QT
-2.646 10.274 -3.529 11.039 QT
-4.411 11.805 -4.693 12.071 QT
-6.849 14.133 L
-5.021 14.133 L
-3.677 14.133 -2.771 14.11 QT
-1.865 14.086 -1.802 14.039 QT
-1.583 13.805 -1.349 12.289 QT
-0.802 12.289 L
-1.333 15.68 L
-8.38 15.68 L
cp}def
f-421612205
f
GR
GS
[0.75 0 0 0.75 565.39284 296.8] CT
0.149 GC
N
/f1101070870{4.75 16.102 M
2.422 16.102 1.586 14.18 QT
0.75 12.258 0.75 9.617 QT
0.75 7.977 1.047 6.516 QT
1.344 5.055 2.242 4.039 QT
3.141 3.024 4.75 3.024 QT
6 3.024 6.797 3.633 QT
7.594 4.242 8.016 5.219 QT
8.438 6.196 8.586 7.297 QT
8.734 8.399 8.734 9.617 QT
8.734 11.258 8.438 12.68 QT
8.141 14.102 7.258 15.102 QT
6.375 16.102 4.75 16.102 QT
cp
4.75 15.602 M
5.813 15.602 6.328 14.516 QT
6.844 13.43 6.969 12.117 QT
7.094 10.805 7.094 9.321 QT
7.094 7.883 6.969 6.68 QT
6.844 5.477 6.328 4.5 QT
5.813 3.524 4.75 3.524 QT
3.672 3.524 3.156 4.5 QT
2.641 5.477 2.516 6.68 QT
2.391 7.883 2.391 9.321 QT
2.391 10.367 2.445 11.305 QT
2.5 12.242 2.719 13.242 QT
2.938 14.242 3.438 14.922 QT
3.938 15.602 4.75 15.602 QT
cp}def
f1101070870
f
GR
GS
[0.75 0 0 0.75 674.67856 296.8] CT
0.149 GC
N
f-421612205
f
GR
GS
[0.75 0 0 0.75 674.67856 296.8] CT
0.149 GC
N
f424309639
f
GR
GS
[0.75 0 0 0.75 783.96432 296.8] CT
0.149 GC
N
/f1326577111{-7.521 14.211 M
-7.083 14.867 -6.333 15.18 QT
-5.583 15.492 -4.708 15.492 QT
-3.615 15.492 -3.146 14.555 QT
-2.677 13.617 -2.677 12.414 QT
-2.677 11.883 -2.779 11.344 QT
-2.88 10.805 -3.107 10.336 QT
-3.333 9.867 -3.74 9.594 QT
-4.146 9.321 -4.724 9.321 QT
-5.99 9.321 L
-6.161 9.321 -6.161 9.133 QT
-6.161 8.977 L
-6.161 8.821 -5.99 8.821 QT
-4.943 8.742 L
-4.271 8.742 -3.833 8.242 QT
-3.396 7.742 -3.193 7.024 QT
-2.99 6.305 -2.99 5.649 QT
-2.99 4.742 -3.411 4.156 QT
-3.833 3.571 -4.708 3.571 QT
-5.443 3.571 -6.099 3.844 QT
-6.755 4.117 -7.146 4.68 QT
-7.099 4.664 -7.076 4.664 QT
-7.052 4.664 -7.021 4.664 QT
-6.583 4.664 -6.294 4.961 QT
-6.005 5.258 -6.005 5.664 QT
-6.005 6.071 -6.294 6.367 QT
-6.583 6.664 -7.021 6.664 QT
-7.427 6.664 -7.724 6.367 QT
-8.021 6.071 -8.021 5.664 QT
-8.021 4.852 -7.529 4.25 QT
-7.036 3.649 -6.263 3.336 QT
-5.49 3.024 -4.708 3.024 QT
-4.13 3.024 -3.497 3.196 QT
-2.865 3.367 -2.341 3.688 QT
-1.818 4.008 -1.49 4.508 QT
-1.161 5.008 -1.161 5.649 QT
-1.161 6.446 -1.521 7.125 QT
-1.88 7.805 -2.497 8.297 QT
-3.115 8.789 -3.865 9.024 QT
-3.036 9.18 -2.294 9.649 QT
-1.552 10.117 -1.099 10.836 QT
-0.646 11.555 -0.646 12.399 QT
-0.646 13.446 -1.224 14.297 QT
-1.802 15.149 -2.74 15.625 QT
-3.677 16.102 -4.708 16.102 QT
-5.599 16.102 -6.497 15.758 QT
-7.396 15.414 -7.966 14.742 QT
-8.536 14.071 -8.536 13.117 QT
-8.536 12.649 -8.224 12.328 QT
-7.911 12.008 -7.427 12.008 QT
-7.13 12.008 -6.872 12.156 QT
-6.615 12.305 -6.474 12.563 QT
-6.333 12.821 -6.333 13.117 QT
-6.333 13.586 -6.654 13.899 QT
-6.974 14.211 -7.427 14.211 QT
-7.521 14.211 L
cp}def
f1326577111
f
GR
GS
[0.75 0 0 0.75 783.96432 296.8] CT
0.149 GC
N
f1101070870
f
GR
GS
[0.75 0 0 0.75 893.25 296.8] CT
0.149 GC
N
f1326577111
f
GR
GS
[0.75 0 0 0.75 893.25 296.8] CT
0.149 GC
N
f424309639
f
GR
GS
[0.75 0 0 0.75 0 0.25] CT
0.149 GC
2 setlinecap
1 LJ
0.667 LW
N
171 389 M
171 33 L
S
GR
GS
[0.75 0 0 0.75 0 0.25] CT
0.149 GC
2 setlinecap
1 LJ
0.667 LW
N
1191 389 M
1191 33 L
S
GR
GS
[0.75 0 0 0.75 0 0.25] CT
0.149 GC
2 setlinecap
1 LJ
0.667 LW
N
171 389 M
181.2 389 L
S
GR
GS
[0.75 0 0 0.75 0 0.25] CT
0.149 GC
2 setlinecap
1 LJ
0.667 LW
N
171 317.8 M
181.2 317.8 L
S
GR
GS
[0.75 0 0 0.75 0 0.25] CT
0.149 GC
2 setlinecap
1 LJ
0.667 LW
N
171 246.6 M
181.2 246.6 L
S
GR
GS
[0.75 0 0 0.75 0 0.25] CT
0.149 GC
2 setlinecap
1 LJ
0.667 LW
N
171 175.4 M
181.2 175.4 L
S
GR
GS
[0.75 0 0 0.75 0 0.25] CT
0.149 GC
2 setlinecap
1 LJ
0.667 LW
N
171 104.2 M
181.2 104.2 L
S
GR
GS
[0.75 0 0 0.75 0 0.25] CT
0.149 GC
2 setlinecap
1 LJ
0.667 LW
N
171 33 M
181.2 33 L
S
GR
GS
[0.75 0 0 0.75 0 0.25] CT
0.149 GC
2 setlinecap
1 LJ
0.667 LW
N
1191 389 M
1180.8 389 L
S
GR
GS
[0.75 0 0 0.75 0 0.25] CT
0.149 GC
2 setlinecap
1 LJ
0.667 LW
N
1191 317.8 M
1180.8 317.8 L
S
GR
GS
[0.75 0 0 0.75 0 0.25] CT
0.149 GC
2 setlinecap
1 LJ
0.667 LW
N
1191 246.6 M
1180.8 246.6 L
S
GR
GS
[0.75 0 0 0.75 0 0.25] CT
0.149 GC
2 setlinecap
1 LJ
0.667 LW
N
1191 175.4 M
1180.8 175.4 L
S
GR
GS
[0.75 0 0 0.75 0 0.25] CT
0.149 GC
2 setlinecap
1 LJ
0.667 LW
N
1191 104.2 M
1180.8 104.2 L
S
GR
GS
[0.75 0 0 0.75 0 0.25] CT
0.149 GC
2 setlinecap
1 LJ
0.667 LW
N
1191 33 M
1180.8 33 L
S
GR
GS
[0.75 0 0 0.75 123.45 292] CT
0.149 GC
N
/f-373173538{-4.583 4.902 M
-6.911 4.902 -7.747 2.98 QT
-8.583 1.058 -8.583 -1.583 QT
-8.583 -3.223 -8.286 -4.684 QT
-7.99 -6.145 -7.091 -7.161 QT
-6.193 -8.176 -4.583 -8.176 QT
-3.333 -8.176 -2.536 -7.567 QT
-1.74 -6.958 -1.318 -5.981 QT
-0.896 -5.004 -0.747 -3.903 QT
-0.599 -2.801 -0.599 -1.583 QT
-0.599 0.058 -0.896 1.48 QT
-1.193 2.902 -2.076 3.902 QT
-2.958 4.902 -4.583 4.902 QT
cp
-4.583 4.402 M
-3.521 4.402 -3.005 3.316 QT
-2.49 2.23 -2.365 0.917 QT
-2.24 -0.395 -2.24 -1.879 QT
-2.24 -3.317 -2.365 -4.52 QT
-2.49 -5.723 -3.005 -6.7 QT
-3.521 -7.676 -4.583 -7.676 QT
-5.661 -7.676 -6.177 -6.7 QT
-6.693 -5.723 -6.818 -4.52 QT
-6.943 -3.317 -6.943 -1.879 QT
-6.943 -0.833 -6.888 0.105 QT
-6.833 1.042 -6.615 2.042 QT
-6.396 3.042 -5.896 3.722 QT
-5.396 4.402 -4.583 4.402 QT
cp}def
f-373173538
f
GR
GS
[0.75 0 0 0.75 123.45 238.59999] CT
0.149 GC
N
/f221929001{-8.38 4.48 M
-8.38 3.964 L
-8.38 3.917 -8.349 3.871 QT
-5.396 0.605 L
-4.724 -0.129 -4.31 -0.614 QT
-3.896 -1.098 -3.49 -1.739 QT
-3.083 -2.379 -2.849 -3.044 QT
-2.615 -3.708 -2.615 -4.458 QT
-2.615 -5.239 -2.896 -5.95 QT
-3.177 -6.661 -3.747 -7.083 QT
-4.318 -7.504 -5.13 -7.504 QT
-5.958 -7.504 -6.615 -7.012 QT
-7.271 -6.52 -7.536 -5.723 QT
-7.474 -5.739 -7.333 -5.739 QT
-6.911 -5.739 -6.607 -5.458 QT
-6.302 -5.176 -6.302 -4.708 QT
-6.302 -4.286 -6.607 -3.981 QT
-6.911 -3.676 -7.333 -3.676 QT
-7.786 -3.676 -8.083 -3.989 QT
-8.38 -4.301 -8.38 -4.708 QT
-8.38 -5.426 -8.115 -6.051 QT
-7.849 -6.676 -7.341 -7.169 QT
-6.833 -7.661 -6.201 -7.919 QT
-5.568 -8.176 -4.849 -8.176 QT
-3.771 -8.176 -2.833 -7.715 QT
-1.896 -7.254 -1.349 -6.419 QT
-0.802 -5.583 -0.802 -4.458 QT
-0.802 -3.629 -1.161 -2.887 QT
-1.521 -2.145 -2.083 -1.536 QT
-2.646 -0.926 -3.529 -0.161 QT
-4.411 0.605 -4.693 0.871 QT
-6.849 2.933 L
-5.021 2.933 L
-3.677 2.933 -2.771 2.91 QT
-1.865 2.886 -1.802 2.839 QT
-1.583 2.605 -1.349 1.089 QT
-0.802 1.089 L
-1.333 4.48 L
-8.38 4.48 L
cp}def
f221929001
f
GR
GS
[0.75 0 0 0.75 123.45 185.2] CT
0.149 GC
N
/f-795451104{-8.802 1.339 M
-8.802 0.683 L
-2.927 -8.083 L
-2.865 -8.176 -2.74 -8.176 QT
-2.458 -8.176 L
-2.24 -8.176 -2.24 -7.958 QT
-2.24 0.683 L
-0.38 0.683 L
-0.38 1.339 L
-2.24 1.339 L
-2.24 3.214 L
-2.24 3.605 -1.685 3.706 QT
-1.13 3.808 -0.396 3.808 QT
-0.396 4.48 L
-5.63 4.48 L
-5.63 3.808 L
-4.896 3.808 -4.341 3.706 QT
-3.786 3.605 -3.786 3.214 QT
-3.786 1.339 L
-8.802 1.339 L
cp
-8.177 0.683 M
-3.677 0.683 L
-3.677 -6.051 L
-8.177 0.683 L
cp}def
f-795451104
f
GR
GS
[0.75 0 0 0.75 123.45 131.8] CT
0.149 GC
N
/f1301558740{-4.583 4.902 M
-5.755 4.902 -6.544 4.277 QT
-7.333 3.652 -7.771 2.652 QT
-8.208 1.652 -8.372 0.558 QT
-8.536 -0.536 -8.536 -1.661 QT
-8.536 -3.161 -7.951 -4.676 QT
-7.365 -6.192 -6.232 -7.184 QT
-5.099 -8.176 -3.536 -8.176 QT
-2.88 -8.176 -2.318 -7.926 QT
-1.755 -7.676 -1.443 -7.2 QT
-1.13 -6.723 -1.13 -6.051 QT
-1.13 -5.661 -1.388 -5.395 QT
-1.646 -5.129 -2.036 -5.129 QT
-2.411 -5.129 -2.677 -5.403 QT
-2.943 -5.676 -2.943 -6.051 QT
-2.943 -6.426 -2.677 -6.692 QT
-2.411 -6.958 -2.036 -6.958 QT
-1.943 -6.958 L
-2.177 -7.301 -2.622 -7.465 QT
-3.068 -7.629 -3.536 -7.629 QT
-4.115 -7.629 -4.599 -7.379 QT
-5.083 -7.129 -5.474 -6.7 QT
-5.865 -6.27 -6.122 -5.754 QT
-6.38 -5.239 -6.529 -4.583 QT
-6.677 -3.926 -6.708 -3.348 QT
-6.74 -2.77 -6.74 -1.911 QT
-6.411 -2.676 -5.802 -3.176 QT
-5.193 -3.676 -4.411 -3.676 QT
-3.568 -3.676 -2.872 -3.333 QT
-2.177 -2.989 -1.677 -2.379 QT
-1.177 -1.77 -0.911 -0.989 QT
-0.646 -0.208 -0.646 0.589 QT
-0.646 1.699 -1.146 2.706 QT
-1.646 3.714 -2.544 4.308 QT
-3.443 4.902 -4.583 4.902 QT
cp
-4.583 4.292 M
-3.849 4.292 -3.404 3.956 QT
-2.958 3.621 -2.747 3.074 QT
-2.536 2.527 -2.49 1.964 QT
-2.443 1.402 -2.443 0.589 QT
-2.443 -0.489 -2.544 -1.254 QT
-2.646 -2.02 -3.099 -2.598 QT
-3.552 -3.176 -4.49 -3.176 QT
-5.255 -3.176 -5.755 -2.653 QT
-6.255 -2.129 -6.482 -1.34 QT
-6.708 -0.551 -6.708 0.183 QT
-6.708 0.433 -6.693 0.558 QT
-6.693 0.589 -6.693 0.613 QT
-6.693 0.636 -6.708 0.652 QT
-6.708 1.48 -6.544 2.308 QT
-6.38 3.136 -5.904 3.714 QT
-5.427 4.292 -4.583 4.292 QT
cp}def
f1301558740
f
GR
GS
[0.75 0 0 0.75 123.45 78.4] CT
0.149 GC
N
/f-394930141{-8.536 1.589 M
-8.536 0.449 -7.786 -0.426 QT
-7.036 -1.301 -5.849 -1.879 QT
-6.552 -2.333 L
-7.208 -2.77 -7.615 -3.481 QT
-8.021 -4.192 -8.021 -4.958 QT
-8.021 -5.879 -7.544 -6.606 QT
-7.068 -7.333 -6.279 -7.754 QT
-5.49 -8.176 -4.583 -8.176 QT
-3.74 -8.176 -2.958 -7.833 QT
-2.177 -7.489 -1.669 -6.848 QT
-1.161 -6.208 -1.161 -5.333 QT
-1.161 -4.692 -1.458 -4.145 QT
-1.755 -3.598 -2.286 -3.161 QT
-2.818 -2.723 -3.411 -2.411 QT
-2.318 -1.723 L
-1.568 -1.223 -1.107 -0.426 QT
-0.646 0.371 -0.646 1.246 QT
-0.646 2.277 -1.201 3.121 QT
-1.755 3.964 -2.661 4.433 QT
-3.568 4.902 -4.583 4.902 QT
-5.568 4.902 -6.482 4.503 QT
-7.396 4.105 -7.966 3.347 QT
-8.536 2.589 -8.536 1.589 QT
cp
-7.505 1.589 M
-7.505 2.339 -7.091 2.964 QT
-6.677 3.589 -5.997 3.941 QT
-5.318 4.292 -4.583 4.292 QT
-3.474 4.292 -2.576 3.652 QT
-1.677 3.011 -1.677 1.933 QT
-1.677 1.574 -1.826 1.214 QT
-1.974 0.855 -2.224 0.566 QT
-2.474 0.277 -2.786 0.089 QT
-5.349 -1.567 L
-5.943 -1.239 -6.435 -0.762 QT
-6.927 -0.286 -7.216 0.324 QT
-7.505 0.933 -7.505 1.589 QT
cp
-6.193 -4.208 M
-3.896 -2.723 L
-3.099 -3.176 -2.591 -3.84 QT
-2.083 -4.504 -2.083 -5.333 QT
-2.083 -5.973 -2.435 -6.504 QT
-2.786 -7.036 -3.365 -7.333 QT
-3.943 -7.629 -4.599 -7.629 QT
-5.177 -7.629 -5.763 -7.403 QT
-6.349 -7.176 -6.724 -6.739 QT
-7.099 -6.301 -7.099 -5.708 QT
-7.099 -4.817 -6.193 -4.208 QT
cp}def
f-394930141
f
GR
GS
[0.75 0 0 0.75 123.45 25] CT
0.149 GC
N
/f-1193263589{-16.901 4.48 M
-16.901 3.808 L
-14.526 3.808 -14.526 3.214 QT
-14.526 -6.77 L
-15.51 -6.286 -17.01 -6.286 QT
-17.01 -6.958 L
-14.682 -6.958 -13.495 -8.176 QT
-13.229 -8.176 L
-13.167 -8.176 -13.104 -8.122 QT
-13.042 -8.067 -13.042 -8.004 QT
-13.042 3.214 L
-13.042 3.808 -10.667 3.808 QT
-10.667 4.48 L
-16.901 4.48 L
cp}def
f-1193263589
f
GR
GS
[0.75 0 0 0.75 123.45 25] CT
0.149 GC
N
f-373173538
f
GR
GS
[0.75 0 0 0.75 0 0.25] CT
0 0.447 0.741 RC
1 LJ
1.333 LW
N
200.143 338.242 M
229.286 181.423 L
258.429 147.324 L
287.571 157.193 L
316.714 151.189 L
345.857 96.592 L
375 223.272 L
404.143 182.441 L
433.286 286.401 L
462.429 381.759 L
491.571 371.407 L
520.714 289.77 L
549.857 273.837 L
579 246.699 L
608.143 209.993 L
637.286 200.28 L
666.429 54.559 L
695.571 177.343 L
724.714 288.97 L
753.857 262.353 L
783 264.105 L
812.143 224.907 L
841.286 227.892 L
870.429 206.527 L
899.571 185.158 L
928.714 169.665 L
957.857 216.029 L
987 328.884 L
1016.143 360.46 L
1045.286 386.819 L
1074.429 350.594 L
1103.571 335.616 L
S
GR
GS
[0.75 0 0 0.75 0 0.25] CT
0.929 0.694 0.125 RC
1 LJ
1.333 LW
N
200.143 313.344 M
229.286 277.297 L
258.429 277.883 L
287.571 293.181 L
316.714 292.66 L
345.857 250.93 L
375 276.021 L
404.143 338.619 L
433.286 335.017 L
462.429 253.265 L
491.571 293.914 L
520.714 365.402 L
549.857 378.091 L
579 357.542 L
608.143 319.481 L
637.286 336.144 L
666.429 150.264 L
695.571 298.378 L
724.714 355.75 L
753.857 387.295 L
783 384.078 L
812.143 360.687 L
841.286 386.526 L
870.429 345.33 L
899.571 332.44 L
928.714 318.349 L
957.857 324.883 L
987 245.429 L
1016.143 264.04 L
1045.286 326.903 L
1074.429 317.986 L
1103.571 366.995 L
S
GR
GS
[0.75 0 0 0.75 0 0.25] CT
1 0 0 RC
1 LJ
2.667 LW
N
200.143 368.763 M
229.286 337.827 L
258.429 350.551 L
287.571 357.148 L
316.714 356.044 L
345.857 339.851 L
375 377.869 L
404.143 319.653 L
433.286 157.089 L
462.429 48.29 L
491.571 71.207 L
520.714 192.692 L
549.857 180.65 L
579 248.958 L
608.143 302.428 L
637.286 317.547 L
666.429 94.674 L
695.571 368.536 L
724.714 214.689 L
753.857 239.654 L
783 206.374 L
812.143 237.93 L
841.286 207.783 L
870.429 265.822 L
899.571 300.684 L
928.714 290.095 L
957.857 297.669 L
987 283.824 L
1016.143 301.844 L
1045.286 352.45 L
1074.429 360.05 L
1103.571 275.383 L
S
GR
GS
[0.75 0 0 0.75 0 0.25] CT
1 GC
N
859 73 M
859 46 L
1178 46 L
1178 73 L
cp
f
GR
GS
[0.75 0 0 0.75 679.48361 44.6868] CT
N
/f1911859244{0.578 4.48 M
0.578 3.808 L
2.547 3.808 2.547 3.214 QT
2.547 -7.223 L
2.547 -7.833 0.578 -7.833 QT
0.578 -8.504 L
11.328 -8.504 L
11.859 -4.145 L
11.313 -4.145 L
11.109 -5.786 10.742 -6.528 QT
10.375 -7.27 9.57 -7.551 QT
8.766 -7.833 7.141 -7.833 QT
5.281 -7.833 L
4.938 -7.833 4.75 -7.801 QT
4.563 -7.77 4.438 -7.637 QT
4.313 -7.504 4.313 -7.223 QT
4.313 -2.583 L
5.719 -2.583 L
6.688 -2.583 7.164 -2.747 QT
7.641 -2.911 7.82 -3.372 QT
8 -3.833 8 -4.801 QT
8.547 -4.801 L
8.547 0.292 L
8 0.292 L
8 -0.676 7.82 -1.137 QT
7.641 -1.598 7.164 -1.762 QT
6.688 -1.926 5.719 -1.926 QT
4.313 -1.926 L
4.313 3.214 L
4.313 3.621 4.547 3.714 QT
4.781 3.808 5.281 3.808 QT
7.297 3.808 L
8.609 3.808 9.422 3.605 QT
10.234 3.402 10.688 2.91 QT
11.141 2.417 11.383 1.644 QT
11.625 0.871 11.844 -0.504 QT
12.391 -0.504 L
11.594 4.48 L
0.578 4.48 L
cp}def
f1911859244
f
GR
GS
[0.75 0 0 0.75 679.48361 44.6868] CT
N
/f-1271245566{13.329 4.48 M
13.329 3.808 L
15.297 3.808 15.297 3.214 QT
15.297 -7.223 L
15.297 -7.833 13.329 -7.833 QT
13.329 -8.504 L
20.344 -8.504 L
21.641 -8.504 22.719 -7.942 QT
23.797 -7.379 24.555 -6.442 QT
25.313 -5.504 25.727 -4.317 QT
26.141 -3.129 26.141 -1.879 QT
26.141 -0.676 25.719 0.456 QT
25.297 1.589 24.516 2.503 QT
23.735 3.417 22.665 3.949 QT
21.594 4.48 20.344 4.48 QT
13.329 4.48 L
cp
17.001 3.214 M
17.001 3.621 17.235 3.714 QT
17.469 3.808 17.969 3.808 QT
19.844 3.808 L
20.829 3.808 21.704 3.386 QT
22.579 2.964 23.157 2.214 QT
23.751 1.417 23.954 0.433 QT
24.157 -0.551 24.157 -1.879 QT
24.157 -3.27 23.954 -4.309 QT
23.751 -5.348 23.157 -6.161 QT
22.579 -6.973 21.712 -7.403 QT
20.844 -7.833 19.844 -7.833 QT
17.969 -7.833 L
17.626 -7.833 17.43 -7.801 QT
17.235 -7.77 17.118 -7.637 QT
17.001 -7.504 17.001 -7.223 QT
17.001 3.214 L
cp}def
f-1271245566
f
GR
GS
[0.75 0 0 0.75 0 0.25] CT
0 0.447 0.741 RC
1 LJ
1.333 LW
N
862.998 59.249 M
902.98 59.249 L
S
GR
GS
[0.75 0 0 0.75 735.67973 44.6868] CT
N
/f-474686110{1.063 4.746 M
1.063 0.308 L
1.063 0.167 1.234 0.167 QT
1.469 0.167 L
1.516 0.167 1.563 0.214 QT
1.609 0.261 1.609 0.308 QT
1.609 2.183 2.766 3.206 QT
3.922 4.23 5.797 4.23 QT
6.453 4.23 7.016 3.847 QT
7.578 3.464 7.883 2.847 QT
8.188 2.23 8.188 1.574 QT
8.188 0.996 7.961 0.456 QT
7.734 -0.083 7.297 -0.481 QT
6.859 -0.879 6.313 -1.02 QT
3.844 -1.614 L
2.609 -1.942 1.836 -2.95 QT
1.063 -3.958 1.063 -5.208 QT
1.063 -6.192 1.563 -7.051 QT
2.063 -7.911 2.914 -8.411 QT
3.766 -8.911 4.75 -8.911 QT
6.656 -8.911 7.781 -7.629 QT
8.547 -8.864 L
8.609 -8.911 8.688 -8.911 QT
8.813 -8.911 L
8.875 -8.911 8.922 -8.872 QT
8.969 -8.833 8.969 -8.754 QT
8.969 -4.348 L
8.969 -4.192 8.813 -4.192 QT
8.594 -4.192 L
8.422 -4.192 8.422 -4.348 QT
8.422 -4.833 8.258 -5.411 QT
8.094 -5.989 7.805 -6.512 QT
7.516 -7.036 7.188 -7.379 QT
6.266 -8.301 4.75 -8.301 QT
4.094 -8.301 3.547 -7.973 QT
3 -7.645 2.68 -7.083 QT
2.359 -6.52 2.359 -5.895 QT
2.359 -5.083 2.867 -4.419 QT
3.375 -3.754 4.188 -3.536 QT
6.656 -2.926 L
7.266 -2.786 7.805 -2.403 QT
8.344 -2.02 8.711 -1.504 QT
9.078 -0.989 9.281 -0.364 QT
9.484 0.261 9.484 0.933 QT
9.484 1.949 9.008 2.863 QT
8.531 3.777 7.672 4.339 QT
6.813 4.902 5.797 4.902 QT
5.172 4.902 4.508 4.761 QT
3.844 4.621 3.289 4.331 QT
2.734 4.042 2.281 3.589 QT
1.484 4.839 L
1.422 4.902 1.344 4.902 QT
1.234 4.902 L
1.063 4.902 1.063 4.746 QT
cp}def
f-474686110
f
GR
GS
[0.75 0 0 0.75 735.67973 44.6868] CT
N
/f-1385369685{10.995 4.48 M
10.995 3.808 L
12.964 3.808 12.964 3.214 QT
12.964 -7.223 L
12.964 -7.833 10.995 -7.833 QT
10.995 -8.504 L
18.011 -8.504 L
19.308 -8.504 20.386 -7.942 QT
21.464 -7.379 22.222 -6.442 QT
22.98 -5.504 23.394 -4.317 QT
23.808 -3.129 23.808 -1.879 QT
23.808 -0.676 23.386 0.456 QT
22.964 1.589 22.183 2.503 QT
21.402 3.417 20.331 3.949 QT
19.261 4.48 18.011 4.48 QT
10.995 4.48 L
cp
14.667 3.214 M
14.667 3.621 14.902 3.714 QT
15.136 3.808 15.636 3.808 QT
17.511 3.808 L
18.495 3.808 19.37 3.386 QT
20.245 2.964 20.824 2.214 QT
21.417 1.417 21.62 0.433 QT
21.824 -0.551 21.824 -1.879 QT
21.824 -3.27 21.62 -4.309 QT
21.417 -5.348 20.824 -6.161 QT
20.245 -6.973 19.378 -7.403 QT
18.511 -7.833 17.511 -7.833 QT
15.636 -7.833 L
15.292 -7.833 15.097 -7.801 QT
14.902 -7.77 14.784 -7.637 QT
14.667 -7.504 14.667 -7.223 QT
14.667 3.214 L
cp}def
f-1385369685
f
GR
GS
[0.75 0 0 0.75 0 0.25] CT
0.929 0.694 0.125 RC
1 LJ
1.333 LW
N
937.926 59.249 M
977.908 59.249 L
S
GR
GS
[0.75 0 0 0.75 790.12665 44.6868] CT
N
/f-1219964112{0.484 4.48 M
0.484 3.808 L
2.547 3.808 2.547 3.214 QT
2.547 -7.223 L
2.547 -7.833 0.484 -7.833 QT
0.484 -8.504 L
6.359 -8.504 L
6.359 -7.833 L
4.313 -7.833 4.313 -7.223 QT
4.313 3.214 L
4.313 3.808 6.359 3.808 QT
6.359 4.48 L
0.484 4.48 L
cp}def
f-1219964112
f
GR
GS
[0.75 0 0 0.75 790.12665 44.6868] CT
N
/f-1967960234{7.35 4.48 M
7.35 3.808 L
9.053 3.808 9.444 2.683 QT
13.428 -8.911 L
13.491 -9.114 13.741 -9.114 QT
13.975 -9.114 L
14.225 -9.114 14.288 -8.911 QT
18.444 3.214 L
18.631 3.605 19.124 3.706 QT
19.616 3.808 20.366 3.808 QT
20.366 4.48 L
15.069 4.48 L
15.069 3.808 L
16.647 3.808 16.647 3.308 QT
16.647 3.214 L
15.616 0.246 L
11.006 0.246 L
10.147 2.683 L
10.131 2.761 10.131 2.886 QT
10.131 3.355 10.577 3.581 QT
11.022 3.808 11.553 3.808 QT
11.553 4.48 L
7.35 4.48 L
cp
11.225 -0.426 M
15.381 -0.426 L
13.303 -6.489 L
11.225 -0.426 L
cp}def
f-1967960234
f
GR
GS
[0.75 0 0 0.75 790.12665 44.6868] CT
N
/f619241193{21.366 4.48 M
21.366 3.808 L
23.335 3.808 23.335 3.214 QT
23.335 -7.223 L
23.335 -7.833 21.366 -7.833 QT
21.366 -8.504 L
27.335 -8.504 L
28.397 -8.504 29.577 -8.114 QT
30.756 -7.723 31.545 -6.934 QT
32.335 -6.145 32.335 -5.051 QT
32.335 -4.254 31.85 -3.629 QT
31.366 -3.004 30.624 -2.583 QT
29.881 -2.161 29.1 -1.973 QT
29.96 -1.676 30.6 -1.028 QT
31.241 -0.379 31.366 0.449 QT
31.631 2.136 L
31.819 3.277 32.022 3.839 QT
32.225 4.402 32.928 4.402 QT
33.522 4.402 33.811 3.855 QT
34.1 3.308 34.1 2.652 QT
34.1 2.589 34.163 2.535 QT
34.225 2.48 34.288 2.48 QT
34.46 2.48 L
34.647 2.48 34.647 2.73 QT
34.647 3.261 34.444 3.753 QT
34.241 4.246 33.858 4.574 QT
33.475 4.902 32.944 4.902 QT
31.569 4.902 30.577 4.214 QT
29.585 3.527 29.585 2.214 QT
29.585 0.527 L
29.585 -0.426 28.928 -1.098 QT
28.272 -1.77 27.319 -1.77 QT
25.038 -1.77 L
25.038 3.214 L
25.038 3.808 26.991 3.808 QT
26.991 4.48 L
21.366 4.48 L
cp
25.038 -2.27 M
27.069 -2.27 L
28.647 -2.27 29.475 -2.903 QT
30.303 -3.536 30.303 -5.051 QT
30.303 -6.567 29.483 -7.2 QT
28.663 -7.833 27.069 -7.833 QT
26.006 -7.833 L
25.663 -7.833 25.467 -7.801 QT
25.272 -7.77 25.155 -7.637 QT
25.038 -7.504 25.038 -7.223 QT
25.038 -2.27 L
cp}def
f619241193
f
GR
GS
[0.75 0 0 0.75 790.12665 44.6868] CT
N
/f1391054589{46.594 9.199 M
45.532 8.355 44.766 7.277 QT
44.001 6.199 43.516 4.972 QT
43.032 3.746 42.79 2.41 QT
42.547 1.074 42.547 -0.27 QT
42.547 -1.629 42.79 -2.965 QT
43.032 -4.301 43.532 -5.536 QT
44.032 -6.77 44.797 -7.848 QT
45.563 -8.926 46.594 -9.739 QT
46.594 -9.77 46.688 -9.77 QT
46.86 -9.77 L
46.922 -9.77 46.969 -9.715 QT
47.016 -9.661 47.016 -9.598 QT
47.016 -9.52 46.969 -9.489 QT
46.047 -8.567 45.43 -7.528 QT
44.813 -6.489 44.438 -5.317 QT
44.063 -4.145 43.899 -2.887 QT
43.735 -1.629 43.735 -0.27 QT
43.735 5.777 46.954 8.902 QT
47.016 8.964 47.016 9.058 QT
47.016 9.105 46.962 9.167 QT
46.907 9.23 46.86 9.23 QT
46.688 9.23 L
46.594 9.23 46.594 9.199 QT
cp}def
f1391054589
f
GR
GS
[0.75 0 0 0.75 790.12665 44.6868] CT
N
/f881003972{48.588 4.48 M
48.588 3.808 L
50.557 3.808 50.557 3.214 QT
50.557 -7.223 L
50.557 -7.833 48.588 -7.833 QT
48.588 -8.504 L
55.354 -8.504 L
56.401 -8.504 57.44 -8.075 QT
58.479 -7.645 59.151 -6.833 QT
59.822 -6.02 59.822 -4.926 QT
59.822 -3.864 59.143 -3.067 QT
58.463 -2.27 57.432 -1.856 QT
56.401 -1.442 55.354 -1.442 QT
52.307 -1.442 L
52.307 3.214 L
52.307 3.808 54.276 3.808 QT
54.276 4.48 L
48.588 4.48 L
cp
52.26 -2.02 M
54.838 -2.02 L
55.885 -2.02 56.533 -2.317 QT
57.182 -2.614 57.486 -3.254 QT
57.791 -3.895 57.791 -4.926 QT
57.791 -6.473 57.111 -7.153 QT
56.432 -7.833 54.838 -7.833 QT
53.229 -7.833 L
52.885 -7.833 52.69 -7.801 QT
52.494 -7.77 52.377 -7.637 QT
52.26 -7.504 52.26 -7.223 QT
52.26 -2.02 L
cp}def
f881003972
f
GR
GS
[0.75 0 0 0.75 790.12665 44.6868] CT
N
/f-57042530{61.292 4.48 M
61.292 3.808 L
63.261 3.808 63.261 3.214 QT
63.261 -7.223 L
63.261 -7.833 61.292 -7.833 QT
61.292 -8.504 L
67.26 -8.504 L
68.323 -8.504 69.503 -8.114 QT
70.682 -7.723 71.471 -6.934 QT
72.26 -6.145 72.26 -5.051 QT
72.26 -4.254 71.776 -3.629 QT
71.292 -3.004 70.55 -2.583 QT
69.807 -2.161 69.026 -1.973 QT
69.885 -1.676 70.526 -1.028 QT
71.167 -0.379 71.292 0.449 QT
71.557 2.136 L
71.745 3.277 71.948 3.839 QT
72.151 4.402 72.854 4.402 QT
73.448 4.402 73.737 3.855 QT
74.026 3.308 74.026 2.652 QT
74.026 2.589 74.089 2.535 QT
74.151 2.48 74.214 2.48 QT
74.385 2.48 L
74.573 2.48 74.573 2.73 QT
74.573 3.261 74.37 3.753 QT
74.167 4.246 73.784 4.574 QT
73.401 4.902 72.87 4.902 QT
71.495 4.902 70.503 4.214 QT
69.51 3.527 69.51 2.214 QT
69.51 0.527 L
69.51 -0.426 68.854 -1.098 QT
68.198 -1.77 67.245 -1.77 QT
64.964 -1.77 L
64.964 3.214 L
64.964 3.808 66.917 3.808 QT
66.917 4.48 L
61.292 4.48 L
cp
64.964 -2.27 M
66.995 -2.27 L
68.573 -2.27 69.401 -2.903 QT
70.229 -3.536 70.229 -5.051 QT
70.229 -6.567 69.409 -7.2 QT
68.589 -7.833 66.995 -7.833 QT
65.932 -7.833 L
65.589 -7.833 65.393 -7.801 QT
65.198 -7.77 65.081 -7.637 QT
64.964 -7.504 64.964 -7.223 QT
64.964 -2.27 L
cp}def
f-57042530
f
GR
GS
[0.75 0 0 0.75 790.12665 44.6868] CT
N
/f-1794990217{74.986 4.48 M
74.986 3.808 L
76.954 3.808 76.954 2.683 QT
76.954 -7.723 L
76.329 -7.833 74.986 -7.833 QT
74.986 -8.504 L
78.626 -8.504 L
78.72 -8.504 78.751 -8.426 QT
85.486 1.48 L
85.486 -6.708 L
85.486 -7.833 83.533 -7.833 QT
83.533 -8.504 L
88.048 -8.504 L
88.048 -7.833 L
86.095 -7.833 86.095 -6.708 QT
86.095 4.308 L
86.095 4.371 86.025 4.425 QT
85.954 4.48 85.908 4.48 QT
85.673 4.48 L
85.579 4.48 85.548 4.402 QT
77.564 -7.333 L
77.564 2.683 L
77.564 3.808 79.517 3.808 QT
79.517 4.48 L
74.986 4.48 L
cp}def
f-1794990217
f
GR
GS
[0.75 0 0 0.75 790.12665 44.6868] CT
N
/f-1078901747{96.395 4.48 M
96.395 3.808 L
98.77 3.808 98.77 3.214 QT
98.77 -6.77 L
97.786 -6.286 96.286 -6.286 QT
96.286 -6.958 L
98.614 -6.958 99.802 -8.176 QT
100.067 -8.176 L
100.13 -8.176 100.192 -8.122 QT
100.255 -8.067 100.255 -8.004 QT
100.255 3.214 L
100.255 3.808 102.63 3.808 QT
102.63 4.48 L
96.395 4.48 L
cp}def
f-1078901747
f
GR
GS
[0.75 0 0 0.75 790.12665 44.6868] CT
N
/f-1110732666{107.26 3.996 M
107.26 2.933 107.447 1.917 QT
107.635 0.902 107.994 -0.083 QT
108.354 -1.067 108.862 -2.02 QT
109.369 -2.973 109.963 -3.801 QT
111.697 -6.223 L
109.526 -6.223 L
106.151 -6.223 106.057 -6.129 QT
105.807 -5.817 105.572 -4.364 QT
105.026 -4.364 L
105.651 -8.364 L
106.213 -8.364 L
106.213 -8.301 L
106.213 -7.958 107.369 -7.856 QT
108.526 -7.754 109.635 -7.754 QT
113.182 -7.754 L
113.182 -7.27 L
113.182 -7.254 113.174 -7.239 QT
113.166 -7.223 113.151 -7.208 QT
110.541 -3.536 L
109.572 -2.114 109.33 -0.364 QT
109.088 1.386 109.088 3.996 QT
109.088 4.355 108.822 4.628 QT
108.557 4.902 108.182 4.902 QT
107.807 4.902 107.533 4.628 QT
107.26 4.355 107.26 3.996 QT
cp}def
f-1110732666
f
GR
GS
[0.75 0 0 0.75 790.12665 44.6868] CT
N
/f1959968701{114.531 9.23 M
114.359 9.23 114.359 9.058 QT
114.359 8.98 114.406 8.949 QT
117.64 5.777 117.64 -0.27 QT
117.64 -6.317 114.437 -9.442 QT
114.359 -9.489 114.359 -9.598 QT
114.359 -9.661 114.414 -9.715 QT
114.468 -9.77 114.531 -9.77 QT
114.703 -9.77 L
114.765 -9.77 114.796 -9.739 QT
116.156 -8.661 117.07 -7.122 QT
117.984 -5.583 118.406 -3.833 QT
118.828 -2.083 118.828 -0.27 QT
118.828 1.074 118.601 2.378 QT
118.375 3.683 117.875 4.949 QT
117.375 6.214 116.617 7.285 QT
115.859 8.355 114.796 9.199 QT
114.765 9.23 114.703 9.23 QT
114.531 9.23 L
cp}def
f1959968701
f
GR
GS
[0.75 0 0 0.75 0 0.25] CT
1 0 0 RC
1 LJ
2.667 LW
N
1010.522 59.249 M
1050.504 59.249 L
S
GR
GS
[0.75 0 0 0.75 0 0.25] CT
0.149 GC
10.0 ML
0.667 LW
N
859 73 M
859 46 L
1178 46 L
1178 73 L
cp
S
GR
%%Trailer
%%Pages: 1
%%EOF
