\relax 
\providecommand\hyper@newdestlabel[2]{}
\@writefile{toc}{\contentsline {chapter}{\numberline {2}Global Navigation Satellite Systems and Cooperative Positioning}{7}{chapter.2}\protected@file@percent }
\@writefile{lof}{\addvspace {10\p@ }}
\@writefile{lot}{\addvspace {10\p@ }}
\newlabel{ch:GNSSfundamentals}{{2}{7}{Global Navigation Satellite Systems and Cooperative Positioning}{chapter.2}{}}
\acronymused{GNSS}
\acronymused{RF}
\acronymused{GNSS}
\acronymused{GPS}
\acronymused{GNSS}
\acronymused{GNSS}
\acronymused{CP}
\acronymused{GPS}
\acronymused{GNSS}
\acronymused{PVT}
\@writefile{toc}{\contentsline {section}{\numberline {2.1}From the Observation of the Stars to Radio Navigation}{7}{section.2.1}\protected@file@percent }
\newlabel{sec:radioNav}{{2.1}{7}{From the Observation of the Stars to Radio Navigation}{section.2.1}{}}
\@writefile{toc}{\contentsline {subsection}{\numberline {2.1.1}Brief history of navigation technologies}{7}{subsection.2.1.1}\protected@file@percent }
\newlabel{sub:history}{{2.1.1}{7}{Brief history of navigation technologies}{subsection.2.1.1}{}}
\acronymused{PNT}
\@writefile{toc}{\contentsline {subsubsection}{Geodesy, timekeeping and astronomy}{8}{subsection.2.1.1}\protected@file@percent }
\@writefile{toc}{\contentsline {subsubsection}{Terrestrial Radionavigation System}{8}{subsection.2.1.1}\protected@file@percent }
\acronymused{RF}
\acronymused{GNSS}
\@writefile{toc}{\contentsline {paragraph}{\ac {TDoA}}{9}{subsection.2.1.1}\protected@file@percent }
\acronymused{TDoA}
\acronymused{TDoA}
\acronymused{ToA}
\AC@undonewlabel{acro:LORAN}
\newlabel{acro:LORAN}{{2.1.1}{9}{\ac {TDoA}}{subsection.2.1.1}{}}
\acronymused{LORAN}
\@writefile{lof}{\contentsline {figure}{\numberline {2.1}{\ignorespaces {Hyperbolic positioning solution using three transmitter and \ac {TDoA} measurements.}\relax }}{9}{figure.caption.7}\protected@file@percent }
\acronymused{TDoA}
\newlabel{fig:TDoA}{{2.1}{9}{{Hyperbolic positioning solution using three transmitter and \ac {TDoA} measurements.}\relax }{figure.caption.7}{}}
\@writefile{toc}{\contentsline {paragraph}{\ac {DoA}}{9}{figure.caption.7}\protected@file@percent }
\acronymused{DoA}
\acronymused{DoA}
\AC@undonewlabel{acro:AoA}
\newlabel{acro:AoA}{{2.1.1}{9}{\ac {DoA}}{figure.caption.7}{}}
\acronymused{AoA}
\acronymused{DoA}
\acronymused{DoA}
\@writefile{toc}{\contentsline {paragraph}{Doppler Navigation}{9}{figure.caption.8}\protected@file@percent }
\@writefile{toc}{\contentsline {paragraph}{\ac {ToA}}{9}{figure.caption.8}\protected@file@percent }
\acronymused{ToA}
\acronymused{GNSS}
\acronymused{ToA}
\AC@undonewlabel{acro:ToF}
\newlabel{acro:ToF}{{2.1.1}{9}{\ac {ToA}}{figure.caption.8}{}}
\acronymused{ToF}
\acronymused{ToA}
\acronymused{ToA}
\acronymused{ToA}
\acronymused{GNSS}
\@writefile{lof}{\contentsline {figure}{\numberline {2.2}{\ignorespaces {Triangulated positioning solution using two asynchronous transmitter and \ac {DoA} measurements.}\relax }}{10}{figure.caption.8}\protected@file@percent }
\acronymused{DoA}
\newlabel{fig:AoA}{{2.2}{10}{{Triangulated positioning solution using two asynchronous transmitter and \ac {DoA} measurements.}\relax }{figure.caption.8}{}}
\acronymused{GNSS}
\@writefile{lof}{\contentsline {figure}{\numberline {2.3}{\ignorespaces {Trilaterated positioning solution using three transmitters and \ac {ToA} measurements with synchronous transmitters and receivers.}\relax }}{10}{figure.caption.9}\protected@file@percent }
\acronymused{ToA}
\newlabel{fig:ToA}{{2.3}{10}{{Trilaterated positioning solution using three transmitters and \ac {ToA} measurements with synchronous transmitters and receivers.}\relax }{figure.caption.9}{}}
\@writefile{toc}{\contentsline {subsubsection}{Early Satellite Navigation Systems}{10}{figure.caption.9}\protected@file@percent }
\newlabel{sec:GNSSSfund}{{2.1.1}{10}{Early Satellite Navigation Systems}{figure.caption.9}{}}
\AC@undonewlabel{acro:DARPA}
\newlabel{acro:DARPA}{{2.1.1}{10}{Early Satellite Navigation Systems}{figure.caption.9}{}}
\acronymused{DARPA}
\AC@undonewlabel{acro:NNSS}
\newlabel{acro:NNSS}{{2.1.1}{10}{Early Satellite Navigation Systems}{figure.caption.9}{}}
\acronymused{NNSS}
\acronymused{GPS}
\acronymused{GNSS}
\acronymused{GPS}
\AC@undonewlabel{acro:GLONASS}
\newlabel{acro:GLONASS}{{2.1.1}{11}{Early Satellite Navigation Systems}{figure.caption.9}{}}
\acronymused{GLONASS}
\acronymused{ToA}
\@writefile{toc}{\contentsline {section}{\numberline {2.2}Navigation Satellite Systems}{11}{section.2.2}\protected@file@percent }
\newlabel{sec:nss}{{2.2}{11}{Navigation Satellite Systems}{section.2.2}{}}
\acronymused{GPS}
\@writefile{toc}{\contentsline {subsection}{\numberline {2.2.1}GPS}{11}{subsection.2.2.1}\protected@file@percent }
\AC@undonewlabel{acro:DoD}
\newlabel{acro:DoD}{{2.2.1}{11}{GPS}{subsection.2.2.1}{}}
\acronymused{DoD}
\acronymused{GPS}
\AC@undonewlabel{acro:MEO}
\newlabel{acro:MEO}{{2.2.1}{11}{GPS}{subsection.2.2.1}{}}
\acronymused{MEO}
\AC@undonewlabel{acro:NAVSTAR}
\newlabel{acro:NAVSTAR}{{2.2.1}{11}{GPS}{subsection.2.2.1}{}}
\acronymused{NAVSTAR}
\acronymused{MEO}
\AC@undonewlabel{acro:UHF}
\newlabel{acro:UHF}{{2.2.1}{11}{GPS}{subsection.2.2.1}{}}
\acronymused{UHF}
\AC@undonewlabel{acro:CDMA}
\newlabel{acro:CDMA}{{2.2.1}{11}{GPS}{subsection.2.2.1}{}}
\acronymused{CDMA}
\acronymused{GPS}
\acronymused{GPS}
\acronymused{GPS}
\@writefile{loc}{\ChangesListline {added}{Added~(1)}{fully}{11}}
\@writefile{loc}{\ChangesListline {replaced}{Replaced~(1)}{At the time of writing}{11}}
\acronymused{GPS}
\@writefile{lot}{\contentsline {table}{\numberline {2.1}{\ignorespaces Current Global Navigation Satellite Systems.\relax }}{12}{table.caption.10}\protected@file@percent }
\newlabel{tab:GNSSs}{{2.1}{12}{Current Global Navigation Satellite Systems.\relax }{table.caption.10}{}}
\@writefile{toc}{\contentsline {subsection}{\numberline {2.2.2}Galileo}{13}{subsection.2.2.2}\protected@file@percent }
\acronymused{GNSS}
\acronymused{ESA}
\AC@undonewlabel{acro:GSA}
\newlabel{acro:GSA}{{2.2.2}{13}{Galileo}{subsection.2.2.2}{}}
\acronymused{GSA}
\AC@undonewlabel{acro:IOC}
\newlabel{acro:IOC}{{2.2.2}{13}{Galileo}{subsection.2.2.2}{}}
\acronymused{IOC}
\AC@undonewlabel{acro:EOC}
\newlabel{acro:EOC}{{2.2.2}{13}{Galileo}{subsection.2.2.2}{}}
\acronymused{EOC}
\@writefile{loc}{\ChangesListline {replaced}{Replaced~(1)}{26}{13}}
\AC@undonewlabel{acro:IOV}
\newlabel{acro:IOV}{{2.2.2}{13}{Galileo}{subsection.2.2.2}{}}
\acronymused{IOV}
\AC@undonewlabel{acro:BOC}
\newlabel{acro:BOC}{{2.2.2}{13}{Galileo}{subsection.2.2.2}{}}
\acronymused{BOC}
\acronymused{GPS}
\@writefile{toc}{\contentsline {subsection}{\numberline {2.2.3}Other global and regional systems}{13}{subsection.2.2.3}\protected@file@percent }
\acronymused{GPS}
\acronymused{GNSS}
\acronymused{GPS}
\AC@undonewlabel{acro:FDMA}
\newlabel{acro:FDMA}{{2.2.3}{13}{Other global and regional systems}{subsection.2.2.3}{}}
\acronymused{FDMA}
\acronymused{CDMA}
\acronymused{CDMA}
\acronymused{GPS}
\acronymused{GPS}
\acronymused{DGPS}
\@writefile{toc}{\contentsline {subsection}{\numberline {2.2.4}Augmentation Systems and \ac {DGPS}}{14}{subsection.2.2.4}\protected@file@percent }
\acronymused{GNSS}
\acronymused{GPS}
\AC@undonewlabel{acro:ILS}
\newlabel{acro:ILS}{{2.2.4}{14}{Augmentation Systems and \ac {DGPS}}{subsection.2.2.4}{}}
\acronymused{ILS}
\acronymused{GNSS}
\acronymused{GPS}
\acronymused{GNSS}
\acronymused{DGNSS}
\acronymused{DGNSS}
\acronymused{GNSS}
\@writefile{loc}{\ChangesListline {added}{Added~(1)}{over defined service areas}{14}}
\@writefile{loc}{\ChangesListline {deleted}{Deleted~(1)}{satellite-based}{14}}
\AC@undonewlabel{acro:SBAS}
\newlabel{acro:SBAS}{{2.2.4}{14}{Augmentation Systems and \ac {DGPS}}{subsection.2.2.4}{}}
\acronymused{SBAS}
\acronymused{GNSS}
\acronymused{GPS}
\@writefile{loc}{\ChangesListline {added}{Added~(1)}{third version of the}{14}}
\AC@undonewlabel{acro:RIMS}
\newlabel{acro:RIMS}{{2.2.4}{14}{Augmentation Systems and \ac {DGPS}}{subsection.2.2.4}{}}
\acronymused{RIMS}
\@writefile{loc}{\ChangesListline {added}{Added~(1)}{to serve a wide area including Europe and the northern coastal region of Africa. Additional ground stations are operational in Kourou (KOU), Montreal (MON), Hartebeesthoek (HBK)}{14}}
\acronymused{GPS}
\acronymused{GPS}
\acronymused{GPS}
\acronymused{GPS}
\acronymused{GPS}
\acronymused{DGNSS}
\acronymused{DGNSS}
\acronymused{GNSS}
\AC@undonewlabel{acro:PPP}
\newlabel{acro:PPP}{{2.2.4}{14}{Augmentation Systems and \ac {DGPS}}{subsection.2.2.4}{}}
\acronymused{PPP}
\acronymused{GNSS}
\@writefile{toc}{\contentsline {section}{\numberline {2.3}Fundamental of PVT computation in GNSS}{15}{section.2.3}\protected@file@percent }
\newlabel{sub:solutionBasics}{{2.3}{15}{Fundamental of PVT computation in GNSS}{section.2.3}{}}
\acronymused{GNSS}
\acronymused{ToA}
\AC@undonewlabel{acro:ECEF}
\newlabel{acro:ECEF}{{2.3}{15}{Fundamental of PVT computation in GNSS}{section.2.3}{}}
\acronymused{ECEF}
\acronymused{GNSS}
\newlabel{eq:pseudocorrect}{{2.1}{15}{Fundamental of PVT computation in GNSS}{equation.2.3.1}{}}
\@writefile{lof}{\contentsline {figure}{\numberline {2.4}{\ignorespaces {\relax \fontsize  {10}{12}\selectfont  \abovedisplayskip 10\p@ plus2\p@ minus5\p@ \abovedisplayshortskip \z@ plus3\p@ \belowdisplayshortskip 6\p@ plus3\p@ minus3\p@ \def \leftmargin \leftmargini \parsep 4.5\p@ plus2\p@ minus\p@ \topsep 9\p@ plus3\p@ minus5\p@ \itemsep 4.5\p@ plus2\p@ minus\p@ {\leftmargin \leftmargini \topsep 6\p@ plus2\p@ minus2\p@ \parsep 3\p@ plus2\p@ minus\p@ \itemsep \parsep }\belowdisplayskip \abovedisplayskip Trilateration in \ac {GNSS} position and time solution based on pseudorange measurements. Size and distances are not scaled to real ratio. }\relax }}{15}{figure.caption.11}\protected@file@percent }
\acronymused{GNSS}
\newlabel{fig:trilateration}{{2.4}{15}{{\small Trilateration in \ac {GNSS} position and time solution based on pseudorange measurements. Size and distances are not scaled to real ratio. }\relax }{figure.caption.11}{}}
\newlabel{eq:setLMS}{{2.2}{16}{Fundamental of PVT computation in GNSS}{equation.2.3.2}{}}
\acronymused{ECEF}
\@writefile{loc}{\ChangesListline {added}{Added~(1)}{approximated}{16}}
\acronymused{KF}
\AC@undonewlabel{acro:PF}
\newlabel{acro:PF}{{2.3}{16}{Fundamental of PVT computation in GNSS}{equation.2.3.2}{}}
\acronymused{PF}
\newlabel{eq:approxPseudo}{{2.4}{16}{Fundamental of PVT computation in GNSS}{equation.2.3.4}{}}
\newlabel{eq:taylor}{{2.5}{16}{Fundamental of PVT computation in GNSS}{equation.2.3.5}{}}
\newlabel{eq:partials}{{2.6}{16}{Fundamental of PVT computation in GNSS}{equation.2.3.6}{}}
\newlabel{eq:linearization}{{2.7}{16}{Fundamental of PVT computation in GNSS}{equation.2.3.7}{}}
\newlabel{eq:linearization2}{{2.8}{16}{Fundamental of PVT computation in GNSS}{equation.2.3.8}{}}
\newlabel{eq:diffTermsCoeffs}{{2.9}{17}{Fundamental of PVT computation in GNSS}{equation.2.3.9}{}}
\newlabel{eq:steer}{{2.12}{17}{Fundamental of PVT computation in GNSS}{equation.2.3.12}{}}
\newlabel{eq:steering}{{2.13}{17}{Fundamental of PVT computation in GNSS}{equation.2.3.13}{}}
\newlabel{eq:positioningSolMatrix}{{2.14}{17}{Fundamental of PVT computation in GNSS}{equation.2.3.14}{}}
\newlabel{eq:basicLMS}{{2.15}{17}{Fundamental of PVT computation in GNSS}{equation.2.3.15}{}}
\newlabel{eq:LMSsolutionDeltax}{{2.16}{17}{Fundamental of PVT computation in GNSS}{equation.2.3.16}{}}
\@writefile{toc}{\contentsline {subsection}{\numberline {2.3.1}Determination of the velocity}{17}{subsection.2.3.1}\protected@file@percent }
\newlabel{sub:velocity}{{2.3.1}{17}{Determination of the velocity}{subsection.2.3.1}{}}
\acronymused{GNSS}
\acronymused{GNSS}
\acronymused{GNSS}
\newlabel{eq:dopplerStatic}{{2.17}{18}{Determination of the velocity}{equation.2.3.17}{}}
\acronymused{GPS}
\acronymused{LoS}
\acronymused{LoS}
\acronymused{ECEF}
\newlabel{eq:relativeV}{{2.18}{18}{Determination of the velocity}{equation.2.3.18}{}}
\newlabel{eq:dopplerShift}{{2.19}{18}{Determination of the velocity}{equation.2.3.19}{}}
\newlabel{eq:receivedFreq}{{2.20}{18}{Determination of the velocity}{equation.2.3.20}{}}
\newlabel{eq:dopplerRelation}{{2.22}{18}{Determination of the velocity}{equation.2.3.22}{}}
\acronymused{GNSS}
\newlabel{eq:doppdummy}{{2.23}{18}{Determination of the velocity}{equation.2.3.23}{}}
\newlabel{eq:dopplerSolMatrix}{{2.24}{19}{Determination of the velocity}{equation.2.3.24}{}}
\@writefile{loc}{\ChangesListline {added}{Added~(1)}{and that is invertible}{19}}
\acronymused{GNSS}
\@setckpt{Chapter1/chapter1}{
\setcounter{page}{20}
\setcounter{equation}{24}
\setcounter{enumi}{0}
\setcounter{enumii}{0}
\setcounter{enumiii}{0}
\setcounter{enumiv}{0}
\setcounter{footnote}{0}
\setcounter{mpfootnote}{0}
\setcounter{part}{0}
\setcounter{chapter}{2}
\setcounter{section}{3}
\setcounter{subsection}{1}
\setcounter{subsubsection}{0}
\setcounter{paragraph}{0}
\setcounter{subparagraph}{0}
\setcounter{figure}{4}
\setcounter{table}{1}
\setcounter{SDpage}{0}
\setcounter{NumberSD}{0}
\setcounter{tomo}{0}
\setcounter{parentequation}{0}
\setcounter{caption@flags}{0}
\setcounter{ContinuedFloat}{0}
\setcounter{subfigure}{0}
\setcounter{subtable}{0}
\setcounter{float@type}{16}
\setcounter{tabx@nest}{0}
\setcounter{listtotal}{0}
\setcounter{listcount}{0}
\setcounter{liststart}{0}
\setcounter{liststop}{0}
\setcounter{citecount}{0}
\setcounter{citetotal}{0}
\setcounter{multicitecount}{0}
\setcounter{multicitetotal}{0}
\setcounter{instcount}{115}
\setcounter{maxnames}{3}
\setcounter{minnames}{1}
\setcounter{maxitems}{3}
\setcounter{minitems}{1}
\setcounter{citecounter}{0}
\setcounter{maxcitecounter}{0}
\setcounter{savedcitecounter}{0}
\setcounter{uniquelist}{0}
\setcounter{uniquename}{0}
\setcounter{refsection}{0}
\setcounter{refsegment}{0}
\setcounter{maxextratitle}{0}
\setcounter{maxextratitleyear}{0}
\setcounter{maxextraname}{5}
\setcounter{maxextradate}{0}
\setcounter{maxextraalpha}{0}
\setcounter{abbrvpenalty}{50}
\setcounter{highnamepenalty}{50}
\setcounter{lownamepenalty}{25}
\setcounter{maxparens}{3}
\setcounter{parenlevel}{0}
\setcounter{mincomprange}{10}
\setcounter{maxcomprange}{100000}
\setcounter{mincompwidth}{1}
\setcounter{afterword}{0}
\setcounter{savedafterword}{0}
\setcounter{annotator}{0}
\setcounter{savedannotator}{0}
\setcounter{author}{0}
\setcounter{savedauthor}{0}
\setcounter{bookauthor}{0}
\setcounter{savedbookauthor}{0}
\setcounter{commentator}{0}
\setcounter{savedcommentator}{0}
\setcounter{editor}{0}
\setcounter{savededitor}{0}
\setcounter{editora}{0}
\setcounter{savededitora}{0}
\setcounter{editorb}{0}
\setcounter{savededitorb}{0}
\setcounter{editorc}{0}
\setcounter{savededitorc}{0}
\setcounter{foreword}{0}
\setcounter{savedforeword}{0}
\setcounter{holder}{0}
\setcounter{savedholder}{0}
\setcounter{introduction}{0}
\setcounter{savedintroduction}{0}
\setcounter{namea}{0}
\setcounter{savednamea}{0}
\setcounter{nameb}{0}
\setcounter{savednameb}{0}
\setcounter{namec}{0}
\setcounter{savednamec}{0}
\setcounter{translator}{0}
\setcounter{savedtranslator}{0}
\setcounter{shortauthor}{0}
\setcounter{savedshortauthor}{0}
\setcounter{shorteditor}{0}
\setcounter{savedshorteditor}{0}
\setcounter{labelname}{0}
\setcounter{savedlabelname}{0}
\setcounter{institution}{0}
\setcounter{savedinstitution}{0}
\setcounter{lista}{0}
\setcounter{savedlista}{0}
\setcounter{listb}{0}
\setcounter{savedlistb}{0}
\setcounter{listc}{0}
\setcounter{savedlistc}{0}
\setcounter{listd}{0}
\setcounter{savedlistd}{0}
\setcounter{liste}{0}
\setcounter{savedliste}{0}
\setcounter{listf}{0}
\setcounter{savedlistf}{0}
\setcounter{location}{0}
\setcounter{savedlocation}{0}
\setcounter{organization}{0}
\setcounter{savedorganization}{0}
\setcounter{origlocation}{0}
\setcounter{savedoriglocation}{0}
\setcounter{origpublisher}{0}
\setcounter{savedorigpublisher}{0}
\setcounter{publisher}{0}
\setcounter{savedpublisher}{0}
\setcounter{language}{0}
\setcounter{savedlanguage}{0}
\setcounter{origlanguage}{0}
\setcounter{savedoriglanguage}{0}
\setcounter{pageref}{0}
\setcounter{savedpageref}{0}
\setcounter{textcitecount}{0}
\setcounter{textcitetotal}{0}
\setcounter{textcitemaxnames}{0}
\setcounter{biburlnumpenalty}{0}
\setcounter{biburlucpenalty}{0}
\setcounter{biburllcpenalty}{0}
\setcounter{smartand}{1}
\setcounter{bbx:relatedcount}{0}
\setcounter{bbx:relatedtotal}{0}
\setcounter{Item}{0}
\setcounter{Hfootnote}{0}
\setcounter{bookmark@seq@number}{16}
\setcounter{nlinenum}{0}
\setcounter{algorithm}{0}
\setcounter{ALC@unique}{0}
\setcounter{ALC@line}{0}
\setcounter{ALC@rem}{0}
\setcounter{ALC@depth}{0}
\setcounter{@todonotes@numberoftodonotes}{0}
\setcounter{Changes@AuthorCount}{2}
\setcounter{Changes@Author}{2}
\setcounter{Changes@addedCount}{0}
\setcounter{Changes@deletedCount}{0}
\setcounter{Changes@replacedCount}{0}
\setcounter{Changes@highlightCount}{0}
\setcounter{Changes@commentCount}{0}
\setcounter{authorcommentcount}{0}
\setcounter{Changes@addedCount1}{8}
\setcounter{Changes@deletedCount1}{1}
\setcounter{Changes@replacedCount1}{2}
\setcounter{Changes@highlightCount1}{0}
\setcounter{Changes@commentCount1}{0}
\setcounter{lstnumber}{1}
\setcounter{FancyVerbLine}{0}
\setcounter{section@level}{0}
\setcounter{lstlisting}{0}
}
