%!PS-Adobe-3.0 EPSF-3.0
%%Creator: (MATLAB, The Mathworks, Inc. Version 9.5.0.944444 \(R2018b\). Operating System: Windows 10)
%%Title: (C:/Users/navsas/Dropbox/Collaborative ranging CRLB/fig/skplotExp.eps)
%%CreationDate: 2018-11-27T15:04:11
%%Pages: (atend)
%%BoundingBox: 0 0 740 549
%%LanguageLevel: 3
%%EndComments
%%BeginProlog
%%BeginResource: procset (Apache XML Graphics Std ProcSet) 1.2 0
%%Version: 1.2 0
%%Copyright: (Copyright 2001-2003,2010 The Apache Software Foundation. License terms: http://www.apache.org/licenses/LICENSE-2.0)
/bd{bind def}bind def
/ld{load def}bd
/GR/grestore ld
/GS/gsave ld
/RM/rmoveto ld
/C/curveto ld
/t/show ld
/L/lineto ld
/ML/setmiterlimit ld
/CT/concat ld
/f/fill ld
/N/newpath ld
/S/stroke ld
/CC/setcmykcolor ld
/A/ashow ld
/cp/closepath ld
/RC/setrgbcolor ld
/LJ/setlinejoin ld
/GC/setgray ld
/LW/setlinewidth ld
/M/moveto ld
/re {4 2 roll M
1 index 0 rlineto
0 exch rlineto
neg 0 rlineto
cp } bd
/_ctm matrix def
/_tm matrix def
/BT { _ctm currentmatrix pop matrix _tm copy pop 0 0 moveto } bd
/ET { _ctm setmatrix } bd
/iTm { _ctm setmatrix _tm concat } bd
/Tm { _tm astore pop iTm 0 0 moveto } bd
/ux 0.0 def
/uy 0.0 def
/F {
  /Tp exch def
  /Tf exch def
  Tf findfont Tp scalefont setfont
  /cf Tf def  /cs Tp def
} bd
/ULS {currentpoint /uy exch def /ux exch def} bd
/ULE {
  /Tcx currentpoint pop def
  gsave
  newpath
  cf findfont cs scalefont dup
  /FontMatrix get 0 get /Ts exch def /FontInfo get dup
  /UnderlinePosition get Ts mul /To exch def
  /UnderlineThickness get Ts mul /Tt exch def
  ux uy To add moveto  Tcx uy To add lineto
  Tt setlinewidth stroke
  grestore
} bd
/OLE {
  /Tcx currentpoint pop def
  gsave
  newpath
  cf findfont cs scalefont dup
  /FontMatrix get 0 get /Ts exch def /FontInfo get dup
  /UnderlinePosition get Ts mul /To exch def
  /UnderlineThickness get Ts mul /Tt exch def
  ux uy To add cs add moveto Tcx uy To add cs add lineto
  Tt setlinewidth stroke
  grestore
} bd
/SOE {
  /Tcx currentpoint pop def
  gsave
  newpath
  cf findfont cs scalefont dup
  /FontMatrix get 0 get /Ts exch def /FontInfo get dup
  /UnderlinePosition get Ts mul /To exch def
  /UnderlineThickness get Ts mul /Tt exch def
  ux uy To add cs 10 mul 26 idiv add moveto Tcx uy To add cs 10 mul 26 idiv add lineto
  Tt setlinewidth stroke
  grestore
} bd
/QT {
/Y22 exch store
/X22 exch store
/Y21 exch store
/X21 exch store
currentpoint
/Y21 load 2 mul add 3 div exch
/X21 load 2 mul add 3 div exch
/X21 load 2 mul /X22 load add 3 div
/Y21 load 2 mul /Y22 load add 3 div
/X22 load /Y22 load curveto
} bd
/SSPD {
dup length /d exch dict def
{
/v exch def
/k exch def
currentpagedevice k known {
/cpdv currentpagedevice k get def
v cpdv ne {
/upd false def
/nullv v type /nulltype eq def
/nullcpdv cpdv type /nulltype eq def
nullv nullcpdv or
{
/upd true def
} {
/sametype v type cpdv type eq def
sametype {
v type /arraytype eq {
/vlen v length def
/cpdvlen cpdv length def
vlen cpdvlen eq {
0 1 vlen 1 sub {
/i exch def
/obj v i get def
/cpdobj cpdv i get def
obj cpdobj ne {
/upd true def
exit
} if
} for
} {
/upd true def
} ifelse
} {
v type /dicttype eq {
v {
/dv exch def
/dk exch def
/cpddv cpdv dk get def
dv cpddv ne {
/upd true def
exit
} if
} forall
} {
/upd true def
} ifelse
} ifelse
} if
} ifelse
upd true eq {
d k v put
} if
} if
} if
} forall
d length 0 gt {
d setpagedevice
} if
} bd
/RE { % /NewFontName [NewEncodingArray] /FontName RE -
  findfont dup length dict begin
  {
    1 index /FID ne
    {def} {pop pop} ifelse
  } forall
  /Encoding exch def
  /FontName 1 index def
  currentdict definefont pop
  end
} bind def
%%EndResource
%%BeginResource: procset (Apache XML Graphics EPS ProcSet) 1.0 0
%%Version: 1.0 0
%%Copyright: (Copyright 2002-2003 The Apache Software Foundation. License terms: http://www.apache.org/licenses/LICENSE-2.0)
/BeginEPSF { %def
/b4_Inc_state save def         % Save state for cleanup
/dict_count countdictstack def % Count objects on dict stack
/op_count count 1 sub def      % Count objects on operand stack
userdict begin                 % Push userdict on dict stack
/showpage { } def              % Redefine showpage, { } = null proc
0 setgray 0 setlinecap         % Prepare graphics state
1 setlinewidth 0 setlinejoin
10 setmiterlimit [ ] 0 setdash newpath
/languagelevel where           % If level not equal to 1 then
{pop languagelevel             % set strokeadjust and
1 ne                           % overprint to their defaults.
{false setstrokeadjust false setoverprint
} if
} if
} bd
/EndEPSF { %def
count op_count sub {pop} repeat            % Clean up stacks
countdictstack dict_count sub {end} repeat
b4_Inc_state restore
} bd
%%EndResource
%FOPBeginFontDict
%%IncludeResource: font Courier-Oblique
%%IncludeResource: font Courier-BoldOblique
%%IncludeResource: font Courier-Bold
%%IncludeResource: font ZapfDingbats
%%IncludeResource: font Symbol
%%IncludeResource: font Helvetica
%%IncludeResource: font Helvetica-Oblique
%%IncludeResource: font Helvetica-Bold
%%IncludeResource: font Helvetica-BoldOblique
%%IncludeResource: font Times-Roman
%%IncludeResource: font Times-Italic
%%IncludeResource: font Times-Bold
%%IncludeResource: font Times-BoldItalic
%%IncludeResource: font Courier
%FOPEndFontDict
%%BeginResource: encoding WinAnsiEncoding
/WinAnsiEncoding [
/.notdef /.notdef /.notdef /.notdef /.notdef
/.notdef /.notdef /.notdef /.notdef /.notdef
/.notdef /.notdef /.notdef /.notdef /.notdef
/.notdef /.notdef /.notdef /.notdef /.notdef
/.notdef /.notdef /.notdef /.notdef /.notdef
/.notdef /.notdef /.notdef /.notdef /.notdef
/.notdef /.notdef /space /exclam /quotedbl
/numbersign /dollar /percent /ampersand /quotesingle
/parenleft /parenright /asterisk /plus /comma
/hyphen /period /slash /zero /one
/two /three /four /five /six
/seven /eight /nine /colon /semicolon
/less /equal /greater /question /at
/A /B /C /D /E
/F /G /H /I /J
/K /L /M /N /O
/P /Q /R /S /T
/U /V /W /X /Y
/Z /bracketleft /backslash /bracketright /asciicircum
/underscore /quoteleft /a /b /c
/d /e /f /g /h
/i /j /k /l /m
/n /o /p /q /r
/s /t /u /v /w
/x /y /z /braceleft /bar
/braceright /asciitilde /bullet /Euro /bullet
/quotesinglbase /florin /quotedblbase /ellipsis /dagger
/daggerdbl /circumflex /perthousand /Scaron /guilsinglleft
/OE /bullet /Zcaron /bullet /bullet
/quoteleft /quoteright /quotedblleft /quotedblright /bullet
/endash /emdash /asciitilde /trademark /scaron
/guilsinglright /oe /bullet /zcaron /Ydieresis
/space /exclamdown /cent /sterling /currency
/yen /brokenbar /section /dieresis /copyright
/ordfeminine /guillemotleft /logicalnot /sfthyphen /registered
/macron /degree /plusminus /twosuperior /threesuperior
/acute /mu /paragraph /middot /cedilla
/onesuperior /ordmasculine /guillemotright /onequarter /onehalf
/threequarters /questiondown /Agrave /Aacute /Acircumflex
/Atilde /Adieresis /Aring /AE /Ccedilla
/Egrave /Eacute /Ecircumflex /Edieresis /Igrave
/Iacute /Icircumflex /Idieresis /Eth /Ntilde
/Ograve /Oacute /Ocircumflex /Otilde /Odieresis
/multiply /Oslash /Ugrave /Uacute /Ucircumflex
/Udieresis /Yacute /Thorn /germandbls /agrave
/aacute /acircumflex /atilde /adieresis /aring
/ae /ccedilla /egrave /eacute /ecircumflex
/edieresis /igrave /iacute /icircumflex /idieresis
/eth /ntilde /ograve /oacute /ocircumflex
/otilde /odieresis /divide /oslash /ugrave
/uacute /ucircumflex /udieresis /yacute /thorn
/ydieresis
] def
%%EndResource
%FOPBeginFontReencode
/Courier-Oblique findfont
dup length dict begin
  {1 index /FID ne {def} {pop pop} ifelse} forall
  /Encoding WinAnsiEncoding def
  currentdict
end
/Courier-Oblique exch definefont pop
/Courier-BoldOblique findfont
dup length dict begin
  {1 index /FID ne {def} {pop pop} ifelse} forall
  /Encoding WinAnsiEncoding def
  currentdict
end
/Courier-BoldOblique exch definefont pop
/Courier-Bold findfont
dup length dict begin
  {1 index /FID ne {def} {pop pop} ifelse} forall
  /Encoding WinAnsiEncoding def
  currentdict
end
/Courier-Bold exch definefont pop
/Helvetica findfont
dup length dict begin
  {1 index /FID ne {def} {pop pop} ifelse} forall
  /Encoding WinAnsiEncoding def
  currentdict
end
/Helvetica exch definefont pop
/Helvetica-Oblique findfont
dup length dict begin
  {1 index /FID ne {def} {pop pop} ifelse} forall
  /Encoding WinAnsiEncoding def
  currentdict
end
/Helvetica-Oblique exch definefont pop
/Helvetica-Bold findfont
dup length dict begin
  {1 index /FID ne {def} {pop pop} ifelse} forall
  /Encoding WinAnsiEncoding def
  currentdict
end
/Helvetica-Bold exch definefont pop
/Helvetica-BoldOblique findfont
dup length dict begin
  {1 index /FID ne {def} {pop pop} ifelse} forall
  /Encoding WinAnsiEncoding def
  currentdict
end
/Helvetica-BoldOblique exch definefont pop
/Times-Roman findfont
dup length dict begin
  {1 index /FID ne {def} {pop pop} ifelse} forall
  /Encoding WinAnsiEncoding def
  currentdict
end
/Times-Roman exch definefont pop
/Times-Italic findfont
dup length dict begin
  {1 index /FID ne {def} {pop pop} ifelse} forall
  /Encoding WinAnsiEncoding def
  currentdict
end
/Times-Italic exch definefont pop
/Times-Bold findfont
dup length dict begin
  {1 index /FID ne {def} {pop pop} ifelse} forall
  /Encoding WinAnsiEncoding def
  currentdict
end
/Times-Bold exch definefont pop
/Times-BoldItalic findfont
dup length dict begin
  {1 index /FID ne {def} {pop pop} ifelse} forall
  /Encoding WinAnsiEncoding def
  currentdict
end
/Times-BoldItalic exch definefont pop
/Courier findfont
dup length dict begin
  {1 index /FID ne {def} {pop pop} ifelse} forall
  /Encoding WinAnsiEncoding def
  currentdict
end
/Courier exch definefont pop
%FOPEndFontReencode
%%EndProlog
%%Page: 1 1
%%PageBoundingBox: 0 0 740 549
%%BeginPageSetup
[1 0 0 -1 0 549] CT
%%EndPageSetup
GS
[0.75 0 0 0.75 0 0] CT
1 GC
N
0 0 986 732 re
f
GR
GS
[0.75 0 0 0.75 0 0] CT
1 GC
N
0 0 986 732 re
f
GR
GS
[0.75 0 0 0.75 0 0] CT
1 GC
N
229.162 370.162 M
229.764 388.53 L
231.565 406.819 L
234.559 424.951 L
238.732 442.848 L
244.066 460.435 L
250.54 477.634 L
258.124 494.374 L
266.787 510.581 L
276.492 526.187 L
287.196 541.125 L
298.855 555.331 L
311.418 568.745 L
324.831 581.307 L
339.037 592.966 L
353.975 603.67 L
369.581 613.375 L
385.789 622.038 L
402.528 629.622 L
419.728 636.096 L
437.314 641.431 L
455.211 645.604 L
473.343 648.597 L
491.632 650.399 L
510 651 L
528.368 650.399 L
546.657 648.597 L
564.789 645.604 L
582.686 641.431 L
600.272 636.096 L
617.472 629.622 L
634.211 622.038 L
650.419 613.375 L
666.025 603.67 L
680.963 592.966 L
695.169 581.307 L
708.582 568.745 L
721.145 555.331 L
732.804 541.125 L
743.508 526.187 L
753.213 510.581 L
761.876 494.374 L
769.46 477.634 L
775.934 460.435 L
781.268 442.848 L
785.441 424.951 L
788.435 406.819 L
790.236 388.53 L
790.838 370.162 L
790.236 351.795 L
788.435 333.506 L
785.441 315.374 L
781.268 297.476 L
775.934 279.89 L
769.46 262.69 L
761.876 245.951 L
753.213 229.743 L
743.508 214.137 L
732.804 199.199 L
721.145 184.993 L
708.582 171.58 L
695.169 159.017 L
680.963 147.359 L
666.025 136.654 L
650.419 126.95 L
634.211 118.287 L
617.472 110.702 L
600.272 104.229 L
582.686 98.894 L
564.789 94.721 L
546.657 91.727 L
528.368 89.926 L
510 89.325 L
491.632 89.926 L
473.343 91.727 L
455.211 94.721 L
437.314 98.894 L
419.728 104.229 L
402.528 110.702 L
385.789 118.287 L
369.581 126.95 L
353.975 136.654 L
339.037 147.359 L
324.831 159.017 L
311.418 171.58 L
298.855 184.993 L
287.196 199.199 L
276.492 214.137 L
266.787 229.743 L
258.124 245.951 L
250.54 262.69 L
244.066 279.89 L
238.732 297.476 L
234.559 315.374 L
231.565 333.506 L
229.764 351.795 L
cp
f
GR
GS
[0.75 0 0 0.75 0 0] CT
0.149 GC
1 LJ
0.667 LW
N
229.162 370.162 M
229.764 388.53 L
231.565 406.819 L
234.559 424.951 L
238.732 442.848 L
244.066 460.435 L
250.54 477.634 L
258.124 494.374 L
266.787 510.581 L
276.492 526.187 L
287.196 541.125 L
298.855 555.331 L
311.418 568.745 L
324.831 581.307 L
339.037 592.966 L
353.975 603.67 L
369.581 613.375 L
385.789 622.038 L
402.528 629.622 L
419.728 636.096 L
437.314 641.431 L
455.211 645.604 L
473.343 648.597 L
491.632 650.399 L
510 651 L
510 651 L
528.368 650.399 L
546.657 648.597 L
564.789 645.604 L
582.686 641.431 L
600.272 636.096 L
617.472 629.622 L
634.211 622.038 L
650.419 613.375 L
666.025 603.67 L
680.963 592.966 L
695.169 581.307 L
708.582 568.745 L
721.145 555.331 L
732.804 541.125 L
743.508 526.187 L
753.213 510.581 L
761.876 494.374 L
769.46 477.634 L
775.934 460.435 L
781.268 442.848 L
785.441 424.951 L
788.435 406.819 L
790.236 388.53 L
790.838 370.162 L
790.838 370.162 L
790.236 351.795 L
788.435 333.506 L
785.441 315.374 L
781.268 297.476 L
775.934 279.89 L
769.46 262.69 L
761.876 245.951 L
753.213 229.743 L
743.508 214.137 L
732.804 199.199 L
721.145 184.993 L
708.582 171.58 L
695.169 159.017 L
680.963 147.359 L
666.025 136.654 L
650.419 126.95 L
634.211 118.287 L
617.472 110.702 L
600.272 104.229 L
582.686 98.894 L
564.789 94.721 L
546.657 91.727 L
528.368 89.926 L
510 89.325 L
510 89.325 L
491.632 89.926 L
473.343 91.727 L
455.211 94.721 L
437.314 98.894 L
419.728 104.229 L
402.528 110.702 L
385.789 118.287 L
369.581 126.95 L
353.975 136.654 L
339.037 147.359 L
324.831 159.017 L
311.418 171.58 L
298.855 184.993 L
287.196 199.199 L
276.492 214.137 L
266.787 229.743 L
258.124 245.951 L
250.54 262.69 L
244.066 279.89 L
238.732 297.476 L
234.559 315.374 L
231.565 333.506 L
229.764 351.795 L
229.162 370.162 L
cp
S
GR
GS
[0.75 0 0 0.75 0 0] CT
0.149 GC
[1 3] 0 setdash
2 LJ
0.667 LW
N
650.419 126.95 M
369.581 613.375 L
S
GR
GS
[0.75 0 0 0.75 0 0] CT
0.149 GC
[1 3] 0 setdash
2 LJ
0.667 LW
N
753.213 229.743 M
266.787 510.581 L
S
GR
GS
[0.75 0 0 0.75 0 0] CT
0.149 GC
[1 3] 0 setdash
2 LJ
0.667 LW
N
790.838 370.162 M
229.162 370.162 L
S
GR
GS
[0.75 0 0 0.75 0 0] CT
0.149 GC
[1 3] 0 setdash
2 LJ
0.667 LW
N
753.213 510.581 M
266.787 229.743 L
S
GR
GS
[0.75 0 0 0.75 0 0] CT
0.149 GC
[1 3] 0 setdash
2 LJ
0.667 LW
N
650.419 613.375 M
369.581 126.95 L
S
GR
GS
[0.75 0 0 0.75 0 0] CT
0.149 GC
[1 3] 0 setdash
2 LJ
0.667 LW
N
510 651 M
510 89.325 L
S
GR
GS
[0.75 0 0 0.75 498.34557 76.97136] CT
N
-8.667 3.495 M
-8.182 4.214 -7.346 4.565 QT
-6.51 4.917 -5.557 4.917 QT
-4.339 4.917 -3.823 3.878 QT
-3.307 2.839 -3.307 1.511 QT
-3.307 0.917 -3.417 0.323 QT
-3.526 -0.271 -3.784 -0.786 QT
-4.042 -1.302 -4.487 -1.607 QT
-4.932 -1.911 -5.573 -1.911 QT
-6.979 -1.911 L
-7.167 -1.911 -7.167 -2.114 QT
-7.167 -2.286 L
-7.167 -2.458 -6.979 -2.458 QT
-5.823 -2.552 L
-5.073 -2.552 -4.589 -3.107 QT
-4.104 -3.661 -3.878 -4.45 QT
-3.651 -5.239 -3.651 -5.958 QT
-3.651 -6.974 -4.12 -7.614 QT
-4.589 -8.255 -5.557 -8.255 QT
-6.354 -8.255 -7.089 -7.958 QT
-7.823 -7.661 -8.245 -7.036 QT
-8.198 -7.052 -8.175 -7.06 QT
-8.151 -7.068 -8.104 -7.068 QT
-7.635 -7.068 -7.315 -6.739 QT
-6.995 -6.411 -6.995 -5.943 QT
-6.995 -5.489 -7.315 -5.161 QT
-7.635 -4.833 -8.104 -4.833 QT
-8.557 -4.833 -8.885 -5.161 QT
-9.214 -5.489 -9.214 -5.943 QT
-9.214 -6.849 -8.675 -7.513 QT
-8.135 -8.177 -7.276 -8.521 QT
-6.417 -8.864 -5.557 -8.864 QT
-4.917 -8.864 -4.214 -8.677 QT
-3.51 -8.489 -2.932 -8.138 QT
-2.354 -7.786 -1.995 -7.232 QT
-1.635 -6.677 -1.635 -5.958 QT
-1.635 -5.083 -2.026 -4.333 QT
-2.417 -3.583 -3.104 -3.044 QT
-3.792 -2.505 -4.62 -2.239 QT
-3.698 -2.052 -2.878 -1.544 QT
-2.057 -1.036 -1.565 -0.232 QT
-1.073 0.573 -1.073 1.495 QT
-1.073 2.651 -1.706 3.589 QT
-2.339 4.526 -3.378 5.057 QT
-4.417 5.589 -5.557 5.589 QT
-6.542 5.589 -7.534 5.214 QT
-8.526 4.839 -9.159 4.089 QT
-9.792 3.339 -9.792 2.292 QT
-9.792 1.761 -9.44 1.417 QT
-9.089 1.073 -8.557 1.073 QT
-8.229 1.073 -7.948 1.229 QT
-7.667 1.386 -7.503 1.675 QT
-7.339 1.964 -7.339 2.292 QT
-7.339 2.807 -7.698 3.151 QT
-8.057 3.495 -8.557 3.495 QT
-8.667 3.495 L
cp
f
GR
GS
[0.75 0 0 0.75 498.34557 76.97136] CT
N
5.25 5.589 M
2.672 5.589 1.75 3.464 QT
0.828 1.339 0.828 -1.583 QT
0.828 -3.396 1.156 -5.005 QT
1.484 -6.614 2.477 -7.739 QT
3.469 -8.864 5.25 -8.864 QT
6.641 -8.864 7.516 -8.193 QT
8.391 -7.521 8.859 -6.443 QT
9.328 -5.364 9.492 -4.146 QT
9.656 -2.927 9.656 -1.583 QT
9.656 0.229 9.328 1.8 QT
9 3.37 8.023 4.479 QT
7.047 5.589 5.25 5.589 QT
cp
5.25 5.042 M
6.422 5.042 6.992 3.839 QT
7.563 2.636 7.695 1.182 QT
7.828 -0.271 7.828 -1.911 QT
7.828 -3.489 7.695 -4.825 QT
7.563 -6.161 6.992 -7.239 QT
6.422 -8.318 5.25 -8.318 QT
4.063 -8.318 3.484 -7.232 QT
2.906 -6.146 2.773 -4.818 QT
2.641 -3.489 2.641 -1.911 QT
2.641 -0.739 2.703 0.292 QT
2.766 1.323 3.008 2.425 QT
3.25 3.526 3.797 4.284 QT
4.344 5.042 5.25 5.042 QT
cp
f
GR
GS
[0.75 0 0 0.75 266.65446 478.27208] CT
N
-14.953 5.12 M
-14.953 4.557 L
-14.953 4.511 -14.906 4.448 QT
-11.656 0.839 L
-10.906 0.026 -10.445 -0.513 QT
-9.984 -1.052 -9.539 -1.763 QT
-9.094 -2.474 -8.828 -3.2 QT
-8.563 -3.927 -8.563 -4.755 QT
-8.563 -5.614 -8.883 -6.404 QT
-9.203 -7.193 -9.836 -7.661 QT
-10.469 -8.13 -11.359 -8.13 QT
-12.266 -8.13 -12.992 -7.583 QT
-13.719 -7.036 -14.016 -6.161 QT
-13.938 -6.177 -13.797 -6.177 QT
-13.328 -6.177 -12.992 -5.864 QT
-12.656 -5.552 -12.656 -5.036 QT
-12.656 -4.568 -12.992 -4.232 QT
-13.328 -3.896 -13.797 -3.896 QT
-14.281 -3.896 -14.617 -4.239 QT
-14.953 -4.583 -14.953 -5.036 QT
-14.953 -5.833 -14.656 -6.521 QT
-14.359 -7.208 -13.797 -7.747 QT
-13.234 -8.286 -12.539 -8.575 QT
-11.844 -8.864 -11.047 -8.864 QT
-9.844 -8.864 -8.813 -8.357 QT
-7.781 -7.849 -7.172 -6.919 QT
-6.563 -5.989 -6.563 -4.755 QT
-6.563 -3.849 -6.961 -3.029 QT
-7.359 -2.208 -7.984 -1.536 QT
-8.609 -0.864 -9.586 -0.013 QT
-10.563 0.839 -10.875 1.136 QT
-13.25 3.417 L
-11.234 3.417 L
-9.75 3.417 -8.75 3.393 QT
-7.75 3.37 -7.688 3.307 QT
-7.438 3.042 -7.188 1.37 QT
-6.563 1.37 L
-7.156 5.12 L
-14.953 5.12 L
cp
f
GR
GS
[0.75 0 0 0.75 266.65446 478.27208] CT
N
-3.38 5.12 M
-3.38 4.386 L
-0.755 4.386 -0.755 3.714 QT
-0.755 -7.302 L
-1.849 -6.786 -3.505 -6.786 QT
-3.505 -7.521 L
-0.927 -7.521 0.385 -8.864 QT
0.682 -8.864 L
0.745 -8.864 0.815 -8.81 QT
0.885 -8.755 0.885 -8.677 QT
0.885 3.714 L
0.885 4.386 3.51 4.386 QT
3.51 5.12 L
-3.38 5.12 L
cp
f
GR
GS
[0.75 0 0 0.75 266.65446 478.27208] CT
N
10.583 5.589 M
8.005 5.589 7.083 3.464 QT
6.161 1.339 6.161 -1.583 QT
6.161 -3.396 6.49 -5.005 QT
6.818 -6.614 7.81 -7.739 QT
8.802 -8.864 10.583 -8.864 QT
11.974 -8.864 12.849 -8.193 QT
13.724 -7.521 14.193 -6.443 QT
14.661 -5.364 14.826 -4.146 QT
14.99 -2.927 14.99 -1.583 QT
14.99 0.229 14.661 1.8 QT
14.333 3.37 13.357 4.479 QT
12.38 5.589 10.583 5.589 QT
cp
10.583 5.042 M
11.755 5.042 12.326 3.839 QT
12.896 2.636 13.029 1.182 QT
13.161 -0.271 13.161 -1.911 QT
13.161 -3.489 13.029 -4.825 QT
12.896 -6.161 12.326 -7.239 QT
11.755 -8.318 10.583 -8.318 QT
9.396 -8.318 8.818 -7.232 QT
8.24 -6.146 8.107 -4.818 QT
7.974 -3.489 7.974 -1.911 QT
7.974 -0.739 8.036 0.292 QT
8.099 1.323 8.341 2.425 QT
8.583 3.526 9.13 4.284 QT
9.677 5.042 10.583 5.042 QT
cp
f
GR
GS
[0.75 0 0 0.75 583.15036 161.77618] CT
N
-5.417 5.589 M
-6.714 5.589 -7.589 4.893 QT
-8.464 4.198 -8.94 3.096 QT
-9.417 1.995 -9.604 0.784 QT
-9.792 -0.427 -9.792 -1.661 QT
-9.792 -3.333 -9.143 -5.005 QT
-8.495 -6.677 -7.237 -7.771 QT
-5.979 -8.864 -4.26 -8.864 QT
-3.542 -8.864 -2.917 -8.591 QT
-2.292 -8.318 -1.94 -7.794 QT
-1.589 -7.271 -1.589 -6.521 QT
-1.589 -6.083 -1.885 -5.794 QT
-2.182 -5.505 -2.604 -5.505 QT
-3.01 -5.505 -3.307 -5.802 QT
-3.604 -6.099 -3.604 -6.521 QT
-3.604 -6.927 -3.307 -7.224 QT
-3.01 -7.521 -2.604 -7.521 QT
-2.495 -7.521 L
-2.76 -7.896 -3.245 -8.075 QT
-3.729 -8.255 -4.26 -8.255 QT
-4.901 -8.255 -5.432 -7.982 QT
-5.964 -7.708 -6.401 -7.239 QT
-6.839 -6.771 -7.12 -6.2 QT
-7.401 -5.63 -7.565 -4.904 QT
-7.729 -4.177 -7.768 -3.536 QT
-7.807 -2.896 -7.807 -1.943 QT
-7.432 -2.802 -6.76 -3.349 QT
-6.089 -3.896 -5.229 -3.896 QT
-4.292 -3.896 -3.526 -3.513 QT
-2.76 -3.13 -2.206 -2.458 QT
-1.651 -1.786 -1.362 -0.927 QT
-1.073 -0.068 -1.073 0.807 QT
-1.073 2.042 -1.62 3.159 QT
-2.167 4.276 -3.159 4.932 QT
-4.151 5.589 -5.417 5.589 QT
cp
-5.417 4.917 M
-4.604 4.917 -4.112 4.55 QT
-3.62 4.182 -3.393 3.573 QT
-3.167 2.964 -3.104 2.339 QT
-3.042 1.714 -3.042 0.807 QT
-3.042 -0.38 -3.159 -1.216 QT
-3.276 -2.052 -3.776 -2.693 QT
-4.276 -3.333 -5.307 -3.333 QT
-6.167 -3.333 -6.714 -2.763 QT
-7.26 -2.193 -7.51 -1.318 QT
-7.76 -0.443 -7.76 0.37 QT
-7.76 0.651 -7.745 0.792 QT
-7.745 0.823 -7.753 0.846 QT
-7.76 0.87 -7.76 0.901 QT
-7.76 1.792 -7.581 2.714 QT
-7.401 3.636 -6.878 4.276 QT
-6.354 4.917 -5.417 4.917 QT
cp
f
GR
GS
[0.75 0 0 0.75 583.15036 161.77618] CT
N
/f1776739717{5.25 5.589 M
2.672 5.589 1.75 3.464 QT
0.828 1.339 0.828 -1.583 QT
0.828 -3.396 1.156 -5.005 QT
1.484 -6.614 2.477 -7.739 QT
3.469 -8.864 5.25 -8.864 QT
6.641 -8.864 7.516 -8.193 QT
8.391 -7.521 8.859 -6.443 QT
9.328 -5.364 9.492 -4.146 QT
9.656 -2.927 9.656 -1.583 QT
9.656 0.229 9.328 1.8 QT
9 3.37 8.023 4.479 QT
7.047 5.589 5.25 5.589 QT
cp
5.25 5.042 M
6.422 5.042 6.992 3.839 QT
7.563 2.636 7.695 1.182 QT
7.828 -0.271 7.828 -1.911 QT
7.828 -3.489 7.695 -4.825 QT
7.563 -6.161 6.992 -7.239 QT
6.422 -8.318 5.25 -8.318 QT
4.063 -8.318 3.484 -7.232 QT
2.906 -6.146 2.773 -4.818 QT
2.641 -3.489 2.641 -1.911 QT
2.641 -0.739 2.703 0.292 QT
2.766 1.323 3.008 2.425 QT
3.25 3.526 3.797 4.284 QT
4.344 5.042 5.25 5.042 QT
cp}def
f1776739717
f
GR
GS
[0.75 0 0 0.75 181.84963 393.46729] CT
N
/f1390903136{-14.953 5.12 M
-14.953 4.557 L
-14.953 4.511 -14.906 4.448 QT
-11.656 0.839 L
-10.906 0.026 -10.445 -0.513 QT
-9.984 -1.052 -9.539 -1.763 QT
-9.094 -2.474 -8.828 -3.2 QT
-8.563 -3.927 -8.563 -4.755 QT
-8.563 -5.614 -8.883 -6.404 QT
-9.203 -7.193 -9.836 -7.661 QT
-10.469 -8.13 -11.359 -8.13 QT
-12.266 -8.13 -12.992 -7.583 QT
-13.719 -7.036 -14.016 -6.161 QT
-13.938 -6.177 -13.797 -6.177 QT
-13.328 -6.177 -12.992 -5.864 QT
-12.656 -5.552 -12.656 -5.036 QT
-12.656 -4.568 -12.992 -4.232 QT
-13.328 -3.896 -13.797 -3.896 QT
-14.281 -3.896 -14.617 -4.239 QT
-14.953 -4.583 -14.953 -5.036 QT
-14.953 -5.833 -14.656 -6.521 QT
-14.359 -7.208 -13.797 -7.747 QT
-13.234 -8.286 -12.539 -8.575 QT
-11.844 -8.864 -11.047 -8.864 QT
-9.844 -8.864 -8.813 -8.357 QT
-7.781 -7.849 -7.172 -6.919 QT
-6.563 -5.989 -6.563 -4.755 QT
-6.563 -3.849 -6.961 -3.029 QT
-7.359 -2.208 -7.984 -1.536 QT
-8.609 -0.864 -9.586 -0.013 QT
-10.563 0.839 -10.875 1.136 QT
-13.25 3.417 L
-11.234 3.417 L
-9.75 3.417 -8.75 3.393 QT
-7.75 3.37 -7.688 3.307 QT
-7.438 3.042 -7.188 1.37 QT
-6.563 1.37 L
-7.156 5.12 L
-14.953 5.12 L
cp}def
f1390903136
f
GR
GS
[0.75 0 0 0.75 181.84963 393.46729] CT
N
/f346431540{-4.755 1.651 M
-4.755 0.917 L
1.745 -8.771 L
1.807 -8.864 1.964 -8.864 QT
2.26 -8.864 L
2.495 -8.864 2.495 -8.63 QT
2.495 0.917 L
4.557 0.917 L
4.557 1.651 L
2.495 1.651 L
2.495 3.714 L
2.495 4.151 3.112 4.268 QT
3.729 4.386 4.542 4.386 QT
4.542 5.12 L
-1.24 5.12 L
-1.24 4.386 L
-0.427 4.386 0.182 4.268 QT
0.792 4.151 0.792 3.714 QT
0.792 1.651 L
-4.755 1.651 L
cp
-4.052 0.917 M
0.917 0.917 L
0.917 -6.521 L
-4.052 0.917 L
cp}def
f346431540
f
GR
GS
[0.75 0 0 0.75 181.84963 393.46729] CT
N
/f-485083074{10.583 5.589 M
8.005 5.589 7.083 3.464 QT
6.161 1.339 6.161 -1.583 QT
6.161 -3.396 6.49 -5.005 QT
6.818 -6.614 7.81 -7.739 QT
8.802 -8.864 10.583 -8.864 QT
11.974 -8.864 12.849 -8.193 QT
13.724 -7.521 14.193 -6.443 QT
14.661 -5.364 14.826 -4.146 QT
14.99 -2.927 14.99 -1.583 QT
14.99 0.229 14.661 1.8 QT
14.333 3.37 13.357 4.479 QT
12.38 5.589 10.583 5.589 QT
cp
10.583 5.042 M
11.755 5.042 12.326 3.839 QT
12.896 2.636 13.029 1.182 QT
13.161 -0.271 13.161 -1.911 QT
13.161 -3.489 13.029 -4.825 QT
12.896 -6.161 12.326 -7.239 QT
11.755 -8.318 10.583 -8.318 QT
9.396 -8.318 8.818 -7.232 QT
8.24 -6.146 8.107 -4.818 QT
7.974 -3.489 7.974 -1.911 QT
7.974 -0.739 8.036 0.292 QT
8.099 1.323 8.341 2.425 QT
8.583 3.526 9.13 4.284 QT
9.677 5.042 10.583 5.042 QT
cp}def
f-485083074
f
GR
GS
[0.75 0 0 0.75 614.19109 277.62172] CT
N
/f1208957343{-8.292 4.245 M
-7.729 4.917 -6.292 4.917 QT
-5.495 4.917 -4.807 4.37 QT
-4.12 3.823 -3.729 3.042 QT
-3.292 2.151 -3.167 1.136 QT
-3.042 0.12 -3.042 -1.364 QT
-3.401 -0.521 -4.073 0.026 QT
-4.745 0.573 -5.62 0.573 QT
-6.839 0.573 -7.8 -0.091 QT
-8.76 -0.755 -9.276 -1.841 QT
-9.792 -2.927 -9.792 -4.146 QT
-9.792 -5.396 -9.214 -6.489 QT
-8.635 -7.583 -7.62 -8.224 QT
-6.604 -8.864 -5.307 -8.864 QT
-4.042 -8.864 -3.182 -8.177 QT
-2.323 -7.489 -1.878 -6.396 QT
-1.432 -5.302 -1.253 -4.083 QT
-1.073 -2.864 -1.073 -1.661 QT
-1.073 -0.052 -1.667 1.636 QT
-2.26 3.323 -3.44 4.456 QT
-4.62 5.589 -6.292 5.589 QT
-7.542 5.589 -8.401 5.003 QT
-9.26 4.417 -9.26 3.229 QT
-9.26 2.807 -8.971 2.511 QT
-8.682 2.214 -8.245 2.214 QT
-7.823 2.214 -7.534 2.511 QT
-7.245 2.807 -7.245 3.229 QT
-7.245 3.636 -7.542 3.94 QT
-7.839 4.245 -8.245 4.245 QT
-8.292 4.245 L
cp
-5.542 0.011 M
-4.682 0.011 -4.135 -0.568 QT
-3.589 -1.146 -3.339 -2.005 QT
-3.089 -2.864 -3.089 -3.724 QT
-3.089 -4.114 L
-3.089 -4.208 L
-3.089 -5.786 -3.55 -7.021 QT
-4.01 -8.255 -5.307 -8.255 QT
-6.151 -8.255 -6.667 -7.896 QT
-7.182 -7.536 -7.425 -6.927 QT
-7.667 -6.318 -7.737 -5.63 QT
-7.807 -4.943 -7.807 -4.146 QT
-7.807 -2.943 -7.69 -2.107 QT
-7.573 -1.271 -7.073 -0.63 QT
-6.573 0.011 -5.542 0.011 QT
cp}def
f1208957343
f
GR
GS
[0.75 0 0 0.75 614.19109 277.62172] CT
N
f1776739717
f
GR
GS
[0.75 0 0 0.75 147.19444 277.62172] CT
N
f1390903136
f
GR
GS
[0.75 0 0 0.75 147.19444 277.62172] CT
N
/f1371073443{-1.677 4.573 M
-1.677 3.401 -1.474 2.284 QT
-1.271 1.167 -0.88 0.081 QT
-0.49 -1.005 0.073 -2.06 QT
0.635 -3.114 1.307 -4.036 QT
3.214 -6.708 L
0.823 -6.708 L
-2.911 -6.708 -3.021 -6.599 QT
-3.302 -6.255 -3.552 -4.661 QT
-4.161 -4.661 L
-3.474 -9.068 L
-2.849 -9.068 L
-2.849 -9.005 L
-2.849 -8.63 -1.568 -8.521 QT
-0.286 -8.411 0.948 -8.411 QT
4.854 -8.411 L
4.854 -7.864 L
4.854 -7.849 4.846 -7.833 QT
4.839 -7.818 4.823 -7.802 QT
1.932 -3.739 L
0.87 -2.161 0.604 -0.232 QT
0.339 1.698 0.339 4.573 QT
0.339 4.979 0.042 5.284 QT
-0.255 5.589 -0.661 5.589 QT
-1.083 5.589 -1.38 5.284 QT
-1.677 4.979 -1.677 4.573 QT
cp}def
f1371073443
f
GR
GS
[0.75 0 0 0.75 147.19444 277.62172] CT
N
f-485083074
f
GR
GS
[0.75 0 0 0.75 583.15036 393.46729] CT
N
/f-150821628{-14.047 5.12 M
-14.047 4.386 L
-11.422 4.386 -11.422 3.714 QT
-11.422 -7.302 L
-12.516 -6.786 -14.172 -6.786 QT
-14.172 -7.521 L
-11.594 -7.521 -10.281 -8.864 QT
-9.984 -8.864 L
-9.922 -8.864 -9.852 -8.81 QT
-9.781 -8.755 -9.781 -8.677 QT
-9.781 3.714 L
-9.781 4.386 -7.156 4.386 QT
-7.156 5.12 L
-14.047 5.12 L
cp}def
f-150821628
f
GR
GS
[0.75 0 0 0.75 583.15036 393.46729] CT
N
/f-1774948328{-4.286 5.12 M
-4.286 4.557 L
-4.286 4.511 -4.24 4.448 QT
-0.99 0.839 L
-0.24 0.026 0.221 -0.513 QT
0.682 -1.052 1.128 -1.763 QT
1.573 -2.474 1.839 -3.2 QT
2.104 -3.927 2.104 -4.755 QT
2.104 -5.614 1.784 -6.404 QT
1.464 -7.193 0.831 -7.661 QT
0.198 -8.13 -0.693 -8.13 QT
-1.599 -8.13 -2.326 -7.583 QT
-3.052 -7.036 -3.349 -6.161 QT
-3.271 -6.177 -3.13 -6.177 QT
-2.661 -6.177 -2.326 -5.864 QT
-1.99 -5.552 -1.99 -5.036 QT
-1.99 -4.568 -2.326 -4.232 QT
-2.661 -3.896 -3.13 -3.896 QT
-3.615 -3.896 -3.951 -4.239 QT
-4.286 -4.583 -4.286 -5.036 QT
-4.286 -5.833 -3.99 -6.521 QT
-3.693 -7.208 -3.13 -7.747 QT
-2.568 -8.286 -1.872 -8.575 QT
-1.177 -8.864 -0.38 -8.864 QT
0.823 -8.864 1.854 -8.357 QT
2.885 -7.849 3.495 -6.919 QT
4.104 -5.989 4.104 -4.755 QT
4.104 -3.849 3.706 -3.029 QT
3.307 -2.208 2.682 -1.536 QT
2.057 -0.864 1.081 -0.013 QT
0.104 0.839 -0.208 1.136 QT
-2.583 3.417 L
-0.568 3.417 L
0.917 3.417 1.917 3.393 QT
2.917 3.37 2.979 3.307 QT
3.229 3.042 3.479 1.37 QT
4.104 1.37 L
3.51 5.12 L
-4.286 5.12 L
cp}def
f-1774948328
f
GR
GS
[0.75 0 0 0.75 583.15036 393.46729] CT
N
f-485083074
f
GR
GS
[0.75 0 0 0.75 181.84963 161.77618] CT
N
/f-211614979{-14 3.495 M
-13.516 4.214 -12.68 4.565 QT
-11.844 4.917 -10.891 4.917 QT
-9.672 4.917 -9.156 3.878 QT
-8.641 2.839 -8.641 1.511 QT
-8.641 0.917 -8.75 0.323 QT
-8.859 -0.271 -9.117 -0.786 QT
-9.375 -1.302 -9.82 -1.607 QT
-10.266 -1.911 -10.906 -1.911 QT
-12.313 -1.911 L
-12.5 -1.911 -12.5 -2.114 QT
-12.5 -2.286 L
-12.5 -2.458 -12.313 -2.458 QT
-11.156 -2.552 L
-10.406 -2.552 -9.922 -3.107 QT
-9.438 -3.661 -9.211 -4.45 QT
-8.984 -5.239 -8.984 -5.958 QT
-8.984 -6.974 -9.453 -7.614 QT
-9.922 -8.255 -10.891 -8.255 QT
-11.688 -8.255 -12.422 -7.958 QT
-13.156 -7.661 -13.578 -7.036 QT
-13.531 -7.052 -13.508 -7.06 QT
-13.484 -7.068 -13.438 -7.068 QT
-12.969 -7.068 -12.648 -6.739 QT
-12.328 -6.411 -12.328 -5.943 QT
-12.328 -5.489 -12.648 -5.161 QT
-12.969 -4.833 -13.438 -4.833 QT
-13.891 -4.833 -14.219 -5.161 QT
-14.547 -5.489 -14.547 -5.943 QT
-14.547 -6.849 -14.008 -7.513 QT
-13.469 -8.177 -12.609 -8.521 QT
-11.75 -8.864 -10.891 -8.864 QT
-10.25 -8.864 -9.547 -8.677 QT
-8.844 -8.489 -8.266 -8.138 QT
-7.688 -7.786 -7.328 -7.232 QT
-6.969 -6.677 -6.969 -5.958 QT
-6.969 -5.083 -7.359 -4.333 QT
-7.75 -3.583 -8.438 -3.044 QT
-9.125 -2.505 -9.953 -2.239 QT
-9.031 -2.052 -8.211 -1.544 QT
-7.391 -1.036 -6.898 -0.232 QT
-6.406 0.573 -6.406 1.495 QT
-6.406 2.651 -7.039 3.589 QT
-7.672 4.526 -8.711 5.057 QT
-9.75 5.589 -10.891 5.589 QT
-11.875 5.589 -12.867 5.214 QT
-13.859 4.839 -14.492 4.089 QT
-15.125 3.339 -15.125 2.292 QT
-15.125 1.761 -14.773 1.417 QT
-14.422 1.073 -13.891 1.073 QT
-13.563 1.073 -13.281 1.229 QT
-13 1.386 -12.836 1.675 QT
-12.672 1.964 -12.672 2.292 QT
-12.672 2.807 -13.031 3.151 QT
-13.391 3.495 -13.891 3.495 QT
-14 3.495 L
cp}def
f-211614979
f
GR
GS
[0.75 0 0 0.75 181.84963 161.77618] CT
N
/f879674892{-0.083 5.589 M
-2.661 5.589 -3.583 3.464 QT
-4.505 1.339 -4.505 -1.583 QT
-4.505 -3.396 -4.177 -5.005 QT
-3.849 -6.614 -2.857 -7.739 QT
-1.865 -8.864 -0.083 -8.864 QT
1.307 -8.864 2.182 -8.193 QT
3.057 -7.521 3.526 -6.443 QT
3.995 -5.364 4.159 -4.146 QT
4.323 -2.927 4.323 -1.583 QT
4.323 0.229 3.995 1.8 QT
3.667 3.37 2.69 4.479 QT
1.714 5.589 -0.083 5.589 QT
cp
-0.083 5.042 M
1.089 5.042 1.659 3.839 QT
2.229 2.636 2.362 1.182 QT
2.495 -0.271 2.495 -1.911 QT
2.495 -3.489 2.362 -4.825 QT
2.229 -6.161 1.659 -7.239 QT
1.089 -8.318 -0.083 -8.318 QT
-1.271 -8.318 -1.849 -7.232 QT
-2.427 -6.146 -2.56 -4.818 QT
-2.693 -3.489 -2.693 -1.911 QT
-2.693 -0.739 -2.63 0.292 QT
-2.568 1.323 -2.326 2.425 QT
-2.083 3.526 -1.536 4.284 QT
-0.99 5.042 -0.083 5.042 QT
cp}def
f879674892
f
GR
GS
[0.75 0 0 0.75 181.84963 161.77618] CT
N
f-485083074
f
GR
GS
[0.75 0 0 0.75 498.34557 478.27208] CT
N
f-150821628
f
GR
GS
[0.75 0 0 0.75 498.34557 478.27208] CT
N
/f-1242808361{-3.505 2.729 M
-3.286 3.339 -2.841 3.846 QT
-2.396 4.354 -1.786 4.636 QT
-1.177 4.917 -0.521 4.917 QT
0.995 4.917 1.565 3.737 QT
2.135 2.557 2.135 0.87 QT
2.135 0.151 2.112 -0.349 QT
2.089 -0.849 1.979 -1.302 QT
1.776 -2.052 1.292 -2.607 QT
0.807 -3.161 0.104 -3.161 QT
-0.599 -3.161 -1.107 -2.943 QT
-1.615 -2.724 -1.935 -2.435 QT
-2.255 -2.146 -2.505 -1.833 QT
-2.755 -1.521 -2.818 -1.489 QT
-3.052 -1.489 L
-3.099 -1.489 -3.177 -1.56 QT
-3.255 -1.63 -3.255 -1.693 QT
-3.255 -8.708 L
-3.255 -8.755 -3.185 -8.81 QT
-3.115 -8.864 -3.052 -8.864 QT
-2.99 -8.864 L
-1.568 -8.193 0.026 -8.193 QT
1.573 -8.193 3.026 -8.864 QT
3.089 -8.864 L
3.151 -8.864 3.214 -8.818 QT
3.276 -8.771 3.276 -8.708 QT
3.276 -8.505 L
3.276 -8.411 3.245 -8.411 QT
2.526 -7.458 1.44 -6.919 QT
0.354 -6.38 -0.802 -6.38 QT
-1.646 -6.38 -2.521 -6.614 QT
-2.521 -2.646 L
-1.833 -3.224 -1.279 -3.458 QT
-0.724 -3.693 0.12 -3.693 QT
1.276 -3.693 2.198 -3.029 QT
3.12 -2.364 3.612 -1.294 QT
4.104 -0.224 4.104 0.901 QT
4.104 2.151 3.479 3.229 QT
2.854 4.307 1.792 4.948 QT
0.729 5.589 -0.521 5.589 QT
-1.552 5.589 -2.419 5.05 QT
-3.286 4.511 -3.786 3.612 QT
-4.286 2.714 -4.286 1.698 QT
-4.286 1.229 -3.982 0.932 QT
-3.677 0.636 -3.208 0.636 QT
-2.755 0.636 -2.443 0.932 QT
-2.13 1.229 -2.13 1.698 QT
-2.13 2.151 -2.443 2.464 QT
-2.755 2.776 -3.208 2.776 QT
-3.286 2.776 -3.38 2.761 QT
-3.474 2.745 -3.505 2.729 QT
cp}def
f-1242808361
f
GR
GS
[0.75 0 0 0.75 498.34557 478.27208] CT
N
f-485083074
f
GR
GS
[0.75 0 0 0.75 266.65446 76.97136] CT
N
f-211614979
f
GR
GS
[0.75 0 0 0.75 266.65446 76.97136] CT
N
/f-1112969129{-3.333 3.495 M
-2.849 4.214 -2.013 4.565 QT
-1.177 4.917 -0.224 4.917 QT
0.995 4.917 1.51 3.878 QT
2.026 2.839 2.026 1.511 QT
2.026 0.917 1.917 0.323 QT
1.807 -0.271 1.549 -0.786 QT
1.292 -1.302 0.846 -1.607 QT
0.401 -1.911 -0.24 -1.911 QT
-1.646 -1.911 L
-1.833 -1.911 -1.833 -2.114 QT
-1.833 -2.286 L
-1.833 -2.458 -1.646 -2.458 QT
-0.49 -2.552 L
0.26 -2.552 0.745 -3.107 QT
1.229 -3.661 1.456 -4.45 QT
1.682 -5.239 1.682 -5.958 QT
1.682 -6.974 1.214 -7.614 QT
0.745 -8.255 -0.224 -8.255 QT
-1.021 -8.255 -1.755 -7.958 QT
-2.49 -7.661 -2.911 -7.036 QT
-2.865 -7.052 -2.841 -7.06 QT
-2.818 -7.068 -2.771 -7.068 QT
-2.302 -7.068 -1.982 -6.739 QT
-1.661 -6.411 -1.661 -5.943 QT
-1.661 -5.489 -1.982 -5.161 QT
-2.302 -4.833 -2.771 -4.833 QT
-3.224 -4.833 -3.552 -5.161 QT
-3.88 -5.489 -3.88 -5.943 QT
-3.88 -6.849 -3.341 -7.513 QT
-2.802 -8.177 -1.943 -8.521 QT
-1.083 -8.864 -0.224 -8.864 QT
0.417 -8.864 1.12 -8.677 QT
1.823 -8.489 2.401 -8.138 QT
2.979 -7.786 3.339 -7.232 QT
3.698 -6.677 3.698 -5.958 QT
3.698 -5.083 3.307 -4.333 QT
2.917 -3.583 2.229 -3.044 QT
1.542 -2.505 0.714 -2.239 QT
1.635 -2.052 2.456 -1.544 QT
3.276 -1.036 3.768 -0.232 QT
4.26 0.573 4.26 1.495 QT
4.26 2.651 3.628 3.589 QT
2.995 4.526 1.956 5.057 QT
0.917 5.589 -0.224 5.589 QT
-1.208 5.589 -2.201 5.214 QT
-3.193 4.839 -3.826 4.089 QT
-4.458 3.339 -4.458 2.292 QT
-4.458 1.761 -4.107 1.417 QT
-3.755 1.073 -3.224 1.073 QT
-2.896 1.073 -2.615 1.229 QT
-2.333 1.386 -2.169 1.675 QT
-2.005 1.964 -2.005 2.292 QT
-2.005 2.807 -2.365 3.151 QT
-2.724 3.495 -3.224 3.495 QT
-3.333 3.495 L
cp}def
f-1112969129
f
GR
GS
[0.75 0 0 0.75 266.65446 76.97136] CT
N
f-485083074
f
GR
GS
[0.75 0 0 0.75 382.5 509.31281] CT
N
/f-1384251478{-5.892 6.775 M
-5.892 0.478 L
-5.892 0.275 -5.657 0.275 QT
-5.329 0.275 L
-5.251 0.275 -5.181 0.337 QT
-5.111 0.4 -5.111 0.478 QT
-5.111 3.134 -3.47 4.587 QT
-1.829 6.041 0.827 6.041 QT
1.764 6.041 2.561 5.501 QT
3.358 4.962 3.796 4.087 QT
4.233 3.212 4.233 2.275 QT
4.233 1.462 3.905 0.689 QT
3.577 -0.084 2.96 -0.655 QT
2.343 -1.225 1.561 -1.413 QT
-1.954 -2.256 L
-3.689 -2.725 -4.79 -4.155 QT
-5.892 -5.584 -5.892 -7.366 QT
-5.892 -8.756 -5.181 -9.983 QT
-4.47 -11.209 -3.259 -11.92 QT
-2.048 -12.631 -0.657 -12.631 QT
2.046 -12.631 3.639 -10.803 QT
4.749 -12.553 L
4.827 -12.631 4.936 -12.631 QT
5.124 -12.631 L
5.202 -12.631 5.272 -12.577 QT
5.343 -12.522 5.343 -12.413 QT
5.343 -6.147 L
5.343 -5.913 5.124 -5.913 QT
4.796 -5.913 L
4.546 -5.913 4.546 -6.147 QT
4.546 -6.834 4.319 -7.655 QT
4.093 -8.475 3.679 -9.225 QT
3.264 -9.975 2.796 -10.444 QT
1.499 -11.772 -0.657 -11.772 QT
-1.579 -11.772 -2.361 -11.303 QT
-3.142 -10.834 -3.603 -10.03 QT
-4.064 -9.225 -4.064 -8.334 QT
-4.064 -7.178 -3.345 -6.233 QT
-2.626 -5.288 -1.454 -4.991 QT
2.046 -4.131 L
2.921 -3.928 3.686 -3.381 QT
4.452 -2.834 4.968 -2.108 QT
5.483 -1.381 5.772 -0.491 QT
6.061 0.4 6.061 1.353 QT
6.061 2.806 5.389 4.111 QT
4.718 5.416 3.499 6.205 QT
2.28 6.994 0.827 6.994 QT
-0.064 6.994 -1.001 6.798 QT
-1.939 6.603 -2.728 6.189 QT
-3.517 5.775 -4.157 5.134 QT
-5.298 6.916 L
-5.376 6.994 -5.501 6.994 QT
-5.657 6.994 L
-5.892 6.994 -5.892 6.775 QT
cp}def
f-1384251478
f
GR
GS
[0.75 0 0 0.75 382.5 45.93063] CT
N
/f2079878726{-9.172 6.4 M
-9.172 5.447 L
-6.391 5.447 -6.391 3.853 QT
-6.391 -10.944 L
-7.266 -11.1 -9.172 -11.1 QT
-9.172 -12.038 L
-4 -12.038 L
-3.875 -12.038 -3.813 -11.944 QT
5.734 2.134 L
5.734 -9.506 L
5.734 -11.1 2.953 -11.1 QT
2.953 -12.038 L
9.375 -12.038 L
9.375 -11.1 L
6.609 -11.1 6.609 -9.506 QT
6.609 6.166 L
6.609 6.244 6.508 6.322 QT
6.406 6.4 6.328 6.4 QT
6 6.4 L
5.875 6.4 5.828 6.291 QT
-5.516 -10.397 L
-5.516 3.853 L
-5.516 5.447 -2.734 5.447 QT
-2.734 6.4 L
-9.172 6.4 L
cp}def
f2079878726
f
GR
GS
[0.75 0 0 0.75 0 0] CT
0.149 GC
[1 3] 0 setdash
2 LJ
0.667 LW
N
510 98.894 M
527.033 99.429 L
543.999 101.033 L
560.831 103.699 L
577.462 107.416 L
593.827 112.171 L
609.861 117.943 L
625.5 124.711 L
640.685 132.448 L
655.353 141.123 L
669.448 150.702 L
682.913 161.146 L
695.696 172.416 L
707.746 184.466 L
719.016 197.249 L
729.461 210.715 L
739.039 224.809 L
747.714 239.478 L
755.451 254.662 L
762.219 270.302 L
767.992 286.336 L
772.746 302.701 L
776.463 319.332 L
779.129 336.163 L
780.733 353.129 L
781.268 370.162 L
780.733 387.195 L
779.129 404.161 L
776.463 420.993 L
772.746 437.624 L
767.992 453.989 L
762.219 470.023 L
755.451 485.663 L
747.714 500.847 L
739.039 515.515 L
729.461 529.61 L
719.016 543.075 L
707.746 555.858 L
695.696 567.908 L
682.913 579.178 L
669.448 589.623 L
655.353 599.202 L
640.685 607.877 L
625.5 615.613 L
609.861 622.381 L
593.827 628.154 L
577.462 632.908 L
560.831 636.626 L
543.999 639.292 L
527.033 640.895 L
510 641.431 L
492.967 640.895 L
476.001 639.292 L
459.169 636.626 L
442.538 632.908 L
426.173 628.154 L
410.139 622.381 L
394.5 615.613 L
379.315 607.877 L
364.647 599.202 L
350.552 589.623 L
337.087 579.178 L
324.304 567.908 L
312.254 555.858 L
300.984 543.075 L
290.539 529.61 L
280.961 515.515 L
272.286 500.847 L
264.549 485.663 L
257.781 470.023 L
252.008 453.989 L
247.254 437.624 L
243.537 420.993 L
240.871 404.161 L
239.267 387.195 L
238.732 370.162 L
239.267 353.129 L
240.871 336.163 L
243.537 319.332 L
247.254 302.701 L
252.008 286.336 L
257.781 270.302 L
264.549 254.662 L
272.286 239.478 L
280.961 224.809 L
290.539 210.715 L
300.984 197.249 L
312.254 184.466 L
324.304 172.416 L
337.087 161.146 L
350.552 150.702 L
364.647 141.123 L
379.315 132.448 L
394.5 124.711 L
410.139 117.943 L
426.173 112.171 L
442.538 107.416 L
459.169 103.699 L
476.001 101.033 L
492.967 99.429 L
510 98.894 L
S
GR
GS
[0.75 0 0 0.75 0 0] CT
0.149 GC
[1 3] 0 setdash
2 LJ
0.667 LW
N
510 126.95 M
525.271 127.43 L
540.483 128.868 L
555.573 131.258 L
570.484 134.591 L
585.157 138.853 L
599.533 144.029 L
613.555 150.097 L
627.169 157.033 L
640.32 164.811 L
652.957 173.399 L
665.03 182.764 L
676.49 192.868 L
687.294 203.672 L
697.398 215.133 L
706.763 227.206 L
715.351 239.842 L
723.129 252.994 L
730.065 266.607 L
736.133 280.63 L
741.309 295.005 L
745.572 309.678 L
748.905 324.589 L
751.295 339.68 L
752.733 354.891 L
753.213 370.162 L
752.733 385.434 L
751.295 400.645 L
748.905 415.736 L
745.572 430.647 L
741.309 445.319 L
736.133 459.695 L
730.065 473.717 L
723.129 487.331 L
715.351 500.482 L
706.763 513.119 L
697.398 525.192 L
687.294 536.653 L
676.49 547.457 L
665.03 557.561 L
652.957 566.925 L
640.32 575.513 L
627.169 583.291 L
613.555 590.228 L
599.533 596.296 L
585.157 601.471 L
570.484 605.734 L
555.573 609.067 L
540.483 611.457 L
525.271 612.895 L
510 613.375 L
494.729 612.895 L
479.517 611.457 L
464.427 609.067 L
449.516 605.734 L
434.843 601.471 L
420.467 596.296 L
406.445 590.228 L
392.831 583.291 L
379.68 575.513 L
367.043 566.925 L
354.97 557.561 L
343.51 547.457 L
332.706 536.653 L
322.601 525.192 L
313.237 513.119 L
304.649 500.482 L
296.871 487.331 L
289.935 473.717 L
283.867 459.695 L
278.691 445.319 L
274.428 430.647 L
271.095 415.736 L
268.705 400.645 L
267.267 385.434 L
266.787 370.162 L
267.267 354.891 L
268.705 339.68 L
271.095 324.589 L
274.428 309.678 L
278.691 295.005 L
283.867 280.63 L
289.935 266.607 L
296.871 252.994 L
304.649 239.842 L
313.237 227.206 L
322.601 215.133 L
332.706 203.672 L
343.51 192.868 L
354.97 182.764 L
367.043 173.399 L
379.68 164.811 L
392.831 157.033 L
406.445 150.097 L
420.467 144.029 L
434.843 138.853 L
449.516 134.591 L
464.427 131.258 L
479.517 128.868 L
494.729 127.43 L
510 126.95 L
S
GR
GS
[0.75 0 0 0.75 391.86823 88.72585] CT
N
/f-2102542514{-6.469 2.606 M
-6.094 3.152 -5.461 3.418 QT
-4.828 3.684 -4.109 3.684 QT
-3.172 3.684 -2.781 2.887 QT
-2.391 2.09 -2.391 1.09 QT
-2.391 0.637 -2.477 0.184 QT
-2.563 -0.269 -2.758 -0.66 QT
-2.953 -1.051 -3.289 -1.285 QT
-3.625 -1.519 -4.125 -1.519 QT
-5.188 -1.519 L
-5.328 -1.519 -5.328 -1.676 QT
-5.328 -1.816 L
-5.328 -1.941 -5.188 -1.941 QT
-4.297 -2.004 L
-3.734 -2.004 -3.367 -2.426 QT
-3 -2.848 -2.828 -3.457 QT
-2.656 -4.066 -2.656 -4.613 QT
-2.656 -5.379 -3.016 -5.871 QT
-3.375 -6.363 -4.109 -6.363 QT
-4.719 -6.363 -5.273 -6.129 QT
-5.828 -5.894 -6.156 -5.426 QT
-6.125 -5.441 -6.102 -5.441 QT
-6.078 -5.441 -6.047 -5.441 QT
-5.688 -5.441 -5.445 -5.191 QT
-5.203 -4.941 -5.203 -4.598 QT
-5.203 -4.254 -5.445 -4.004 QT
-5.688 -3.754 -6.047 -3.754 QT
-6.391 -3.754 -6.641 -4.004 QT
-6.891 -4.254 -6.891 -4.598 QT
-6.891 -5.285 -6.477 -5.793 QT
-6.063 -6.301 -5.414 -6.558 QT
-4.766 -6.816 -4.109 -6.816 QT
-3.625 -6.816 -3.086 -6.676 QT
-2.547 -6.535 -2.109 -6.262 QT
-1.672 -5.988 -1.391 -5.566 QT
-1.109 -5.144 -1.109 -4.613 QT
-1.109 -3.941 -1.414 -3.371 QT
-1.719 -2.801 -2.242 -2.387 QT
-2.766 -1.973 -3.391 -1.769 QT
-2.688 -1.629 -2.063 -1.238 QT
-1.438 -0.848 -1.063 -0.238 QT
-0.688 0.371 -0.688 1.074 QT
-0.688 1.949 -1.172 2.668 QT
-1.656 3.387 -2.445 3.793 QT
-3.234 4.199 -4.109 4.199 QT
-4.859 4.199 -5.609 3.91 QT
-6.359 3.621 -6.844 3.051 QT
-7.328 2.481 -7.328 1.684 QT
-7.328 1.277 -7.063 1.012 QT
-6.797 0.746 -6.391 0.746 QT
-6.141 0.746 -5.922 0.871 QT
-5.703 0.996 -5.586 1.215 QT
-5.469 1.434 -5.469 1.684 QT
-5.469 2.074 -5.742 2.34 QT
-6.016 2.606 -6.391 2.606 QT
-6.469 2.606 L
cp}def
f-2102542514
f
GR
GS
[0.75 0 0 0.75 391.86823 88.72585] CT
N
/f-1692182862{4 4.199 M
2.047 4.199 1.336 2.582 QT
0.625 0.965 0.625 -1.269 QT
0.625 -2.66 0.883 -3.887 QT
1.141 -5.113 1.891 -5.965 QT
2.641 -6.816 4 -6.816 QT
5.063 -6.816 5.734 -6.301 QT
6.406 -5.785 6.758 -4.973 QT
7.109 -4.16 7.234 -3.223 QT
7.359 -2.285 7.359 -1.269 QT
7.359 0.106 7.109 1.309 QT
6.859 2.512 6.117 3.356 QT
5.375 4.199 4 4.199 QT
cp
4 3.777 M
4.891 3.777 5.328 2.863 QT
5.766 1.949 5.867 0.84 QT
5.969 -0.269 5.969 -1.519 QT
5.969 -2.723 5.867 -3.738 QT
5.766 -4.754 5.336 -5.582 QT
4.906 -6.41 4 -6.41 QT
3.094 -6.41 2.656 -5.582 QT
2.219 -4.754 2.117 -3.738 QT
2.016 -2.723 2.016 -1.519 QT
2.016 -0.629 2.063 0.16 QT
2.109 0.949 2.297 1.785 QT
2.484 2.621 2.898 3.199 QT
3.313 3.777 4 3.777 QT
cp}def
f-1692182862
f
GR
GS
[0.75 0 0 0.75 0 0] CT
0.149 GC
[1 3] 0 setdash
2 LJ
0.667 LW
N
510 171.58 M
522.469 171.972 L
534.889 173.146 L
547.211 175.098 L
559.385 177.819 L
571.365 181.299 L
583.103 185.525 L
594.552 190.48 L
605.668 196.143 L
616.406 202.494 L
626.724 209.506 L
636.581 217.152 L
645.939 225.402 L
654.76 234.223 L
663.01 243.581 L
670.656 253.439 L
677.669 263.757 L
684.019 274.495 L
689.683 285.61 L
694.637 297.059 L
698.863 308.797 L
702.343 320.777 L
705.065 332.952 L
707.016 345.273 L
708.19 357.693 L
708.582 370.162 L
708.19 382.631 L
707.016 395.051 L
705.065 407.373 L
702.343 419.548 L
698.863 431.528 L
694.637 443.265 L
689.683 454.715 L
684.019 465.83 L
677.669 476.568 L
670.656 486.886 L
663.01 496.743 L
654.76 506.101 L
645.939 514.923 L
636.581 523.173 L
626.724 530.819 L
616.406 537.831 L
605.668 544.181 L
594.552 549.845 L
583.103 554.799 L
571.365 559.025 L
559.385 562.506 L
547.211 565.227 L
534.889 567.179 L
522.469 568.353 L
510 568.745 L
497.531 568.353 L
485.111 567.179 L
472.789 565.227 L
460.615 562.506 L
448.635 559.025 L
436.897 554.799 L
425.448 549.845 L
414.332 544.181 L
403.594 537.831 L
393.276 530.819 L
383.419 523.173 L
374.061 514.923 L
365.24 506.101 L
356.99 496.743 L
349.344 486.886 L
342.331 476.568 L
335.981 465.83 L
330.317 454.715 L
325.363 443.265 L
321.137 431.528 L
317.657 419.548 L
314.935 407.373 L
312.984 395.051 L
311.81 382.631 L
311.418 370.162 L
311.81 357.693 L
312.984 345.273 L
314.935 332.952 L
317.657 320.777 L
321.137 308.797 L
325.363 297.059 L
330.317 285.61 L
335.981 274.495 L
342.331 263.757 L
349.344 253.439 L
356.99 243.581 L
365.24 234.223 L
374.061 225.402 L
383.419 217.152 L
393.276 209.506 L
403.594 202.494 L
414.332 196.143 L
425.448 190.48 L
436.897 185.525 L
448.635 181.299 L
460.615 177.819 L
472.789 175.098 L
485.111 173.146 L
497.531 171.972 L
510 171.58 L
S
GR
GS
[0.75 0 0 0.75 391.14532 121.96091] CT
N
/f42575179{-7.547 1.199 M
-7.547 0.637 L
-2.609 -6.738 L
-2.547 -6.816 -2.438 -6.816 QT
-2.203 -6.816 L
-2.031 -6.816 -2.031 -6.644 QT
-2.031 0.637 L
-0.453 0.637 L
-0.453 1.199 L
-2.031 1.199 L
-2.031 2.762 L
-2.031 3.09 -1.563 3.184 QT
-1.094 3.277 -0.469 3.277 QT
-0.469 3.84 L
-4.875 3.84 L
-4.875 3.277 L
-4.266 3.277 -3.797 3.184 QT
-3.328 3.09 -3.328 2.762 QT
-3.328 1.199 L
-7.547 1.199 L
cp
-7.016 0.637 M
-3.234 0.637 L
-3.234 -5.035 L
-7.016 0.637 L
cp}def
f42575179
f
GR
GS
[0.75 0 0 0.75 391.14532 121.96091] CT
N
/f919121033{1.391 2.012 M
1.563 2.481 1.898 2.863 QT
2.234 3.246 2.703 3.465 QT
3.172 3.684 3.672 3.684 QT
4.828 3.684 5.266 2.785 QT
5.703 1.887 5.703 0.606 QT
5.703 0.043 5.68 -0.332 QT
5.656 -0.707 5.578 -1.066 QT
5.422 -1.629 5.055 -2.051 QT
4.688 -2.473 4.141 -2.473 QT
3.609 -2.473 3.219 -2.308 QT
2.828 -2.144 2.586 -1.926 QT
2.344 -1.707 2.156 -1.465 QT
1.969 -1.223 1.922 -1.207 QT
1.75 -1.207 L
1.703 -1.207 1.648 -1.254 QT
1.594 -1.301 1.594 -1.348 QT
1.594 -6.691 L
1.594 -6.738 1.641 -6.777 QT
1.688 -6.816 1.75 -6.816 QT
1.797 -6.816 L
2.875 -6.301 4.078 -6.301 QT
5.266 -6.301 6.375 -6.816 QT
6.422 -6.816 L
6.469 -6.816 6.516 -6.777 QT
6.563 -6.738 6.563 -6.691 QT
6.563 -6.551 L
6.563 -6.473 6.531 -6.473 QT
5.984 -5.738 5.164 -5.332 QT
4.344 -4.926 3.453 -4.926 QT
2.813 -4.926 2.141 -5.113 QT
2.141 -2.082 L
2.672 -2.519 3.094 -2.699 QT
3.516 -2.879 4.156 -2.879 QT
5.047 -2.879 5.742 -2.371 QT
6.438 -1.863 6.813 -1.051 QT
7.188 -0.238 7.188 0.621 QT
7.188 1.574 6.719 2.395 QT
6.25 3.215 5.438 3.707 QT
4.625 4.199 3.672 4.199 QT
2.875 4.199 2.219 3.785 QT
1.563 3.371 1.18 2.684 QT
0.797 1.996 0.797 1.231 QT
0.797 0.871 1.031 0.645 QT
1.266 0.418 1.625 0.418 QT
1.969 0.418 2.211 0.645 QT
2.453 0.871 2.453 1.231 QT
2.453 1.574 2.211 1.809 QT
1.969 2.043 1.625 2.043 QT
1.563 2.043 1.492 2.035 QT
1.422 2.027 1.391 2.012 QT
cp}def
f919121033
f
GR
GS
[0.75 0 0 0.75 0 0] CT
0.149 GC
[1 3] 0 setdash
2 LJ
0.667 LW
N
510 229.743 M
518.817 230.021 L
527.599 230.851 L
536.312 232.231 L
544.921 234.155 L
553.392 236.616 L
561.692 239.604 L
569.787 243.108 L
577.647 247.112 L
585.24 251.603 L
592.536 256.561 L
599.506 261.968 L
606.123 267.801 L
612.361 274.039 L
618.195 280.656 L
623.601 287.626 L
628.56 294.922 L
633.05 302.515 L
637.055 310.375 L
640.558 318.471 L
643.546 326.771 L
646.007 335.242 L
647.932 343.85 L
649.312 352.563 L
650.142 361.345 L
650.419 370.162 L
650.142 378.979 L
649.312 387.761 L
647.932 396.474 L
646.007 405.083 L
643.546 413.554 L
640.558 421.854 L
637.055 429.95 L
633.05 437.81 L
628.56 445.402 L
623.601 452.698 L
618.195 459.669 L
612.361 466.286 L
606.123 472.523 L
599.506 478.357 L
592.536 483.764 L
585.24 488.722 L
577.647 493.212 L
569.787 497.217 L
561.692 500.72 L
553.392 503.709 L
544.921 506.17 L
536.312 508.094 L
527.599 509.474 L
518.817 510.304 L
510 510.581 L
501.183 510.304 L
492.401 509.474 L
483.688 508.094 L
475.079 506.17 L
466.608 503.709 L
458.308 500.72 L
450.213 497.217 L
442.353 493.212 L
434.76 488.722 L
427.464 483.764 L
420.494 478.357 L
413.877 472.523 L
407.639 466.286 L
401.805 459.669 L
396.399 452.698 L
391.44 445.402 L
386.95 437.81 L
382.945 429.95 L
379.442 421.854 L
376.454 413.554 L
373.993 405.083 L
372.068 396.474 L
370.688 387.761 L
369.858 378.979 L
369.581 370.162 L
369.858 361.345 L
370.688 352.563 L
372.068 343.85 L
373.993 335.242 L
376.454 326.771 L
379.442 318.471 L
382.945 310.375 L
386.95 302.515 L
391.44 294.922 L
396.399 287.626 L
401.805 280.656 L
407.639 274.039 L
413.877 267.801 L
420.494 261.968 L
427.464 256.561 L
434.76 251.603 L
442.353 247.112 L
450.213 243.108 L
458.308 239.604 L
466.608 236.616 L
475.079 234.155 L
483.688 232.231 L
492.401 230.851 L
501.183 230.021 L
510 229.743 L
S
GR
GS
[0.75 0 0 0.75 391.14532 164.62286] CT
N
/f359229147{-4 4.199 M
-4.984 4.199 -5.648 3.668 QT
-6.313 3.137 -6.68 2.293 QT
-7.047 1.449 -7.188 0.527 QT
-7.328 -0.394 -7.328 -1.332 QT
-7.328 -2.598 -6.836 -3.871 QT
-6.344 -5.144 -5.383 -5.98 QT
-4.422 -6.816 -3.109 -6.816 QT
-2.563 -6.816 -2.094 -6.613 QT
-1.625 -6.41 -1.352 -6.004 QT
-1.078 -5.598 -1.078 -5.035 QT
-1.078 -4.707 -1.305 -4.48 QT
-1.531 -4.254 -1.859 -4.254 QT
-2.172 -4.254 -2.398 -4.48 QT
-2.625 -4.707 -2.625 -5.035 QT
-2.625 -5.348 -2.398 -5.574 QT
-2.172 -5.801 -1.859 -5.801 QT
-1.766 -5.801 L
-1.969 -6.082 -2.344 -6.223 QT
-2.719 -6.363 -3.109 -6.363 QT
-3.594 -6.363 -4.008 -6.152 QT
-4.422 -5.941 -4.75 -5.582 QT
-5.078 -5.223 -5.297 -4.785 QT
-5.516 -4.348 -5.633 -3.793 QT
-5.75 -3.238 -5.781 -2.754 QT
-5.813 -2.269 -5.813 -1.535 QT
-5.531 -2.191 -5.016 -2.613 QT
-4.5 -3.035 -3.859 -3.035 QT
-3.141 -3.035 -2.555 -2.746 QT
-1.969 -2.457 -1.547 -1.941 QT
-1.125 -1.426 -0.906 -0.769 QT
-0.688 -0.113 -0.688 0.559 QT
-0.688 1.496 -1.102 2.34 QT
-1.516 3.184 -2.273 3.692 QT
-3.031 4.199 -4 4.199 QT
cp
-4 3.684 M
-3.375 3.684 -3 3.402 QT
-2.625 3.121 -2.453 2.652 QT
-2.281 2.184 -2.234 1.715 QT
-2.188 1.246 -2.188 0.559 QT
-2.188 -0.348 -2.273 -0.988 QT
-2.359 -1.629 -2.742 -2.121 QT
-3.125 -2.613 -3.922 -2.613 QT
-4.563 -2.613 -4.984 -2.176 QT
-5.406 -1.738 -5.594 -1.066 QT
-5.781 -0.394 -5.781 0.215 QT
-5.781 0.434 -5.766 0.543 QT
-5.766 0.559 -5.773 0.574 QT
-5.781 0.59 -5.781 0.621 QT
-5.781 1.309 -5.641 2.012 QT
-5.5 2.715 -5.102 3.199 QT
-4.703 3.684 -4 3.684 QT
cp}def
f359229147
f
GR
GS
[0.75 0 0 0.75 391.14532 164.62286] CT
N
f-1692182862
f
GR
GS
[0.75 0 0 0.75 0 0] CT
0.149 GC
[1 3] 0 setdash
2 LJ
0.667 LW
N
510 297.476 M
514.564 297.62 L
519.11 298.049 L
523.62 298.764 L
528.076 299.76 L
532.461 301.034 L
536.758 302.58 L
540.948 304.394 L
545.017 306.467 L
548.947 308.791 L
552.724 311.358 L
556.332 314.157 L
559.757 317.176 L
562.986 320.405 L
566.006 323.83 L
568.804 327.438 L
571.371 331.215 L
573.695 335.145 L
575.768 339.214 L
577.582 343.405 L
579.129 347.701 L
580.403 352.086 L
581.399 356.542 L
582.113 361.052 L
582.543 365.598 L
582.686 370.162 L
582.543 374.726 L
582.113 379.272 L
581.399 383.782 L
580.403 388.239 L
579.129 392.624 L
577.582 396.92 L
575.768 401.111 L
573.695 405.179 L
571.371 409.109 L
568.804 412.886 L
566.006 416.494 L
562.986 419.919 L
559.757 423.148 L
556.332 426.168 L
552.724 428.967 L
548.947 431.533 L
545.017 433.858 L
540.948 435.931 L
536.758 437.744 L
532.461 439.291 L
528.076 440.565 L
523.62 441.561 L
519.11 442.275 L
514.564 442.705 L
510 442.848 L
505.436 442.705 L
500.89 442.275 L
496.38 441.561 L
491.924 440.565 L
487.539 439.291 L
483.242 437.744 L
479.052 435.931 L
474.983 433.858 L
471.053 431.533 L
467.276 428.967 L
463.668 426.168 L
460.243 423.148 L
457.014 419.919 L
453.994 416.494 L
451.196 412.886 L
448.629 409.109 L
446.305 405.179 L
444.232 401.111 L
442.418 396.92 L
440.871 392.624 L
439.597 388.239 L
438.601 383.782 L
437.887 379.272 L
437.457 374.726 L
437.314 370.162 L
437.457 365.598 L
437.887 361.052 L
438.601 356.542 L
439.597 352.086 L
440.871 347.701 L
442.418 343.405 L
444.232 339.214 L
446.305 335.145 L
448.629 331.215 L
451.196 327.438 L
453.994 323.83 L
457.014 320.405 L
460.243 317.176 L
463.668 314.157 L
467.276 311.358 L
471.053 308.791 L
474.983 306.467 L
479.052 304.394 L
483.242 302.58 L
487.539 301.034 L
491.924 299.76 L
496.38 298.764 L
500.89 298.049 L
505.436 297.62 L
510 297.476 L
S
GR
GS
[0.75 0 0 0.75 391.14532 216.38299] CT
N
/f967907560{-5.219 3.418 M
-5.219 2.527 -5.063 1.676 QT
-4.906 0.824 -4.602 -0.004 QT
-4.297 -0.832 -3.875 -1.637 QT
-3.453 -2.441 -2.938 -3.144 QT
-1.484 -5.176 L
-3.313 -5.176 L
-6.156 -5.176 -6.234 -5.098 QT
-6.453 -4.832 -6.641 -3.613 QT
-7.094 -3.613 L
-6.578 -6.973 L
-6.109 -6.973 L
-6.109 -6.926 L
-6.109 -6.644 -5.133 -6.558 QT
-4.156 -6.473 -3.219 -6.473 QT
-0.234 -6.473 L
-0.234 -6.051 L
-0.234 -6.035 -0.242 -6.027 QT
-0.25 -6.019 -0.25 -6.004 QT
-2.453 -2.91 L
-3.266 -1.707 -3.469 -0.238 QT
-3.672 1.231 -3.672 3.418 QT
-3.672 3.731 -3.898 3.965 QT
-4.125 4.199 -4.438 4.199 QT
-4.766 4.199 -4.992 3.965 QT
-5.219 3.731 -5.219 3.418 QT
cp}def
f967907560
f
GR
GS
[0.75 0 0 0.75 391.14532 216.38299] CT
N
f919121033
f
GR
GS
[0.75 0 0 0.75 0 0] CT
0.149 GC
[1 3] 0 setdash
2 LJ
0.667 LW
N
510 370.162 M
510 370.162 L
510 370.162 L
510 370.162 L
510 370.162 L
510 370.162 L
510 370.162 L
510 370.162 L
510 370.162 L
510 370.162 L
510 370.162 L
510 370.162 L
510 370.162 L
510 370.162 L
510 370.162 L
510 370.162 L
510 370.162 L
510 370.162 L
510 370.162 L
510 370.162 L
510 370.162 L
510 370.162 L
510 370.162 L
510 370.162 L
510 370.162 L
510 370.162 L
510 370.162 L
510 370.162 L
510 370.162 L
510 370.162 L
510 370.162 L
510 370.162 L
510 370.162 L
510 370.162 L
510 370.162 L
510 370.162 L
510 370.162 L
510 370.162 L
510 370.162 L
510 370.162 L
510 370.162 L
510 370.162 L
510 370.162 L
510 370.162 L
510 370.162 L
510 370.162 L
510 370.162 L
510 370.162 L
510 370.162 L
510 370.162 L
510 370.162 L
510 370.162 L
510 370.162 L
510 370.162 L
510 370.162 L
510 370.162 L
510 370.162 L
510 370.162 L
510 370.162 L
510 370.162 L
510 370.162 L
510 370.162 L
510 370.162 L
510 370.162 L
510 370.162 L
510 370.162 L
510 370.162 L
510 370.162 L
510 370.162 L
510 370.162 L
510 370.162 L
510 370.162 L
510 370.162 L
510 370.162 L
510 370.162 L
510 370.162 L
510 370.162 L
510 370.162 L
510 370.162 L
510 370.162 L
510 370.162 L
510 370.162 L
510 370.162 L
510 370.162 L
510 370.162 L
510 370.162 L
510 370.162 L
510 370.162 L
510 370.162 L
510 370.162 L
510 370.162 L
510 370.162 L
510 370.162 L
510 370.162 L
510 370.162 L
510 370.162 L
510 370.162 L
510 370.162 L
510 370.162 L
510 370.162 L
510 370.162 L
S
GR
GS
[0.75 0 0 0.75 390.18471 262.25228] CT
N
/f-1341065651{-6.188 3.168 M
-5.75 3.684 -4.672 3.684 QT
-4.063 3.684 -3.531 3.27 QT
-3 2.856 -2.719 2.246 QT
-2.375 1.574 -2.281 0.801 QT
-2.188 0.027 -2.188 -1.113 QT
-2.469 -0.457 -2.977 -0.043 QT
-3.484 0.371 -4.156 0.371 QT
-5.078 0.371 -5.813 -0.137 QT
-6.547 -0.644 -6.938 -1.465 QT
-7.328 -2.285 -7.328 -3.223 QT
-7.328 -4.176 -6.891 -5.012 QT
-6.453 -5.848 -5.68 -6.332 QT
-4.906 -6.816 -3.922 -6.816 QT
-2.953 -6.816 -2.297 -6.293 QT
-1.641 -5.769 -1.297 -4.933 QT
-0.953 -4.098 -0.82 -3.168 QT
-0.688 -2.238 -0.688 -1.332 QT
-0.688 -0.098 -1.141 1.184 QT
-1.594 2.465 -2.492 3.332 QT
-3.391 4.199 -4.672 4.199 QT
-5.609 4.199 -6.266 3.746 QT
-6.922 3.293 -6.922 2.402 QT
-6.922 2.074 -6.703 1.848 QT
-6.484 1.621 -6.156 1.621 QT
-5.828 1.621 -5.609 1.848 QT
-5.391 2.074 -5.391 2.402 QT
-5.391 2.715 -5.617 2.942 QT
-5.844 3.168 -6.156 3.168 QT
-6.188 3.168 L
cp
-4.094 -0.051 M
-3.438 -0.051 -3.016 -0.496 QT
-2.594 -0.941 -2.406 -1.598 QT
-2.219 -2.254 -2.219 -2.894 QT
-2.219 -3.207 L
-2.219 -3.269 L
-2.219 -4.473 -2.57 -5.418 QT
-2.922 -6.363 -3.922 -6.363 QT
-4.547 -6.363 -4.945 -6.082 QT
-5.344 -5.801 -5.531 -5.34 QT
-5.719 -4.879 -5.766 -4.355 QT
-5.813 -3.832 -5.813 -3.223 QT
-5.813 -2.316 -5.727 -1.676 QT
-5.641 -1.035 -5.258 -0.543 QT
-4.875 -0.051 -4.094 -0.051 QT
cp}def
f-1341065651
f
GR
GS
[0.75 0 0 0.75 390.18471 262.25228] CT
N
f-1692182862
f
GR
GS
[0.75 0 0 0.75 382.5 312.28999] CT
1 GC
N
10 0 M
10 -5.523 5.523 -10 0 -10 C
-5.523 -10 -10 -5.523 -10 0 C
-10 5.523 -5.523 10 0 10 C
5.523 10 10 5.523 10 0 C
cp
f
GR
GS
[0.75 0 0 0.75 382.5 312.28999] CT
10.0 ML
2.667 LW
N
10 0 M
10 -5.523 5.523 -10 0 -10 C
-5.523 -10 -10 -5.523 -10 0 C
-10 5.523 -5.523 10 0 10 C
5.523 10 10 5.523 10 0 C
cp
S
GR
GS
[0.75 0 0 0.75 333.60901 432.68417] CT
1 GC
N
/f-1017779695{10 0 M
10 -5.523 5.523 -10 0 -10 C
-5.523 -10 -10 -5.523 -10 0 C
-10 5.523 -5.523 10 0 10 C
5.523 10 10 5.523 10 0 C
cp}def
f-1017779695
f
GR
GS
[0.75 0 0 0.75 333.60901 432.68417] CT
10.0 ML
2.667 LW
N
10 0 M
10 -5.523 5.523 -10 0 -10 C
-5.523 -10 -10 -5.523 -10 0 C
-10 5.523 -5.523 10 0 10 C
5.523 10 10 5.523 10 0 C
cp
S
GR
GS
[0.75 0 0 0.75 281.36073 422.06355] CT
1 GC
N
f-1017779695
f
GR
GS
[0.75 0 0 0.75 281.36073 422.06355] CT
10.0 ML
2.667 LW
N
10 0 M
10 -5.523 5.523 -10 0 -10 C
-5.523 -10 -10 -5.523 -10 0 C
-10 5.523 -5.523 10 0 10 C
5.523 10 10 5.523 10 0 C
cp
S
GR
GS
[0.75 0 0 0.75 279.86343 356.37753] CT
1 GC
N
f-1017779695
f
GR
GS
[0.75 0 0 0.75 279.86343 356.37753] CT
10.0 ML
2.667 LW
N
10 0 M
10 -5.523 5.523 -10 0 -10 C
-5.523 -10 -10 -5.523 -10 0 C
-10 5.523 -5.523 10 0 10 C
5.523 10 10 5.523 10 0 C
cp
S
GR
GS
[0.75 0 0 0.75 244.48695 327.85437] CT
1 GC
N
f-1017779695
f
GR
GS
[0.75 0 0 0.75 244.48695 327.85437] CT
10.0 ML
2.667 LW
N
10 0 M
10 -5.523 5.523 -10 0 -10 C
-5.523 -10 -10 -5.523 -10 0 C
-10 5.523 -5.523 10 0 10 C
5.523 10 10 5.523 10 0 C
cp
S
GR
GS
[0.75 0 0 0.75 0 0] CT
1 0 0 RC
N
/f1051077945{242.235 368.453 M
242.289 367.216 L
242.235 365.979 L
242.073 364.75 L
241.803 363.539 L
241.429 362.355 L
240.953 361.206 L
240.377 360.1 L
239.707 359.045 L
238.947 358.049 L
238.103 357.12 L
237.181 356.263 L
236.186 355.485 L
235.128 354.791 L
234.012 354.187 L
232.847 353.677 L
231.643 353.264 L
230.406 352.952 L
229.146 352.743 L
227.873 352.638 L
226.595 352.638 L
225.322 352.743 L
224.062 352.952 L
222.826 353.264 L
221.621 353.677 L
220.456 354.187 L
219.341 354.791 L
218.282 355.485 L
217.288 356.263 L
216.365 357.12 L
215.521 358.049 L
214.761 359.045 L
214.091 360.1 L
213.516 361.206 L
213.039 362.355 L
212.665 363.539 L
212.396 364.75 L
212.233 365.979 L
212.179 367.216 L
212.233 368.453 L
212.396 369.682 L
212.665 370.893 L
213.039 372.077 L
213.516 373.226 L
214.091 374.332 L
214.761 375.387 L
215.521 376.383 L
216.365 377.312 L
217.288 378.169 L
218.282 378.947 L
219.341 379.641 L
220.456 380.245 L
221.621 380.755 L
222.826 381.168 L
224.062 381.48 L
225.322 381.689 L
226.595 381.794 L
227.873 381.794 L
229.146 381.689 L
230.406 381.48 L
231.643 381.168 L
232.847 380.755 L
234.012 380.245 L
235.128 379.641 L
236.186 378.947 L
237.181 378.169 L
238.103 377.312 L
238.947 376.383 L
239.707 375.387 L
240.377 374.332 L
240.953 373.226 L
241.429 372.077 L
241.803 370.893 L
242.073 369.682 L
cp}def
f1051077945
f
GR
GS
[0.75 0 0 0.75 0 0] CT
1 0 0 RC
1 LJ
0.667 LW
N
242.289 367.216 M
242.235 365.979 L
242.073 364.75 L
241.803 363.539 L
241.429 362.355 L
240.953 361.206 L
240.377 360.1 L
239.707 359.045 L
238.947 358.049 L
238.103 357.12 L
237.181 356.263 L
236.186 355.485 L
235.128 354.791 L
234.012 354.187 L
232.847 353.677 L
231.643 353.264 L
230.406 352.952 L
229.146 352.743 L
227.873 352.638 L
226.595 352.638 L
225.322 352.743 L
224.062 352.952 L
222.826 353.264 L
221.621 353.677 L
220.456 354.187 L
219.341 354.791 L
218.282 355.485 L
217.288 356.263 L
216.365 357.12 L
215.521 358.049 L
214.761 359.045 L
214.091 360.1 L
213.516 361.206 L
213.039 362.355 L
212.665 363.539 L
212.396 364.75 L
212.233 365.979 L
212.179 367.216 L
212.233 368.453 L
212.396 369.682 L
212.665 370.893 L
213.039 372.077 L
213.516 373.226 L
214.091 374.332 L
214.761 375.387 L
215.521 376.383 L
216.365 377.312 L
217.288 378.169 L
218.282 378.947 L
219.341 379.641 L
220.456 380.245 L
221.621 380.755 L
222.826 381.168 L
224.062 381.48 L
225.322 381.689 L
226.595 381.794 L
227.873 381.794 L
229.146 381.689 L
230.406 381.48 L
231.643 381.168 L
232.847 380.755 L
234.012 380.245 L
235.128 379.641 L
236.186 378.947 L
237.181 378.169 L
238.103 377.312 L
238.947 376.383 L
239.707 375.387 L
240.377 374.332 L
240.953 373.226 L
241.429 372.077 L
241.803 370.893 L
242.073 369.682 L
242.235 368.453 L
242.289 367.216 L
cp
S
GR
GS
[0.75 0 0 0.75 0 0] CT
1 0 0 RC
N
/f2092425713{260.765 472.889 M
260.819 471.652 L
260.765 470.414 L
260.603 469.186 L
260.333 467.975 L
259.959 466.791 L
259.483 465.642 L
258.908 464.536 L
258.237 463.481 L
257.478 462.485 L
256.633 461.555 L
255.711 460.698 L
254.716 459.92 L
253.658 459.227 L
252.542 458.623 L
251.378 458.113 L
250.173 457.7 L
248.936 457.388 L
247.677 457.179 L
246.403 457.074 L
245.125 457.074 L
243.852 457.179 L
242.593 457.388 L
241.356 457.7 L
240.151 458.113 L
238.986 458.623 L
237.871 459.227 L
236.812 459.92 L
235.818 460.698 L
234.895 461.555 L
234.051 462.485 L
233.291 463.481 L
232.621 464.536 L
232.046 465.642 L
231.569 466.791 L
231.195 467.975 L
230.926 469.186 L
230.764 470.414 L
230.709 471.652 L
230.764 472.889 L
230.926 474.118 L
231.195 475.328 L
231.569 476.513 L
232.046 477.662 L
232.621 478.768 L
233.291 479.823 L
234.051 480.818 L
234.895 481.748 L
235.818 482.605 L
236.812 483.383 L
237.871 484.077 L
238.986 484.681 L
240.151 485.191 L
241.356 485.604 L
242.593 485.916 L
243.852 486.125 L
245.125 486.23 L
246.403 486.23 L
247.677 486.125 L
248.936 485.916 L
250.173 485.604 L
251.378 485.191 L
252.542 484.681 L
253.658 484.077 L
254.716 483.383 L
255.711 482.605 L
256.633 481.748 L
257.478 480.818 L
258.237 479.823 L
258.908 478.768 L
259.483 477.662 L
259.959 476.513 L
260.333 475.328 L
260.603 474.118 L
cp}def
f2092425713
f
GR
GS
[0.75 0 0 0.75 0 0] CT
1 0 0 RC
1 LJ
0.667 LW
N
260.819 471.652 M
260.765 470.414 L
260.603 469.186 L
260.333 467.975 L
259.959 466.791 L
259.483 465.642 L
258.908 464.536 L
258.237 463.481 L
257.478 462.485 L
256.633 461.555 L
255.711 460.698 L
254.716 459.92 L
253.658 459.227 L
252.542 458.623 L
251.378 458.113 L
250.173 457.7 L
248.936 457.388 L
247.677 457.179 L
246.403 457.074 L
245.125 457.074 L
243.852 457.179 L
242.593 457.388 L
241.356 457.7 L
240.151 458.113 L
238.986 458.623 L
237.871 459.227 L
236.812 459.92 L
235.818 460.698 L
234.895 461.555 L
234.051 462.485 L
233.291 463.481 L
232.621 464.536 L
232.046 465.642 L
231.569 466.791 L
231.195 467.975 L
230.926 469.186 L
230.764 470.414 L
230.709 471.652 L
230.764 472.889 L
230.926 474.118 L
231.195 475.328 L
231.569 476.513 L
232.046 477.662 L
232.621 478.768 L
233.291 479.823 L
234.051 480.818 L
234.895 481.748 L
235.818 482.605 L
236.812 483.383 L
237.871 484.077 L
238.986 484.681 L
240.151 485.191 L
241.356 485.604 L
242.593 485.916 L
243.852 486.125 L
245.125 486.23 L
246.403 486.23 L
247.677 486.125 L
248.936 485.916 L
250.173 485.604 L
251.378 485.191 L
252.542 484.681 L
253.658 484.077 L
254.716 483.383 L
255.711 482.605 L
256.633 481.748 L
257.478 480.818 L
258.237 479.823 L
258.908 478.768 L
259.483 477.662 L
259.959 476.513 L
260.333 475.328 L
260.603 474.118 L
260.765 472.889 L
260.819 471.652 L
cp
S
GR
GS
[0.75 0 0 0.75 0 0] CT
1 0 0 RC
N
/f380693403{277.345 237.434 M
277.399 236.196 L
277.345 234.959 L
277.182 233.731 L
276.913 232.52 L
276.539 231.336 L
276.062 230.186 L
275.487 229.08 L
274.817 228.026 L
274.057 227.03 L
273.213 226.1 L
272.29 225.243 L
271.296 224.465 L
270.237 223.772 L
269.122 223.168 L
267.957 222.657 L
266.752 222.245 L
265.516 221.933 L
264.256 221.723 L
262.983 221.618 L
261.705 221.618 L
260.432 221.723 L
259.172 221.933 L
257.935 222.245 L
256.731 222.657 L
255.566 223.168 L
254.45 223.772 L
253.392 224.465 L
252.398 225.243 L
251.475 226.1 L
250.631 227.03 L
249.871 228.026 L
249.201 229.08 L
248.625 230.186 L
248.149 231.336 L
247.775 232.52 L
247.505 233.731 L
247.343 234.959 L
247.289 236.196 L
247.343 237.434 L
247.505 238.662 L
247.775 239.873 L
248.149 241.057 L
248.625 242.207 L
249.201 243.313 L
249.871 244.367 L
250.631 245.363 L
251.475 246.293 L
252.398 247.15 L
253.392 247.928 L
254.45 248.621 L
255.566 249.225 L
256.731 249.736 L
257.935 250.148 L
259.172 250.46 L
260.432 250.67 L
261.705 250.775 L
262.983 250.775 L
264.256 250.67 L
265.516 250.46 L
266.752 250.148 L
267.957 249.736 L
269.122 249.225 L
270.237 248.621 L
271.296 247.928 L
272.29 247.15 L
273.213 246.293 L
274.057 245.363 L
274.817 244.367 L
275.487 243.313 L
276.062 242.207 L
276.539 241.057 L
276.913 239.873 L
277.182 238.662 L
cp}def
f380693403
f
GR
GS
[0.75 0 0 0.75 0 0] CT
1 0 0 RC
1 LJ
0.667 LW
N
277.399 236.196 M
277.345 234.959 L
277.182 233.731 L
276.913 232.52 L
276.539 231.336 L
276.062 230.186 L
275.487 229.08 L
274.817 228.026 L
274.057 227.03 L
273.213 226.1 L
272.29 225.243 L
271.296 224.465 L
270.237 223.772 L
269.122 223.168 L
267.957 222.657 L
266.752 222.245 L
265.516 221.933 L
264.256 221.723 L
262.983 221.618 L
261.705 221.618 L
260.432 221.723 L
259.172 221.933 L
257.935 222.245 L
256.731 222.657 L
255.566 223.168 L
254.45 223.772 L
253.392 224.465 L
252.398 225.243 L
251.475 226.1 L
250.631 227.03 L
249.871 228.026 L
249.201 229.08 L
248.625 230.186 L
248.149 231.336 L
247.775 232.52 L
247.505 233.731 L
247.343 234.959 L
247.289 236.196 L
247.343 237.434 L
247.505 238.662 L
247.775 239.873 L
248.149 241.057 L
248.625 242.207 L
249.201 243.313 L
249.871 244.367 L
250.631 245.363 L
251.475 246.293 L
252.398 247.15 L
253.392 247.928 L
254.45 248.621 L
255.566 249.225 L
256.731 249.736 L
257.935 250.148 L
259.172 250.46 L
260.432 250.67 L
261.705 250.775 L
262.983 250.775 L
264.256 250.67 L
265.516 250.46 L
266.752 250.148 L
267.957 249.736 L
269.122 249.225 L
270.237 248.621 L
271.296 247.928 L
272.29 247.15 L
273.213 246.293 L
274.057 245.363 L
274.817 244.367 L
275.487 243.313 L
276.062 242.207 L
276.539 241.057 L
276.913 239.873 L
277.182 238.662 L
277.345 237.434 L
277.399 236.196 L
cp
S
GR
GS
[0.75 0 0 0.75 212.00951 160.36575] CT
N
/f-1833028947{1.672 20.212 M
1.672 19.822 1.75 19.462 QT
3.703 11.712 L
0.875 11.712 L
0.594 11.712 0.594 11.353 QT
0.703 10.759 0.953 10.759 QT
3.938 10.759 L
5.016 6.353 L
5.125 5.994 5.445 5.744 QT
5.766 5.494 6.156 5.494 QT
6.5 5.494 6.734 5.697 QT
6.969 5.9 6.969 6.244 QT
6.969 6.322 6.961 6.369 QT
6.953 6.416 6.938 6.478 QT
5.859 10.759 L
8.641 10.759 L
8.906 10.759 8.906 11.119 QT
8.906 11.181 8.859 11.337 QT
8.813 11.494 8.75 11.603 QT
8.688 11.712 8.563 11.712 QT
5.609 11.712 L
3.672 19.509 L
3.484 20.275 3.484 20.837 QT
3.484 21.994 4.266 21.994 QT
5.453 21.994 6.375 20.876 QT
7.297 19.759 7.781 18.431 QT
7.891 18.275 7.984 18.275 QT
8.313 18.275 L
8.422 18.275 8.492 18.345 QT
8.563 18.416 8.563 18.509 QT
8.563 18.556 8.531 18.587 QT
7.938 20.228 6.805 21.462 QT
5.672 22.697 4.203 22.697 QT
3.141 22.697 2.406 22.001 QT
1.672 21.306 1.672 20.212 QT
cp}def
f-1833028947
f
GR
GS
[0.75 0 0 0.75 212.00951 160.36575] CT
N
/f-855994398{11.442 24.931 M
11.88 25.587 12.63 25.9 QT
13.38 26.212 14.255 26.212 QT
15.348 26.212 15.817 25.275 QT
16.286 24.337 16.286 23.134 QT
16.286 22.603 16.184 22.064 QT
16.083 21.525 15.856 21.056 QT
15.63 20.587 15.223 20.314 QT
14.817 20.04 14.239 20.04 QT
12.973 20.04 L
12.802 20.04 12.802 19.853 QT
12.802 19.697 L
12.802 19.54 12.973 19.54 QT
14.02 19.462 L
14.692 19.462 15.13 18.962 QT
15.567 18.462 15.77 17.744 QT
15.973 17.025 15.973 16.369 QT
15.973 15.462 15.552 14.876 QT
15.13 14.29 14.255 14.29 QT
13.52 14.29 12.864 14.564 QT
12.208 14.837 11.817 15.4 QT
11.864 15.384 11.887 15.384 QT
11.911 15.384 11.942 15.384 QT
12.38 15.384 12.669 15.681 QT
12.958 15.978 12.958 16.384 QT
12.958 16.79 12.669 17.087 QT
12.38 17.384 11.942 17.384 QT
11.536 17.384 11.239 17.087 QT
10.942 16.79 10.942 16.384 QT
10.942 15.572 11.434 14.97 QT
11.927 14.369 12.7 14.056 QT
13.473 13.744 14.255 13.744 QT
14.833 13.744 15.466 13.915 QT
16.098 14.087 16.622 14.408 QT
17.145 14.728 17.473 15.228 QT
17.802 15.728 17.802 16.369 QT
17.802 17.165 17.442 17.845 QT
17.083 18.525 16.466 19.017 QT
15.848 19.509 15.098 19.744 QT
15.927 19.9 16.669 20.369 QT
17.411 20.837 17.864 21.556 QT
18.317 22.275 18.317 23.119 QT
18.317 24.165 17.739 25.017 QT
17.161 25.869 16.223 26.345 QT
15.286 26.822 14.255 26.822 QT
13.364 26.822 12.466 26.478 QT
11.567 26.134 10.997 25.462 QT
10.427 24.79 10.427 23.837 QT
10.427 23.369 10.739 23.048 QT
11.052 22.728 11.536 22.728 QT
11.833 22.728 12.091 22.876 QT
12.348 23.025 12.489 23.283 QT
12.63 23.54 12.63 23.837 QT
12.63 24.306 12.309 24.619 QT
11.989 24.931 11.536 24.931 QT
11.442 24.931 L
cp}def
f-855994398
f
GR
GS
[0.75 0 0 0.75 182.01992 252.93384] CT
N
f-1833028947
f
GR
GS
[0.75 0 0 0.75 182.01992 252.93384] CT
N
/f-2100812036{11.395 26.4 M
11.395 25.728 L
13.77 25.728 13.77 25.134 QT
13.77 15.15 L
12.786 15.634 11.286 15.634 QT
11.286 14.962 L
13.614 14.962 14.802 13.744 QT
15.067 13.744 L
15.13 13.744 15.192 13.798 QT
15.255 13.853 15.255 13.915 QT
15.255 25.134 L
15.255 25.728 17.63 25.728 QT
17.63 26.4 L
11.395 26.4 L
cp}def
f-2100812036
f
GR
GS
[0.75 0 0 0.75 190.79736 322.71595] CT
N
f-1833028947
f
GR
GS
[0.75 0 0 0.75 190.79736 322.71595] CT
N
/f-1028082059{10.583 26.4 M
10.583 25.884 L
10.583 25.837 10.614 25.79 QT
13.567 22.525 L
14.239 21.79 14.653 21.306 QT
15.067 20.822 15.473 20.181 QT
15.88 19.54 16.114 18.876 QT
16.348 18.212 16.348 17.462 QT
16.348 16.681 16.067 15.97 QT
15.786 15.259 15.216 14.837 QT
14.645 14.415 13.833 14.415 QT
13.005 14.415 12.348 14.908 QT
11.692 15.4 11.427 16.197 QT
11.489 16.181 11.63 16.181 QT
12.052 16.181 12.356 16.462 QT
12.661 16.744 12.661 17.212 QT
12.661 17.634 12.356 17.939 QT
12.052 18.244 11.63 18.244 QT
11.177 18.244 10.88 17.931 QT
10.583 17.619 10.583 17.212 QT
10.583 16.494 10.848 15.869 QT
11.114 15.244 11.622 14.751 QT
12.13 14.259 12.762 14.001 QT
13.395 13.744 14.114 13.744 QT
15.192 13.744 16.13 14.205 QT
17.067 14.665 17.614 15.501 QT
18.161 16.337 18.161 17.462 QT
18.161 18.29 17.802 19.033 QT
17.442 19.775 16.88 20.384 QT
16.317 20.994 15.434 21.759 QT
14.552 22.525 14.27 22.79 QT
12.114 24.853 L
13.942 24.853 L
15.286 24.853 16.192 24.83 QT
17.098 24.806 17.161 24.759 QT
17.38 24.525 17.614 23.009 QT
18.161 23.009 L
17.63 26.4 L
10.583 26.4 L
cp}def
f-1028082059
f
GR
GS
[0.75 0 0 0.75 0 0] CT
1 0 0 RC
N
/f-552487427{781.56 255.473 M
781.615 254.235 L
781.56 252.998 L
781.398 251.769 L
781.129 250.559 L
780.755 249.374 L
780.278 248.225 L
779.703 247.119 L
779.033 246.065 L
778.273 245.069 L
777.429 244.139 L
776.506 243.282 L
775.512 242.504 L
774.453 241.81 L
773.337 241.206 L
772.173 240.696 L
770.968 240.284 L
769.731 239.972 L
768.472 239.762 L
767.198 239.657 L
765.921 239.657 L
764.647 239.762 L
763.388 239.972 L
762.151 240.284 L
760.946 240.696 L
759.782 241.206 L
758.666 241.81 L
757.607 242.504 L
756.613 243.282 L
755.691 244.139 L
754.846 245.069 L
754.086 246.065 L
753.416 247.119 L
752.841 248.225 L
752.365 249.374 L
751.99 250.559 L
751.721 251.769 L
751.559 252.998 L
751.505 254.235 L
751.559 255.473 L
751.721 256.701 L
751.99 257.912 L
752.365 259.096 L
752.841 260.246 L
753.416 261.352 L
754.086 262.406 L
754.846 263.402 L
755.691 264.332 L
756.613 265.189 L
757.607 265.967 L
758.666 266.66 L
759.782 267.264 L
760.946 267.775 L
762.151 268.187 L
763.388 268.499 L
764.647 268.709 L
765.921 268.814 L
767.198 268.814 L
768.472 268.709 L
769.731 268.499 L
770.968 268.187 L
772.173 267.775 L
773.337 267.264 L
774.453 266.66 L
775.512 265.967 L
776.506 265.189 L
777.429 264.332 L
778.273 263.402 L
779.033 262.406 L
779.703 261.352 L
780.278 260.246 L
780.755 259.096 L
781.129 257.912 L
781.398 256.701 L
cp}def
f-552487427
f
GR
GS
[0.75 0 0 0.75 0 0] CT
1 0 0 RC
1 LJ
0.667 LW
N
781.615 254.235 M
781.56 252.998 L
781.398 251.769 L
781.129 250.559 L
780.755 249.374 L
780.278 248.225 L
779.703 247.119 L
779.033 246.065 L
778.273 245.069 L
777.429 244.139 L
776.506 243.282 L
775.512 242.504 L
774.453 241.81 L
773.337 241.206 L
772.173 240.696 L
770.968 240.284 L
769.731 239.972 L
768.472 239.762 L
767.198 239.657 L
765.921 239.657 L
764.647 239.762 L
763.388 239.972 L
762.151 240.284 L
760.946 240.696 L
759.782 241.206 L
758.666 241.81 L
757.607 242.504 L
756.613 243.282 L
755.691 244.139 L
754.846 245.069 L
754.086 246.065 L
753.416 247.119 L
752.841 248.225 L
752.365 249.374 L
751.99 250.559 L
751.721 251.769 L
751.559 252.998 L
751.505 254.235 L
751.559 255.473 L
751.721 256.701 L
751.99 257.912 L
752.365 259.096 L
752.841 260.246 L
753.416 261.352 L
754.086 262.406 L
754.846 263.402 L
755.691 264.332 L
756.613 265.189 L
757.607 265.967 L
758.666 266.66 L
759.782 267.264 L
760.946 267.775 L
762.151 268.187 L
763.388 268.499 L
764.647 268.709 L
765.921 268.814 L
767.198 268.814 L
768.472 268.709 L
769.731 268.499 L
770.968 268.187 L
772.173 267.775 L
773.337 267.264 L
774.453 266.66 L
775.512 265.967 L
776.506 265.189 L
777.429 264.332 L
778.273 263.402 L
779.033 262.406 L
779.703 261.352 L
780.278 260.246 L
780.755 259.096 L
781.129 257.912 L
781.398 256.701 L
781.56 255.473 L
781.615 254.235 L
cp
S
GR
GS
[0.75 0 0 0.75 0 0] CT
1 0 0 RC
N
/f-1989336440{689.946 594.445 M
690 593.208 L
689.946 591.97 L
689.784 590.742 L
689.514 589.531 L
689.14 588.347 L
688.664 587.198 L
688.088 586.092 L
687.418 585.037 L
686.658 584.041 L
685.814 583.111 L
684.892 582.254 L
683.897 581.476 L
682.839 580.783 L
681.723 580.179 L
680.559 579.669 L
679.354 579.256 L
678.117 578.944 L
676.857 578.734 L
675.584 578.63 L
674.306 578.63 L
673.033 578.734 L
671.773 578.944 L
670.537 579.256 L
669.332 579.669 L
668.167 580.179 L
667.052 580.783 L
665.993 581.476 L
664.999 582.254 L
664.076 583.111 L
663.232 584.041 L
662.472 585.037 L
661.802 586.092 L
661.227 587.198 L
660.75 588.347 L
660.376 589.531 L
660.107 590.742 L
659.944 591.97 L
659.89 593.208 L
659.944 594.445 L
660.107 595.674 L
660.376 596.884 L
660.75 598.069 L
661.227 599.218 L
661.802 600.324 L
662.472 601.378 L
663.232 602.374 L
664.076 603.304 L
664.999 604.161 L
665.993 604.939 L
667.052 605.633 L
668.167 606.237 L
669.332 606.747 L
670.537 607.159 L
671.773 607.472 L
673.033 607.681 L
674.306 607.786 L
675.584 607.786 L
676.857 607.681 L
678.117 607.472 L
679.354 607.159 L
680.559 606.747 L
681.723 606.237 L
682.839 605.633 L
683.897 604.939 L
684.892 604.161 L
685.814 603.304 L
686.658 602.374 L
687.418 601.378 L
688.088 600.324 L
688.664 599.218 L
689.14 598.069 L
689.514 596.884 L
689.784 595.674 L
cp}def
f-1989336440
f
GR
GS
[0.75 0 0 0.75 0 0] CT
1 0 0 RC
1 LJ
0.667 LW
N
690 593.208 M
689.946 591.97 L
689.784 590.742 L
689.514 589.531 L
689.14 588.347 L
688.664 587.198 L
688.088 586.092 L
687.418 585.037 L
686.658 584.041 L
685.814 583.111 L
684.892 582.254 L
683.897 581.476 L
682.839 580.783 L
681.723 580.179 L
680.559 579.669 L
679.354 579.256 L
678.117 578.944 L
676.857 578.734 L
675.584 578.63 L
674.306 578.63 L
673.033 578.734 L
671.773 578.944 L
670.537 579.256 L
669.332 579.669 L
668.167 580.179 L
667.052 580.783 L
665.993 581.476 L
664.999 582.254 L
664.076 583.111 L
663.232 584.041 L
662.472 585.037 L
661.802 586.092 L
661.227 587.198 L
660.75 588.347 L
660.376 589.531 L
660.107 590.742 L
659.944 591.97 L
659.89 593.208 L
659.944 594.445 L
660.107 595.674 L
660.376 596.884 L
660.75 598.069 L
661.227 599.218 L
661.802 600.324 L
662.472 601.378 L
663.232 602.374 L
664.076 603.304 L
664.999 604.161 L
665.993 604.939 L
667.052 605.633 L
668.167 606.237 L
669.332 606.747 L
670.537 607.159 L
671.773 607.472 L
673.033 607.681 L
674.306 607.786 L
675.584 607.786 L
676.857 607.681 L
678.117 607.472 L
679.354 607.159 L
680.559 606.747 L
681.723 606.237 L
682.839 605.633 L
683.897 604.939 L
684.892 604.161 L
685.814 603.304 L
686.658 602.374 L
687.418 601.378 L
688.088 600.324 L
688.664 599.218 L
689.14 598.069 L
689.514 596.884 L
689.784 595.674 L
689.946 594.445 L
690 593.208 L
cp
S
GR
GS
[0.75 0 0 0.75 556.52435 195.96888] CT
N
f-1833028947
f
GR
GS
[0.75 0 0 0.75 556.52435 195.96888] CT
N
/f2029717348{10.161 23.259 M
10.161 22.603 L
16.036 13.837 L
16.098 13.744 16.223 13.744 QT
16.505 13.744 L
16.723 13.744 16.723 13.962 QT
16.723 22.603 L
18.583 22.603 L
18.583 23.259 L
16.723 23.259 L
16.723 25.134 L
16.723 25.525 17.278 25.626 QT
17.833 25.728 18.567 25.728 QT
18.567 26.4 L
13.333 26.4 L
13.333 25.728 L
14.067 25.728 14.622 25.626 QT
15.177 25.525 15.177 25.134 QT
15.177 23.259 L
10.161 23.259 L
cp
10.786 22.603 M
15.286 22.603 L
15.286 15.869 L
10.786 22.603 L
cp}def
f2029717348
f
GR
GS
[0.75 0 0 0.75 476.64807 413.87965] CT
N
f-1833028947
f
GR
GS
[0.75 0 0 0.75 476.64807 413.87965] CT
N
/f369414846{11.286 24.244 M
11.473 24.79 11.88 25.244 QT
12.286 25.697 12.833 25.955 QT
13.38 26.212 13.973 26.212 QT
15.348 26.212 15.872 25.15 QT
16.395 24.087 16.395 22.556 QT
16.395 21.9 16.372 21.447 QT
16.348 20.994 16.239 20.587 QT
16.067 19.915 15.63 19.415 QT
15.192 18.915 14.552 18.915 QT
13.911 18.915 13.45 19.111 QT
12.989 19.306 12.7 19.564 QT
12.411 19.822 12.192 20.111 QT
11.973 20.4 11.911 20.415 QT
11.692 20.415 L
11.645 20.415 11.583 20.353 QT
11.52 20.29 11.52 20.244 QT
11.52 13.9 L
11.52 13.853 11.575 13.798 QT
11.63 13.744 11.692 13.744 QT
11.755 13.744 L
13.036 14.353 14.473 14.353 QT
15.88 14.353 17.192 13.744 QT
17.239 13.744 L
17.317 13.744 17.372 13.79 QT
17.427 13.837 17.427 13.9 QT
17.427 14.072 L
17.427 14.165 17.38 14.165 QT
16.739 15.025 15.762 15.509 QT
14.786 15.994 13.723 15.994 QT
12.973 15.994 12.177 15.775 QT
12.177 19.369 L
12.802 18.853 13.302 18.634 QT
13.802 18.415 14.567 18.415 QT
15.614 18.415 16.442 19.025 QT
17.27 19.634 17.716 20.603 QT
18.161 21.572 18.161 22.572 QT
18.161 23.712 17.598 24.689 QT
17.036 25.665 16.075 26.244 QT
15.114 26.822 13.973 26.822 QT
13.052 26.822 12.262 26.337 QT
11.473 25.853 11.028 25.033 QT
10.583 24.212 10.583 23.306 QT
10.583 22.869 10.856 22.603 QT
11.13 22.337 11.552 22.337 QT
11.973 22.337 12.255 22.611 QT
12.536 22.884 12.536 23.306 QT
12.536 23.712 12.255 23.994 QT
11.973 24.275 11.552 24.275 QT
11.489 24.275 11.403 24.259 QT
11.317 24.244 11.286 24.244 QT
cp}def
f369414846
f
GR
GS
[0.75 0 0 0.75 0 0] CT
1 GC
N
/f-396759090{498.986 401 M
498.986 433 L
523 433 L
523 401 L
cp}def
f-396759090
f
GR
GS
[0.75 0 0 0.75 0 0] CT
0.494 GC
[1 3] 0 setdash
2 LJ
0.667 LW
N
510 438.732 M
510 378 L
S
GR
%%Trailer
%%Pages: 1
%%EOF
