%!PS-Adobe-3.0 EPSF-3.0
%%Creator: (MATLAB, The Mathworks, Inc. Version 9.5.0.944444 \(R2018b\). Operating System: Windows 10)
%%Title: C:/Users/navsas/Dropbox/AggregateCooperativeImprovement.eps
%%CreationDate: 2019-06-20T11:08:50
%%Pages: (atend)
%%BoundingBox: 0 0 801 447
%%LanguageLevel: 3
%%EndComments
%%BeginProlog
%%BeginResource: procset (Apache XML Graphics Std ProcSet) 1.2 0
%%Version: 1.2 0
%%Copyright: (Copyright 2001-2003,2010 The Apache Software Foundation. License terms: http://www.apache.org/licenses/LICENSE-2.0)
/bd{bind def}bind def
/ld{load def}bd
/GR/grestore ld
/GS/gsave ld
/RM/rmoveto ld
/C/curveto ld
/t/show ld
/L/lineto ld
/ML/setmiterlimit ld
/CT/concat ld
/f/fill ld
/N/newpath ld
/S/stroke ld
/CC/setcmykcolor ld
/A/ashow ld
/cp/closepath ld
/RC/setrgbcolor ld
/LJ/setlinejoin ld
/GC/setgray ld
/LW/setlinewidth ld
/M/moveto ld
/re {4 2 roll M
1 index 0 rlineto
0 exch rlineto
neg 0 rlineto
cp } bd
/_ctm matrix def
/_tm matrix def
/BT { _ctm currentmatrix pop matrix _tm copy pop 0 0 moveto } bd
/ET { _ctm setmatrix } bd
/iTm { _ctm setmatrix _tm concat } bd
/Tm { _tm astore pop iTm 0 0 moveto } bd
/ux 0.0 def
/uy 0.0 def
/F {
  /Tp exch def
  /Tf exch def
  Tf findfont Tp scalefont setfont
  /cf Tf def  /cs Tp def
} bd
/ULS {currentpoint /uy exch def /ux exch def} bd
/ULE {
  /Tcx currentpoint pop def
  gsave
  newpath
  cf findfont cs scalefont dup
  /FontMatrix get 0 get /Ts exch def /FontInfo get dup
  /UnderlinePosition get Ts mul /To exch def
  /UnderlineThickness get Ts mul /Tt exch def
  ux uy To add moveto  Tcx uy To add lineto
  Tt setlinewidth stroke
  grestore
} bd
/OLE {
  /Tcx currentpoint pop def
  gsave
  newpath
  cf findfont cs scalefont dup
  /FontMatrix get 0 get /Ts exch def /FontInfo get dup
  /UnderlinePosition get Ts mul /To exch def
  /UnderlineThickness get Ts mul /Tt exch def
  ux uy To add cs add moveto Tcx uy To add cs add lineto
  Tt setlinewidth stroke
  grestore
} bd
/SOE {
  /Tcx currentpoint pop def
  gsave
  newpath
  cf findfont cs scalefont dup
  /FontMatrix get 0 get /Ts exch def /FontInfo get dup
  /UnderlinePosition get Ts mul /To exch def
  /UnderlineThickness get Ts mul /Tt exch def
  ux uy To add cs 10 mul 26 idiv add moveto Tcx uy To add cs 10 mul 26 idiv add lineto
  Tt setlinewidth stroke
  grestore
} bd
/QT {
/Y22 exch store
/X22 exch store
/Y21 exch store
/X21 exch store
currentpoint
/Y21 load 2 mul add 3 div exch
/X21 load 2 mul add 3 div exch
/X21 load 2 mul /X22 load add 3 div
/Y21 load 2 mul /Y22 load add 3 div
/X22 load /Y22 load curveto
} bd
/SSPD {
dup length /d exch dict def
{
/v exch def
/k exch def
currentpagedevice k known {
/cpdv currentpagedevice k get def
v cpdv ne {
/upd false def
/nullv v type /nulltype eq def
/nullcpdv cpdv type /nulltype eq def
nullv nullcpdv or
{
/upd true def
} {
/sametype v type cpdv type eq def
sametype {
v type /arraytype eq {
/vlen v length def
/cpdvlen cpdv length def
vlen cpdvlen eq {
0 1 vlen 1 sub {
/i exch def
/obj v i get def
/cpdobj cpdv i get def
obj cpdobj ne {
/upd true def
exit
} if
} for
} {
/upd true def
} ifelse
} {
v type /dicttype eq {
v {
/dv exch def
/dk exch def
/cpddv cpdv dk get def
dv cpddv ne {
/upd true def
exit
} if
} forall
} {
/upd true def
} ifelse
} ifelse
} if
} ifelse
upd true eq {
d k v put
} if
} if
} if
} forall
d length 0 gt {
d setpagedevice
} if
} bd
/RE { % /NewFontName [NewEncodingArray] /FontName RE -
  findfont dup length dict begin
  {
    1 index /FID ne
    {def} {pop pop} ifelse
  } forall
  /Encoding exch def
  /FontName 1 index def
  currentdict definefont pop
  end
} bind def
%%EndResource
%%BeginResource: procset (Apache XML Graphics EPS ProcSet) 1.0 0
%%Version: 1.0 0
%%Copyright: (Copyright 2002-2003 The Apache Software Foundation. License terms: http://www.apache.org/licenses/LICENSE-2.0)
/BeginEPSF { %def
/b4_Inc_state save def         % Save state for cleanup
/dict_count countdictstack def % Count objects on dict stack
/op_count count 1 sub def      % Count objects on operand stack
userdict begin                 % Push userdict on dict stack
/showpage { } def              % Redefine showpage, { } = null proc
0 setgray 0 setlinecap         % Prepare graphics state
1 setlinewidth 0 setlinejoin
10 setmiterlimit [ ] 0 setdash newpath
/languagelevel where           % If level not equal to 1 then
{pop languagelevel             % set strokeadjust and
1 ne                           % overprint to their defaults.
{false setstrokeadjust false setoverprint
} if
} if
} bd
/EndEPSF { %def
count op_count sub {pop} repeat            % Clean up stacks
countdictstack dict_count sub {end} repeat
b4_Inc_state restore
} bd
%%EndResource
%FOPBeginFontDict
%%IncludeResource: font Courier-Oblique
%%IncludeResource: font Courier-BoldOblique
%%IncludeResource: font Courier-Bold
%%IncludeResource: font ZapfDingbats
%%IncludeResource: font Symbol
%%IncludeResource: font Helvetica
%%IncludeResource: font Helvetica-Oblique
%%IncludeResource: font Helvetica-Bold
%%IncludeResource: font Helvetica-BoldOblique
%%IncludeResource: font Times-Roman
%%IncludeResource: font Times-Italic
%%IncludeResource: font Times-Bold
%%IncludeResource: font Times-BoldItalic
%%IncludeResource: font Courier
%FOPEndFontDict
%%BeginResource: encoding WinAnsiEncoding
/WinAnsiEncoding [
/.notdef /.notdef /.notdef /.notdef /.notdef
/.notdef /.notdef /.notdef /.notdef /.notdef
/.notdef /.notdef /.notdef /.notdef /.notdef
/.notdef /.notdef /.notdef /.notdef /.notdef
/.notdef /.notdef /.notdef /.notdef /.notdef
/.notdef /.notdef /.notdef /.notdef /.notdef
/.notdef /.notdef /space /exclam /quotedbl
/numbersign /dollar /percent /ampersand /quotesingle
/parenleft /parenright /asterisk /plus /comma
/hyphen /period /slash /zero /one
/two /three /four /five /six
/seven /eight /nine /colon /semicolon
/less /equal /greater /question /at
/A /B /C /D /E
/F /G /H /I /J
/K /L /M /N /O
/P /Q /R /S /T
/U /V /W /X /Y
/Z /bracketleft /backslash /bracketright /asciicircum
/underscore /quoteleft /a /b /c
/d /e /f /g /h
/i /j /k /l /m
/n /o /p /q /r
/s /t /u /v /w
/x /y /z /braceleft /bar
/braceright /asciitilde /bullet /Euro /bullet
/quotesinglbase /florin /quotedblbase /ellipsis /dagger
/daggerdbl /circumflex /perthousand /Scaron /guilsinglleft
/OE /bullet /Zcaron /bullet /bullet
/quoteleft /quoteright /quotedblleft /quotedblright /bullet
/endash /emdash /asciitilde /trademark /scaron
/guilsinglright /oe /bullet /zcaron /Ydieresis
/space /exclamdown /cent /sterling /currency
/yen /brokenbar /section /dieresis /copyright
/ordfeminine /guillemotleft /logicalnot /sfthyphen /registered
/macron /degree /plusminus /twosuperior /threesuperior
/acute /mu /paragraph /middot /cedilla
/onesuperior /ordmasculine /guillemotright /onequarter /onehalf
/threequarters /questiondown /Agrave /Aacute /Acircumflex
/Atilde /Adieresis /Aring /AE /Ccedilla
/Egrave /Eacute /Ecircumflex /Edieresis /Igrave
/Iacute /Icircumflex /Idieresis /Eth /Ntilde
/Ograve /Oacute /Ocircumflex /Otilde /Odieresis
/multiply /Oslash /Ugrave /Uacute /Ucircumflex
/Udieresis /Yacute /Thorn /germandbls /agrave
/aacute /acircumflex /atilde /adieresis /aring
/ae /ccedilla /egrave /eacute /ecircumflex
/edieresis /igrave /iacute /icircumflex /idieresis
/eth /ntilde /ograve /oacute /ocircumflex
/otilde /odieresis /divide /oslash /ugrave
/uacute /ucircumflex /udieresis /yacute /thorn
/ydieresis
] def
%%EndResource
%FOPBeginFontReencode
/Courier-Oblique findfont
dup length dict begin
  {1 index /FID ne {def} {pop pop} ifelse} forall
  /Encoding WinAnsiEncoding def
  currentdict
end
/Courier-Oblique exch definefont pop
/Courier-BoldOblique findfont
dup length dict begin
  {1 index /FID ne {def} {pop pop} ifelse} forall
  /Encoding WinAnsiEncoding def
  currentdict
end
/Courier-BoldOblique exch definefont pop
/Courier-Bold findfont
dup length dict begin
  {1 index /FID ne {def} {pop pop} ifelse} forall
  /Encoding WinAnsiEncoding def
  currentdict
end
/Courier-Bold exch definefont pop
/Helvetica findfont
dup length dict begin
  {1 index /FID ne {def} {pop pop} ifelse} forall
  /Encoding WinAnsiEncoding def
  currentdict
end
/Helvetica exch definefont pop
/Helvetica-Oblique findfont
dup length dict begin
  {1 index /FID ne {def} {pop pop} ifelse} forall
  /Encoding WinAnsiEncoding def
  currentdict
end
/Helvetica-Oblique exch definefont pop
/Helvetica-Bold findfont
dup length dict begin
  {1 index /FID ne {def} {pop pop} ifelse} forall
  /Encoding WinAnsiEncoding def
  currentdict
end
/Helvetica-Bold exch definefont pop
/Helvetica-BoldOblique findfont
dup length dict begin
  {1 index /FID ne {def} {pop pop} ifelse} forall
  /Encoding WinAnsiEncoding def
  currentdict
end
/Helvetica-BoldOblique exch definefont pop
/Times-Roman findfont
dup length dict begin
  {1 index /FID ne {def} {pop pop} ifelse} forall
  /Encoding WinAnsiEncoding def
  currentdict
end
/Times-Roman exch definefont pop
/Times-Italic findfont
dup length dict begin
  {1 index /FID ne {def} {pop pop} ifelse} forall
  /Encoding WinAnsiEncoding def
  currentdict
end
/Times-Italic exch definefont pop
/Times-Bold findfont
dup length dict begin
  {1 index /FID ne {def} {pop pop} ifelse} forall
  /Encoding WinAnsiEncoding def
  currentdict
end
/Times-Bold exch definefont pop
/Times-BoldItalic findfont
dup length dict begin
  {1 index /FID ne {def} {pop pop} ifelse} forall
  /Encoding WinAnsiEncoding def
  currentdict
end
/Times-BoldItalic exch definefont pop
/Courier findfont
dup length dict begin
  {1 index /FID ne {def} {pop pop} ifelse} forall
  /Encoding WinAnsiEncoding def
  currentdict
end
/Courier exch definefont pop
%FOPEndFontReencode
%%EndProlog
%%Page: 1 1
%%PageBoundingBox: 0 0 801 447
%%BeginPageSetup
[1 0 0 -1 0 447] CT
%%EndPageSetup
GS
[0.75 0 0 0.75 0 0] CT
1 GC
N
0 0 1068 596 re
f
GR
GS
[0.75 0 0 0.75 0 0] CT
1 GC
N
0 0 1068 596 re
f
GR
GS
[0.75 0 0 0.75 0 0] CT
1 GC
N
73 530 M
509 530 L
509 45 L
73 45 L
cp
f
GR
GS
[0.75 0 0 0.75 217.63062 30.1683] CT
/Helvetica 23.467 F
GS
[1 0 0 1 0 0] CT
-218 -6 moveto 
1 -1 scale
(High-relative dynamics test case [5-160 s]) t 
GR
GR
GS
[0.75 0 0 0.75 0 0] CT
0.149 GC
1 LJ
0.667 LW
N
73 530 M
509 530 L
S
GR
GS
[0.75 0 0 0.75 0 0] CT
0.851 0.325 0.098 RC
N
108.511 530 M
108.511 205.332 L
88.783 205.332 L
88.783 530 L
cp
217.018 530 M
217.018 407.884 L
197.29 407.884 L
197.29 530 L
cp
325.525 530 M
325.525 419.341 L
305.796 419.341 L
305.796 530 L
cp
434.032 530 M
434.032 466.365 L
414.303 466.365 L
414.303 530 L
cp
f
GR
GS
[0.75 0 0 0.75 0 0] CT
10.0 ML
0.667 LW
N
88.783 530 M
88.783 205.332 L
108.511 205.332 L
108.511 530 L
cp
S
GR
GS
[0.75 0 0 0.75 0 0] CT
10.0 ML
0.667 LW
N
197.29 530 M
197.29 407.884 L
217.018 407.884 L
217.018 530 L
cp
S
GR
GS
[0.75 0 0 0.75 0 0] CT
10.0 ML
0.667 LW
N
305.796 530 M
305.796 419.341 L
325.525 419.341 L
325.525 530 L
cp
S
GR
GS
[0.75 0 0 0.75 0 0] CT
10.0 ML
0.667 LW
N
414.303 530 M
414.303 466.365 L
434.032 466.365 L
434.032 530 L
cp
S
GR
GS
[0.75 0 0 0.75 0 0] CT
0.929 0.694 0.125 RC
N
128.24 530 M
128.24 48.656 L
108.511 48.656 L
108.511 530 L
cp
236.747 530 M
236.747 306.347 L
217.018 306.347 L
217.018 530 L
cp
345.253 530 M
345.253 316.845 L
325.525 316.845 L
325.525 530 L
cp
453.76 530 M
453.76 417.815 L
434.032 417.815 L
434.032 530 L
cp
f
GR
GS
[0.75 0 0 0.75 0 0] CT
10.0 ML
0.667 LW
N
108.511 530 M
108.511 48.656 L
128.24 48.656 L
128.24 530 L
cp
S
GR
GS
[0.75 0 0 0.75 0 0] CT
10.0 ML
0.667 LW
N
217.018 530 M
217.018 306.347 L
236.747 306.347 L
236.747 530 L
cp
S
GR
GS
[0.75 0 0 0.75 0 0] CT
10.0 ML
0.667 LW
N
325.525 530 M
325.525 316.845 L
345.253 316.845 L
345.253 530 L
cp
S
GR
GS
[0.75 0 0 0.75 0 0] CT
10.0 ML
0.667 LW
N
434.032 530 M
434.032 417.815 L
453.76 417.815 L
453.76 530 L
cp
S
GR
GS
[0.75 0 0 0.75 0 0] CT
1 0.843 0 RC
N
147.968 530 M
147.968 58.52 L
128.24 58.52 L
128.24 530 L
cp
256.475 530 M
256.475 258.627 L
236.747 258.627 L
236.747 530 L
cp
364.982 530 M
364.982 269.136 L
345.253 269.136 L
345.253 530 L
cp
473.489 530 M
473.489 391.109 L
453.76 391.109 L
453.76 530 L
cp
f
GR
GS
[0.75 0 0 0.75 0 0] CT
10.0 ML
0.667 LW
N
128.24 530 M
128.24 58.52 L
147.968 58.52 L
147.968 530 L
cp
S
GR
GS
[0.75 0 0 0.75 0 0] CT
10.0 ML
0.667 LW
N
236.747 530 M
236.747 258.627 L
256.475 258.627 L
256.475 530 L
cp
S
GR
GS
[0.75 0 0 0.75 0 0] CT
10.0 ML
0.667 LW
N
345.253 530 M
345.253 269.136 L
364.982 269.136 L
364.982 530 L
cp
S
GR
GS
[0.75 0 0 0.75 0 0] CT
10.0 ML
0.667 LW
N
453.76 530 M
453.76 391.109 L
473.489 391.109 L
473.489 530 L
cp
S
GR
GS
[0.75 0 0 0.75 0 0] CT
0.953 0.871 0.733 RC
N
167.697 530 M
167.697 83.585 L
147.968 83.585 L
147.968 530 L
cp
276.204 530 M
276.204 232.469 L
256.475 232.469 L
256.475 530 L
cp
384.71 530 M
384.71 238.097 L
364.982 238.097 L
364.982 530 L
cp
493.217 530 M
493.217 381.435 L
473.489 381.435 L
473.489 530 L
cp
f
GR
GS
[0.75 0 0 0.75 0 0] CT
10.0 ML
0.667 LW
N
147.968 530 M
147.968 83.585 L
167.697 83.585 L
167.697 530 L
cp
S
GR
GS
[0.75 0 0 0.75 0 0] CT
10.0 ML
0.667 LW
N
256.475 530 M
256.475 232.469 L
276.204 232.469 L
276.204 530 L
cp
S
GR
GS
[0.75 0 0 0.75 0 0] CT
10.0 ML
0.667 LW
N
364.982 530 M
364.982 238.097 L
384.71 238.097 L
384.71 530 L
cp
S
GR
GS
[0.75 0 0 0.75 0 0] CT
10.0 ML
0.667 LW
N
473.489 530 M
473.489 381.435 L
493.217 381.435 L
493.217 530 L
cp
S
GR
GS
[0.75 0 0 0.75 0 0] CT
0.149 GC
2 setlinecap
1 LJ
0.667 LW
N
73 530 M
509 530 L
S
GR
GS
[0.75 0 0 0.75 0 0] CT
0.149 GC
2 setlinecap
1 LJ
0.667 LW
N
73 45 M
509 45 L
S
GR
GS
[0.75 0 0 0.75 0 0] CT
0.149 GC
2 setlinecap
1 LJ
0.667 LW
N
128.24 530 M
128.24 525.15 L
S
GR
GS
[0.75 0 0 0.75 0 0] CT
0.149 GC
2 setlinecap
1 LJ
0.667 LW
N
236.747 530 M
236.747 525.15 L
S
GR
GS
[0.75 0 0 0.75 0 0] CT
0.149 GC
2 setlinecap
1 LJ
0.667 LW
N
345.253 530 M
345.253 525.15 L
S
GR
GS
[0.75 0 0 0.75 0 0] CT
0.149 GC
2 setlinecap
1 LJ
0.667 LW
N
453.76 530 M
453.76 525.15 L
S
GR
GS
[0.75 0 0 0.75 0 0] CT
0.149 GC
2 setlinecap
1 LJ
0.667 LW
N
128.24 45 M
128.24 49.85 L
S
GR
GS
[0.75 0 0 0.75 0 0] CT
0.149 GC
2 setlinecap
1 LJ
0.667 LW
N
236.747 45 M
236.747 49.85 L
S
GR
GS
[0.75 0 0 0.75 0 0] CT
0.149 GC
2 setlinecap
1 LJ
0.667 LW
N
345.253 45 M
345.253 49.85 L
S
GR
GS
[0.75 0 0 0.75 0 0] CT
0.149 GC
2 setlinecap
1 LJ
0.667 LW
N
453.76 45 M
453.76 49.85 L
S
GR
GS
[0.75 0 0 0.75 96.17987 402.70001] CT
0.149 GC
/Helvetica 21.333 F
GS
[1 0 0 1 0 0] CT
-6 22 moveto 
1 -1 scale
(4) t 
GR
GR
GS
[0.75 0 0 0.75 177.55996 402.70001] CT
0.149 GC
/Helvetica 21.333 F
GS
[1 0 0 1 0 0] CT
-6 22 moveto 
1 -1 scale
(6) t 
GR
GR
GS
[0.75 0 0 0.75 258.94004 402.70001] CT
0.149 GC
/Helvetica 21.333 F
GS
[1 0 0 1 0 0] CT
-6 22 moveto 
1 -1 scale
(8) t 
GR
GR
GS
[0.75 0 0 0.75 340.32014 402.70001] CT
0.149 GC
/Helvetica 21.333 F
GS
[1 0 0 1 0 0] CT
-12 22 moveto 
1 -1 scale
(10) t 
GR
GR
GS
[0.75 0 0 0.75 218.25016 418.35086] CT
0.149 GC
N
-6.465 20.212 M
-6.527 20.212 -6.59 20.134 QT
-6.652 20.056 -6.652 19.993 QT
-5.324 14.618 L
-5.277 14.493 -5.137 14.493 QT
-4.855 14.493 L
-4.777 14.493 -4.723 14.556 QT
-4.668 14.618 -4.668 14.728 QT
-4.855 15.509 -4.855 16.134 QT
-4.855 17.79 -3.715 18.603 QT
-2.574 19.415 -0.824 19.415 QT
-0.074 19.415 0.652 19.04 QT
1.379 18.665 1.926 18.071 QT
2.473 17.478 2.801 16.743 QT
3.129 16.009 3.129 15.259 QT
3.129 14.446 2.699 13.813 QT
2.27 13.181 1.52 12.993 QT
-1.293 12.259 L
-2.418 11.946 -3.098 11.032 QT
-3.777 10.118 -3.777 8.978 QT
-3.777 7.587 -2.957 6.313 QT
-2.137 5.04 -0.816 4.267 QT
0.504 3.493 1.879 3.493 QT
2.926 3.493 3.809 3.884 QT
4.691 4.274 5.16 5.118 QT
6.488 3.556 L
6.613 3.493 6.645 3.493 QT
6.785 3.493 L
6.879 3.493 6.934 3.571 QT
6.988 3.649 6.988 3.728 QT
5.645 9.071 L
5.613 9.228 5.473 9.228 QT
5.191 9.228 L
4.988 9.228 4.988 8.978 QT
5.098 8.243 5.098 7.712 QT
5.098 6.634 4.73 5.845 QT
4.363 5.056 3.629 4.649 QT
2.895 4.243 1.816 4.243 QT
0.895 4.243 -0.02 4.767 QT
-0.934 5.29 -1.496 6.165 QT
-2.059 7.04 -2.059 7.993 QT
-2.059 8.728 -1.621 9.298 QT
-1.184 9.868 -0.465 10.071 QT
2.332 10.806 L
3.098 11.009 3.668 11.517 QT
4.238 12.024 4.527 12.728 QT
4.816 13.431 4.816 14.259 QT
4.816 15.353 4.355 16.415 QT
3.895 17.478 3.074 18.353 QT
2.254 19.228 1.207 19.72 QT
0.16 20.212 -0.934 20.212 QT
-3.668 20.212 -4.855 18.618 QT
-6.137 20.149 L
-6.277 20.212 -6.309 20.212 QT
-6.465 20.212 L
cp
f
GR
GS
[0.75 0 0 0.75 0 0] CT
0.149 GC
2 setlinecap
1 LJ
0.667 LW
N
73 530 M
73 45 L
S
GR
GS
[0.75 0 0 0.75 0 0] CT
0.149 GC
2 setlinecap
1 LJ
0.667 LW
N
509 530 M
509 45 L
S
GR
GS
[0.75 0 0 0.75 0 0] CT
0.149 GC
2 setlinecap
1 LJ
0.667 LW
N
73 530 M
77.85 530 L
S
GR
GS
[0.75 0 0 0.75 0 0] CT
0.149 GC
2 setlinecap
1 LJ
0.667 LW
N
73 469.375 M
77.85 469.375 L
S
GR
GS
[0.75 0 0 0.75 0 0] CT
0.149 GC
2 setlinecap
1 LJ
0.667 LW
N
73 408.75 M
77.85 408.75 L
S
GR
GS
[0.75 0 0 0.75 0 0] CT
0.149 GC
2 setlinecap
1 LJ
0.667 LW
N
73 348.125 M
77.85 348.125 L
S
GR
GS
[0.75 0 0 0.75 0 0] CT
0.149 GC
2 setlinecap
1 LJ
0.667 LW
N
73 287.5 M
77.85 287.5 L
S
GR
GS
[0.75 0 0 0.75 0 0] CT
0.149 GC
2 setlinecap
1 LJ
0.667 LW
N
73 226.875 M
77.85 226.875 L
S
GR
GS
[0.75 0 0 0.75 0 0] CT
0.149 GC
2 setlinecap
1 LJ
0.667 LW
N
73 166.25 M
77.85 166.25 L
S
GR
GS
[0.75 0 0 0.75 0 0] CT
0.149 GC
2 setlinecap
1 LJ
0.667 LW
N
73 105.625 M
77.85 105.625 L
S
GR
GS
[0.75 0 0 0.75 0 0] CT
0.149 GC
2 setlinecap
1 LJ
0.667 LW
N
73 45 M
77.85 45 L
S
GR
GS
[0.75 0 0 0.75 0 0] CT
0.149 GC
2 setlinecap
1 LJ
0.667 LW
N
509 530 M
504.15 530 L
S
GR
GS
[0.75 0 0 0.75 0 0] CT
0.149 GC
2 setlinecap
1 LJ
0.667 LW
N
509 469.375 M
504.15 469.375 L
S
GR
GS
[0.75 0 0 0.75 0 0] CT
0.149 GC
2 setlinecap
1 LJ
0.667 LW
N
509 408.75 M
504.15 408.75 L
S
GR
GS
[0.75 0 0 0.75 0 0] CT
0.149 GC
2 setlinecap
1 LJ
0.667 LW
N
509 348.125 M
504.15 348.125 L
S
GR
GS
[0.75 0 0 0.75 0 0] CT
0.149 GC
2 setlinecap
1 LJ
0.667 LW
N
509 287.5 M
504.15 287.5 L
S
GR
GS
[0.75 0 0 0.75 0 0] CT
0.149 GC
2 setlinecap
1 LJ
0.667 LW
N
509 226.875 M
504.15 226.875 L
S
GR
GS
[0.75 0 0 0.75 0 0] CT
0.149 GC
2 setlinecap
1 LJ
0.667 LW
N
509 166.25 M
504.15 166.25 L
S
GR
GS
[0.75 0 0 0.75 0 0] CT
0.149 GC
2 setlinecap
1 LJ
0.667 LW
N
509 105.625 M
504.15 105.625 L
S
GR
GS
[0.75 0 0 0.75 0 0] CT
0.149 GC
2 setlinecap
1 LJ
0.667 LW
N
509 45 M
504.15 45 L
S
GR
GS
[0.75 0 0 0.75 49.55 397.5] CT
0.149 GC
/Helvetica 21.333 F
GS
[1 0 0 1 0 0] CT
-12 8.5 moveto 
1 -1 scale
(0) t 
GR
GR
GS
[0.75 0 0 0.75 49.55 352.03125] CT
0.149 GC
/Helvetica 21.333 F
GS
[1 0 0 1 0 0] CT
-12 8.5 moveto 
1 -1 scale
(5) t 
GR
GR
GS
[0.75 0 0 0.75 49.55 306.5625] CT
0.149 GC
/Helvetica 21.333 F
GS
[1 0 0 1 0 0] CT
-24 8.5 moveto 
1 -1 scale
(10) t 
GR
GR
GS
[0.75 0 0 0.75 49.55 261.09375] CT
0.149 GC
/Helvetica 21.333 F
GS
[1 0 0 1 0 0] CT
-24 8.5 moveto 
1 -1 scale
(15) t 
GR
GR
GS
[0.75 0 0 0.75 49.55 215.625] CT
0.149 GC
/Helvetica 21.333 F
GS
[1 0 0 1 0 0] CT
-24 8.5 moveto 
1 -1 scale
(20) t 
GR
GR
GS
[0.75 0 0 0.75 49.55 170.15625] CT
0.149 GC
/Helvetica 21.333 F
GS
[1 0 0 1 0 0] CT
-24 8.5 moveto 
1 -1 scale
(25) t 
GR
GR
GS
[0.75 0 0 0.75 49.55 124.6875] CT
0.149 GC
/Helvetica 21.333 F
GS
[1 0 0 1 0 0] CT
-24 8.5 moveto 
1 -1 scale
(30) t 
GR
GR
GS
[0.75 0 0 0.75 49.55 79.21875] CT
0.149 GC
/Helvetica 21.333 F
GS
[1 0 0 1 0 0] CT
-24 8.5 moveto 
1 -1 scale
(35) t 
GR
GR
GS
[0.75 0 0 0.75 49.55 33.75] CT
0.149 GC
/Helvetica 21.333 F
GS
[1 0 0 1 0 0] CT
-24 8.5 moveto 
1 -1 scale
(40) t 
GR
GR
GS
[0 -0.75 0.75 0 28.55 215.62482] CT
0.149 GC
N
-5.09 -8.448 M
-5.371 -8.448 -5.371 -8.745 QT
-3.402 -16.573 L
-3.324 -16.964 -3.293 -17.182 QT
-3.293 -17.557 -4.793 -17.557 QT
-5.027 -17.557 -5.027 -17.854 QT
-5.012 -17.917 -4.973 -18.065 QT
-4.934 -18.214 -4.871 -18.292 QT
-4.809 -18.37 -4.699 -18.37 QT
-1.605 -18.604 L
-1.324 -18.604 -1.324 -18.323 QT
-3.574 -9.307 L
-1.762 -9.901 -0.23 -11.198 QT
1.301 -12.495 2.363 -14.245 QT
3.426 -15.995 3.895 -17.886 QT
3.988 -18.214 4.262 -18.409 QT
4.535 -18.604 4.863 -18.604 QT
5.176 -18.604 5.363 -18.425 QT
5.551 -18.245 5.551 -17.948 QT
5.551 -17.573 5.246 -16.815 QT
4.941 -16.057 4.66 -15.464 QT
3.738 -13.667 2.238 -12.151 QT
1.301 -11.214 0.215 -10.479 QT
-0.871 -9.745 -2.051 -9.237 QT
-3.23 -8.729 -4.543 -8.448 QT
-5.09 -8.448 L
cp
f
GR
GS
[0.75 0 0 0.75 0 0] CT
1 GC
N
498 164 M
498 56 L
391 56 L
391 164 L
cp
f
GR
GS
[0.75 0 0 0.75 328.53818 53.11029] CT
N
3.063 0.589 M
3.063 1.854 3.555 2.807 QT
4.047 3.761 4.969 4.3 QT
5.891 4.839 7.156 4.839 QT
8.484 4.839 9.711 4.167 QT
10.938 3.495 11.797 2.362 QT
12.656 1.229 12.984 -0.052 QT
13.016 -0.177 13.141 -0.177 QT
13.406 -0.177 L
13.484 -0.177 13.539 -0.114 QT
13.594 -0.052 13.594 0.011 QT
13.594 0.026 13.563 0.073 QT
13.203 1.526 12.172 2.807 QT
11.141 4.089 9.711 4.839 QT
8.281 5.589 6.75 5.589 QT
5.109 5.589 3.813 4.846 QT
2.516 4.104 1.789 2.792 QT
1.063 1.479 1.063 -0.177 QT
1.063 -1.943 1.852 -3.669 QT
2.641 -5.396 3.977 -6.739 QT
5.313 -8.083 7.016 -8.888 QT
8.719 -9.693 10.484 -9.693 QT
11.172 -9.693 11.813 -9.482 QT
12.453 -9.271 12.992 -8.841 QT
13.531 -8.411 13.891 -7.849 QT
15.547 -9.646 L
15.547 -9.693 15.641 -9.693 QT
15.766 -9.693 L
15.859 -9.693 15.906 -9.614 QT
15.953 -9.536 15.953 -9.474 QT
14.531 -3.802 L
14.531 -3.661 14.359 -3.661 QT
13.984 -3.661 L
13.828 -3.661 13.828 -3.896 QT
13.906 -4.349 13.906 -5.005 QT
13.906 -6.021 13.555 -6.935 QT
13.203 -7.849 12.469 -8.396 QT
11.734 -8.943 10.688 -8.943 QT
8.969 -8.943 7.547 -8.083 QT
6.125 -7.224 5.133 -5.825 QT
4.141 -4.427 3.602 -2.716 QT
3.063 -1.005 3.063 0.589 QT
cp
f
GR
GS
[0.75 0 0 0.75 328.53818 53.11029] CT
N
24.277 2.323 M
24.105 2.323 23.988 2.19 QT
23.871 2.057 23.871 1.917 QT
23.871 1.729 23.988 1.612 QT
24.105 1.495 24.277 1.495 QT
37.465 1.495 L
37.621 1.495 37.73 1.612 QT
37.84 1.729 37.84 1.917 QT
37.84 2.057 37.73 2.19 QT
37.621 2.323 37.465 2.323 QT
24.277 2.323 L
cp
24.277 -1.755 M
24.105 -1.755 23.988 -1.872 QT
23.871 -1.989 23.871 -2.177 QT
23.871 -2.318 23.988 -2.458 QT
24.105 -2.599 24.277 -2.599 QT
37.465 -2.599 L
37.621 -2.599 37.73 -2.458 QT
37.84 -2.318 37.84 -2.177 QT
37.84 -1.989 37.73 -1.872 QT
37.621 -1.755 37.465 -1.755 QT
24.277 -1.755 L
cp
f
GR
GS
[0.75 0 0 0.75 328.53818 53.11029] CT
N
47.171 5.12 M
47.171 4.386 L
49.796 4.386 49.796 3.714 QT
49.796 -7.302 L
48.702 -6.786 47.046 -6.786 QT
47.046 -7.521 L
49.624 -7.521 50.936 -8.864 QT
51.233 -8.864 L
51.296 -8.864 51.366 -8.81 QT
51.436 -8.755 51.436 -8.677 QT
51.436 3.714 L
51.436 4.386 54.061 4.386 QT
54.061 5.12 L
47.171 5.12 L
cp
f
GR
GS
[0.75 0 0 0.75 0 0] CT
0.851 0.325 0.098 RC
N
435.048 80.423 M
435.048 61.205 L
395.004 61.205 L
395.004 80.423 L
cp
f
GR
GS
[0.75 0 0 0.75 0 0] CT
10.0 ML
0.667 LW
N
395.004 80.423 M
395.004 61.205 L
435.048 61.205 L
435.048 80.423 L
cp
S
GR
GS
[0.75 0 0 0.75 328.53818 72.70343] CT
N
/f-4508157{3.063 0.589 M
3.063 1.854 3.555 2.807 QT
4.047 3.761 4.969 4.3 QT
5.891 4.839 7.156 4.839 QT
8.484 4.839 9.711 4.167 QT
10.938 3.495 11.797 2.362 QT
12.656 1.229 12.984 -0.052 QT
13.016 -0.177 13.141 -0.177 QT
13.406 -0.177 L
13.484 -0.177 13.539 -0.114 QT
13.594 -0.052 13.594 0.011 QT
13.594 0.026 13.563 0.073 QT
13.203 1.526 12.172 2.807 QT
11.141 4.089 9.711 4.839 QT
8.281 5.589 6.75 5.589 QT
5.109 5.589 3.813 4.846 QT
2.516 4.104 1.789 2.792 QT
1.063 1.479 1.063 -0.177 QT
1.063 -1.943 1.852 -3.669 QT
2.641 -5.396 3.977 -6.739 QT
5.313 -8.083 7.016 -8.888 QT
8.719 -9.693 10.484 -9.693 QT
11.172 -9.693 11.813 -9.482 QT
12.453 -9.271 12.992 -8.841 QT
13.531 -8.411 13.891 -7.849 QT
15.547 -9.646 L
15.547 -9.693 15.641 -9.693 QT
15.766 -9.693 L
15.859 -9.693 15.906 -9.614 QT
15.953 -9.536 15.953 -9.474 QT
14.531 -3.802 L
14.531 -3.661 14.359 -3.661 QT
13.984 -3.661 L
13.828 -3.661 13.828 -3.896 QT
13.906 -4.349 13.906 -5.005 QT
13.906 -6.021 13.555 -6.935 QT
13.203 -7.849 12.469 -8.396 QT
11.734 -8.943 10.688 -8.943 QT
8.969 -8.943 7.547 -8.083 QT
6.125 -7.224 5.133 -5.825 QT
4.141 -4.427 3.602 -2.716 QT
3.063 -1.005 3.063 0.589 QT
cp}def
f-4508157
f
GR
GS
[0.75 0 0 0.75 328.53818 72.70343] CT
N
/f116278797{24.277 2.323 M
24.105 2.323 23.988 2.19 QT
23.871 2.057 23.871 1.917 QT
23.871 1.729 23.988 1.612 QT
24.105 1.495 24.277 1.495 QT
37.465 1.495 L
37.621 1.495 37.73 1.612 QT
37.84 1.729 37.84 1.917 QT
37.84 2.057 37.73 2.19 QT
37.621 2.323 37.465 2.323 QT
24.277 2.323 L
cp
24.277 -1.755 M
24.105 -1.755 23.988 -1.872 QT
23.871 -1.989 23.871 -2.177 QT
23.871 -2.318 23.988 -2.458 QT
24.105 -2.599 24.277 -2.599 QT
37.465 -2.599 L
37.621 -2.599 37.73 -2.458 QT
37.84 -2.318 37.84 -2.177 QT
37.84 -1.989 37.73 -1.872 QT
37.621 -1.755 37.465 -1.755 QT
24.277 -1.755 L
cp}def
f116278797
f
GR
GS
[0.75 0 0 0.75 328.53818 72.70343] CT
N
/f1266608125{46.264 5.12 M
46.264 4.557 L
46.264 4.511 46.311 4.448 QT
49.561 0.839 L
50.311 0.026 50.772 -0.513 QT
51.233 -1.052 51.678 -1.763 QT
52.124 -2.474 52.389 -3.2 QT
52.655 -3.927 52.655 -4.755 QT
52.655 -5.614 52.335 -6.404 QT
52.014 -7.193 51.382 -7.661 QT
50.749 -8.13 49.858 -8.13 QT
48.952 -8.13 48.225 -7.583 QT
47.499 -7.036 47.202 -6.161 QT
47.28 -6.177 47.421 -6.177 QT
47.889 -6.177 48.225 -5.864 QT
48.561 -5.552 48.561 -5.036 QT
48.561 -4.568 48.225 -4.232 QT
47.889 -3.896 47.421 -3.896 QT
46.936 -3.896 46.6 -4.239 QT
46.264 -4.583 46.264 -5.036 QT
46.264 -5.833 46.561 -6.521 QT
46.858 -7.208 47.421 -7.747 QT
47.983 -8.286 48.678 -8.575 QT
49.374 -8.864 50.171 -8.864 QT
51.374 -8.864 52.405 -8.357 QT
53.436 -7.849 54.046 -6.919 QT
54.655 -5.989 54.655 -4.755 QT
54.655 -3.849 54.257 -3.029 QT
53.858 -2.208 53.233 -1.536 QT
52.608 -0.864 51.632 -0.013 QT
50.655 0.839 50.343 1.136 QT
47.968 3.417 L
49.983 3.417 L
51.468 3.417 52.468 3.393 QT
53.468 3.37 53.53 3.307 QT
53.78 3.042 54.03 1.37 QT
54.655 1.37 L
54.061 5.12 L
46.264 5.12 L
cp}def
f1266608125
f
GR
GS
[0.75 0 0 0.75 0 0] CT
0.929 0.694 0.125 RC
N
435.048 106.547 M
435.048 87.329 L
395.004 87.329 L
395.004 106.547 L
cp
f
GR
GS
[0.75 0 0 0.75 0 0] CT
10.0 ML
0.667 LW
N
395.004 106.547 M
395.004 87.329 L
435.048 87.329 L
435.048 106.547 L
cp
S
GR
GS
[0.75 0 0 0.75 328.53818 92.29657] CT
N
f-4508157
f
GR
GS
[0.75 0 0 0.75 328.53818 92.29657] CT
N
f116278797
f
GR
GS
[0.75 0 0 0.75 328.53818 92.29657] CT
N
/f-2039573565{47.218 3.495 M
47.702 4.214 48.538 4.565 QT
49.374 4.917 50.327 4.917 QT
51.546 4.917 52.061 3.878 QT
52.577 2.839 52.577 1.511 QT
52.577 0.917 52.468 0.323 QT
52.358 -0.271 52.1 -0.786 QT
51.843 -1.302 51.397 -1.607 QT
50.952 -1.911 50.311 -1.911 QT
48.905 -1.911 L
48.718 -1.911 48.718 -2.114 QT
48.718 -2.286 L
48.718 -2.458 48.905 -2.458 QT
50.061 -2.552 L
50.811 -2.552 51.296 -3.107 QT
51.78 -3.661 52.007 -4.45 QT
52.233 -5.239 52.233 -5.958 QT
52.233 -6.974 51.764 -7.614 QT
51.296 -8.255 50.327 -8.255 QT
49.53 -8.255 48.796 -7.958 QT
48.061 -7.661 47.639 -7.036 QT
47.686 -7.052 47.71 -7.06 QT
47.733 -7.068 47.78 -7.068 QT
48.249 -7.068 48.569 -6.739 QT
48.889 -6.411 48.889 -5.943 QT
48.889 -5.489 48.569 -5.161 QT
48.249 -4.833 47.78 -4.833 QT
47.327 -4.833 46.999 -5.161 QT
46.671 -5.489 46.671 -5.943 QT
46.671 -6.849 47.21 -7.513 QT
47.749 -8.177 48.608 -8.521 QT
49.468 -8.864 50.327 -8.864 QT
50.968 -8.864 51.671 -8.677 QT
52.374 -8.489 52.952 -8.138 QT
53.53 -7.786 53.889 -7.232 QT
54.249 -6.677 54.249 -5.958 QT
54.249 -5.083 53.858 -4.333 QT
53.468 -3.583 52.78 -3.044 QT
52.093 -2.505 51.264 -2.239 QT
52.186 -2.052 53.007 -1.544 QT
53.827 -1.036 54.319 -0.232 QT
54.811 0.573 54.811 1.495 QT
54.811 2.651 54.178 3.589 QT
53.546 4.526 52.507 5.057 QT
51.468 5.589 50.327 5.589 QT
49.343 5.589 48.35 5.214 QT
47.358 4.839 46.725 4.089 QT
46.093 3.339 46.093 2.292 QT
46.093 1.761 46.444 1.417 QT
46.796 1.073 47.327 1.073 QT
47.655 1.073 47.936 1.229 QT
48.218 1.386 48.382 1.675 QT
48.546 1.964 48.546 2.292 QT
48.546 2.807 48.186 3.151 QT
47.827 3.495 47.327 3.495 QT
47.218 3.495 L
cp}def
f-2039573565
f
GR
GS
[0.75 0 0 0.75 0 0] CT
1 0.843 0 RC
N
435.048 132.671 M
435.048 113.453 L
395.004 113.453 L
395.004 132.671 L
cp
f
GR
GS
[0.75 0 0 0.75 0 0] CT
10.0 ML
0.667 LW
N
395.004 132.671 M
395.004 113.453 L
435.048 113.453 L
435.048 132.671 L
cp
S
GR
GS
[0.75 0 0 0.75 328.53818 111.88971] CT
N
f-4508157
f
GR
GS
[0.75 0 0 0.75 328.53818 111.88971] CT
N
f116278797
f
GR
GS
[0.75 0 0 0.75 328.53818 111.88971] CT
N
/f2027795826{45.796 1.651 M
45.796 0.917 L
52.296 -8.771 L
52.358 -8.864 52.514 -8.864 QT
52.811 -8.864 L
53.046 -8.864 53.046 -8.63 QT
53.046 0.917 L
55.108 0.917 L
55.108 1.651 L
53.046 1.651 L
53.046 3.714 L
53.046 4.151 53.663 4.268 QT
54.28 4.386 55.093 4.386 QT
55.093 5.12 L
49.311 5.12 L
49.311 4.386 L
50.124 4.386 50.733 4.268 QT
51.343 4.151 51.343 3.714 QT
51.343 1.651 L
45.796 1.651 L
cp
46.499 0.917 M
51.468 0.917 L
51.468 -6.521 L
46.499 0.917 L
cp}def
f2027795826
f
GR
GS
[0.75 0 0 0.75 0 0] CT
0.953 0.871 0.733 RC
N
435.048 158.795 M
435.048 139.577 L
395.004 139.577 L
395.004 158.795 L
cp
f
GR
GS
[0.75 0 0 0.75 0 0] CT
10.0 ML
0.667 LW
N
395.004 158.795 M
395.004 139.577 L
435.048 139.577 L
435.048 158.795 L
cp
S
GR
GS
[0.75 0 0 0.75 0 0] CT
1 GC
10.0 ML
0.667 LW
N
391 164 M
391 56 L
498 56 L
498 164 L
cp
S
GR
GS
[0.75 0 0 0.75 0 0] CT
1 GC
N
585 530 M
1026 530 L
1026 44 L
585 44 L
cp
f
GR
GS
[0.75 0 0 0.75 604.12555 29.70001] CT
/Helvetica 23.467 F
GS
[1 0 0 1 0 0] CT
-208.5 -6 moveto 
1 -1 scale
(Low-relative dynamics test case [5-80 s]) t 
GR
GR
GS
[0.75 0 0 0.75 0 0] CT
0.149 GC
1 LJ
0.667 LW
N
585 530 M
1026 530 L
S
GR
GS
[0.75 0 0 0.75 0 0] CT
0.851 0.325 0.098 RC
N
620.919 530 M
620.919 260.459 L
600.964 260.459 L
600.964 530 L
cp
730.67 530 M
730.67 329.626 L
710.715 329.626 L
710.715 530 L
cp
840.421 530 M
840.421 331.542 L
820.466 331.542 L
820.466 530 L
cp
950.172 530 M
950.172 406.539 L
930.217 406.539 L
930.217 530 L
cp
f
GR
GS
[0.75 0 0 0.75 0 0] CT
10.0 ML
0.667 LW
N
600.964 530 M
600.964 260.459 L
620.919 260.459 L
620.919 530 L
cp
S
GR
GS
[0.75 0 0 0.75 0 0] CT
10.0 ML
0.667 LW
N
710.715 530 M
710.715 329.626 L
730.67 329.626 L
730.67 530 L
cp
S
GR
GS
[0.75 0 0 0.75 0 0] CT
10.0 ML
0.667 LW
N
820.466 530 M
820.466 331.542 L
840.421 331.542 L
840.421 530 L
cp
S
GR
GS
[0.75 0 0 0.75 0 0] CT
10.0 ML
0.667 LW
N
930.217 530 M
930.217 406.539 L
950.172 406.539 L
950.172 530 L
cp
S
GR
GS
[0.75 0 0 0.75 0 0] CT
0.929 0.694 0.125 RC
N
640.873 530 M
640.873 173.479 L
620.919 173.479 L
620.919 530 L
cp
750.624 530 M
750.624 197.163 L
730.67 197.163 L
730.67 530 L
cp
860.376 530 M
860.376 195.725 L
840.421 195.725 L
840.421 530 L
cp
970.127 530 M
970.127 306.522 L
950.172 306.522 L
950.172 530 L
cp
f
GR
GS
[0.75 0 0 0.75 0 0] CT
10.0 ML
0.667 LW
N
620.919 530 M
620.919 173.479 L
640.873 173.479 L
640.873 530 L
cp
S
GR
GS
[0.75 0 0 0.75 0 0] CT
10.0 ML
0.667 LW
N
730.67 530 M
730.67 197.163 L
750.624 197.163 L
750.624 530 L
cp
S
GR
GS
[0.75 0 0 0.75 0 0] CT
10.0 ML
0.667 LW
N
840.421 530 M
840.421 195.725 L
860.376 195.725 L
860.376 530 L
cp
S
GR
GS
[0.75 0 0 0.75 0 0] CT
10.0 ML
0.667 LW
N
950.172 530 M
950.172 306.522 L
970.127 306.522 L
970.127 530 L
cp
S
GR
GS
[0.75 0 0 0.75 0 0] CT
1 0.843 0 RC
N
660.828 530 M
660.828 399.238 L
640.873 399.238 L
640.873 530 L
cp
770.579 530 M
770.579 229.185 L
750.624 229.185 L
750.624 530 L
cp
880.33 530 M
880.33 127.793 L
860.376 127.793 L
860.376 530 L
cp
990.081 530 M
990.081 292.984 L
970.127 292.984 L
970.127 530 L
cp
f
GR
GS
[0.75 0 0 0.75 0 0] CT
10.0 ML
0.667 LW
N
640.873 530 M
640.873 399.238 L
660.828 399.238 L
660.828 530 L
cp
S
GR
GS
[0.75 0 0 0.75 0 0] CT
10.0 ML
0.667 LW
N
750.624 530 M
750.624 229.185 L
770.579 229.185 L
770.579 530 L
cp
S
GR
GS
[0.75 0 0 0.75 0 0] CT
10.0 ML
0.667 LW
N
860.376 530 M
860.376 127.793 L
880.33 127.793 L
880.33 530 L
cp
S
GR
GS
[0.75 0 0 0.75 0 0] CT
10.0 ML
0.667 LW
N
970.127 530 M
970.127 292.984 L
990.081 292.984 L
990.081 530 L
cp
S
GR
GS
[0.75 0 0 0.75 0 0] CT
0.953 0.871 0.733 RC
N
680.783 530 M
680.783 523.856 L
660.828 523.856 L
660.828 530 L
cp
790.534 530 M
790.534 214.436 L
770.579 214.436 L
770.579 530 L
cp
900.285 530 M
900.285 65.182 L
880.33 65.182 L
880.33 530 L
cp
1010.036 530 M
1010.036 266.114 L
990.081 266.114 L
990.081 530 L
cp
f
GR
GS
[0.75 0 0 0.75 0 0] CT
10.0 ML
0.667 LW
N
660.828 530 M
660.828 523.856 L
680.783 523.856 L
680.783 530 L
cp
S
GR
GS
[0.75 0 0 0.75 0 0] CT
10.0 ML
0.667 LW
N
770.579 530 M
770.579 214.436 L
790.534 214.436 L
790.534 530 L
cp
S
GR
GS
[0.75 0 0 0.75 0 0] CT
10.0 ML
0.667 LW
N
880.33 530 M
880.33 65.182 L
900.285 65.182 L
900.285 530 L
cp
S
GR
GS
[0.75 0 0 0.75 0 0] CT
10.0 ML
0.667 LW
N
990.081 530 M
990.081 266.114 L
1010.036 266.114 L
1010.036 530 L
cp
S
GR
GS
[0.75 0 0 0.75 0 0] CT
0.149 GC
2 setlinecap
1 LJ
0.667 LW
N
585 530 M
1026 530 L
S
GR
GS
[0.75 0 0 0.75 0 0] CT
0.149 GC
2 setlinecap
1 LJ
0.667 LW
N
585 44 M
1026 44 L
S
GR
GS
[0.75 0 0 0.75 0 0] CT
0.149 GC
2 setlinecap
1 LJ
0.667 LW
N
640.873 530 M
640.873 525.14 L
S
GR
GS
[0.75 0 0 0.75 0 0] CT
0.149 GC
2 setlinecap
1 LJ
0.667 LW
N
750.624 530 M
750.624 525.14 L
S
GR
GS
[0.75 0 0 0.75 0 0] CT
0.149 GC
2 setlinecap
1 LJ
0.667 LW
N
860.376 530 M
860.376 525.14 L
S
GR
GS
[0.75 0 0 0.75 0 0] CT
0.149 GC
2 setlinecap
1 LJ
0.667 LW
N
970.127 530 M
970.127 525.14 L
S
GR
GS
[0.75 0 0 0.75 0 0] CT
0.149 GC
2 setlinecap
1 LJ
0.667 LW
N
640.873 44 M
640.873 48.86 L
S
GR
GS
[0.75 0 0 0.75 0 0] CT
0.149 GC
2 setlinecap
1 LJ
0.667 LW
N
750.624 44 M
750.624 48.86 L
S
GR
GS
[0.75 0 0 0.75 0 0] CT
0.149 GC
2 setlinecap
1 LJ
0.667 LW
N
860.376 44 M
860.376 48.86 L
S
GR
GS
[0.75 0 0 0.75 0 0] CT
0.149 GC
2 setlinecap
1 LJ
0.667 LW
N
970.127 44 M
970.127 48.86 L
S
GR
GS
[0.75 0 0 0.75 480.65497 402.70001] CT
0.149 GC
/Helvetica 21.333 F
GS
[1 0 0 1 0 0] CT
-12 22 moveto 
1 -1 scale
(10) t 
GR
GR
GS
[0.75 0 0 0.75 562.96834 402.70001] CT
0.149 GC
/Helvetica 21.333 F
GS
[1 0 0 1 0 0] CT
-6 22 moveto 
1 -1 scale
(8) t 
GR
GR
GS
[0.75 0 0 0.75 645.28166 402.70001] CT
0.149 GC
/Helvetica 21.333 F
GS
[1 0 0 1 0 0] CT
-6 22 moveto 
1 -1 scale
(6) t 
GR
GR
GS
[0.75 0 0 0.75 727.59503 402.70001] CT
0.149 GC
/Helvetica 21.333 F
GS
[1 0 0 1 0 0] CT
-6 22 moveto 
1 -1 scale
(4) t 
GR
GR
GS
[0.75 0 0 0.75 604.12514 418.39384] CT
0.149 GC
N
/f772063169{-6.465 20.212 M
-6.527 20.212 -6.59 20.134 QT
-6.652 20.056 -6.652 19.993 QT
-5.324 14.618 L
-5.277 14.493 -5.137 14.493 QT
-4.855 14.493 L
-4.777 14.493 -4.723 14.556 QT
-4.668 14.618 -4.668 14.728 QT
-4.855 15.509 -4.855 16.134 QT
-4.855 17.79 -3.715 18.603 QT
-2.574 19.415 -0.824 19.415 QT
-0.074 19.415 0.652 19.04 QT
1.379 18.665 1.926 18.071 QT
2.473 17.478 2.801 16.743 QT
3.129 16.009 3.129 15.259 QT
3.129 14.446 2.699 13.813 QT
2.27 13.181 1.52 12.993 QT
-1.293 12.259 L
-2.418 11.946 -3.098 11.032 QT
-3.777 10.118 -3.777 8.978 QT
-3.777 7.587 -2.957 6.313 QT
-2.137 5.04 -0.816 4.267 QT
0.504 3.493 1.879 3.493 QT
2.926 3.493 3.809 3.884 QT
4.691 4.274 5.16 5.118 QT
6.488 3.556 L
6.613 3.493 6.645 3.493 QT
6.785 3.493 L
6.879 3.493 6.934 3.571 QT
6.988 3.649 6.988 3.728 QT
5.645 9.071 L
5.613 9.228 5.473 9.228 QT
5.191 9.228 L
4.988 9.228 4.988 8.978 QT
5.098 8.243 5.098 7.712 QT
5.098 6.634 4.73 5.845 QT
4.363 5.056 3.629 4.649 QT
2.895 4.243 1.816 4.243 QT
0.895 4.243 -0.02 4.767 QT
-0.934 5.29 -1.496 6.165 QT
-2.059 7.04 -2.059 7.993 QT
-2.059 8.728 -1.621 9.298 QT
-1.184 9.868 -0.465 10.071 QT
2.332 10.806 L
3.098 11.009 3.668 11.517 QT
4.238 12.024 4.527 12.728 QT
4.816 13.431 4.816 14.259 QT
4.816 15.353 4.355 16.415 QT
3.895 17.478 3.074 18.353 QT
2.254 19.228 1.207 19.72 QT
0.16 20.212 -0.934 20.212 QT
-3.668 20.212 -4.855 18.618 QT
-6.137 20.149 L
-6.277 20.212 -6.309 20.212 QT
-6.465 20.212 L
cp}def
f772063169
f
GR
GS
[0.75 0 0 0.75 0 0] CT
0.149 GC
2 setlinecap
1 LJ
0.667 LW
N
585 530 M
585 44 L
S
GR
GS
[0.75 0 0 0.75 0 0] CT
0.149 GC
2 setlinecap
1 LJ
0.667 LW
N
1026 530 M
1026 44 L
S
GR
GS
[0.75 0 0 0.75 0 0] CT
0.149 GC
2 setlinecap
1 LJ
0.667 LW
N
585 530 M
589.86 530 L
S
GR
GS
[0.75 0 0 0.75 0 0] CT
0.149 GC
2 setlinecap
1 LJ
0.667 LW
N
585 469.25 M
589.86 469.25 L
S
GR
GS
[0.75 0 0 0.75 0 0] CT
0.149 GC
2 setlinecap
1 LJ
0.667 LW
N
585 408.5 M
589.86 408.5 L
S
GR
GS
[0.75 0 0 0.75 0 0] CT
0.149 GC
2 setlinecap
1 LJ
0.667 LW
N
585 347.75 M
589.86 347.75 L
S
GR
GS
[0.75 0 0 0.75 0 0] CT
0.149 GC
2 setlinecap
1 LJ
0.667 LW
N
585 287 M
589.86 287 L
S
GR
GS
[0.75 0 0 0.75 0 0] CT
0.149 GC
2 setlinecap
1 LJ
0.667 LW
N
585 226.25 M
589.86 226.25 L
S
GR
GS
[0.75 0 0 0.75 0 0] CT
0.149 GC
2 setlinecap
1 LJ
0.667 LW
N
585 165.5 M
589.86 165.5 L
S
GR
GS
[0.75 0 0 0.75 0 0] CT
0.149 GC
2 setlinecap
1 LJ
0.667 LW
N
585 104.75 M
589.86 104.75 L
S
GR
GS
[0.75 0 0 0.75 0 0] CT
0.149 GC
2 setlinecap
1 LJ
0.667 LW
N
585 44 M
589.86 44 L
S
GR
GS
[0.75 0 0 0.75 0 0] CT
0.149 GC
2 setlinecap
1 LJ
0.667 LW
N
1026 530 M
1021.14 530 L
S
GR
GS
[0.75 0 0 0.75 0 0] CT
0.149 GC
2 setlinecap
1 LJ
0.667 LW
N
1026 469.25 M
1021.14 469.25 L
S
GR
GS
[0.75 0 0 0.75 0 0] CT
0.149 GC
2 setlinecap
1 LJ
0.667 LW
N
1026 408.5 M
1021.14 408.5 L
S
GR
GS
[0.75 0 0 0.75 0 0] CT
0.149 GC
2 setlinecap
1 LJ
0.667 LW
N
1026 347.75 M
1021.14 347.75 L
S
GR
GS
[0.75 0 0 0.75 0 0] CT
0.149 GC
2 setlinecap
1 LJ
0.667 LW
N
1026 287 M
1021.14 287 L
S
GR
GS
[0.75 0 0 0.75 0 0] CT
0.149 GC
2 setlinecap
1 LJ
0.667 LW
N
1026 226.25 M
1021.14 226.25 L
S
GR
GS
[0.75 0 0 0.75 0 0] CT
0.149 GC
2 setlinecap
1 LJ
0.667 LW
N
1026 165.5 M
1021.14 165.5 L
S
GR
GS
[0.75 0 0 0.75 0 0] CT
0.149 GC
2 setlinecap
1 LJ
0.667 LW
N
1026 104.75 M
1021.14 104.75 L
S
GR
GS
[0.75 0 0 0.75 0 0] CT
0.149 GC
2 setlinecap
1 LJ
0.667 LW
N
1026 44 M
1021.14 44 L
S
GR
GS
[0.75 0 0 0.75 433.54999 397.5] CT
0.149 GC
/Helvetica 21.333 F
GS
[1 0 0 1 0 0] CT
-12 8.5 moveto 
1 -1 scale
(0) t 
GR
GR
GS
[0.75 0 0 0.75 433.54999 351.9375] CT
0.149 GC
/Helvetica 21.333 F
GS
[1 0 0 1 0 0] CT
-12 8.5 moveto 
1 -1 scale
(2) t 
GR
GR
GS
[0.75 0 0 0.75 433.54999 306.375] CT
0.149 GC
/Helvetica 21.333 F
GS
[1 0 0 1 0 0] CT
-12 8.5 moveto 
1 -1 scale
(4) t 
GR
GR
GS
[0.75 0 0 0.75 433.54999 260.8125] CT
0.149 GC
/Helvetica 21.333 F
GS
[1 0 0 1 0 0] CT
-12 8.5 moveto 
1 -1 scale
(6) t 
GR
GR
GS
[0.75 0 0 0.75 433.54999 215.25] CT
0.149 GC
/Helvetica 21.333 F
GS
[1 0 0 1 0 0] CT
-12 8.5 moveto 
1 -1 scale
(8) t 
GR
GR
GS
[0.75 0 0 0.75 433.54999 169.6875] CT
0.149 GC
/Helvetica 21.333 F
GS
[1 0 0 1 0 0] CT
-24 8.5 moveto 
1 -1 scale
(10) t 
GR
GR
GS
[0.75 0 0 0.75 433.54999 124.125] CT
0.149 GC
/Helvetica 21.333 F
GS
[1 0 0 1 0 0] CT
-24 8.5 moveto 
1 -1 scale
(12) t 
GR
GR
GS
[0.75 0 0 0.75 433.54999 78.5625] CT
0.149 GC
/Helvetica 21.333 F
GS
[1 0 0 1 0 0] CT
-24 8.5 moveto 
1 -1 scale
(14) t 
GR
GR
GS
[0.75 0 0 0.75 433.54999 33] CT
0.149 GC
/Helvetica 21.333 F
GS
[1 0 0 1 0 0] CT
-24 8.5 moveto 
1 -1 scale
(16) t 
GR
GR
GS
[0 -0.75 0.75 0 412.54999 215.24982] CT
0.149 GC
N
/f890126587{-5.09 -8.448 M
-5.371 -8.448 -5.371 -8.745 QT
-3.402 -16.573 L
-3.324 -16.964 -3.293 -17.182 QT
-3.293 -17.557 -4.793 -17.557 QT
-5.027 -17.557 -5.027 -17.854 QT
-5.012 -17.917 -4.973 -18.065 QT
-4.934 -18.214 -4.871 -18.292 QT
-4.809 -18.37 -4.699 -18.37 QT
-1.605 -18.604 L
-1.324 -18.604 -1.324 -18.323 QT
-3.574 -9.307 L
-1.762 -9.901 -0.23 -11.198 QT
1.301 -12.495 2.363 -14.245 QT
3.426 -15.995 3.895 -17.886 QT
3.988 -18.214 4.262 -18.409 QT
4.535 -18.604 4.863 -18.604 QT
5.176 -18.604 5.363 -18.425 QT
5.551 -18.245 5.551 -17.948 QT
5.551 -17.573 5.246 -16.815 QT
4.941 -16.057 4.66 -15.464 QT
3.738 -13.667 2.238 -12.151 QT
1.301 -11.214 0.215 -10.479 QT
-0.871 -9.745 -2.051 -9.237 QT
-3.23 -8.729 -4.543 -8.448 QT
-5.09 -8.448 L
cp}def
f890126587
f
GR
GS
[0.75 0 0 0.75 0 0] CT
1 GC
N
1015 163 M
1015 55 L
908 55 L
908 163 L
cp
f
GR
GS
[0.75 0 0 0.75 716.28818 52.36029] CT
N
f-4508157
f
GR
GS
[0.75 0 0 0.75 716.28818 52.36029] CT
N
f116278797
f
GR
GS
[0.75 0 0 0.75 716.28818 52.36029] CT
N
/f-1618597327{47.171 5.12 M
47.171 4.386 L
49.796 4.386 49.796 3.714 QT
49.796 -7.302 L
48.702 -6.786 47.046 -6.786 QT
47.046 -7.521 L
49.624 -7.521 50.936 -8.864 QT
51.233 -8.864 L
51.296 -8.864 51.366 -8.81 QT
51.436 -8.755 51.436 -8.677 QT
51.436 3.714 L
51.436 4.386 54.061 4.386 QT
54.061 5.12 L
47.171 5.12 L
cp}def
f-1618597327
f
GR
GS
[0.75 0 0 0.75 0 0] CT
0.851 0.325 0.098 RC
N
952.048 79.423 M
952.048 60.205 L
912.004 60.205 L
912.004 79.423 L
cp
f
GR
GS
[0.75 0 0 0.75 0 0] CT
10.0 ML
0.667 LW
N
912.004 79.423 M
912.004 60.205 L
952.048 60.205 L
952.048 79.423 L
cp
S
GR
GS
[0.75 0 0 0.75 716.28818 71.95343] CT
N
f-4508157
f
GR
GS
[0.75 0 0 0.75 716.28818 71.95343] CT
N
f116278797
f
GR
GS
[0.75 0 0 0.75 716.28818 71.95343] CT
N
f1266608125
f
GR
GS
[0.75 0 0 0.75 0 0] CT
0.929 0.694 0.125 RC
N
952.048 105.547 M
952.048 86.329 L
912.004 86.329 L
912.004 105.547 L
cp
f
GR
GS
[0.75 0 0 0.75 0 0] CT
10.0 ML
0.667 LW
N
912.004 105.547 M
912.004 86.329 L
952.048 86.329 L
952.048 105.547 L
cp
S
GR
GS
[0.75 0 0 0.75 716.28818 91.54657] CT
N
f-4508157
f
GR
GS
[0.75 0 0 0.75 716.28818 91.54657] CT
N
f116278797
f
GR
GS
[0.75 0 0 0.75 716.28818 91.54657] CT
N
f-2039573565
f
GR
GS
[0.75 0 0 0.75 0 0] CT
1 0.843 0 RC
N
952.048 131.671 M
952.048 112.453 L
912.004 112.453 L
912.004 131.671 L
cp
f
GR
GS
[0.75 0 0 0.75 0 0] CT
10.0 ML
0.667 LW
N
912.004 131.671 M
912.004 112.453 L
952.048 112.453 L
952.048 131.671 L
cp
S
GR
GS
[0.75 0 0 0.75 716.28818 111.13971] CT
N
f-4508157
f
GR
GS
[0.75 0 0 0.75 716.28818 111.13971] CT
N
f116278797
f
GR
GS
[0.75 0 0 0.75 716.28818 111.13971] CT
N
f2027795826
f
GR
GS
[0.75 0 0 0.75 0 0] CT
0.953 0.871 0.733 RC
N
952.048 157.795 M
952.048 138.577 L
912.004 138.577 L
912.004 157.795 L
cp
f
GR
GS
[0.75 0 0 0.75 0 0] CT
10.0 ML
0.667 LW
N
912.004 157.795 M
912.004 138.577 L
952.048 138.577 L
952.048 157.795 L
cp
S
GR
GS
[0.75 0 0 0.75 0 0] CT
1 GC
10.0 ML
0.667 LW
N
908 163 M
908 55 L
1015 55 L
1015 163 L
cp
S
GR
%%Trailer
%%Pages: 1
%%EOF
