%!PS-Adobe-3.0 EPSF-3.0
%%Creator: (MATLAB, The Mathworks, Inc. Version 9.5.0.944444 \(R2018b\). Operating System: Windows 10)
%%Title: (C:/Users/Alex/Documents/PhD Docs/01. GIT/my_phd_thesis/Chapter8/Figures/capsloc_res/pieCharts_examples_c01.eps)
%%CreationDate: 2019-11-04T11:15:41
%%Pages: (atend)
%%BoundingBox: 0 0 603 541
%%LanguageLevel: 3
%%EndComments
%%BeginProlog
%%BeginResource: procset (Apache XML Graphics Std ProcSet) 1.2 0
%%Version: 1.2 0
%%Copyright: (Copyright 2001-2003,2010 The Apache Software Foundation. License terms: http://www.apache.org/licenses/LICENSE-2.0)
/bd{bind def}bind def
/ld{load def}bd
/GR/grestore ld
/GS/gsave ld
/RM/rmoveto ld
/C/curveto ld
/t/show ld
/L/lineto ld
/ML/setmiterlimit ld
/CT/concat ld
/f/fill ld
/N/newpath ld
/S/stroke ld
/CC/setcmykcolor ld
/A/ashow ld
/cp/closepath ld
/RC/setrgbcolor ld
/LJ/setlinejoin ld
/GC/setgray ld
/LW/setlinewidth ld
/M/moveto ld
/re {4 2 roll M
1 index 0 rlineto
0 exch rlineto
neg 0 rlineto
cp } bd
/_ctm matrix def
/_tm matrix def
/BT { _ctm currentmatrix pop matrix _tm copy pop 0 0 moveto } bd
/ET { _ctm setmatrix } bd
/iTm { _ctm setmatrix _tm concat } bd
/Tm { _tm astore pop iTm 0 0 moveto } bd
/ux 0.0 def
/uy 0.0 def
/F {
  /Tp exch def
  /Tf exch def
  Tf findfont Tp scalefont setfont
  /cf Tf def  /cs Tp def
} bd
/ULS {currentpoint /uy exch def /ux exch def} bd
/ULE {
  /Tcx currentpoint pop def
  gsave
  newpath
  cf findfont cs scalefont dup
  /FontMatrix get 0 get /Ts exch def /FontInfo get dup
  /UnderlinePosition get Ts mul /To exch def
  /UnderlineThickness get Ts mul /Tt exch def
  ux uy To add moveto  Tcx uy To add lineto
  Tt setlinewidth stroke
  grestore
} bd
/OLE {
  /Tcx currentpoint pop def
  gsave
  newpath
  cf findfont cs scalefont dup
  /FontMatrix get 0 get /Ts exch def /FontInfo get dup
  /UnderlinePosition get Ts mul /To exch def
  /UnderlineThickness get Ts mul /Tt exch def
  ux uy To add cs add moveto Tcx uy To add cs add lineto
  Tt setlinewidth stroke
  grestore
} bd
/SOE {
  /Tcx currentpoint pop def
  gsave
  newpath
  cf findfont cs scalefont dup
  /FontMatrix get 0 get /Ts exch def /FontInfo get dup
  /UnderlinePosition get Ts mul /To exch def
  /UnderlineThickness get Ts mul /Tt exch def
  ux uy To add cs 10 mul 26 idiv add moveto Tcx uy To add cs 10 mul 26 idiv add lineto
  Tt setlinewidth stroke
  grestore
} bd
/QT {
/Y22 exch store
/X22 exch store
/Y21 exch store
/X21 exch store
currentpoint
/Y21 load 2 mul add 3 div exch
/X21 load 2 mul add 3 div exch
/X21 load 2 mul /X22 load add 3 div
/Y21 load 2 mul /Y22 load add 3 div
/X22 load /Y22 load curveto
} bd
/SSPD {
dup length /d exch dict def
{
/v exch def
/k exch def
currentpagedevice k known {
/cpdv currentpagedevice k get def
v cpdv ne {
/upd false def
/nullv v type /nulltype eq def
/nullcpdv cpdv type /nulltype eq def
nullv nullcpdv or
{
/upd true def
} {
/sametype v type cpdv type eq def
sametype {
v type /arraytype eq {
/vlen v length def
/cpdvlen cpdv length def
vlen cpdvlen eq {
0 1 vlen 1 sub {
/i exch def
/obj v i get def
/cpdobj cpdv i get def
obj cpdobj ne {
/upd true def
exit
} if
} for
} {
/upd true def
} ifelse
} {
v type /dicttype eq {
v {
/dv exch def
/dk exch def
/cpddv cpdv dk get def
dv cpddv ne {
/upd true def
exit
} if
} forall
} {
/upd true def
} ifelse
} ifelse
} if
} ifelse
upd true eq {
d k v put
} if
} if
} if
} forall
d length 0 gt {
d setpagedevice
} if
} bd
/RE { % /NewFontName [NewEncodingArray] /FontName RE -
  findfont dup length dict begin
  {
    1 index /FID ne
    {def} {pop pop} ifelse
  } forall
  /Encoding exch def
  /FontName 1 index def
  currentdict definefont pop
  end
} bind def
%%EndResource
%%BeginResource: procset (Apache XML Graphics EPS ProcSet) 1.0 0
%%Version: 1.0 0
%%Copyright: (Copyright 2002-2003 The Apache Software Foundation. License terms: http://www.apache.org/licenses/LICENSE-2.0)
/BeginEPSF { %def
/b4_Inc_state save def         % Save state for cleanup
/dict_count countdictstack def % Count objects on dict stack
/op_count count 1 sub def      % Count objects on operand stack
userdict begin                 % Push userdict on dict stack
/showpage { } def              % Redefine showpage, { } = null proc
0 setgray 0 setlinecap         % Prepare graphics state
1 setlinewidth 0 setlinejoin
10 setmiterlimit [ ] 0 setdash newpath
/languagelevel where           % If level not equal to 1 then
{pop languagelevel             % set strokeadjust and
1 ne                           % overprint to their defaults.
{false setstrokeadjust false setoverprint
} if
} if
} bd
/EndEPSF { %def
count op_count sub {pop} repeat            % Clean up stacks
countdictstack dict_count sub {end} repeat
b4_Inc_state restore
} bd
%%EndResource
%FOPBeginFontDict
%%IncludeResource: font Courier-Oblique
%%IncludeResource: font Courier-BoldOblique
%%IncludeResource: font Courier-Bold
%%IncludeResource: font ZapfDingbats
%%IncludeResource: font Symbol
%%IncludeResource: font Helvetica
%%IncludeResource: font Helvetica-Oblique
%%IncludeResource: font Helvetica-Bold
%%IncludeResource: font Helvetica-BoldOblique
%%IncludeResource: font Times-Roman
%%IncludeResource: font Times-Italic
%%IncludeResource: font Times-Bold
%%IncludeResource: font Times-BoldItalic
%%IncludeResource: font Courier
%FOPEndFontDict
%%BeginResource: encoding WinAnsiEncoding
/WinAnsiEncoding [
/.notdef /.notdef /.notdef /.notdef /.notdef
/.notdef /.notdef /.notdef /.notdef /.notdef
/.notdef /.notdef /.notdef /.notdef /.notdef
/.notdef /.notdef /.notdef /.notdef /.notdef
/.notdef /.notdef /.notdef /.notdef /.notdef
/.notdef /.notdef /.notdef /.notdef /.notdef
/.notdef /.notdef /space /exclam /quotedbl
/numbersign /dollar /percent /ampersand /quotesingle
/parenleft /parenright /asterisk /plus /comma
/hyphen /period /slash /zero /one
/two /three /four /five /six
/seven /eight /nine /colon /semicolon
/less /equal /greater /question /at
/A /B /C /D /E
/F /G /H /I /J
/K /L /M /N /O
/P /Q /R /S /T
/U /V /W /X /Y
/Z /bracketleft /backslash /bracketright /asciicircum
/underscore /quoteleft /a /b /c
/d /e /f /g /h
/i /j /k /l /m
/n /o /p /q /r
/s /t /u /v /w
/x /y /z /braceleft /bar
/braceright /asciitilde /bullet /Euro /bullet
/quotesinglbase /florin /quotedblbase /ellipsis /dagger
/daggerdbl /circumflex /perthousand /Scaron /guilsinglleft
/OE /bullet /Zcaron /bullet /bullet
/quoteleft /quoteright /quotedblleft /quotedblright /bullet
/endash /emdash /asciitilde /trademark /scaron
/guilsinglright /oe /bullet /zcaron /Ydieresis
/space /exclamdown /cent /sterling /currency
/yen /brokenbar /section /dieresis /copyright
/ordfeminine /guillemotleft /logicalnot /sfthyphen /registered
/macron /degree /plusminus /twosuperior /threesuperior
/acute /mu /paragraph /middot /cedilla
/onesuperior /ordmasculine /guillemotright /onequarter /onehalf
/threequarters /questiondown /Agrave /Aacute /Acircumflex
/Atilde /Adieresis /Aring /AE /Ccedilla
/Egrave /Eacute /Ecircumflex /Edieresis /Igrave
/Iacute /Icircumflex /Idieresis /Eth /Ntilde
/Ograve /Oacute /Ocircumflex /Otilde /Odieresis
/multiply /Oslash /Ugrave /Uacute /Ucircumflex
/Udieresis /Yacute /Thorn /germandbls /agrave
/aacute /acircumflex /atilde /adieresis /aring
/ae /ccedilla /egrave /eacute /ecircumflex
/edieresis /igrave /iacute /icircumflex /idieresis
/eth /ntilde /ograve /oacute /ocircumflex
/otilde /odieresis /divide /oslash /ugrave
/uacute /ucircumflex /udieresis /yacute /thorn
/ydieresis
] def
%%EndResource
%FOPBeginFontReencode
/Courier-Oblique findfont
dup length dict begin
  {1 index /FID ne {def} {pop pop} ifelse} forall
  /Encoding WinAnsiEncoding def
  currentdict
end
/Courier-Oblique exch definefont pop
/Courier-BoldOblique findfont
dup length dict begin
  {1 index /FID ne {def} {pop pop} ifelse} forall
  /Encoding WinAnsiEncoding def
  currentdict
end
/Courier-BoldOblique exch definefont pop
/Courier-Bold findfont
dup length dict begin
  {1 index /FID ne {def} {pop pop} ifelse} forall
  /Encoding WinAnsiEncoding def
  currentdict
end
/Courier-Bold exch definefont pop
/Helvetica findfont
dup length dict begin
  {1 index /FID ne {def} {pop pop} ifelse} forall
  /Encoding WinAnsiEncoding def
  currentdict
end
/Helvetica exch definefont pop
/Helvetica-Oblique findfont
dup length dict begin
  {1 index /FID ne {def} {pop pop} ifelse} forall
  /Encoding WinAnsiEncoding def
  currentdict
end
/Helvetica-Oblique exch definefont pop
/Helvetica-Bold findfont
dup length dict begin
  {1 index /FID ne {def} {pop pop} ifelse} forall
  /Encoding WinAnsiEncoding def
  currentdict
end
/Helvetica-Bold exch definefont pop
/Helvetica-BoldOblique findfont
dup length dict begin
  {1 index /FID ne {def} {pop pop} ifelse} forall
  /Encoding WinAnsiEncoding def
  currentdict
end
/Helvetica-BoldOblique exch definefont pop
/Times-Roman findfont
dup length dict begin
  {1 index /FID ne {def} {pop pop} ifelse} forall
  /Encoding WinAnsiEncoding def
  currentdict
end
/Times-Roman exch definefont pop
/Times-Italic findfont
dup length dict begin
  {1 index /FID ne {def} {pop pop} ifelse} forall
  /Encoding WinAnsiEncoding def
  currentdict
end
/Times-Italic exch definefont pop
/Times-Bold findfont
dup length dict begin
  {1 index /FID ne {def} {pop pop} ifelse} forall
  /Encoding WinAnsiEncoding def
  currentdict
end
/Times-Bold exch definefont pop
/Times-BoldItalic findfont
dup length dict begin
  {1 index /FID ne {def} {pop pop} ifelse} forall
  /Encoding WinAnsiEncoding def
  currentdict
end
/Times-BoldItalic exch definefont pop
/Courier findfont
dup length dict begin
  {1 index /FID ne {def} {pop pop} ifelse} forall
  /Encoding WinAnsiEncoding def
  currentdict
end
/Courier exch definefont pop
%FOPEndFontReencode
%%EndProlog
%%Page: 1 1
%%PageBoundingBox: 0 0 603 541
%%BeginPageSetup
[1 0 0 -1 0 541] CT
%%EndPageSetup
GS
[0.75 0 0 0.75 0 0.25] CT
N
0 0 M
804 0 L
804 721 L
0 721 L
0 0 L
cp
clip
1 GC
N
0 0 804 721 re
f
GR
GS
[0.75 0 0 0.75 0 0.25] CT
1 GC
N
0 0 804 721 re
f
GR
GS
[0.75 0 0 0.75 441.37541 44.64999] CT
/Helvetica-Bold 17.6 F
GS
[1 0 0 1 0 0] CT
-88.5 -4 moveto 
1 -1 scale
(EN Profitability SM01) t 
GR
GR
GS
[0.75 0 0 0.75 0 0.25] CT
0.302 0.745 0.933 RC
N
503.404 108.579 M
498.756 113.632 L
494.426 118.96 L
583.529 186.954 L
583.529 74.871 L
576.667 75.081 L
569.83 75.711 L
563.045 76.759 L
556.336 78.22 L
549.73 80.088 L
543.25 82.358 L
536.922 85.021 L
530.768 88.066 L
524.813 91.481 L
519.078 95.256 L
513.584 99.374 L
508.353 103.821 L
cp
f
GR
GS
[0.75 0 0 0.75 0 0.25] CT
0.302 0.745 0.933 RC
2 setlinecap
10.0 ML
0.667 LW
N
583.529 186.954 M
583.529 74.871 L
576.667 75.081 L
569.83 75.711 L
563.045 76.759 L
556.336 78.22 L
549.73 80.088 L
543.25 82.358 L
536.922 85.021 L
530.768 88.066 L
524.813 91.481 L
519.078 95.256 L
513.584 99.374 L
508.353 103.821 L
503.404 108.579 L
498.756 113.632 L
494.426 118.96 L
583.529 186.954 L
583.529 186.954 L
S
GR
GS
[0.75 0 0 0.75 0 0.25] CT
0.094 0.749 0.71 RC
N
514.594 281.265 M
520.011 285.724 L
525.696 289.835 L
531.628 293.583 L
537.782 296.952 L
544.135 299.929 L
550.662 302.503 L
557.338 304.664 L
564.135 306.403 L
571.028 307.713 L
577.989 308.589 L
584.992 309.028 L
592.008 309.028 L
599.011 308.589 L
605.972 307.713 L
612.865 306.403 L
619.662 304.664 L
626.338 302.503 L
632.865 299.929 L
639.218 296.952 L
645.372 293.583 L
651.304 289.835 L
656.989 285.724 L
662.406 281.265 L
667.534 276.475 L
672.352 271.375 L
676.841 265.982 L
680.984 260.32 L
684.764 254.409 L
688.168 248.274 L
691.181 241.937 L
693.791 235.425 L
695.989 228.761 L
697.766 221.974 L
699.114 215.088 L
700.029 208.132 L
700.507 201.132 L
700.546 194.116 L
700.146 187.111 L
699.309 180.145 L
698.037 173.245 L
696.336 166.438 L
694.213 159.75 L
691.675 153.209 L
688.733 146.84 L
685.398 140.666 L
681.683 134.714 L
677.604 129.006 L
588.5 197 L
499.396 129.006 L
495.317 134.714 L
491.602 140.666 L
488.267 146.84 L
485.325 153.209 L
482.787 159.75 L
480.664 166.438 L
478.963 173.245 L
477.691 180.145 L
476.854 187.111 L
476.454 194.116 L
476.493 201.132 L
476.971 208.132 L
477.886 215.088 L
479.234 221.974 L
481.011 228.761 L
483.209 235.425 L
485.819 241.937 L
488.832 248.274 L
492.236 254.409 L
496.016 260.32 L
500.159 265.982 L
504.648 271.375 L
509.466 276.475 L
cp
f
GR
GS
[0.75 0 0 0.75 0 0.25] CT
0 0.749 0.749 RC
2 setlinecap
10.0 ML
0.667 LW
N
588.5 197 M
499.396 129.006 L
495.317 134.714 L
491.602 140.666 L
488.267 146.84 L
485.325 153.209 L
482.787 159.75 L
480.664 166.438 L
478.963 173.245 L
477.691 180.145 L
476.854 187.111 L
476.454 194.116 L
476.493 201.132 L
476.971 208.132 L
477.886 215.088 L
479.234 221.974 L
481.011 228.761 L
483.209 235.425 L
485.819 241.937 L
488.832 248.274 L
492.236 254.409 L
496.016 260.32 L
500.159 265.982 L
504.648 271.375 L
509.466 276.475 L
514.594 281.265 L
520.011 285.724 L
525.696 289.835 L
531.628 293.583 L
537.782 296.952 L
544.135 299.929 L
550.662 302.503 L
557.338 304.664 L
564.135 306.403 L
571.028 307.713 L
577.989 308.589 L
584.992 309.028 L
592.008 309.028 L
599.011 308.589 L
605.972 307.713 L
612.865 306.403 L
619.662 304.664 L
626.338 302.503 L
632.865 299.929 L
639.218 296.952 L
645.372 293.583 L
651.304 289.835 L
656.989 285.724 L
662.406 281.265 L
667.534 276.475 L
672.352 271.375 L
676.841 265.982 L
680.984 260.32 L
684.764 254.409 L
688.168 248.274 L
691.181 241.937 L
693.791 235.425 L
695.989 228.761 L
697.766 221.974 L
699.114 215.088 L
700.029 208.132 L
700.507 201.132 L
700.546 194.116 L
700.146 187.111 L
699.309 180.145 L
698.037 173.245 L
696.336 166.438 L
694.213 159.75 L
691.675 153.209 L
688.733 146.84 L
685.398 140.666 L
681.683 134.714 L
677.604 129.006 L
588.5 197 L
588.5 197 L
S
GR
GS
[0.75 0 0 0.75 0 0.25] CT
0 0.447 0.741 RC
N
588.5 84.917 M
588.5 197 L
677.604 129.006 L
673.273 123.678 L
668.625 118.625 L
663.676 113.866 L
658.445 109.42 L
652.952 105.301 L
647.216 101.527 L
641.261 98.111 L
635.107 95.067 L
628.779 92.404 L
622.299 90.134 L
615.693 88.265 L
608.984 86.804 L
602.199 85.757 L
595.362 85.127 L
cp
f
GR
GS
[0.75 0 0 0.75 0 0.25] CT
0 0.447 0.741 RC
2 setlinecap
10.0 ML
0.667 LW
N
588.5 197 M
677.604 129.006 L
673.273 123.678 L
668.625 118.625 L
663.676 113.866 L
658.445 109.42 L
652.952 105.301 L
647.216 101.527 L
641.261 98.111 L
635.107 95.067 L
628.779 92.404 L
622.299 90.134 L
615.693 88.265 L
608.984 86.804 L
602.199 85.757 L
595.362 85.127 L
588.5 84.917 L
588.5 197 L
588.5 197 L
S
GR
GS
[0.75 0 0 0.75 429.63831 96.58764] CT
1 GC
/Helvetica-Bold 18.667 F
GS
[1 0 0 1 0 0] CT
-38 -5 moveto 
1 -1 scale
(15%) t 
GR
GR
GS
[0.75 0 0 0.75 444.375 174.46875] CT
1 GC
/Helvetica-Bold 18.667 F
GS
[1 0 0 1 0 0] CT
-19 19 moveto 
1 -1 scale
(70%) t 
GR
GR
GS
[0.75 0 0 0.75 453.88362 106.372] CT
1 GC
/Helvetica-Bold 18.667 F
GS
[1 0 0 1 0 0] CT
0 -5 moveto 
1 -1 scale
(15%) t 
GR
GR
GS
[0.75 0 0 0.75 0 0.25] CT
1 GC
N
618 678 M
618 650 L
197 650 L
197 678 L
cp
f
GR
GS
[0.75 0 0 0.75 183 498.25] CT
/Helvetica 18.667 F
GS
[1 0 0 1 0 0] CT
0 7 moveto 
1 -1 scale
(Profitable) t 
GR
GR
GS
[0.75 0 0 0.75 0 0.25] CT
0.302 0.745 0.933 RC
N
241 673 M
241 655 L
201 655 L
201 673 L
cp
f
GR
GS
[0.75 0 0 0.75 0 0.25] CT
0.302 0.745 0.933 RC
10.0 ML
0.667 LW
N
201 673 M
201 655 L
241 655 L
241 673 L
cp
S
GR
GS
[0.75 0 0 0.75 280.5 498.25] CT
/Helvetica 18.667 F
GS
[1 0 0 1 0 0] CT
0 7 moveto 
1 -1 scale
(Hysteresis) t 
GR
GR
GS
[0.75 0 0 0.75 0 0.25] CT
0.094 0.749 0.71 RC
N
371 673 M
371 655 L
331 655 L
331 673 L
cp
f
GR
GS
[0.75 0 0 0.75 0 0.25] CT
0 0.749 0.749 RC
10.0 ML
0.667 LW
N
331 673 M
331 655 L
371 655 L
371 673 L
cp
S
GR
GS
[0.75 0 0 0.75 384.75 498.25] CT
/Helvetica 18.667 F
GS
[1 0 0 1 0 0] CT
0 7 moveto 
1 -1 scale
(Unprofitable) t 
GR
GR
GS
[0.75 0 0 0.75 0 0.25] CT
0 0.447 0.741 RC
N
510 673 M
510 655 L
470 655 L
470 673 L
cp
f
GR
GS
[0.75 0 0 0.75 0 0.25] CT
0 0.447 0.741 RC
10.0 ML
0.667 LW
N
470 673 M
470 655 L
510 655 L
510 673 L
cp
S
GR
GS
[0.75 0 0 0.75 0 0.25] CT
1 GC
10.0 ML
0.667 LW
N
197 678 M
197 650 L
618 650 L
618 678 L
cp
S
GR
GS
[0.75 0 0 0.75 175.87517 44.64999] CT
/Helvetica-Bold 17.6 F
GS
[1 0 0 1 0 0] CT
-95 -4 moveto 
1 -1 scale
(ENU Profitability SM01) t 
GR
GR
GS
[0.75 0 0 0.75 0 0.25] CT
0.302 0.745 0.933 RC
N
132.839 128.819 M
129.486 134.626 L
126.486 140.624 L
123.851 146.791 L
228.186 187.739 L
228.186 75.656 L
221.483 75.857 L
214.804 76.458 L
208.173 77.457 L
201.613 78.851 L
195.149 80.635 L
188.803 82.803 L
182.598 85.346 L
176.556 88.256 L
170.699 91.521 L
165.047 95.132 L
159.622 99.073 L
154.442 103.332 L
149.526 107.894 L
144.892 112.741 L
140.556 117.856 L
136.533 123.222 L
cp
f
GR
GS
[0.75 0 0 0.75 0 0.25] CT
0.302 0.745 0.933 RC
2 setlinecap
10.0 ML
0.667 LW
N
228.186 187.739 M
228.186 75.656 L
221.483 75.857 L
214.804 76.458 L
208.173 77.457 L
201.613 78.851 L
195.149 80.635 L
188.803 82.803 L
182.598 85.346 L
176.556 88.256 L
170.699 91.521 L
165.047 95.132 L
159.622 99.073 L
154.442 103.332 L
149.526 107.894 L
144.892 112.741 L
140.556 117.856 L
136.533 123.222 L
132.839 128.819 L
129.486 134.626 L
126.486 140.624 L
123.851 146.791 L
228.186 187.739 L
228.186 187.739 L
S
GR
GS
[0.75 0 0 0.75 0 0.25] CT
0.094 0.749 0.71 RC
N
161.653 282.182 M
167.058 286.523 L
172.722 290.521 L
178.622 294.161 L
184.736 297.43 L
191.04 300.315 L
197.511 302.804 L
204.123 304.888 L
210.851 306.56 L
217.67 307.813 L
224.553 308.641 L
231.475 309.042 L
238.407 309.015 L
245.325 308.559 L
252.202 307.677 L
259.01 306.371 L
265.725 304.646 L
272.321 302.509 L
278.772 299.969 L
285.053 297.035 L
291.141 293.718 L
297.012 290.032 L
302.644 285.989 L
308.016 281.606 L
313.106 276.899 L
317.895 271.886 L
322.366 266.587 L
326.5 261.021 L
330.282 255.211 L
333.698 249.178 L
336.734 242.945 L
339.379 236.537 L
341.622 229.977 L
343.456 223.291 L
344.873 216.504 L
345.868 209.643 L
346.437 202.734 L
346.577 195.802 L
234.5 197 L
130.165 156.051 L
127.833 162.58 L
125.909 169.241 L
124.4 176.008 L
123.313 182.855 L
122.651 189.756 L
122.417 196.685 L
122.612 203.615 L
123.235 210.52 L
124.284 217.373 L
125.754 224.148 L
127.641 230.819 L
129.936 237.361 L
132.631 243.749 L
135.716 249.957 L
139.179 255.963 L
143.007 261.744 L
147.185 267.276 L
151.697 272.54 L
156.526 277.515 L
cp
f
GR
GS
[0.75 0 0 0.75 0 0.25] CT
0 0.749 0.749 RC
2 setlinecap
10.0 ML
0.667 LW
N
234.5 197 M
130.165 156.051 L
127.833 162.58 L
125.909 169.241 L
124.4 176.008 L
123.313 182.855 L
122.651 189.756 L
122.417 196.685 L
122.612 203.615 L
123.235 210.52 L
124.284 217.373 L
125.754 224.148 L
127.641 230.819 L
129.936 237.361 L
132.631 243.749 L
135.716 249.957 L
139.179 255.963 L
143.007 261.744 L
147.185 267.276 L
151.697 272.54 L
156.526 277.515 L
161.653 282.182 L
167.058 286.523 L
172.722 290.521 L
178.622 294.161 L
184.736 297.43 L
191.04 300.315 L
197.511 302.804 L
204.123 304.888 L
210.851 306.56 L
217.67 307.813 L
224.553 308.641 L
231.475 309.042 L
238.407 309.015 L
245.325 308.559 L
252.202 307.677 L
259.01 306.371 L
265.725 304.646 L
272.321 302.509 L
278.772 299.969 L
285.053 297.035 L
291.141 293.718 L
297.012 290.032 L
302.644 285.989 L
308.016 281.606 L
313.106 276.899 L
317.895 271.886 L
322.366 266.587 L
326.5 261.021 L
330.282 255.211 L
333.698 249.178 L
336.734 242.945 L
339.379 236.537 L
341.622 229.977 L
343.456 223.291 L
344.873 216.504 L
345.868 209.643 L
346.437 202.734 L
346.577 195.802 L
234.5 197 L
234.5 197 L
S
GR
GS
[0.75 0 0 0.75 0 0.25] CT
0 0.447 0.741 RC
N
234.5 84.917 M
234.5 197 L
346.577 195.802 L
346.284 188.815 L
345.556 181.86 L
344.396 174.963 L
342.807 168.153 L
340.798 161.454 L
338.374 154.894 L
335.546 148.498 L
332.324 142.291 L
328.722 136.297 L
324.753 130.539 L
320.433 125.04 L
315.778 119.821 L
310.806 114.902 L
305.538 110.303 L
299.993 106.042 L
294.193 102.135 L
288.16 98.597 L
281.919 95.442 L
275.493 92.682 L
268.908 90.329 L
262.188 88.39 L
255.361 86.875 L
248.453 85.789 L
241.49 85.135 L
cp
f
GR
GS
[0.75 0 0 0.75 0 0.25] CT
0 0.447 0.741 RC
2 setlinecap
10.0 ML
0.667 LW
N
234.5 197 M
346.577 195.802 L
346.284 188.815 L
345.556 181.86 L
344.396 174.963 L
342.807 168.153 L
340.798 161.454 L
338.374 154.894 L
335.546 148.498 L
332.324 142.291 L
328.722 136.297 L
324.753 130.539 L
320.433 125.04 L
315.778 119.821 L
310.806 114.902 L
305.538 110.303 L
299.993 106.042 L
294.193 102.135 L
288.16 98.597 L
281.919 95.442 L
275.493 92.682 L
268.908 90.329 L
262.188 88.39 L
255.361 86.875 L
248.453 85.789 L
241.49 85.135 L
234.5 84.917 L
234.5 197 L
234.5 197 L
S
GR
GS
[0.75 0 0 0.75 155.80009 102.15316] CT
1 GC
/Helvetica-Bold 18.667 F
GS
[1 0 0 1 0 0] CT
-38 -5 moveto 
1 -1 scale
(19%) t 
GR
GR
GS
[0.75 0 0 0.75 175.66966 178.19724] CT
1 GC
/Helvetica-Bold 18.667 F
GS
[1 0 0 1 0 0] CT
-19 19 moveto 
1 -1 scale
(56%) t 
GR
GR
GS
[0.75 0 0 0.75 198.16001 119.76632] CT
1 GC
/Helvetica-Bold 18.667 F
GS
[1 0 0 1 0 0] CT
0 -5 moveto 
1 -1 scale
(25%) t 
GR
GR
GS
[0.75 0 0 0.75 440.62541 277.14999] CT
/Helvetica-Bold 17.6 F
GS
[1 0 0 1 0 0] CT
-88.5 -4 moveto 
1 -1 scale
(EN Profitability SM02) t 
GR
GR
GS
[0.75 0 0 0.75 0 0.25] CT
0.302 0.745 0.933 RC
N
508.763 412.723 M
503.837 417.34 L
499.198 422.245 L
582.912 496.774 L
582.912 384.69 L
576.164 384.894 L
569.441 385.503 L
562.766 386.516 L
556.165 387.929 L
549.66 389.736 L
543.276 391.932 L
537.036 394.509 L
530.963 397.456 L
525.078 400.764 L
519.402 404.42 L
513.957 408.411 L
cp
f
GR
GS
[0.75 0 0 0.75 0 0.25] CT
0.302 0.745 0.933 RC
2 setlinecap
10.0 ML
0.667 LW
N
582.912 496.774 M
582.912 384.69 L
576.164 384.894 L
569.441 385.503 L
562.766 386.516 L
556.165 387.929 L
549.66 389.736 L
543.276 391.932 L
537.036 394.509 L
530.963 397.456 L
525.078 400.764 L
519.402 404.42 L
513.957 408.411 L
508.763 412.723 L
503.837 417.34 L
499.198 422.245 L
582.912 496.774 L
582.912 496.774 L
S
GR
GS
[0.75 0 0 0.75 0 0.25] CT
0.094 0.749 0.71 RC
N
506.514 584.486 M
511.48 589.363 L
516.74 593.923 L
522.272 598.148 L
528.056 602.021 L
534.068 605.528 L
540.288 608.655 L
546.689 611.389 L
553.247 613.721 L
559.938 615.642 L
566.735 617.143 L
573.612 618.22 L
580.543 618.867 L
587.5 619.083 L
594.457 618.867 L
601.388 618.22 L
608.265 617.143 L
615.062 615.642 L
621.753 613.721 L
628.311 611.389 L
634.712 608.655 L
640.932 605.528 L
646.944 602.021 L
652.728 598.148 L
658.26 593.923 L
663.519 589.363 L
668.486 584.486 L
673.139 579.309 L
677.463 573.854 L
681.439 568.14 L
685.053 562.191 L
688.291 556.029 L
691.14 549.678 L
693.589 543.163 L
695.629 536.508 L
697.253 529.739 L
698.452 522.882 L
699.224 515.964 L
699.565 509.012 L
699.474 502.052 L
698.951 495.111 L
697.998 488.215 L
696.619 481.392 L
694.819 474.668 L
692.605 468.069 L
689.986 461.62 L
686.971 455.346 L
683.573 449.271 L
679.804 443.418 L
675.679 437.811 L
671.215 432.471 L
587.5 507 L
503.785 432.471 L
499.321 437.811 L
495.196 443.418 L
491.427 449.271 L
488.029 455.346 L
485.014 461.62 L
482.395 468.069 L
480.181 474.668 L
478.381 481.392 L
477.002 488.215 L
476.049 495.111 L
475.526 502.052 L
475.435 509.012 L
475.776 515.964 L
476.548 522.882 L
477.747 529.739 L
479.371 536.508 L
481.411 543.163 L
483.86 549.678 L
486.709 556.029 L
489.947 562.191 L
493.561 568.14 L
497.537 573.854 L
501.861 579.309 L
cp
f
GR
GS
[0.75 0 0 0.75 0 0.25] CT
0 0.749 0.749 RC
2 setlinecap
10.0 ML
0.667 LW
N
587.5 507 M
503.785 432.471 L
499.321 437.811 L
495.196 443.418 L
491.427 449.271 L
488.029 455.346 L
485.014 461.62 L
482.395 468.069 L
480.181 474.668 L
478.381 481.392 L
477.002 488.215 L
476.049 495.111 L
475.526 502.052 L
475.435 509.012 L
475.776 515.964 L
476.548 522.882 L
477.747 529.739 L
479.371 536.508 L
481.411 543.163 L
483.86 549.678 L
486.709 556.029 L
489.947 562.191 L
493.561 568.14 L
497.537 573.854 L
501.861 579.309 L
506.514 584.486 L
511.48 589.363 L
516.74 593.923 L
522.272 598.148 L
528.056 602.021 L
534.068 605.528 L
540.288 608.655 L
546.689 611.389 L
553.247 613.721 L
559.938 615.642 L
566.735 617.143 L
573.612 618.22 L
580.543 618.867 L
587.5 619.083 L
594.457 618.867 L
601.388 618.22 L
608.265 617.143 L
615.062 615.642 L
621.753 613.721 L
628.311 611.389 L
634.712 608.655 L
640.932 605.528 L
646.944 602.021 L
652.728 598.148 L
658.26 593.923 L
663.519 589.363 L
668.486 584.486 L
673.139 579.309 L
677.463 573.854 L
681.439 568.14 L
685.053 562.191 L
688.291 556.029 L
691.14 549.678 L
693.589 543.163 L
695.629 536.508 L
697.253 529.739 L
698.452 522.882 L
699.224 515.964 L
699.565 509.012 L
699.474 502.052 L
698.951 495.111 L
697.998 488.215 L
696.619 481.392 L
694.819 474.668 L
692.605 468.069 L
689.986 461.62 L
686.971 455.346 L
683.573 449.271 L
679.804 443.418 L
675.679 437.811 L
671.215 432.471 L
587.5 507 L
587.5 507 L
S
GR
GS
[0.75 0 0 0.75 0 0.25] CT
0 0.447 0.741 RC
N
587.5 394.917 M
587.5 507 L
671.215 432.471 L
666.576 427.566 L
661.65 422.95 L
656.455 418.638 L
651.01 414.647 L
645.335 410.991 L
639.45 407.683 L
633.376 404.735 L
627.136 402.159 L
620.752 399.963 L
614.248 398.155 L
607.646 396.742 L
600.971 395.729 L
594.248 395.12 L
cp
f
GR
GS
[0.75 0 0 0.75 0 0.25] CT
0 0.447 0.741 RC
2 setlinecap
10.0 ML
0.667 LW
N
587.5 507 M
671.215 432.471 L
666.576 427.566 L
661.65 422.95 L
656.455 418.638 L
651.01 414.647 L
645.335 410.991 L
639.45 407.683 L
633.376 404.735 L
627.136 402.159 L
620.752 399.963 L
614.248 398.155 L
607.646 396.742 L
600.971 395.729 L
594.248 395.12 L
587.5 394.917 L
587.5 507 L
587.5 507 L
S
GR
GS
[0.75 0 0 0.75 428.58655 328.21181] CT
1 GC
/Helvetica-Bold 18.667 F
GS
[1 0 0 1 0 0] CT
-38 -5 moveto 
1 -1 scale
(13%) t 
GR
GR
GS
[0.75 0 0 0.75 445.875 412.96877] CT
1 GC
/Helvetica-Bold 18.667 F
GS
[1 0 0 1 0 0] CT
-19 19 moveto 
1 -1 scale
(74%) t 
GR
GR
GS
[0.75 0 0 0.75 451.47276 335.13166] CT
1 GC
/Helvetica-Bold 18.667 F
GS
[1 0 0 1 0 0] CT
0 -5 moveto 
1 -1 scale
(13%) t 
GR
GR
GS
[0.75 0 0 0.75 175.12517 277.14999] CT
/Helvetica-Bold 17.6 F
GS
[1 0 0 1 0 0] CT
-95 -4 moveto 
1 -1 scale
(ENU Profitability SM02) t 
GR
GR
GS
[0.75 0 0 0.75 0 0.25] CT
0.302 0.745 0.933 RC
N
162.724 406.047 M
157.236 410.15 L
152.009 414.581 L
147.063 419.323 L
142.415 424.359 L
138.084 429.669 L
134.086 435.233 L
130.435 441.032 L
127.145 447.043 L
124.229 453.244 L
121.697 459.611 L
227.066 497.822 L
227.066 385.739 L
220.217 385.949 L
213.393 386.576 L
206.621 387.62 L
199.925 389.075 L
193.33 390.937 L
186.862 393.198 L
180.544 395.85 L
174.399 398.883 L
168.452 402.287 L
cp
f
GR
GS
[0.75 0 0 0.75 0 0.25] CT
0.302 0.745 0.933 RC
2 setlinecap
10.0 ML
0.667 LW
N
227.066 497.822 M
227.066 385.739 L
220.217 385.949 L
213.393 386.576 L
206.621 387.62 L
199.925 389.075 L
193.33 390.937 L
186.862 393.198 L
180.544 395.85 L
174.399 398.883 L
168.452 402.287 L
162.724 406.047 L
157.236 410.15 L
152.009 414.581 L
147.063 419.323 L
142.415 424.359 L
138.084 429.669 L
134.086 435.233 L
130.435 441.032 L
127.145 447.043 L
124.229 453.244 L
121.697 459.611 L
227.066 497.822 L
227.066 497.822 L
S
GR
GS
[0.75 0 0 0.75 0 0.25] CT
0.094 0.749 0.71 RC
N
158.736 590.505 M
164.102 595.015 L
169.74 599.181 L
175.627 602.986 L
181.74 606.416 L
188.056 609.457 L
194.549 612.098 L
201.195 614.327 L
207.967 616.136 L
214.839 617.519 L
221.784 618.469 L
228.775 618.984 L
235.784 619.06 L
242.785 618.698 L
249.749 617.899 L
256.649 616.667 L
263.459 615.005 L
270.152 612.921 L
276.702 610.423 L
283.082 607.52 L
289.269 604.224 L
295.237 600.548 L
300.964 596.506 L
306.427 592.114 L
311.605 587.388 L
316.477 582.349 L
321.025 577.015 L
325.23 571.407 L
329.077 565.547 L
332.55 559.458 L
335.635 553.163 L
338.321 546.689 L
340.597 540.059 L
342.454 533.299 L
343.885 526.437 L
344.884 519.499 L
345.448 512.512 L
345.573 505.503 L
345.261 498.501 L
344.511 491.531 L
343.327 484.622 L
341.713 477.801 L
233.5 507 L
128.131 468.789 L
125.949 475.45 L
124.187 482.235 L
122.853 489.116 L
121.951 496.068 L
121.486 503.062 L
121.459 510.072 L
121.87 517.069 L
122.718 524.028 L
123.999 530.919 L
125.708 537.718 L
127.839 544.396 L
130.383 550.927 L
133.331 557.287 L
136.67 563.451 L
140.388 569.393 L
144.471 575.091 L
148.901 580.523 L
153.662 585.668 L
cp
f
GR
GS
[0.75 0 0 0.75 0 0.25] CT
0 0.749 0.749 RC
2 setlinecap
10.0 ML
0.667 LW
N
233.5 507 M
128.131 468.789 L
125.949 475.45 L
124.187 482.235 L
122.853 489.116 L
121.951 496.068 L
121.486 503.062 L
121.459 510.072 L
121.87 517.069 L
122.718 524.028 L
123.999 530.919 L
125.708 537.718 L
127.839 544.396 L
130.383 550.927 L
133.331 557.287 L
136.67 563.451 L
140.388 569.393 L
144.471 575.091 L
148.901 580.523 L
153.662 585.668 L
158.736 590.505 L
164.102 595.015 L
169.74 599.181 L
175.627 602.986 L
181.74 606.416 L
188.056 609.457 L
194.549 612.098 L
201.195 614.327 L
207.967 616.136 L
214.839 617.519 L
221.784 618.469 L
228.775 618.984 L
235.784 619.06 L
242.785 618.698 L
249.749 617.899 L
256.649 616.667 L
263.459 615.005 L
270.152 612.921 L
276.702 610.423 L
283.082 607.52 L
289.269 604.224 L
295.237 600.548 L
300.964 596.506 L
306.427 592.114 L
311.605 587.388 L
316.477 582.349 L
321.025 577.015 L
325.23 571.407 L
329.077 565.547 L
332.55 559.458 L
335.635 553.163 L
338.321 546.689 L
340.597 540.059 L
342.454 533.299 L
343.885 526.437 L
344.884 519.499 L
345.448 512.512 L
345.573 505.503 L
345.261 498.501 L
344.511 491.531 L
343.327 484.622 L
341.713 477.801 L
233.5 507 L
233.5 507 L
S
GR
GS
[0.75 0 0 0.75 0 0.25] CT
0 0.447 0.741 RC
N
233.5 394.917 M
233.5 507 L
341.713 477.801 L
339.687 471.125 L
337.25 464.589 L
334.41 458.217 L
331.18 452.034 L
327.571 446.064 L
323.598 440.33 L
319.276 434.854 L
314.622 429.657 L
309.654 424.761 L
304.39 420.182 L
298.852 415.941 L
293.06 412.051 L
287.038 408.53 L
280.809 405.39 L
274.396 402.644 L
267.825 400.302 L
261.121 398.373 L
254.31 396.865 L
247.418 395.784 L
240.473 395.134 L
cp
f
GR
GS
[0.75 0 0 0.75 0 0.25] CT
0 0.447 0.741 RC
2 setlinecap
10.0 ML
0.667 LW
N
233.5 507 M
341.713 477.801 L
339.687 471.125 L
337.25 464.589 L
334.41 458.217 L
331.18 452.034 L
327.571 446.064 L
323.598 440.33 L
319.276 434.854 L
314.622 429.657 L
309.654 424.761 L
304.39 420.182 L
298.852 415.941 L
293.06 412.051 L
287.038 408.53 L
280.809 405.39 L
274.396 402.644 L
267.825 400.302 L
261.121 398.373 L
254.31 396.865 L
247.418 395.784 L
240.473 395.134 L
233.5 394.917 L
233.5 507 L
233.5 507 L
S
GR
GS
[0.75 0 0 0.75 147.21709 336.90195] CT
1 GC
/Helvetica-Bold 18.667 F
GS
[1 0 0 1 0 0] CT
-38 -5 moveto 
1 -1 scale
(19%) t 
GR
GR
GS
[0.75 0 0 0.75 175.72683 416.63655] CT
1 GC
/Helvetica-Bold 18.667 F
GS
[1 0 0 1 0 0] CT
-19 19 moveto 
1 -1 scale
(60%) t 
GR
GR
GS
[0.75 0 0 0.75 193.10193 347.59018] CT
1 GC
/Helvetica-Bold 18.667 F
GS
[1 0 0 1 0 0] CT
0 -5 moveto 
1 -1 scale
(21%) t 
GR
GR
%%Trailer
%%Pages: 1
%%EOF
