\relax 
\providecommand\hyper@newdestlabel[2]{}
\@writefile{toc}{\contentsline {chapter}{\numberline {3}Receiver architecture and satellite-to-receiver measurements}{21}{chapter.3}\protected@file@percent }
\@writefile{lof}{\addvspace {10\p@ }}
\@writefile{lot}{\addvspace {10\p@ }}
\newlabel{ch:rxarchitecture}{{3}{21}{Receiver architecture and satellite-to-receiver measurements}{chapter.3}{}}
\acronymused{GNSS}
\acronymused{GNSS}
\acronymused{GNSS}
\acronymused{PVT}
\acronymused{GNSS}
\@writefile{toc}{\contentsline {section}{\numberline {3.1}Signal structure and frequency plans}{21}{section.3.1}\protected@file@percent }
\newlabel{sec:sigStruct}{{3.1}{21}{Signal structure and frequency plans}{section.3.1}{}}
\acronymused{GNSS}
\AC@undonewlabel{acro:SIS}
\newlabel{acro:SIS}{{3.1}{21}{Signal structure and frequency plans}{section.3.1}{}}
\acronymused{SIS}
\acronymused{ToA}
\acronymused{SIS}
\acronymused{GNSS}
\acronymused{SIS}
\acronymused{SIS}
\@writefile{loc}{\ChangesListline {replaced}{Replaced~(1)}{an}{21}}
\@writefile{loc}{\ChangesListline {added}{Added~(1)}{original}{21}}
\acronymused{RF}
\acronymused{RF}
\newlabel{eq:complexBaseband}{{3.2}{22}{Signal structure and frequency plans}{equation.3.1.2}{}}
\newlabel{eq:multiComponent}{{3.3}{22}{Signal structure and frequency plans}{equation.3.1.3}{}}
\acronymused{PRN}
\acronymused{CDMA}
\acronymused{GNSS}
\@writefile{lof}{\contentsline {figure}{\numberline {3.1}{\ignorespaces {\relax \fontsize  {10}{12}\selectfont  \abovedisplayskip 10\p@ plus2\p@ minus5\p@ \abovedisplayshortskip \z@ plus3\p@ \belowdisplayshortskip 6\p@ plus3\p@ minus3\p@ \def \leftmargin \leftmargini \parsep 4.5\p@ plus2\p@ minus\p@ \topsep 9\p@ plus3\p@ minus5\p@ \itemsep 4.5\p@ plus2\p@ minus\p@ {\leftmargin \leftmargini \topsep 6\p@ plus2\p@ minus2\p@ \parsep 3\p@ plus2\p@ minus\p@ \itemsep \parsep }\belowdisplayskip \abovedisplayskip \ac {GPS} navigation signal components: \ac {RF} carrier signal (top), subcarrier(second), spreading code (third), navigation data (bottom). The signals are not in scale.}\relax }}{22}{figure.caption.12}\protected@file@percent }
\acronymused{GPS}
\acronymused{RF}
\newlabel{fig:signals}{{3.1}{22}{{\small \ac {GPS} navigation signal components: \ac {RF} carrier signal (top), subcarrier(second), spreading code (third), navigation data (bottom). The signals are not in scale.}\relax }{figure.caption.12}{}}
\AC@undonewlabel{acro:MCS}
\newlabel{acro:MCS}{{3.1}{22}{Signal structure and frequency plans}{figure.caption.12}{}}
\acronymused{MCS}
\acronymused{SIS}
\acronymused{BOC}
\acronymused{MCS}
\acronymused{GPS}
\acronymused{RNSS}
\@writefile{lof}{\contentsline {figure}{\numberline {3.2}{\ignorespaces {\relax \fontsize  {10}{12}\selectfont  \abovedisplayskip 10\p@ plus2\p@ minus5\p@ \abovedisplayshortskip \z@ plus3\p@ \belowdisplayshortskip 6\p@ plus3\p@ minus3\p@ \def \leftmargin \leftmargini \parsep 4.5\p@ plus2\p@ minus\p@ \topsep 9\p@ plus3\p@ minus5\p@ \itemsep 4.5\p@ plus2\p@ minus\p@ {\leftmargin \leftmargini \topsep 6\p@ plus2\p@ minus2\p@ \parsep 3\p@ plus2\p@ minus\p@ \itemsep \parsep }\belowdisplayskip \abovedisplayskip Galielo and \ac {GPS} frequency plan fitting the bands reserved to \ac {RNSS}. Reproduced from \cite {galileo2008galileo}.}\relax }}{23}{figure.caption.13}\protected@file@percent }
\acronymused{GPS}
\acronymused{RNSS}
\newlabel{fig:signalPLan}{{3.2}{23}{{\small Galielo and \ac {GPS} frequency plan fitting the bands reserved to \ac {RNSS}. Reproduced from \cite {galileo2008galileo}.}\relax }{figure.caption.13}{}}
\acronymused{GPS}
\AC@undonewlabel{acro:ICD}
\newlabel{acro:ICD}{{3.1}{23}{Signal structure and frequency plans}{figure.caption.13}{}}
\acronymused{ICD}
\acronymused{GNSS}
\acronymused{GPS}
\@writefile{lot}{\contentsline {table}{\numberline {3.1}{\ignorespaces Current (2019) and modernized GPS signals \cite {GPS_ICD_800_2014}, \cite {GPS_ICD_705_2014}, \cite {GPS_ICD_200_2016}. Taken from \cite {inbook2011overview}.\relax }}{24}{table.caption.14}\protected@file@percent }
\newlabel{tab:GPSGAL_04}{{3.1}{24}{Current (2019) and modernized GPS signals \cite {GPS_ICD_800_2014}, \cite {GPS_ICD_705_2014}, \cite {GPS_ICD_200_2016}. Taken from \cite {inbook2011overview}.\relax }{table.caption.14}{}}
\@writefile{loc}{\ChangesListline {replaced}{Replaced~(1)}{HAS}{25}}
\@writefile{lot}{\contentsline {table}{\numberline {3.2}{\ignorespaces Current(2019) Galileo signals \cite {EC_GalCSdecision_2017}, \cite {EC_GalInitService_2016}, \cite {EU_GalileoICD_2016}. Taken from \cite {inbook2011overview}.\relax }}{25}{table.caption.15}\protected@file@percent }
\newlabel{tab:GPSGAL_05}{{3.2}{25}{Current(2019) Galileo signals \cite {EC_GalCSdecision_2017}, \cite {EC_GalInitService_2016}, \cite {EU_GalileoICD_2016}. Taken from \cite {inbook2011overview}.\relax }{table.caption.15}{}}
\@writefile{toc}{\contentsline {section}{\numberline {3.2}Receiver Architecture}{26}{section.3.2}\protected@file@percent }
\newlabel{sec:archite}{{3.2}{26}{Receiver Architecture}{section.3.2}{}}
\acronymused{GNSS}
\@writefile{loc}{\ChangesListline {added}{Added~(1)}{\textit  {decoding} of the navigation message,}{26}}
\AC@undonewlabel{acro:ADC}
\newlabel{acro:ADC}{{3.2}{26}{Receiver Architecture}{section.3.2}{}}
\acronymused{ADC}
\@writefile{toc}{\contentsline {subsection}{\numberline {3.2.1}Received signal}{26}{subsection.3.2.1}\protected@file@percent }
\acronymused{GNSS}
\acronymused{SIS}
\AC@undonewlabel{acro:LNA}
\newlabel{acro:LNA}{{3.2.1}{26}{Received signal}{equation.3.2.4}{}}
\acronymused{LNA}
\AC@undonewlabel{acro:AWGN}
\newlabel{acro:AWGN}{{3.2.1}{26}{Received signal}{equation.3.2.4}{}}
\acronymused{AWGN}
\newlabel{eq:noise}{{3.5}{26}{Received signal}{equation.3.2.5}{}}
\@writefile{toc}{\contentsline {subsection}{\numberline {3.2.2}Front-end}{26}{subsection.3.2.2}\protected@file@percent }
\acronymused{GNSS}
\acronymused{ADC}
\acronymused{LNA}
\acronymused{LNA}
\AC@undonewlabel{acro:IF}
\newlabel{acro:IF}{{3.2.2}{27}{Front-end}{subsection.3.2.2}{}}
\acronymused{IF}
\@writefile{lof}{\contentsline {figure}{\numberline {3.3}{\ignorespaces Front-end architecture for the Analog-to-digital conversion of \ac {GNSS} \ac {RF} signals.\relax }}{27}{figure.caption.16}\protected@file@percent }
\acronymused{GNSS}
\acronymused{RF}
\newlabel{fig:front_end}{{3.3}{27}{Front-end architecture for the Analog-to-digital conversion of \ac {GNSS} \ac {RF} signals.\relax }{figure.caption.16}{}}
\AC@undonewlabel{acro:LO}
\newlabel{acro:LO}{{3.2.2}{27}{Front-end}{figure.caption.16}{}}
\acronymused{LO}
\acronymused{RF}
\acronymused{RF}
\acronymused{IF}
\acronymused{IF}
\acronymused{LO}
\acronymused{LO}
\newlabel{Eq_s_mix_t}{{3.7}{27}{Front-end}{equation.3.2.7}{}}
\acronymused{IF}
\acronymused{IF}
\newlabel{Eq_y_IFi_t}{{3.8}{27}{Front-end}{equation.3.2.8}{}}
\acronymused{PRN}
\acronymused{IF}
\acronymused{IF}
\acronymused{GNSS}
\acronymused{ADC}
\@writefile{loc}{\ChangesListline {replaced}{Replaced}{digitalize}{27}}
\acronymused{ADC}
\@writefile{loc}{\ChangesListline {added}{Added~(1)}{indeed}{27}}
\@writefile{loc}{\ChangesListline {replaced}{Replaced~(1)}{transform}{27}}
\AC@undonewlabel{acro:AGC}
\newlabel{acro:AGC}{{3.2.2}{28}{Front-end}{equation.3.2.8}{}}
\acronymused{AGC}
\acronymused{ADC}
\acronymused{ADC}
\newlabel{Eq:y_IFi_nTs}{{3.9}{28}{Front-end}{equation.3.2.9}{}}
\newlabel{Eq:y_IFi_n}{{3.10}{28}{Front-end}{equation.3.2.10}{}}
\@writefile{toc}{\contentsline {subsection}{\numberline {3.2.3}Acquisition}{28}{subsection.3.2.3}\protected@file@percent }
\acronymused{GNSS}
\acronymused{ToA}
\acronymused{ML}
\newlabel{Eq:ML_acquisition}{{3.11}{28}{Acquisition}{equation.3.2.11}{}}
\newlabel{Eq:local_signal_acquisition}{{3.12}{28}{Acquisition}{equation.3.2.12}{}}
\acronymused{PRN}
\acronymused{CAF}
\acronymused{CAF}
\newlabel{Eq:CAF}{{3.13}{28}{Acquisition}{equation.3.2.13}{}}
\acronymused{CAF}
\acronymused{GPS}
\acronymused{GPS}
\@writefile{lof}{\contentsline {figure}{\numberline {3.4}{\ignorespaces Simplistic scheme of search space for the rough estimation of Doppler shift and code delay in the acquisition stage.\relax }}{29}{figure.caption.17}\protected@file@percent }
\newlabel{fig:searchSpace}{{3.4}{29}{Simplistic scheme of search space for the rough estimation of Doppler shift and code delay in the acquisition stage.\relax }{figure.caption.17}{}}
\acronymused{CAF}
\acronymused{PRN}
\acronymused{PRN}
\acronymused{PRN}
\acronymused{PRN}
\newlabel{fig:}{{\caption@xref {fig:}{ on input line 305}}{29}{Acquisition}{figure.caption.18}{}}
\newlabel{fig:}{{\caption@xref {fig:}{ on input line 309}}{29}{Acquisition}{figure.caption.18}{}}
\@writefile{lof}{\contentsline {figure}{\numberline {3.5}{\ignorespaces Example of \ac {CAF} over the search space evaluated on a Galileo \ac {PRN}$12$ (left) and for \ac {PRN}$21$ (right) realistic signal. Image taken from \cite {cristodaro2019advanced}.\relax }}{29}{figure.caption.18}\protected@file@percent }
\acronymused{CAF}
\acronymused{PRN}
\acronymused{PRN}
\newlabel{fig:acq_Galileo_PRN_12yes_21no}{{3.5}{29}{Example of \ac {CAF} over the search space evaluated on a Galileo \ac {PRN}$12$ (left) and for \ac {PRN}$21$ (right) realistic signal. Image taken from \cite {cristodaro2019advanced}.\relax }{figure.caption.18}{}}
\@writefile{toc}{\contentsline {subsection}{\numberline {3.2.4}Tracking}{30}{subsection.3.2.4}\protected@file@percent }
\newlabel{sec:tracking_GNSS_rx}{{3.2.4}{30}{Tracking}{subsection.3.2.4}{}}
\acronymused{CAF}
\acronymused{DLL}
\acronymused{PLL}
\acronymused{DLL}
\acronymused{PRN}
\acronymused{PLL}
\acronymused{DLL}
\acronymused{DLL}
\acronymused{PLL}
\@writefile{lof}{\contentsline {figure}{\numberline {3.6}{\ignorespaces Generic tracking loop (\ac {DLL}/\ac {PLL}) architecture.\relax }}{30}{figure.caption.19}\protected@file@percent }
\acronymused{DLL}
\acronymused{PLL}
\newlabel{fig:generic_DLL_PLL}{{3.6}{30}{Generic tracking loop (\ac {DLL}/\ac {PLL}) architecture.\relax }{figure.caption.19}{}}
\@writefile{toc}{\contentsline {subsubsection}{Code tracking loops}{30}{figure.caption.19}\protected@file@percent }
\acronymused{DLL}
\acronymused{DLL}
\acronymused{GNSS}
\acronymused{GNSS}
\AC@undonewlabel{acro:NCO}
\newlabel{acro:NCO}{{3.2.4}{31}{Code tracking loops}{figure.caption.19}{}}
\acronymused{NCO}
\@writefile{lof}{\contentsline {figure}{\numberline {3.7}{\ignorespaces Block diagram describing the architecture of a generic code and carrier tracking loop for \ac {GNSS} receivers.\relax }}{31}{figure.caption.20}\protected@file@percent }
\acronymused{GNSS}
\newlabel{fig:code_carrier_tracking_loops}{{3.7}{31}{Block diagram describing the architecture of a generic code and carrier tracking loop for \ac {GNSS} receivers.\relax }{figure.caption.20}{}}
\acronymused{DLL}
\@writefile{toc}{\contentsline {subsubsection}{Carrier tracking loops}{31}{figure.caption.21}\protected@file@percent }
\@writefile{lof}{\contentsline {figure}{\numberline {3.8}{\ignorespaces Example of code correlation phases: (a) replica code 1/2-chip early, (b) replica code 1/4-chip early, (c) replica code aligned, and (d) replica code 1/4-chip late. Figure taken from \cite {kaplan2005understanding}.\relax }}{32}{figure.caption.21}\protected@file@percent }
\newlabel{fig:DLL_correlation}{{3.8}{32}{Example of code correlation phases: (a) replica code 1/2-chip early, (b) replica code 1/4-chip early, (c) replica code aligned, and (d) replica code 1/4-chip late. Figure taken from \cite {kaplan2005understanding}.\relax }{figure.caption.21}{}}
\acronymused{GNSS}
\acronymused{PLL}
\acronymused{PLL}
\acronymused{PLL}
\acronymused{GNSS}
\acronymused{PLL}
\AC@undonewlabel{acro:FLL}
\newlabel{acro:FLL}{{3.2.4}{32}{Carrier tracking loops}{figure.caption.21}{}}
\acronymused{FLL}
\acronymused{PLL}
\acronymused{FLL}
\acronymused{PLL}
\acronymused{FLL}
\acronymused{GNSS}
\acronymused{PLL}
\acronymused{DLL}
\acronymused{PLL}
\acronymused{PLL}
\acronymused{DLL}
\newlabel{Eq:y_for_PLL}{{3.16}{33}{Carrier tracking loops}{equation.3.2.16}{}}
\@writefile{loc}{\ChangesListline {added}{Added~(1)}{where $\mathaccentV {tilde}07E{\eta }$ is the amplitude noise altered by non-linear trasformations applied during the tracking stage.}{33}}
\newlabel{Eq:arctan_costas_discr}{{3.19}{33}{Carrier tracking loops}{equation.3.2.19}{}}
\acronymused{PLL}
\@writefile{lof}{\contentsline {figure}{\numberline {3.9}{\ignorespaces I, Q phasor diagram\cite {kaplan2005understanding}.\relax }}{33}{figure.caption.22}\protected@file@percent }
\newlabel{fig:PLL_IQ_phasors}{{3.9}{33}{I, Q phasor diagram\cite {kaplan2005understanding}.\relax }{figure.caption.22}{}}
\@writefile{toc}{\contentsline {subsection}{\numberline {3.2.5}Navigation Message demodulation}{34}{subsection.3.2.5}\protected@file@percent }
\acronymused{GPS}
\acronymused{ICD}
\acronymused{GPS}
\AC@undonewlabel{acro:OS}
\newlabel{acro:OS}{{3.2.5}{34}{Navigation Message demodulation}{subsection.3.2.5}{}}
\acronymused{OS}
\acronymused{GPS}
\acronymused{GPS}
\@writefile{lof}{\contentsline {figure}{\numberline {3.10}{\ignorespaces \relax \fontsize  {10}{12}\selectfont  \abovedisplayskip 10\p@ plus2\p@ minus5\p@ \abovedisplayshortskip \z@ plus3\p@ \belowdisplayshortskip 6\p@ plus3\p@ minus3\p@ \def \leftmargin \leftmargini \parsep 4.5\p@ plus2\p@ minus\p@ \topsep 9\p@ plus3\p@ minus5\p@ \itemsep 4.5\p@ plus2\p@ minus\p@ {\leftmargin \leftmargini \topsep 6\p@ plus2\p@ minus2\p@ \parsep 3\p@ plus2\p@ minus\p@ \itemsep \parsep }\belowdisplayskip \abovedisplayskip {Structure of the navigation message included in the \ac {GPS} civil signal, transmitted on L1 frequency.}\relax }}{34}{figure.caption.23}\protected@file@percent }
\acronymused{GPS}
\newlabel{fig:navMessage}{{3.10}{34}{\small {Structure of the navigation message included in the \ac {GPS} civil signal, transmitted on L1 frequency.}\relax }{figure.caption.23}{}}
\acronymused{GPS}
\acronymused{GPS}
\@writefile{toc}{\contentsline {section}{\numberline {3.3}Pseudorange Measurements}{35}{section.3.3}\protected@file@percent }
\newlabel{sec:pseudoClass}{{3.3}{35}{Pseudorange Measurements}{section.3.3}{}}
\acronymused{PVT}
\@writefile{toc}{\contentsline {subsection}{\numberline {3.3.1}Raw measurements computation}{35}{subsection.3.3.1}\protected@file@percent }
\AC@undonewlabel{acro:TLM}
\newlabel{acro:TLM}{{3.3.1}{36}{Raw measurements computation}{subsection.3.3.1}{}}
\acronymused{TLM}
\newlabel{time1}{{3.20}{36}{Raw measurements computation}{equation.3.3.20}{}}
\AC@undonewlabel{acro:HOW}
\newlabel{acro:HOW}{{3.3.1}{36}{Raw measurements computation}{equation.3.3.20}{}}
\acronymused{HOW}
\acronymused{GNSS}
\acronymused{GNSS}
\newlabel{time2}{{3.21}{36}{Raw measurements computation}{equation.3.3.21}{}}
\newlabel{time3}{{3.22}{36}{Raw measurements computation}{equation.3.3.22}{}}
\newlabel{time4}{{3.23}{36}{Raw measurements computation}{equation.3.3.23}{}}
\newlabel{time5}{{3.24}{36}{Raw measurements computation}{equation.3.3.24}{}}
\newlabel{time6}{{3.25}{36}{Raw measurements computation}{equation.3.3.25}{}}
\@writefile{lof}{\contentsline {figure}{\numberline {3.11}{\ignorespaces {\relax \fontsize  {10}{12}\selectfont  \abovedisplayskip 10\p@ plus2\p@ minus5\p@ \abovedisplayshortskip \z@ plus3\p@ \belowdisplayshortskip 6\p@ plus3\p@ minus3\p@ \def \leftmargin \leftmargini \parsep 4.5\p@ plus2\p@ minus\p@ \topsep 9\p@ plus3\p@ minus5\p@ \itemsep 4.5\p@ plus2\p@ minus\p@ {\leftmargin \leftmargini \topsep 6\p@ plus2\p@ minus2\p@ \parsep 3\p@ plus2\p@ minus\p@ \itemsep \parsep }\belowdisplayskip \abovedisplayskip Common reception time diagram.}\relax }}{36}{figure.caption.24}\protected@file@percent }
\newlabel{fig:commonrx}{{3.11}{36}{{\small Common reception time diagram.}\relax }{figure.caption.24}{}}
\@writefile{toc}{\contentsline {subsection}{\numberline {3.3.2}Pseudorange correction and PVT}{37}{subsection.3.3.2}\protected@file@percent }
\acronymused{GNSS}
\acronymused{GNSS}
\newlabel{eq:totalDelay}{{3.26}{37}{Pseudorange correction and PVT}{equation.3.3.26}{}}
\acronymused{RF}
\acronymused{RF}
\acronymused{IF}
\acronymused{LNA}
\acronymused{RF}
\acronymused{PVT}
\acronymused{PVT}
\acronymused{PVT}
\acronymused{ICD}
\@writefile{loc}{\ChangesListline {deleted}{Deleted~(1)}{s}{37}}
\@writefile{toc}{\contentsline {subsection}{\numberline {3.3.3}GNSS software receivers}{37}{subsection.3.3.3}\protected@file@percent }
\acronymused{GNSS}
\@writefile{lof}{\contentsline {figure}{\numberline {3.12}{\ignorespaces {\relax \fontsize  {10}{12}\selectfont  \abovedisplayskip 10\p@ plus2\p@ minus5\p@ \abovedisplayshortskip \z@ plus3\p@ \belowdisplayshortskip 6\p@ plus3\p@ minus3\p@ \def \leftmargin \leftmargini \parsep 4.5\p@ plus2\p@ minus\p@ \topsep 9\p@ plus3\p@ minus5\p@ \itemsep 4.5\p@ plus2\p@ minus\p@ {\leftmargin \leftmargini \topsep 6\p@ plus2\p@ minus2\p@ \parsep 3\p@ plus2\p@ minus\p@ \itemsep \parsep }\belowdisplayskip \abovedisplayskip Pseudorange correction scheme reproduced from the GPS ICD \cite {navstar1993icd}.}\relax }}{38}{figure.caption.25}\protected@file@percent }
\newlabel{fig:pseudorangeICD}{{3.12}{38}{{\small Pseudorange correction scheme reproduced from the GPS ICD \cite {navstar1993icd}.}\relax }{figure.caption.25}{}}
\acronymused{GNSS}
\acronymused{GNSS}
\AC@undonewlabel{acro:SDR}
\newlabel{acro:SDR}{{3.3.3}{38}{GNSS software receivers}{subsection.3.3.3}{}}
\acronymused{SDR}
\acronymused{SDR}
\acronymused{GNSS}
\acronymused{GNSS}
\acronymused{SDR}
\acronymused{GNSS}
\AC@undonewlabel{acro:HW}
\newlabel{acro:HW}{{3.3.3}{38}{GNSS software receivers}{subsection.3.3.3}{}}
\acronymused{HW}
\AC@undonewlabel{acro:SW}
\newlabel{acro:SW}{{3.3.3}{38}{GNSS software receivers}{subsection.3.3.3}{}}
\acronymused{SW}
\acronymused{SDR}
\AC@undonewlabel{acro:USRP}
\newlabel{acro:USRP}{{3.3.3}{38}{GNSS software receivers}{subsection.3.3.3}{}}
\acronymused{USRP}
\acronymused{GNSS}
\acronymused{GNSS}
\@writefile{toc}{\contentsline {section}{\numberline {3.4}Networked \ac {GNSS} Mass-market receiver: a concept}{39}{section.3.4}\protected@file@percent }
\acronymused{GNSS}
\AC@undonewlabel{acro:TTF}
\newlabel{acro:TTF}{{3.4}{39}{Networked \ac {GNSS} Mass-market receiver: a concept}{section.3.4}{}}
\acronymused{TTF}
\acronymused{GNSS}
\AC@undonewlabel{acro:CRU}
\newlabel{acro:CRU}{{3.4}{39}{Networked \ac {GNSS} Mass-market receiver: a concept}{section.3.4}{}}
\acronymused{CRU}
\acronymused{CRU}
\acronymused{PVT}
\@writefile{lof}{\contentsline {figure}{\numberline {3.13}{\ignorespaces {\relax \fontsize  {10}{12}\selectfont  \abovedisplayskip 10\p@ plus2\p@ minus5\p@ \abovedisplayshortskip \z@ plus3\p@ \belowdisplayshortskip 6\p@ plus3\p@ minus3\p@ \def \leftmargin \leftmargini \parsep 4.5\p@ plus2\p@ minus\p@ \topsep 9\p@ plus3\p@ minus5\p@ \itemsep 4.5\p@ plus2\p@ minus\p@ {\leftmargin \leftmargini \topsep 6\p@ plus2\p@ minus2\p@ \parsep 3\p@ plus2\p@ minus\p@ \itemsep \parsep }\belowdisplayskip \abovedisplayskip High-level scheme of the concept of a networked \ac {GNSS} receiver with a PVT stage aided by auxiliary measurements retrieved from collaborating receivers.}\relax }}{39}{figure.caption.26}\protected@file@percent }
\acronymused{GNSS}
\newlabel{fig:hiLevIntScheme}{{3.13}{39}{{\small High-level scheme of the concept of a networked \ac {GNSS} receiver with a PVT stage aided by auxiliary measurements retrieved from collaborating receivers.}\relax }{figure.caption.26}{}}
\acronymused{GNSS}
\acronymused{PVT}
\acronymused{GNSS}
\acronymused{PVT}
\acronymused{CRU}
\acronymused{GNSS}
\acronymused{GNSS}
\@writefile{lof}{\contentsline {figure}{\numberline {3.14}{\ignorespaces {\relax \fontsize  {10}{12}\selectfont  \abovedisplayskip 10\p@ plus2\p@ minus5\p@ \abovedisplayshortskip \z@ plus3\p@ \belowdisplayshortskip 6\p@ plus3\p@ minus3\p@ \def \leftmargin \leftmargini \parsep 4.5\p@ plus2\p@ minus\p@ \topsep 9\p@ plus3\p@ minus5\p@ \itemsep 4.5\p@ plus2\p@ minus\p@ {\leftmargin \leftmargini \topsep 6\p@ plus2\p@ minus2\p@ \parsep 3\p@ plus2\p@ minus\p@ \itemsep \parsep }\belowdisplayskip \abovedisplayskip Asynchronous measurements and \ac {PVT} epochs in \ac {GNSS} independent receivers.}\relax }}{40}{figure.caption.27}\protected@file@percent }
\acronymused{PVT}
\acronymused{GNSS}
\newlabel{fig:epochsAlignment}{{3.14}{40}{{\small Asynchronous measurements and \ac {PVT} epochs in \ac {GNSS} independent receivers.}\relax }{figure.caption.27}{}}
\acronymused{RF}
\acronymused{GNSS}
\@setckpt{Chapter2/chapter2}{
\setcounter{page}{41}
\setcounter{equation}{26}
\setcounter{enumi}{0}
\setcounter{enumii}{0}
\setcounter{enumiii}{0}
\setcounter{enumiv}{0}
\setcounter{footnote}{0}
\setcounter{mpfootnote}{0}
\setcounter{part}{0}
\setcounter{chapter}{3}
\setcounter{section}{4}
\setcounter{subsection}{0}
\setcounter{subsubsection}{0}
\setcounter{paragraph}{0}
\setcounter{subparagraph}{0}
\setcounter{figure}{14}
\setcounter{table}{2}
\setcounter{SDpage}{0}
\setcounter{NumberSD}{0}
\setcounter{tomo}{0}
\setcounter{parentequation}{0}
\setcounter{caption@flags}{0}
\setcounter{ContinuedFloat}{0}
\setcounter{subfigure}{0}
\setcounter{subtable}{0}
\setcounter{float@type}{16}
\setcounter{tabx@nest}{0}
\setcounter{listtotal}{0}
\setcounter{listcount}{0}
\setcounter{liststart}{0}
\setcounter{liststop}{0}
\setcounter{citecount}{0}
\setcounter{citetotal}{0}
\setcounter{multicitecount}{0}
\setcounter{multicitetotal}{0}
\setcounter{instcount}{182}
\setcounter{maxnames}{3}
\setcounter{minnames}{1}
\setcounter{maxitems}{3}
\setcounter{minitems}{1}
\setcounter{citecounter}{0}
\setcounter{maxcitecounter}{0}
\setcounter{savedcitecounter}{0}
\setcounter{uniquelist}{0}
\setcounter{uniquename}{0}
\setcounter{refsection}{0}
\setcounter{refsegment}{0}
\setcounter{maxextratitle}{0}
\setcounter{maxextratitleyear}{0}
\setcounter{maxextraname}{5}
\setcounter{maxextradate}{0}
\setcounter{maxextraalpha}{0}
\setcounter{abbrvpenalty}{50}
\setcounter{highnamepenalty}{50}
\setcounter{lownamepenalty}{25}
\setcounter{maxparens}{3}
\setcounter{parenlevel}{0}
\setcounter{mincomprange}{10}
\setcounter{maxcomprange}{100000}
\setcounter{mincompwidth}{1}
\setcounter{afterword}{0}
\setcounter{savedafterword}{0}
\setcounter{annotator}{0}
\setcounter{savedannotator}{0}
\setcounter{author}{0}
\setcounter{savedauthor}{0}
\setcounter{bookauthor}{0}
\setcounter{savedbookauthor}{0}
\setcounter{commentator}{0}
\setcounter{savedcommentator}{0}
\setcounter{editor}{0}
\setcounter{savededitor}{0}
\setcounter{editora}{0}
\setcounter{savededitora}{0}
\setcounter{editorb}{0}
\setcounter{savededitorb}{0}
\setcounter{editorc}{0}
\setcounter{savededitorc}{0}
\setcounter{foreword}{0}
\setcounter{savedforeword}{0}
\setcounter{holder}{0}
\setcounter{savedholder}{0}
\setcounter{introduction}{0}
\setcounter{savedintroduction}{0}
\setcounter{namea}{0}
\setcounter{savednamea}{0}
\setcounter{nameb}{0}
\setcounter{savednameb}{0}
\setcounter{namec}{0}
\setcounter{savednamec}{0}
\setcounter{translator}{0}
\setcounter{savedtranslator}{0}
\setcounter{shortauthor}{0}
\setcounter{savedshortauthor}{0}
\setcounter{shorteditor}{0}
\setcounter{savedshorteditor}{0}
\setcounter{labelname}{0}
\setcounter{savedlabelname}{0}
\setcounter{institution}{0}
\setcounter{savedinstitution}{0}
\setcounter{lista}{0}
\setcounter{savedlista}{0}
\setcounter{listb}{0}
\setcounter{savedlistb}{0}
\setcounter{listc}{0}
\setcounter{savedlistc}{0}
\setcounter{listd}{0}
\setcounter{savedlistd}{0}
\setcounter{liste}{0}
\setcounter{savedliste}{0}
\setcounter{listf}{0}
\setcounter{savedlistf}{0}
\setcounter{location}{0}
\setcounter{savedlocation}{0}
\setcounter{organization}{0}
\setcounter{savedorganization}{0}
\setcounter{origlocation}{0}
\setcounter{savedoriglocation}{0}
\setcounter{origpublisher}{0}
\setcounter{savedorigpublisher}{0}
\setcounter{publisher}{0}
\setcounter{savedpublisher}{0}
\setcounter{language}{0}
\setcounter{savedlanguage}{0}
\setcounter{origlanguage}{0}
\setcounter{savedoriglanguage}{0}
\setcounter{pageref}{0}
\setcounter{savedpageref}{0}
\setcounter{textcitecount}{0}
\setcounter{textcitetotal}{0}
\setcounter{textcitemaxnames}{0}
\setcounter{biburlnumpenalty}{0}
\setcounter{biburlucpenalty}{0}
\setcounter{biburllcpenalty}{0}
\setcounter{smartand}{1}
\setcounter{bbx:relatedcount}{0}
\setcounter{bbx:relatedtotal}{0}
\setcounter{Item}{0}
\setcounter{Hfootnote}{0}
\setcounter{bookmark@seq@number}{29}
\setcounter{nlinenum}{0}
\setcounter{algorithm}{0}
\setcounter{ALC@unique}{0}
\setcounter{ALC@line}{0}
\setcounter{ALC@rem}{0}
\setcounter{ALC@depth}{0}
\setcounter{@todonotes@numberoftodonotes}{0}
\setcounter{Changes@AuthorCount}{2}
\setcounter{Changes@Author}{2}
\setcounter{Changes@addedCount}{0}
\setcounter{Changes@deletedCount}{0}
\setcounter{Changes@replacedCount}{1}
\setcounter{Changes@highlightCount}{0}
\setcounter{Changes@commentCount}{0}
\setcounter{authorcommentcount}{0}
\setcounter{Changes@addedCount1}{12}
\setcounter{Changes@deletedCount1}{2}
\setcounter{Changes@replacedCount1}{5}
\setcounter{Changes@highlightCount1}{0}
\setcounter{Changes@commentCount1}{0}
\setcounter{lstnumber}{1}
\setcounter{FancyVerbLine}{0}
\setcounter{section@level}{0}
\setcounter{lstlisting}{0}
}
