%!PS-Adobe-3.0 EPSF-3.0
%%Creator: (MATLAB, The Mathworks, Inc. Version 9.5.0.944444 \(R2018b\). Operating System: Windows 10)
%%Title: (C:/Users/Alex/Documents/PhD Docs/NavSAS Git Repo/ieee_trans_vehicular_iar2019/fig/fullComparisonError_new_v2.eps)
%%CreationDate: 2019-05-02T17:09:17
%%Pages: (atend)
%%BoundingBox: 0 0 635 650
%%LanguageLevel: 3
%%EndComments
%%BeginProlog
%%BeginResource: procset (Apache XML Graphics Std ProcSet) 1.2 0
%%Version: 1.2 0
%%Copyright: (Copyright 2001-2003,2010 The Apache Software Foundation. License terms: http://www.apache.org/licenses/LICENSE-2.0)
/bd{bind def}bind def
/ld{load def}bd
/GR/grestore ld
/GS/gsave ld
/RM/rmoveto ld
/C/curveto ld
/t/show ld
/L/lineto ld
/ML/setmiterlimit ld
/CT/concat ld
/f/fill ld
/N/newpath ld
/S/stroke ld
/CC/setcmykcolor ld
/A/ashow ld
/cp/closepath ld
/RC/setrgbcolor ld
/LJ/setlinejoin ld
/GC/setgray ld
/LW/setlinewidth ld
/M/moveto ld
/re {4 2 roll M
1 index 0 rlineto
0 exch rlineto
neg 0 rlineto
cp } bd
/_ctm matrix def
/_tm matrix def
/BT { _ctm currentmatrix pop matrix _tm copy pop 0 0 moveto } bd
/ET { _ctm setmatrix } bd
/iTm { _ctm setmatrix _tm concat } bd
/Tm { _tm astore pop iTm 0 0 moveto } bd
/ux 0.0 def
/uy 0.0 def
/F {
  /Tp exch def
  /Tf exch def
  Tf findfont Tp scalefont setfont
  /cf Tf def  /cs Tp def
} bd
/ULS {currentpoint /uy exch def /ux exch def} bd
/ULE {
  /Tcx currentpoint pop def
  gsave
  newpath
  cf findfont cs scalefont dup
  /FontMatrix get 0 get /Ts exch def /FontInfo get dup
  /UnderlinePosition get Ts mul /To exch def
  /UnderlineThickness get Ts mul /Tt exch def
  ux uy To add moveto  Tcx uy To add lineto
  Tt setlinewidth stroke
  grestore
} bd
/OLE {
  /Tcx currentpoint pop def
  gsave
  newpath
  cf findfont cs scalefont dup
  /FontMatrix get 0 get /Ts exch def /FontInfo get dup
  /UnderlinePosition get Ts mul /To exch def
  /UnderlineThickness get Ts mul /Tt exch def
  ux uy To add cs add moveto Tcx uy To add cs add lineto
  Tt setlinewidth stroke
  grestore
} bd
/SOE {
  /Tcx currentpoint pop def
  gsave
  newpath
  cf findfont cs scalefont dup
  /FontMatrix get 0 get /Ts exch def /FontInfo get dup
  /UnderlinePosition get Ts mul /To exch def
  /UnderlineThickness get Ts mul /Tt exch def
  ux uy To add cs 10 mul 26 idiv add moveto Tcx uy To add cs 10 mul 26 idiv add lineto
  Tt setlinewidth stroke
  grestore
} bd
/QT {
/Y22 exch store
/X22 exch store
/Y21 exch store
/X21 exch store
currentpoint
/Y21 load 2 mul add 3 div exch
/X21 load 2 mul add 3 div exch
/X21 load 2 mul /X22 load add 3 div
/Y21 load 2 mul /Y22 load add 3 div
/X22 load /Y22 load curveto
} bd
/SSPD {
dup length /d exch dict def
{
/v exch def
/k exch def
currentpagedevice k known {
/cpdv currentpagedevice k get def
v cpdv ne {
/upd false def
/nullv v type /nulltype eq def
/nullcpdv cpdv type /nulltype eq def
nullv nullcpdv or
{
/upd true def
} {
/sametype v type cpdv type eq def
sametype {
v type /arraytype eq {
/vlen v length def
/cpdvlen cpdv length def
vlen cpdvlen eq {
0 1 vlen 1 sub {
/i exch def
/obj v i get def
/cpdobj cpdv i get def
obj cpdobj ne {
/upd true def
exit
} if
} for
} {
/upd true def
} ifelse
} {
v type /dicttype eq {
v {
/dv exch def
/dk exch def
/cpddv cpdv dk get def
dv cpddv ne {
/upd true def
exit
} if
} forall
} {
/upd true def
} ifelse
} ifelse
} if
} ifelse
upd true eq {
d k v put
} if
} if
} if
} forall
d length 0 gt {
d setpagedevice
} if
} bd
/RE { % /NewFontName [NewEncodingArray] /FontName RE -
  findfont dup length dict begin
  {
    1 index /FID ne
    {def} {pop pop} ifelse
  } forall
  /Encoding exch def
  /FontName 1 index def
  currentdict definefont pop
  end
} bind def
%%EndResource
%%BeginResource: procset (Apache XML Graphics EPS ProcSet) 1.0 0
%%Version: 1.0 0
%%Copyright: (Copyright 2002-2003 The Apache Software Foundation. License terms: http://www.apache.org/licenses/LICENSE-2.0)
/BeginEPSF { %def
/b4_Inc_state save def         % Save state for cleanup
/dict_count countdictstack def % Count objects on dict stack
/op_count count 1 sub def      % Count objects on operand stack
userdict begin                 % Push userdict on dict stack
/showpage { } def              % Redefine showpage, { } = null proc
0 setgray 0 setlinecap         % Prepare graphics state
1 setlinewidth 0 setlinejoin
10 setmiterlimit [ ] 0 setdash newpath
/languagelevel where           % If level not equal to 1 then
{pop languagelevel             % set strokeadjust and
1 ne                           % overprint to their defaults.
{false setstrokeadjust false setoverprint
} if
} if
} bd
/EndEPSF { %def
count op_count sub {pop} repeat            % Clean up stacks
countdictstack dict_count sub {end} repeat
b4_Inc_state restore
} bd
%%EndResource
%FOPBeginFontDict
%%IncludeResource: font Courier-Oblique
%%IncludeResource: font Courier-BoldOblique
%%IncludeResource: font Courier-Bold
%%IncludeResource: font ZapfDingbats
%%IncludeResource: font Symbol
%%IncludeResource: font Helvetica
%%IncludeResource: font Helvetica-Oblique
%%IncludeResource: font Helvetica-Bold
%%IncludeResource: font Helvetica-BoldOblique
%%IncludeResource: font Times-Roman
%%IncludeResource: font Times-Italic
%%IncludeResource: font Times-Bold
%%IncludeResource: font Times-BoldItalic
%%IncludeResource: font Courier
%FOPEndFontDict
%%BeginResource: encoding WinAnsiEncoding
/WinAnsiEncoding [
/.notdef /.notdef /.notdef /.notdef /.notdef
/.notdef /.notdef /.notdef /.notdef /.notdef
/.notdef /.notdef /.notdef /.notdef /.notdef
/.notdef /.notdef /.notdef /.notdef /.notdef
/.notdef /.notdef /.notdef /.notdef /.notdef
/.notdef /.notdef /.notdef /.notdef /.notdef
/.notdef /.notdef /space /exclam /quotedbl
/numbersign /dollar /percent /ampersand /quotesingle
/parenleft /parenright /asterisk /plus /comma
/hyphen /period /slash /zero /one
/two /three /four /five /six
/seven /eight /nine /colon /semicolon
/less /equal /greater /question /at
/A /B /C /D /E
/F /G /H /I /J
/K /L /M /N /O
/P /Q /R /S /T
/U /V /W /X /Y
/Z /bracketleft /backslash /bracketright /asciicircum
/underscore /quoteleft /a /b /c
/d /e /f /g /h
/i /j /k /l /m
/n /o /p /q /r
/s /t /u /v /w
/x /y /z /braceleft /bar
/braceright /asciitilde /bullet /Euro /bullet
/quotesinglbase /florin /quotedblbase /ellipsis /dagger
/daggerdbl /circumflex /perthousand /Scaron /guilsinglleft
/OE /bullet /Zcaron /bullet /bullet
/quoteleft /quoteright /quotedblleft /quotedblright /bullet
/endash /emdash /asciitilde /trademark /scaron
/guilsinglright /oe /bullet /zcaron /Ydieresis
/space /exclamdown /cent /sterling /currency
/yen /brokenbar /section /dieresis /copyright
/ordfeminine /guillemotleft /logicalnot /sfthyphen /registered
/macron /degree /plusminus /twosuperior /threesuperior
/acute /mu /paragraph /middot /cedilla
/onesuperior /ordmasculine /guillemotright /onequarter /onehalf
/threequarters /questiondown /Agrave /Aacute /Acircumflex
/Atilde /Adieresis /Aring /AE /Ccedilla
/Egrave /Eacute /Ecircumflex /Edieresis /Igrave
/Iacute /Icircumflex /Idieresis /Eth /Ntilde
/Ograve /Oacute /Ocircumflex /Otilde /Odieresis
/multiply /Oslash /Ugrave /Uacute /Ucircumflex
/Udieresis /Yacute /Thorn /germandbls /agrave
/aacute /acircumflex /atilde /adieresis /aring
/ae /ccedilla /egrave /eacute /ecircumflex
/edieresis /igrave /iacute /icircumflex /idieresis
/eth /ntilde /ograve /oacute /ocircumflex
/otilde /odieresis /divide /oslash /ugrave
/uacute /ucircumflex /udieresis /yacute /thorn
/ydieresis
] def
%%EndResource
%FOPBeginFontReencode
/Courier-Oblique findfont
dup length dict begin
  {1 index /FID ne {def} {pop pop} ifelse} forall
  /Encoding WinAnsiEncoding def
  currentdict
end
/Courier-Oblique exch definefont pop
/Courier-BoldOblique findfont
dup length dict begin
  {1 index /FID ne {def} {pop pop} ifelse} forall
  /Encoding WinAnsiEncoding def
  currentdict
end
/Courier-BoldOblique exch definefont pop
/Courier-Bold findfont
dup length dict begin
  {1 index /FID ne {def} {pop pop} ifelse} forall
  /Encoding WinAnsiEncoding def
  currentdict
end
/Courier-Bold exch definefont pop
/Helvetica findfont
dup length dict begin
  {1 index /FID ne {def} {pop pop} ifelse} forall
  /Encoding WinAnsiEncoding def
  currentdict
end
/Helvetica exch definefont pop
/Helvetica-Oblique findfont
dup length dict begin
  {1 index /FID ne {def} {pop pop} ifelse} forall
  /Encoding WinAnsiEncoding def
  currentdict
end
/Helvetica-Oblique exch definefont pop
/Helvetica-Bold findfont
dup length dict begin
  {1 index /FID ne {def} {pop pop} ifelse} forall
  /Encoding WinAnsiEncoding def
  currentdict
end
/Helvetica-Bold exch definefont pop
/Helvetica-BoldOblique findfont
dup length dict begin
  {1 index /FID ne {def} {pop pop} ifelse} forall
  /Encoding WinAnsiEncoding def
  currentdict
end
/Helvetica-BoldOblique exch definefont pop
/Times-Roman findfont
dup length dict begin
  {1 index /FID ne {def} {pop pop} ifelse} forall
  /Encoding WinAnsiEncoding def
  currentdict
end
/Times-Roman exch definefont pop
/Times-Italic findfont
dup length dict begin
  {1 index /FID ne {def} {pop pop} ifelse} forall
  /Encoding WinAnsiEncoding def
  currentdict
end
/Times-Italic exch definefont pop
/Times-Bold findfont
dup length dict begin
  {1 index /FID ne {def} {pop pop} ifelse} forall
  /Encoding WinAnsiEncoding def
  currentdict
end
/Times-Bold exch definefont pop
/Times-BoldItalic findfont
dup length dict begin
  {1 index /FID ne {def} {pop pop} ifelse} forall
  /Encoding WinAnsiEncoding def
  currentdict
end
/Times-BoldItalic exch definefont pop
/Courier findfont
dup length dict begin
  {1 index /FID ne {def} {pop pop} ifelse} forall
  /Encoding WinAnsiEncoding def
  currentdict
end
/Courier exch definefont pop
%FOPEndFontReencode
%%EndProlog
%%Page: 1 1
%%PageBoundingBox: 0 0 635 650
%%BeginPageSetup
[1 0 0 -1 0 650] CT
%%EndPageSetup
GS
[0.75 0 0 0.75 0 0.5] CT
1 GC
N
0 0 846 866 re
f
GR
GS
[0.75 0 0 0.75 0 0.5] CT
1 GC
N
0 0 846 866 re
f
GR
GS
[0.75 0 0 0.75 0 0.5] CT
1 GC
N
111 778 M
766 778 L
766 629 L
111 629 L
cp
f
GR
GS
[0.75 0 0 0.75 0 0.5] CT
0.149 GC
2 setlinecap
1 LJ
0.667 LW
N
111 778 M
766 778 L
S
GR
GS
[0.75 0 0 0.75 0 0.5] CT
0.149 GC
2 setlinecap
1 LJ
0.667 LW
N
111 629 M
766 629 L
S
GR
GS
[0.75 0 0 0.75 0 0.5] CT
0.149 GC
2 setlinecap
1 LJ
0.667 LW
N
111 778 M
111 771.45 L
S
GR
GS
[0.75 0 0 0.75 0 0.5] CT
0.149 GC
2 setlinecap
1 LJ
0.667 LW
N
242 778 M
242 771.45 L
S
GR
GS
[0.75 0 0 0.75 0 0.5] CT
0.149 GC
2 setlinecap
1 LJ
0.667 LW
N
373 778 M
373 771.45 L
S
GR
GS
[0.75 0 0 0.75 0 0.5] CT
0.149 GC
2 setlinecap
1 LJ
0.667 LW
N
504 778 M
504 771.45 L
S
GR
GS
[0.75 0 0 0.75 0 0.5] CT
0.149 GC
2 setlinecap
1 LJ
0.667 LW
N
635 778 M
635 771.45 L
S
GR
GS
[0.75 0 0 0.75 0 0.5] CT
0.149 GC
2 setlinecap
1 LJ
0.667 LW
N
766 778 M
766 771.45 L
S
GR
GS
[0.75 0 0 0.75 0 0.5] CT
0.149 GC
2 setlinecap
1 LJ
0.667 LW
N
111 629 M
111 635.55 L
S
GR
GS
[0.75 0 0 0.75 0 0.5] CT
0.149 GC
2 setlinecap
1 LJ
0.667 LW
N
242 629 M
242 635.55 L
S
GR
GS
[0.75 0 0 0.75 0 0.5] CT
0.149 GC
2 setlinecap
1 LJ
0.667 LW
N
373 629 M
373 635.55 L
S
GR
GS
[0.75 0 0 0.75 0 0.5] CT
0.149 GC
2 setlinecap
1 LJ
0.667 LW
N
504 629 M
504 635.55 L
S
GR
GS
[0.75 0 0 0.75 0 0.5] CT
0.149 GC
2 setlinecap
1 LJ
0.667 LW
N
635 629 M
635 635.55 L
S
GR
GS
[0.75 0 0 0.75 0 0.5] CT
0.149 GC
2 setlinecap
1 LJ
0.667 LW
N
766 629 M
766 635.55 L
S
GR
GS
[0.75 0 0 0.75 83.25 589.60001] CT
0.149 GC
N
0 20.691 M
-2.938 20.691 -4 18.269 QT
-5.063 15.847 -5.063 12.504 QT
-5.063 10.426 -4.68 8.582 QT
-4.297 6.738 -3.164 5.457 QT
-2.031 4.176 0 4.176 QT
1.578 4.176 2.586 4.949 QT
3.594 5.722 4.125 6.949 QT
4.656 8.176 4.852 9.574 QT
5.047 10.972 5.047 12.504 QT
5.047 14.566 4.664 16.363 QT
4.281 18.16 3.164 19.426 QT
2.047 20.691 0 20.691 QT
cp
0 20.066 M
1.344 20.066 2 18.691 QT
2.656 17.316 2.805 15.652 QT
2.953 13.988 2.953 12.113 QT
2.953 10.316 2.805 8.793 QT
2.656 7.269 2 6.035 QT
1.344 4.801 0 4.801 QT
-1.359 4.801 -2.016 6.043 QT
-2.672 7.285 -2.82 8.801 QT
-2.969 10.316 -2.969 12.113 QT
-2.969 13.457 -2.906 14.636 QT
-2.844 15.816 -2.563 17.082 QT
-2.281 18.347 -1.656 19.207 QT
-1.031 20.066 0 20.066 QT
cp
f
GR
GS
[0.75 0 0 0.75 181.5 589.60001] CT
0.149 GC
N
-3.906 17.426 M
-3.672 18.129 -3.156 18.707 QT
-2.641 19.285 -1.945 19.605 QT
-1.25 19.926 -0.5 19.926 QT
1.234 19.926 1.891 18.574 QT
2.547 17.222 2.547 15.301 QT
2.547 14.472 2.516 13.902 QT
2.484 13.332 2.359 12.816 QT
2.141 11.972 1.578 11.34 QT
1.016 10.707 0.219 10.707 QT
-0.594 10.707 -1.172 10.949 QT
-1.75 11.191 -2.117 11.519 QT
-2.484 11.847 -2.766 12.215 QT
-3.047 12.582 -3.109 12.597 QT
-3.391 12.597 L
-3.438 12.597 -3.531 12.519 QT
-3.625 12.441 -3.625 12.379 QT
-3.625 4.363 L
-3.625 4.301 -3.547 4.238 QT
-3.469 4.176 -3.391 4.176 QT
-3.313 4.176 L
-1.703 4.941 0.125 4.941 QT
1.906 4.941 3.547 4.176 QT
3.625 4.176 L
3.703 4.176 3.773 4.23 QT
3.844 4.285 3.844 4.363 QT
3.844 4.582 L
3.844 4.707 3.797 4.707 QT
2.984 5.785 1.742 6.394 QT
0.5 7.004 -0.813 7.004 QT
-1.781 7.004 -2.781 6.738 QT
-2.781 11.269 L
-1.984 10.629 -1.359 10.355 QT
-0.734 10.082 0.234 10.082 QT
1.563 10.082 2.609 10.84 QT
3.656 11.597 4.219 12.824 QT
4.781 14.051 4.781 15.332 QT
4.781 16.769 4.07 18.004 QT
3.359 19.238 2.141 19.965 QT
0.922 20.691 -0.5 20.691 QT
-1.688 20.691 -2.68 20.082 QT
-3.672 19.472 -4.234 18.441 QT
-4.797 17.41 -4.797 16.238 QT
-4.797 15.707 -4.445 15.363 QT
-4.094 15.019 -3.578 15.019 QT
-3.047 15.019 -2.688 15.371 QT
-2.328 15.722 -2.328 16.238 QT
-2.328 16.754 -2.688 17.113 QT
-3.047 17.472 -3.578 17.472 QT
-3.656 17.472 -3.758 17.457 QT
-3.859 17.441 -3.906 17.426 QT
cp
f
GR
GS
[0.75 0 0 0.75 279.75 589.60001] CT
0.149 GC
N
-9.766 20.16 M
-9.766 19.316 L
-6.766 19.316 -6.766 18.551 QT
-6.766 5.957 L
-8.016 6.551 -9.906 6.551 QT
-9.906 5.707 L
-6.969 5.707 -5.469 4.176 QT
-5.125 4.176 L
-5.047 4.176 -4.969 4.238 QT
-4.891 4.301 -4.891 4.379 QT
-4.891 18.551 L
-4.891 19.316 -1.891 19.316 QT
-1.891 20.16 L
-9.766 20.16 L
cp
f
GR
GS
[0.75 0 0 0.75 279.75 589.60001] CT
0.149 GC
N
6 20.691 M
3.063 20.691 2 18.269 QT
0.938 15.847 0.938 12.504 QT
0.938 10.426 1.32 8.582 QT
1.703 6.738 2.836 5.457 QT
3.969 4.176 6 4.176 QT
7.578 4.176 8.586 4.949 QT
9.594 5.722 10.125 6.949 QT
10.656 8.176 10.852 9.574 QT
11.047 10.972 11.047 12.504 QT
11.047 14.566 10.664 16.363 QT
10.281 18.16 9.164 19.426 QT
8.047 20.691 6 20.691 QT
cp
6 20.066 M
7.344 20.066 8 18.691 QT
8.656 17.316 8.805 15.652 QT
8.953 13.988 8.953 12.113 QT
8.953 10.316 8.805 8.793 QT
8.656 7.269 8 6.035 QT
7.344 4.801 6 4.801 QT
4.641 4.801 3.984 6.043 QT
3.328 7.285 3.18 8.801 QT
3.031 10.316 3.031 12.113 QT
3.031 13.457 3.094 14.636 QT
3.156 15.816 3.438 17.082 QT
3.719 18.347 4.344 19.207 QT
4.969 20.066 6 20.066 QT
cp
f
GR
GS
[0.75 0 0 0.75 378 589.60001] CT
0.149 GC
N
/f143727194{-9.766 20.16 M
-9.766 19.316 L
-6.766 19.316 -6.766 18.551 QT
-6.766 5.957 L
-8.016 6.551 -9.906 6.551 QT
-9.906 5.707 L
-6.969 5.707 -5.469 4.176 QT
-5.125 4.176 L
-5.047 4.176 -4.969 4.238 QT
-4.891 4.301 -4.891 4.379 QT
-4.891 18.551 L
-4.891 19.316 -1.891 19.316 QT
-1.891 20.16 L
-9.766 20.16 L
cp}def
f143727194
f
GR
GS
[0.75 0 0 0.75 378 589.60001] CT
0.149 GC
N
/f-1909175845{2.094 17.426 M
2.328 18.129 2.844 18.707 QT
3.359 19.285 4.055 19.605 QT
4.75 19.926 5.5 19.926 QT
7.234 19.926 7.891 18.574 QT
8.547 17.222 8.547 15.301 QT
8.547 14.472 8.516 13.902 QT
8.484 13.332 8.359 12.816 QT
8.141 11.972 7.578 11.34 QT
7.016 10.707 6.219 10.707 QT
5.406 10.707 4.828 10.949 QT
4.25 11.191 3.883 11.519 QT
3.516 11.847 3.234 12.215 QT
2.953 12.582 2.891 12.597 QT
2.609 12.597 L
2.563 12.597 2.469 12.519 QT
2.375 12.441 2.375 12.379 QT
2.375 4.363 L
2.375 4.301 2.453 4.238 QT
2.531 4.176 2.609 4.176 QT
2.688 4.176 L
4.297 4.941 6.125 4.941 QT
7.906 4.941 9.547 4.176 QT
9.625 4.176 L
9.703 4.176 9.773 4.23 QT
9.844 4.285 9.844 4.363 QT
9.844 4.582 L
9.844 4.707 9.797 4.707 QT
8.984 5.785 7.742 6.394 QT
6.5 7.004 5.188 7.004 QT
4.219 7.004 3.219 6.738 QT
3.219 11.269 L
4.016 10.629 4.641 10.355 QT
5.266 10.082 6.234 10.082 QT
7.563 10.082 8.609 10.84 QT
9.656 11.597 10.219 12.824 QT
10.781 14.051 10.781 15.332 QT
10.781 16.769 10.07 18.004 QT
9.359 19.238 8.141 19.965 QT
6.922 20.691 5.5 20.691 QT
4.313 20.691 3.32 20.082 QT
2.328 19.472 1.766 18.441 QT
1.203 17.41 1.203 16.238 QT
1.203 15.707 1.555 15.363 QT
1.906 15.019 2.422 15.019 QT
2.953 15.019 3.313 15.371 QT
3.672 15.722 3.672 16.238 QT
3.672 16.754 3.313 17.113 QT
2.953 17.472 2.422 17.472 QT
2.344 17.472 2.242 17.457 QT
2.141 17.441 2.094 17.426 QT
cp}def
f-1909175845
f
GR
GS
[0.75 0 0 0.75 476.25 589.60001] CT
0.149 GC
N
/f-678663693{-10.797 20.16 M
-10.797 19.519 L
-10.797 19.457 -10.75 19.379 QT
-7.031 15.254 L
-6.188 14.347 -5.656 13.722 QT
-5.125 13.097 -4.609 12.293 QT
-4.094 11.488 -3.797 10.652 QT
-3.5 9.816 -3.5 8.879 QT
-3.5 7.894 -3.867 6.996 QT
-4.234 6.097 -4.953 5.558 QT
-5.672 5.019 -6.688 5.019 QT
-7.734 5.019 -8.563 5.644 QT
-9.391 6.269 -9.734 7.269 QT
-9.641 7.238 -9.484 7.238 QT
-8.938 7.238 -8.555 7.605 QT
-8.172 7.972 -8.172 8.551 QT
-8.172 9.097 -8.555 9.48 QT
-8.938 9.863 -9.484 9.863 QT
-10.047 9.863 -10.422 9.465 QT
-10.797 9.066 -10.797 8.551 QT
-10.797 7.644 -10.461 6.855 QT
-10.125 6.066 -9.484 5.449 QT
-8.844 4.832 -8.039 4.504 QT
-7.234 4.176 -6.344 4.176 QT
-4.969 4.176 -3.781 4.754 QT
-2.594 5.332 -1.906 6.394 QT
-1.219 7.457 -1.219 8.879 QT
-1.219 9.91 -1.672 10.847 QT
-2.125 11.785 -2.844 12.558 QT
-3.563 13.332 -4.672 14.301 QT
-5.781 15.269 -6.141 15.597 QT
-8.859 18.207 L
-6.547 18.207 L
-4.844 18.207 -3.703 18.183 QT
-2.563 18.16 -2.5 18.097 QT
-2.219 17.785 -1.922 15.879 QT
-1.219 15.879 L
-1.891 20.16 L
-10.797 20.16 L
cp}def
f-678663693
f
GR
GS
[0.75 0 0 0.75 476.25 589.60001] CT
0.149 GC
N
/f1305826713{6 20.691 M
3.063 20.691 2 18.269 QT
0.938 15.847 0.938 12.504 QT
0.938 10.426 1.32 8.582 QT
1.703 6.738 2.836 5.457 QT
3.969 4.176 6 4.176 QT
7.578 4.176 8.586 4.949 QT
9.594 5.722 10.125 6.949 QT
10.656 8.176 10.852 9.574 QT
11.047 10.972 11.047 12.504 QT
11.047 14.566 10.664 16.363 QT
10.281 18.16 9.164 19.426 QT
8.047 20.691 6 20.691 QT
cp
6 20.066 M
7.344 20.066 8 18.691 QT
8.656 17.316 8.805 15.652 QT
8.953 13.988 8.953 12.113 QT
8.953 10.316 8.805 8.793 QT
8.656 7.269 8 6.035 QT
7.344 4.801 6 4.801 QT
4.641 4.801 3.984 6.043 QT
3.328 7.285 3.18 8.801 QT
3.031 10.316 3.031 12.113 QT
3.031 13.457 3.094 14.636 QT
3.156 15.816 3.438 17.082 QT
3.719 18.347 4.344 19.207 QT
4.969 20.066 6 20.066 QT
cp}def
f1305826713
f
GR
GS
[0.75 0 0 0.75 574.5 589.60001] CT
0.149 GC
N
f-678663693
f
GR
GS
[0.75 0 0 0.75 574.5 589.60001] CT
0.149 GC
N
f-1909175845
f
GR
GS
[0.75 0 0 0.75 328.87523 613.22693] CT
0.149 GC
N
/f-1821715070{-40.893 22.176 M
-40.893 21.254 L
-38.206 21.254 -38.206 20.442 QT
-38.206 6.16 L
-38.206 5.332 -40.893 5.332 QT
-40.893 4.41 L
-26.19 4.41 L
-25.471 10.363 L
-26.221 10.363 L
-26.487 8.129 -26.995 7.113 QT
-27.503 6.098 -28.604 5.715 QT
-29.706 5.332 -31.909 5.332 QT
-34.471 5.332 L
-34.94 5.332 -35.198 5.371 QT
-35.456 5.41 -35.62 5.59 QT
-35.784 5.77 -35.784 6.16 QT
-35.784 12.504 L
-33.862 12.504 L
-32.549 12.504 -31.893 12.277 QT
-31.237 12.051 -30.995 11.426 QT
-30.753 10.801 -30.753 9.473 QT
-29.987 9.473 L
-29.987 16.457 L
-30.753 16.457 L
-30.753 15.129 -30.995 14.496 QT
-31.237 13.863 -31.893 13.637 QT
-32.549 13.41 -33.862 13.41 QT
-35.784 13.41 L
-35.784 20.442 L
-35.784 20.988 -35.471 21.121 QT
-35.159 21.254 -34.471 21.254 QT
-31.706 21.254 L
-29.909 21.254 -28.799 20.973 QT
-27.69 20.692 -27.073 20.027 QT
-26.456 19.363 -26.12 18.301 QT
-25.784 17.238 -25.487 15.363 QT
-24.737 15.363 L
-25.831 22.176 L
-40.893 22.176 L
cp}def
f-1821715070
f
GR
GS
[0.75 0 0 0.75 328.87523 613.22693] CT
0.149 GC
N
/f1128155212{-23.052 27.223 M
-23.052 26.317 L
-22.161 26.317 -21.591 26.16 QT
-21.02 26.004 -21.02 25.473 QT
-21.02 12.942 L
-21.02 12.238 -21.528 12.059 QT
-22.036 11.879 -23.052 11.879 QT
-23.052 10.973 L
-19.208 10.692 L
-19.208 12.301 L
-18.489 11.504 -17.544 11.098 QT
-16.598 10.692 -15.536 10.692 QT
-14.005 10.692 -12.77 11.52 QT
-11.536 12.348 -10.841 13.699 QT
-10.145 15.051 -10.145 16.567 QT
-10.145 18.145 -10.919 19.496 QT
-11.692 20.848 -13.02 21.66 QT
-14.348 22.473 -15.927 22.473 QT
-17.817 22.473 -19.13 20.926 QT
-19.13 25.473 L
-19.13 26.004 -18.552 26.16 QT
-17.973 26.317 -17.098 26.317 QT
-17.098 27.223 L
-23.052 27.223 L
cp
-19.13 19.645 M
-18.677 20.582 -17.864 21.184 QT
-17.052 21.785 -16.083 21.785 QT
-15.177 21.785 -14.489 21.301 QT
-13.802 20.817 -13.325 20.004 QT
-12.848 19.192 -12.63 18.293 QT
-12.411 17.395 -12.411 16.567 QT
-12.411 15.52 -12.786 14.309 QT
-13.161 13.098 -13.927 12.27 QT
-14.692 11.442 -15.786 11.442 QT
-16.848 11.442 -17.731 11.981 QT
-18.614 12.52 -19.13 13.442 QT
-19.13 19.645 L
cp}def
f1128155212
f
GR
GS
[0.75 0 0 0.75 328.87523 613.22693] CT
0.149 GC
N
/f-653968273{-1.823 22.473 M
-3.386 22.473 -4.722 21.676 QT
-6.058 20.879 -6.831 19.543 QT
-7.605 18.207 -7.605 16.645 QT
-7.605 15.442 -7.175 14.34 QT
-6.745 13.238 -5.956 12.371 QT
-5.167 11.504 -4.112 11.012 QT
-3.058 10.52 -1.823 10.52 QT
-0.23 10.52 1.091 11.363 QT
2.411 12.207 3.169 13.621 QT
3.927 15.035 3.927 16.645 QT
3.927 18.207 3.153 19.543 QT
2.38 20.879 1.052 21.676 QT
-0.276 22.473 -1.823 22.473 QT
cp
-1.823 21.707 M
0.255 21.707 0.958 20.199 QT
1.661 18.692 1.661 16.348 QT
1.661 15.035 1.52 14.184 QT
1.38 13.332 0.911 12.629 QT
0.614 12.192 0.161 11.871 QT
-0.292 11.551 -0.792 11.379 QT
-1.292 11.207 -1.823 11.207 QT
-2.636 11.207 -3.362 11.574 QT
-4.089 11.942 -4.573 12.629 QT
-5.058 13.363 -5.191 14.246 QT
-5.323 15.129 -5.323 16.348 QT
-5.323 17.801 -5.073 18.965 QT
-4.823 20.129 -4.05 20.918 QT
-3.276 21.707 -1.823 21.707 QT
cp}def
f-653968273
f
GR
GS
[0.75 0 0 0.75 328.87523 613.22693] CT
0.149 GC
N
/f247815177{12.079 22.473 M
10.516 22.473 9.235 21.652 QT
7.954 20.832 7.212 19.465 QT
6.469 18.098 6.469 16.567 QT
6.469 15.035 7.204 13.621 QT
7.938 12.207 9.227 11.363 QT
10.516 10.52 12.079 10.52 QT
13.61 10.52 14.86 11.113 QT
16.11 11.707 16.11 13.067 QT
16.11 13.582 15.751 13.957 QT
15.391 14.332 14.86 14.332 QT
14.344 14.332 13.985 13.957 QT
13.626 13.582 13.626 13.067 QT
13.626 12.613 13.915 12.277 QT
14.204 11.942 14.641 11.848 QT
13.735 11.285 12.11 11.285 QT
10.86 11.285 10.102 12.106 QT
9.344 12.926 9.04 14.145 QT
8.735 15.363 8.735 16.567 QT
8.735 17.817 9.11 18.996 QT
9.485 20.176 10.313 20.942 QT
11.141 21.707 12.407 21.707 QT
13.641 21.707 14.501 20.949 QT
15.36 20.192 15.673 18.973 QT
15.673 18.817 15.876 18.817 QT
16.204 18.817 L
16.282 18.817 16.344 18.887 QT
16.407 18.957 16.407 19.051 QT
16.407 19.129 L
16.001 20.66 14.837 21.567 QT
13.673 22.473 12.079 22.473 QT
cp}def
f247815177
f
GR
GS
[0.75 0 0 0.75 328.87523 613.22693] CT
0.149 GC
N
/f805205712{17.391 22.176 M
17.391 21.254 L
18.266 21.254 18.844 21.121 QT
19.423 20.988 19.423 20.442 QT
19.423 6.785 L
19.423 6.098 19.212 5.785 QT
19.001 5.473 18.602 5.402 QT
18.204 5.332 17.391 5.332 QT
17.391 4.41 L
21.251 4.129 L
21.251 13.067 L
21.798 11.988 22.774 11.34 QT
23.751 10.692 24.923 10.692 QT
26.735 10.692 27.641 11.551 QT
28.548 12.41 28.548 14.192 QT
28.548 20.442 L
28.548 20.988 29.118 21.121 QT
29.688 21.254 30.579 21.254 QT
30.579 22.176 L
24.626 22.176 L
24.626 21.254 L
25.516 21.254 26.087 21.121 QT
26.657 20.988 26.657 20.442 QT
26.657 14.27 L
26.657 13.004 26.29 12.184 QT
25.923 11.363 24.766 11.363 QT
23.266 11.363 22.29 12.567 QT
21.313 13.77 21.313 15.301 QT
21.313 20.442 L
21.313 20.988 21.891 21.121 QT
22.469 21.254 23.344 21.254 QT
23.344 22.176 L
17.391 22.176 L
cp}def
f805205712
f
GR
GS
[0.75 0 0 0.75 328.87523 613.22693] CT
0.149 GC
N
/f-1418493494{32.136 22.254 M
32.136 18.004 L
32.136 17.801 32.371 17.801 QT
32.683 17.801 L
32.839 17.801 32.886 18.004 QT
33.621 21.785 36.386 21.785 QT
37.621 21.785 38.456 21.223 QT
39.292 20.66 39.292 19.504 QT
39.292 18.66 38.644 18.067 QT
37.996 17.473 37.105 17.27 QT
35.371 16.926 L
34.496 16.723 33.777 16.332 QT
33.058 15.942 32.597 15.285 QT
32.136 14.629 32.136 13.77 QT
32.136 12.629 32.738 11.902 QT
33.339 11.176 34.308 10.848 QT
35.277 10.52 36.386 10.52 QT
37.73 10.52 38.714 11.238 QT
39.464 10.582 L
39.464 10.52 39.589 10.52 QT
39.777 10.52 L
39.855 10.52 39.917 10.59 QT
39.98 10.66 39.98 10.738 QT
39.98 14.145 L
39.98 14.379 39.777 14.379 QT
39.464 14.379 L
39.23 14.379 39.23 14.145 QT
39.23 12.785 38.48 11.957 QT
37.73 11.129 36.371 11.129 QT
35.199 11.129 34.339 11.559 QT
33.48 11.988 33.48 13.051 QT
33.48 13.77 34.097 14.231 QT
34.714 14.692 35.542 14.895 QT
37.308 15.238 L
38.199 15.442 38.964 15.918 QT
39.73 16.395 40.183 17.137 QT
40.636 17.879 40.636 18.801 QT
40.636 19.738 40.308 20.434 QT
39.98 21.129 39.402 21.582 QT
38.824 22.035 38.042 22.254 QT
37.261 22.473 36.386 22.473 QT
34.761 22.473 33.621 21.379 QT
32.667 22.41 L
32.667 22.473 32.527 22.473 QT
32.371 22.473 L
32.136 22.473 32.136 22.254 QT
cp}def
f-1418493494
f
GR
GS
[0.75 0 0 0.75 0 0.5] CT
0.149 GC
2 setlinecap
1 LJ
0.667 LW
N
111 778 M
111 629 L
S
GR
GS
[0.75 0 0 0.75 0 0.5] CT
0.149 GC
2 setlinecap
1 LJ
0.667 LW
N
766 778 M
766 629 L
S
GR
GS
[0.75 0 0 0.75 0 0.5] CT
0.149 GC
2 setlinecap
1 LJ
0.667 LW
N
111 778 M
117.55 778 L
S
GR
GS
[0.75 0 0 0.75 0 0.5] CT
0.149 GC
2 setlinecap
1 LJ
0.667 LW
N
111 707.439 M
117.55 707.439 L
S
GR
GS
[0.75 0 0 0.75 0 0.5] CT
0.149 GC
2 setlinecap
1 LJ
0.667 LW
N
111 636.878 M
117.55 636.878 L
S
GR
GS
[0.75 0 0 0.75 0 0.5] CT
0.149 GC
2 setlinecap
1 LJ
0.667 LW
N
766 778 M
759.45 778 L
S
GR
GS
[0.75 0 0 0.75 0 0.5] CT
0.149 GC
2 setlinecap
1 LJ
0.667 LW
N
766 707.439 M
759.45 707.439 L
S
GR
GS
[0.75 0 0 0.75 0 0.5] CT
0.149 GC
2 setlinecap
1 LJ
0.667 LW
N
766 636.878 M
759.45 636.878 L
S
GR
GS
[0.75 0 0 0.75 77.65 584] CT
0.149 GC
N
/f1219663315{-6 6.291 M
-8.938 6.291 -10 3.869 QT
-11.063 1.447 -11.063 -1.896 QT
-11.063 -3.974 -10.68 -5.818 QT
-10.297 -7.662 -9.164 -8.943 QT
-8.031 -10.224 -6 -10.224 QT
-4.422 -10.224 -3.414 -9.451 QT
-2.406 -8.678 -1.875 -7.451 QT
-1.344 -6.224 -1.148 -4.826 QT
-0.953 -3.428 -0.953 -1.896 QT
-0.953 0.166 -1.336 1.963 QT
-1.719 3.76 -2.836 5.026 QT
-3.953 6.291 -6 6.291 QT
cp
-6 5.666 M
-4.656 5.666 -4 4.291 QT
-3.344 2.916 -3.195 1.252 QT
-3.047 -0.412 -3.047 -2.287 QT
-3.047 -4.084 -3.195 -5.607 QT
-3.344 -7.131 -4 -8.365 QT
-4.656 -9.599 -6 -9.599 QT
-7.359 -9.599 -8.016 -8.357 QT
-8.672 -7.115 -8.82 -5.599 QT
-8.969 -4.084 -8.969 -2.287 QT
-8.969 -0.943 -8.906 0.236 QT
-8.844 1.416 -8.563 2.682 QT
-8.281 3.947 -7.656 4.807 QT
-7.031 5.666 -6 5.666 QT
cp}def
f1219663315
f
GR
GS
[0.75 0 0 0.75 77.65 531.07932] CT
0.149 GC
N
/f1579298569{-21.766 5.76 M
-21.766 4.916 L
-18.766 4.916 -18.766 4.151 QT
-18.766 -8.443 L
-20.016 -7.849 -21.906 -7.849 QT
-21.906 -8.693 L
-18.969 -8.693 -17.469 -10.224 QT
-17.125 -10.224 L
-17.047 -10.224 -16.969 -10.162 QT
-16.891 -10.099 -16.891 -10.021 QT
-16.891 4.151 L
-16.891 4.916 -13.891 4.916 QT
-13.891 5.76 L
-21.766 5.76 L
cp}def
f1579298569
f
GR
GS
[0.75 0 0 0.75 77.65 531.07932] CT
0.149 GC
N
f1219663315
f
GR
GS
[0.75 0 0 0.75 77.65 478.15868] CT
0.149 GC
N
/f1975841261{-22.797 5.76 M
-22.797 5.119 L
-22.797 5.057 -22.75 4.979 QT
-19.031 0.854 L
-18.188 -0.053 -17.656 -0.678 QT
-17.125 -1.303 -16.609 -2.107 QT
-16.094 -2.912 -15.797 -3.748 QT
-15.5 -4.584 -15.5 -5.521 QT
-15.5 -6.506 -15.867 -7.404 QT
-16.234 -8.303 -16.953 -8.842 QT
-17.672 -9.381 -18.688 -9.381 QT
-19.734 -9.381 -20.563 -8.756 QT
-21.391 -8.131 -21.734 -7.131 QT
-21.641 -7.162 -21.484 -7.162 QT
-20.938 -7.162 -20.555 -6.795 QT
-20.172 -6.428 -20.172 -5.849 QT
-20.172 -5.303 -20.555 -4.92 QT
-20.938 -4.537 -21.484 -4.537 QT
-22.047 -4.537 -22.422 -4.935 QT
-22.797 -5.334 -22.797 -5.849 QT
-22.797 -6.756 -22.461 -7.545 QT
-22.125 -8.334 -21.484 -8.951 QT
-20.844 -9.568 -20.039 -9.896 QT
-19.234 -10.224 -18.344 -10.224 QT
-16.969 -10.224 -15.781 -9.646 QT
-14.594 -9.068 -13.906 -8.006 QT
-13.219 -6.943 -13.219 -5.521 QT
-13.219 -4.49 -13.672 -3.553 QT
-14.125 -2.615 -14.844 -1.842 QT
-15.563 -1.068 -16.672 -0.099 QT
-17.781 0.869 -18.141 1.197 QT
-20.859 3.807 L
-18.547 3.807 L
-16.844 3.807 -15.703 3.783 QT
-14.563 3.76 -14.5 3.697 QT
-14.219 3.385 -13.922 1.479 QT
-13.219 1.479 L
-13.891 5.76 L
-22.797 5.76 L
cp}def
f1975841261
f
GR
GS
[0.75 0 0 0.75 77.65 478.15868] CT
0.149 GC
N
f1219663315
f
GR
GS
[0.75 0 0 0.75 0 0.5] CT
0 0.447 0.741 RC
1 LJ
2.667 LW
N
137.2 696.457 M
163.4 771.662 L
189.6 774.482 L
215.8 772.255 L
242 771.53 L
268.2 759.596 L
294.4 775.961 L
320.6 771.738 L
346.8 766.948 L
373 774.851 L
399.2 776.189 L
425.4 776.665 L
451.6 777.374 L
477.8 742.498 L
504 652.092 L
530.2 761.515 L
556.4 765.671 L
582.6 769.223 L
608.8 771.884 L
635 630.496 L
661.2 637.941 L
687.4 629 L
713.6 767.036 L
739.8 772.426 L
S
GR
GS
[0.75 0 0 0.75 0 0.5] CT
0.929 0.694 0.125 RC
1 LJ
2.667 LW
N
137.2 699.554 M
163.4 774.911 L
189.6 756.179 L
215.8 762.322 L
242 760.471 L
268.2 755.022 L
294.4 773.107 L
320.6 764.697 L
346.8 769.837 L
373 760.96 L
399.2 760.538 L
425.4 762.08 L
451.6 763.404 L
477.8 729.806 L
504 651.837 L
530.2 750.33 L
556.4 756.24 L
582.6 760.353 L
608.8 761.567 L
635 632.41 L
661.2 639.066 L
687.4 631.489 L
713.6 775.257 L
739.8 776.817 L
S
GR
GS
[0.75 0 0 0.75 0 0.5] CT
1 0 0 RC
1 LJ
2.667 LW
N
137.2 750.635 M
163.4 695.71 L
189.6 664.167 L
215.8 674.699 L
242 674.979 L
268.2 653.273 L
294.4 690.39 L
320.6 677.525 L
346.8 673.318 L
373 660.896 L
399.2 654.541 L
425.4 655.796 L
451.6 655.55 L
477.8 700.248 L
504 768.57 L
530.2 659.745 L
556.4 663.118 L
582.6 659.085 L
608.8 662.651 L
635 727.111 L
661.2 735.105 L
687.4 724.821 L
713.6 679.177 L
739.8 682.181 L
S
GR
GS
[0.75 0 0 0.75 0 0.5] CT
1 GC
N
755 718 M
755 637 L
567 637 L
567 718 L
cp
f
GR
GS
[0.75 0 0 0.75 460.35471 489.24146] CT
N
/f-597267615{0.672 5.12 M
0.672 4.386 L
2.547 4.386 2.984 3.136 QT
7.391 -9.693 L
7.453 -9.911 7.734 -9.911 QT
8 -9.911 L
8.281 -9.911 8.344 -9.693 QT
12.938 3.714 L
13.141 4.151 13.688 4.268 QT
14.234 4.386 15.047 4.386 QT
15.047 5.12 L
9.203 5.12 L
9.203 4.386 L
10.938 4.386 10.938 3.823 QT
10.938 3.714 L
9.797 0.432 L
4.703 0.432 L
3.766 3.136 L
3.75 3.214 3.75 3.354 QT
3.75 3.886 4.242 4.136 QT
4.734 4.386 5.313 4.386 QT
5.313 5.12 L
0.672 5.12 L
cp
4.953 -0.302 M
9.563 -0.302 L
7.25 -7.005 L
4.953 -0.302 L
cp}def
f-597267615
f
GR
GS
[0.75 0 0 0.75 460.35471 489.24146] CT
N
/f1637560580{16.703 5.12 M
16.703 4.386 L
18.859 4.386 18.859 3.714 QT
18.859 -7.818 L
18.859 -8.489 16.703 -8.489 QT
16.703 -9.224 L
24.172 -9.224 L
25.328 -9.224 26.477 -8.755 QT
27.625 -8.286 28.367 -7.38 QT
29.109 -6.474 29.109 -5.271 QT
29.109 -4.114 28.359 -3.232 QT
27.609 -2.349 26.469 -1.888 QT
25.328 -1.427 24.172 -1.427 QT
20.813 -1.427 L
20.813 3.714 L
20.813 4.386 22.969 4.386 QT
22.969 5.12 L
16.703 5.12 L
cp
20.75 -2.052 M
23.594 -2.052 L
24.75 -2.052 25.469 -2.388 QT
26.188 -2.724 26.523 -3.427 QT
26.859 -4.13 26.859 -5.271 QT
26.859 -6.989 26.109 -7.739 QT
25.359 -8.489 23.594 -8.489 QT
21.813 -8.489 L
21.438 -8.489 21.227 -8.458 QT
21.016 -8.427 20.883 -8.279 QT
20.75 -8.13 20.75 -7.818 QT
20.75 -2.052 L
cp}def
f1637560580
f
GR
GS
[0.75 0 0 0.75 460.35471 489.24146] CT
N
/f374720792{31.222 5.12 M
31.222 4.386 L
33.378 4.386 33.378 3.714 QT
33.378 -7.818 L
33.378 -8.489 31.222 -8.489 QT
31.222 -9.224 L
38.956 -9.224 L
40.394 -9.224 41.581 -8.607 QT
42.769 -7.989 43.612 -6.95 QT
44.456 -5.911 44.909 -4.599 QT
45.362 -3.286 45.362 -1.911 QT
45.362 -0.583 44.901 0.675 QT
44.44 1.932 43.573 2.94 QT
42.706 3.948 41.526 4.534 QT
40.347 5.12 38.956 5.12 QT
31.222 5.12 L
cp
35.269 3.714 M
35.269 4.167 35.526 4.276 QT
35.784 4.386 36.331 4.386 QT
38.409 4.386 L
39.487 4.386 40.456 3.917 QT
41.425 3.448 42.065 2.62 QT
42.737 1.729 42.956 0.643 QT
43.175 -0.443 43.175 -1.911 QT
43.175 -3.443 42.956 -4.591 QT
42.737 -5.739 42.065 -6.646 QT
41.44 -7.536 40.48 -8.013 QT
39.519 -8.489 38.409 -8.489 QT
36.331 -8.489 L
35.956 -8.489 35.745 -8.458 QT
35.534 -8.427 35.401 -8.279 QT
35.269 -8.13 35.269 -7.818 QT
35.269 3.714 L
cp}def
f374720792
f
GR
GS
[0.75 0 0 0.75 0 0.5] CT
0 0.447 0.741 RC
1 LJ
2.667 LW
N
570.984 651.655 M
610.819 651.655 L
S
GR
GS
[0.75 0 0 0.75 460.35471 508.625] CT
N
/f1886913203{1.172 5.417 M
1.172 0.511 L
1.172 0.354 1.359 0.354 QT
1.625 0.354 L
1.688 0.354 1.734 0.401 QT
1.781 0.448 1.781 0.511 QT
1.781 2.573 3.063 3.706 QT
4.344 4.839 6.406 4.839 QT
7.141 4.839 7.758 4.417 QT
8.375 3.995 8.711 3.315 QT
9.047 2.636 9.047 1.917 QT
9.047 1.276 8.797 0.675 QT
8.547 0.073 8.063 -0.364 QT
7.578 -0.802 6.969 -0.958 QT
4.25 -1.614 L
2.891 -1.974 2.031 -3.091 QT
1.172 -4.208 1.172 -5.583 QT
1.172 -6.677 1.727 -7.63 QT
2.281 -8.583 3.219 -9.138 QT
4.156 -9.693 5.25 -9.693 QT
7.359 -9.693 8.594 -8.255 QT
9.453 -9.63 L
9.516 -9.693 9.594 -9.693 QT
9.734 -9.693 L
9.797 -9.693 9.859 -9.646 QT
9.922 -9.599 9.922 -9.505 QT
9.922 -4.646 L
9.922 -4.458 9.734 -4.458 QT
9.5 -4.458 L
9.297 -4.458 9.297 -4.646 QT
9.297 -5.177 9.117 -5.81 QT
8.938 -6.443 8.625 -7.029 QT
8.313 -7.614 7.938 -7.989 QT
6.922 -9.005 5.25 -9.005 QT
4.531 -9.005 3.93 -8.646 QT
3.328 -8.286 2.969 -7.661 QT
2.609 -7.036 2.609 -6.349 QT
2.609 -5.443 3.164 -4.708 QT
3.719 -3.974 4.625 -3.739 QT
7.359 -3.068 L
8.031 -2.911 8.633 -2.482 QT
9.234 -2.052 9.633 -1.489 QT
10.031 -0.927 10.258 -0.239 QT
10.484 0.448 10.484 1.198 QT
10.484 2.323 9.961 3.339 QT
9.438 4.354 8.484 4.971 QT
7.531 5.589 6.406 5.589 QT
5.719 5.589 4.984 5.432 QT
4.25 5.276 3.641 4.956 QT
3.031 4.636 2.516 4.136 QT
1.641 5.526 L
1.578 5.589 1.484 5.589 QT
1.359 5.589 L
1.172 5.589 1.172 5.417 QT
cp}def
f1886913203
f
GR
GS
[0.75 0 0 0.75 460.35471 508.625] CT
N
/f1818420723{12.555 5.12 M
12.555 4.386 L
14.711 4.386 14.711 3.714 QT
14.711 -7.818 L
14.711 -8.489 12.555 -8.489 QT
12.555 -9.224 L
20.289 -9.224 L
21.727 -9.224 22.914 -8.607 QT
24.102 -7.989 24.946 -6.95 QT
25.789 -5.911 26.243 -4.599 QT
26.696 -3.286 26.696 -1.911 QT
26.696 -0.583 26.235 0.675 QT
25.774 1.932 24.907 2.94 QT
24.039 3.948 22.86 4.534 QT
21.68 5.12 20.289 5.12 QT
12.555 5.12 L
cp
16.602 3.714 M
16.602 4.167 16.86 4.276 QT
17.118 4.386 17.664 4.386 QT
19.743 4.386 L
20.821 4.386 21.789 3.917 QT
22.758 3.448 23.399 2.62 QT
24.071 1.729 24.289 0.643 QT
24.508 -0.443 24.508 -1.911 QT
24.508 -3.443 24.289 -4.591 QT
24.071 -5.739 23.399 -6.646 QT
22.774 -7.536 21.813 -8.013 QT
20.852 -8.489 19.743 -8.489 QT
17.664 -8.489 L
17.289 -8.489 17.078 -8.458 QT
16.868 -8.427 16.735 -8.279 QT
16.602 -8.13 16.602 -7.818 QT
16.602 3.714 L
cp}def
f1818420723
f
GR
GS
[0.75 0 0 0.75 0 0.5] CT
0.929 0.694 0.125 RC
1 LJ
2.667 LW
N
570.984 677.5 M
610.819 677.5 L
S
GR
GS
[0.75 0 0 0.75 460.35471 528.00854] CT
N
/f-1657957548{0.547 5.12 M
0.547 4.386 L
2.813 4.386 2.813 3.714 QT
2.813 -7.818 L
2.813 -8.489 0.547 -8.489 QT
0.547 -9.224 L
7.031 -9.224 L
7.031 -8.489 L
4.766 -8.489 4.766 -7.818 QT
4.766 3.714 L
4.766 4.386 7.031 4.386 QT
7.031 5.12 L
0.547 5.12 L
cp}def
f-1657957548
f
GR
GS
[0.75 0 0 0.75 460.35471 528.00854] CT
N
/f-1984996643{8.376 5.12 M
8.376 4.386 L
10.251 4.386 10.688 3.136 QT
15.094 -9.693 L
15.157 -9.911 15.438 -9.911 QT
15.704 -9.911 L
15.985 -9.911 16.047 -9.693 QT
20.641 3.714 L
20.844 4.151 21.391 4.268 QT
21.938 4.386 22.751 4.386 QT
22.751 5.12 L
16.907 5.12 L
16.907 4.386 L
18.641 4.386 18.641 3.823 QT
18.641 3.714 L
17.501 0.432 L
12.407 0.432 L
11.469 3.136 L
11.454 3.214 11.454 3.354 QT
11.454 3.886 11.946 4.136 QT
12.438 4.386 13.016 4.386 QT
13.016 5.12 L
8.376 5.12 L
cp
12.657 -0.302 M
17.266 -0.302 L
14.954 -7.005 L
12.657 -0.302 L
cp}def
f-1984996643
f
GR
GS
[0.75 0 0 0.75 460.35471 528.00854] CT
N
/f-1025401139{24.407 5.12 M
24.407 4.386 L
26.563 4.386 26.563 3.714 QT
26.563 -7.818 L
26.563 -8.489 24.407 -8.489 QT
24.407 -9.224 L
31.001 -9.224 L
32.172 -9.224 33.469 -8.802 QT
34.766 -8.38 35.641 -7.505 QT
36.516 -6.63 36.516 -5.427 QT
36.516 -4.536 35.985 -3.849 QT
35.454 -3.161 34.626 -2.693 QT
33.797 -2.224 32.938 -2.021 QT
33.891 -1.693 34.594 -0.974 QT
35.297 -0.255 35.438 0.667 QT
35.735 2.542 L
35.954 3.792 36.172 4.417 QT
36.391 5.042 37.172 5.042 QT
37.829 5.042 38.149 4.432 QT
38.469 3.823 38.469 3.104 QT
38.469 3.026 38.54 2.971 QT
38.61 2.917 38.672 2.917 QT
38.876 2.917 L
39.079 2.917 39.079 3.198 QT
39.079 3.761 38.852 4.315 QT
38.626 4.87 38.196 5.229 QT
37.766 5.589 37.188 5.589 QT
35.672 5.589 34.579 4.831 QT
33.485 4.073 33.485 2.62 QT
33.485 0.745 L
33.485 -0.302 32.758 -1.044 QT
32.032 -1.786 30.969 -1.786 QT
28.454 -1.786 L
28.454 3.714 L
28.454 4.386 30.61 4.386 QT
30.61 5.12 L
24.407 5.12 L
cp
28.454 -2.333 M
30.704 -2.333 L
32.438 -2.333 33.352 -3.036 QT
34.266 -3.739 34.266 -5.427 QT
34.266 -7.099 33.36 -7.794 QT
32.454 -8.489 30.704 -8.489 QT
29.516 -8.489 L
29.141 -8.489 28.93 -8.458 QT
28.719 -8.427 28.587 -8.279 QT
28.454 -8.13 28.454 -7.818 QT
28.454 -2.333 L
cp}def
f-1025401139
f
GR
GS
[0.75 0 0 0.75 460.35471 528.00854] CT
N
/f1233475555{53.034 10.323 M
51.862 9.401 51.019 8.206 QT
50.175 7.011 49.636 5.659 QT
49.097 4.307 48.831 2.831 QT
48.565 1.354 48.565 -0.13 QT
48.565 -1.63 48.831 -3.107 QT
49.097 -4.583 49.644 -5.95 QT
50.19 -7.318 51.042 -8.505 QT
51.894 -9.693 53.034 -10.583 QT
53.034 -10.63 53.128 -10.63 QT
53.331 -10.63 L
53.394 -10.63 53.44 -10.575 QT
53.487 -10.521 53.487 -10.443 QT
53.487 -10.349 53.456 -10.318 QT
52.425 -9.302 51.745 -8.154 QT
51.065 -7.005 50.651 -5.708 QT
50.237 -4.411 50.05 -3.021 QT
49.862 -1.63 49.862 -0.13 QT
49.862 6.542 53.425 10.011 QT
53.487 10.073 53.487 10.182 QT
53.487 10.229 53.433 10.3 QT
53.378 10.37 53.331 10.37 QT
53.128 10.37 L
53.034 10.37 53.034 10.323 QT
cp}def
f1233475555
f
GR
GS
[0.75 0 0 0.75 460.35471 528.00854] CT
N
/f-1264859159{55.518 5.12 M
55.518 4.386 L
57.674 4.386 57.674 3.714 QT
57.674 -7.818 L
57.674 -8.489 55.518 -8.489 QT
55.518 -9.224 L
62.987 -9.224 L
64.143 -9.224 65.291 -8.755 QT
66.44 -8.286 67.182 -7.38 QT
67.924 -6.474 67.924 -5.271 QT
67.924 -4.114 67.174 -3.232 QT
66.424 -2.349 65.284 -1.888 QT
64.143 -1.427 62.987 -1.427 QT
59.627 -1.427 L
59.627 3.714 L
59.627 4.386 61.784 4.386 QT
61.784 5.12 L
55.518 5.12 L
cp
59.565 -2.052 M
62.409 -2.052 L
63.565 -2.052 64.284 -2.388 QT
65.002 -2.724 65.338 -3.427 QT
65.674 -4.13 65.674 -5.271 QT
65.674 -6.989 64.924 -7.739 QT
64.174 -8.489 62.409 -8.489 QT
60.627 -8.489 L
60.252 -8.489 60.041 -8.458 QT
59.831 -8.427 59.698 -8.279 QT
59.565 -8.13 59.565 -7.818 QT
59.565 -2.052 L
cp}def
f-1264859159
f
GR
GS
[0.75 0 0 0.75 460.35471 528.00854] CT
N
/f-1666518754{70.037 5.12 M
70.037 4.386 L
72.193 4.386 72.193 3.714 QT
72.193 -7.818 L
72.193 -8.489 70.037 -8.489 QT
70.037 -9.224 L
76.63 -9.224 L
77.802 -9.224 79.099 -8.802 QT
80.396 -8.38 81.271 -7.505 QT
82.146 -6.63 82.146 -5.427 QT
82.146 -4.536 81.615 -3.849 QT
81.083 -3.161 80.255 -2.693 QT
79.427 -2.224 78.568 -2.021 QT
79.521 -1.693 80.224 -0.974 QT
80.927 -0.255 81.068 0.667 QT
81.365 2.542 L
81.583 3.792 81.802 4.417 QT
82.021 5.042 82.802 5.042 QT
83.458 5.042 83.779 4.432 QT
84.099 3.823 84.099 3.104 QT
84.099 3.026 84.169 2.971 QT
84.24 2.917 84.302 2.917 QT
84.505 2.917 L
84.708 2.917 84.708 3.198 QT
84.708 3.761 84.482 4.315 QT
84.255 4.87 83.826 5.229 QT
83.396 5.589 82.818 5.589 QT
81.302 5.589 80.208 4.831 QT
79.115 4.073 79.115 2.62 QT
79.115 0.745 L
79.115 -0.302 78.388 -1.044 QT
77.662 -1.786 76.599 -1.786 QT
74.083 -1.786 L
74.083 3.714 L
74.083 4.386 76.24 4.386 QT
76.24 5.12 L
70.037 5.12 L
cp
74.083 -2.333 M
76.333 -2.333 L
78.068 -2.333 78.982 -3.036 QT
79.896 -3.739 79.896 -5.427 QT
79.896 -7.099 78.99 -7.794 QT
78.083 -8.489 76.333 -8.489 QT
75.146 -8.489 L
74.771 -8.489 74.56 -8.458 QT
74.349 -8.427 74.216 -8.279 QT
74.083 -8.13 74.083 -7.818 QT
74.083 -2.333 L
cp}def
f-1666518754
f
GR
GS
[0.75 0 0 0.75 460.35471 528.00854] CT
N
/f1415424017{85.678 5.12 M
85.678 4.386 L
87.85 4.386 87.85 3.136 QT
87.85 -8.364 L
87.162 -8.489 85.678 -8.489 QT
85.678 -9.224 L
89.709 -9.224 L
89.803 -9.224 89.85 -9.146 QT
97.287 1.792 L
97.287 -7.239 L
97.287 -8.489 95.115 -8.489 QT
95.115 -9.224 L
100.115 -9.224 L
100.115 -8.489 L
97.959 -8.489 97.959 -7.239 QT
97.959 4.932 L
97.959 4.995 97.873 5.057 QT
97.787 5.12 97.74 5.12 QT
97.49 5.12 L
97.381 5.12 97.35 5.042 QT
88.522 -7.943 L
88.522 3.136 L
88.522 4.386 90.693 4.386 QT
90.693 5.12 L
85.678 5.12 L
cp}def
f1415424017
f
GR
GS
[0.75 0 0 0.75 460.35471 528.00854] CT
N
/f-2057051167{110.101 5.12 M
110.101 4.386 L
112.726 4.386 112.726 3.714 QT
112.726 -7.302 L
111.633 -6.786 109.976 -6.786 QT
109.976 -7.521 L
112.555 -7.521 113.867 -8.864 QT
114.164 -8.864 L
114.226 -8.864 114.297 -8.81 QT
114.367 -8.755 114.367 -8.677 QT
114.367 3.714 L
114.367 4.386 116.992 4.386 QT
116.992 5.12 L
110.101 5.12 L
cp}def
f-2057051167
f
GR
GS
[0.75 0 0 0.75 460.35471 528.00854] CT
N
/f-1535148082{122.471 4.573 M
122.471 3.401 122.674 2.284 QT
122.877 1.167 123.268 0.081 QT
123.659 -1.005 124.221 -2.06 QT
124.784 -3.114 125.456 -4.036 QT
127.362 -6.708 L
124.971 -6.708 L
121.237 -6.708 121.127 -6.599 QT
120.846 -6.255 120.596 -4.661 QT
119.987 -4.661 L
120.674 -9.068 L
121.299 -9.068 L
121.299 -9.005 L
121.299 -8.63 122.581 -8.521 QT
123.862 -8.411 125.096 -8.411 QT
129.002 -8.411 L
129.002 -7.864 L
129.002 -7.849 128.995 -7.833 QT
128.987 -7.818 128.971 -7.802 QT
126.081 -3.739 L
125.018 -2.161 124.752 -0.232 QT
124.487 1.698 124.487 4.573 QT
124.487 4.979 124.19 5.284 QT
123.893 5.589 123.487 5.589 QT
123.065 5.589 122.768 5.284 QT
122.471 4.979 122.471 4.573 QT
cp}def
f-1535148082
f
GR
GS
[0.75 0 0 0.75 460.35471 528.00854] CT
N
/f1232456156{130.841 10.37 M
130.654 10.37 130.654 10.182 QT
130.654 10.089 130.7 10.057 QT
134.294 6.542 134.294 -0.13 QT
134.294 -6.802 130.747 -10.271 QT
130.654 -10.318 130.654 -10.443 QT
130.654 -10.521 130.716 -10.575 QT
130.779 -10.63 130.841 -10.63 QT
131.044 -10.63 L
131.107 -10.63 131.138 -10.583 QT
132.654 -9.396 133.654 -7.693 QT
134.654 -5.989 135.122 -4.068 QT
135.591 -2.146 135.591 -0.13 QT
135.591 1.354 135.341 2.8 QT
135.091 4.245 134.544 5.643 QT
133.997 7.042 133.154 8.221 QT
132.31 9.401 131.138 10.323 QT
131.107 10.37 131.044 10.37 QT
130.841 10.37 L
cp}def
f1232456156
f
GR
GS
[0.75 0 0 0.75 0 0.5] CT
1 0 0 RC
1 LJ
2.667 LW
N
570.984 703.345 M
610.819 703.345 L
S
GR
GS
[0.75 0 0 0.75 0 0.5] CT
0.149 GC
10.0 ML
0.667 LW
N
567 718 M
567 637 L
755 637 L
755 718 L
cp
S
GR
GS
[0.75 0 0 0.75 0 0.5] CT
1 GC
N
110 168 M
766 168 L
766 29 L
110 29 L
cp
f
GR
GS
[0.75 0 0 0.75 0 0.5] CT
0.149 GC
2 setlinecap
1 LJ
0.667 LW
N
110 168 M
766 168 L
S
GR
GS
[0.75 0 0 0.75 0 0.5] CT
0.149 GC
2 setlinecap
1 LJ
0.667 LW
N
110 29 M
766 29 L
S
GR
GS
[0.75 0 0 0.75 0 0.5] CT
0.149 GC
2 setlinecap
1 LJ
0.667 LW
N
110 168 M
110 161.44 L
S
GR
GS
[0.75 0 0 0.75 0 0.5] CT
0.149 GC
2 setlinecap
1 LJ
0.667 LW
N
219.333 168 M
219.333 161.44 L
S
GR
GS
[0.75 0 0 0.75 0 0.5] CT
0.149 GC
2 setlinecap
1 LJ
0.667 LW
N
328.667 168 M
328.667 161.44 L
S
GR
GS
[0.75 0 0 0.75 0 0.5] CT
0.149 GC
2 setlinecap
1 LJ
0.667 LW
N
438 168 M
438 161.44 L
S
GR
GS
[0.75 0 0 0.75 0 0.5] CT
0.149 GC
2 setlinecap
1 LJ
0.667 LW
N
547.333 168 M
547.333 161.44 L
S
GR
GS
[0.75 0 0 0.75 0 0.5] CT
0.149 GC
2 setlinecap
1 LJ
0.667 LW
N
656.667 168 M
656.667 161.44 L
S
GR
GS
[0.75 0 0 0.75 0 0.5] CT
0.149 GC
2 setlinecap
1 LJ
0.667 LW
N
766 168 M
766 161.44 L
S
GR
GS
[0.75 0 0 0.75 0 0.5] CT
0.149 GC
2 setlinecap
1 LJ
0.667 LW
N
110 29 M
110 35.56 L
S
GR
GS
[0.75 0 0 0.75 0 0.5] CT
0.149 GC
2 setlinecap
1 LJ
0.667 LW
N
219.333 29 M
219.333 35.56 L
S
GR
GS
[0.75 0 0 0.75 0 0.5] CT
0.149 GC
2 setlinecap
1 LJ
0.667 LW
N
328.667 29 M
328.667 35.56 L
S
GR
GS
[0.75 0 0 0.75 0 0.5] CT
0.149 GC
2 setlinecap
1 LJ
0.667 LW
N
438 29 M
438 35.56 L
S
GR
GS
[0.75 0 0 0.75 0 0.5] CT
0.149 GC
2 setlinecap
1 LJ
0.667 LW
N
547.333 29 M
547.333 35.56 L
S
GR
GS
[0.75 0 0 0.75 0 0.5] CT
0.149 GC
2 setlinecap
1 LJ
0.667 LW
N
656.667 29 M
656.667 35.56 L
S
GR
GS
[0.75 0 0 0.75 0 0.5] CT
0.149 GC
2 setlinecap
1 LJ
0.667 LW
N
766 29 M
766 35.56 L
S
GR
GS
[0.75 0 0 0.75 82.5 132.09999] CT
0.149 GC
N
/f-1749699357{0 20.691 M
-2.938 20.691 -4 18.269 QT
-5.063 15.847 -5.063 12.504 QT
-5.063 10.426 -4.68 8.582 QT
-4.297 6.738 -3.164 5.457 QT
-2.031 4.176 0 4.176 QT
1.578 4.176 2.586 4.949 QT
3.594 5.722 4.125 6.949 QT
4.656 8.176 4.852 9.574 QT
5.047 10.972 5.047 12.504 QT
5.047 14.566 4.664 16.363 QT
4.281 18.16 3.164 19.426 QT
2.047 20.691 0 20.691 QT
cp
0 20.066 M
1.344 20.066 2 18.691 QT
2.656 17.316 2.805 15.652 QT
2.953 13.988 2.953 12.113 QT
2.953 10.316 2.805 8.793 QT
2.656 7.269 2 6.035 QT
1.344 4.801 0 4.801 QT
-1.359 4.801 -2.016 6.043 QT
-2.672 7.285 -2.82 8.801 QT
-2.969 10.316 -2.969 12.113 QT
-2.969 13.457 -2.906 14.636 QT
-2.844 15.816 -2.563 17.082 QT
-2.281 18.347 -1.656 19.207 QT
-1.031 20.066 0 20.066 QT
cp}def
f-1749699357
f
GR
GS
[0.75 0 0 0.75 164.5 132.09999] CT
0.149 GC
N
/f-685938123{-3.906 17.426 M
-3.672 18.129 -3.156 18.707 QT
-2.641 19.285 -1.945 19.605 QT
-1.25 19.926 -0.5 19.926 QT
1.234 19.926 1.891 18.574 QT
2.547 17.222 2.547 15.301 QT
2.547 14.472 2.516 13.902 QT
2.484 13.332 2.359 12.816 QT
2.141 11.972 1.578 11.34 QT
1.016 10.707 0.219 10.707 QT
-0.594 10.707 -1.172 10.949 QT
-1.75 11.191 -2.117 11.519 QT
-2.484 11.847 -2.766 12.215 QT
-3.047 12.582 -3.109 12.597 QT
-3.391 12.597 L
-3.438 12.597 -3.531 12.519 QT
-3.625 12.441 -3.625 12.379 QT
-3.625 4.363 L
-3.625 4.301 -3.547 4.238 QT
-3.469 4.176 -3.391 4.176 QT
-3.313 4.176 L
-1.703 4.941 0.125 4.941 QT
1.906 4.941 3.547 4.176 QT
3.625 4.176 L
3.703 4.176 3.773 4.23 QT
3.844 4.285 3.844 4.363 QT
3.844 4.582 L
3.844 4.707 3.797 4.707 QT
2.984 5.785 1.742 6.394 QT
0.5 7.004 -0.813 7.004 QT
-1.781 7.004 -2.781 6.738 QT
-2.781 11.269 L
-1.984 10.629 -1.359 10.355 QT
-0.734 10.082 0.234 10.082 QT
1.563 10.082 2.609 10.84 QT
3.656 11.597 4.219 12.824 QT
4.781 14.051 4.781 15.332 QT
4.781 16.769 4.07 18.004 QT
3.359 19.238 2.141 19.965 QT
0.922 20.691 -0.5 20.691 QT
-1.688 20.691 -2.68 20.082 QT
-3.672 19.472 -4.234 18.441 QT
-4.797 17.41 -4.797 16.238 QT
-4.797 15.707 -4.445 15.363 QT
-4.094 15.019 -3.578 15.019 QT
-3.047 15.019 -2.688 15.371 QT
-2.328 15.722 -2.328 16.238 QT
-2.328 16.754 -2.688 17.113 QT
-3.047 17.472 -3.578 17.472 QT
-3.656 17.472 -3.758 17.457 QT
-3.859 17.441 -3.906 17.426 QT
cp}def
f-685938123
f
GR
GS
[0.75 0 0 0.75 246.49999 132.09999] CT
0.149 GC
N
f143727194
f
GR
GS
[0.75 0 0 0.75 246.49999 132.09999] CT
0.149 GC
N
f1305826713
f
GR
GS
[0.75 0 0 0.75 328.5 132.09999] CT
0.149 GC
N
f143727194
f
GR
GS
[0.75 0 0 0.75 328.5 132.09999] CT
0.149 GC
N
f-1909175845
f
GR
GS
[0.75 0 0 0.75 410.49998 132.09999] CT
0.149 GC
N
f-678663693
f
GR
GS
[0.75 0 0 0.75 410.49998 132.09999] CT
0.149 GC
N
f1305826713
f
GR
GS
[0.75 0 0 0.75 492.50002 132.09999] CT
0.149 GC
N
f-678663693
f
GR
GS
[0.75 0 0 0.75 492.50002 132.09999] CT
0.149 GC
N
f-1909175845
f
GR
GS
[0.75 0 0 0.75 574.5 132.09999] CT
0.149 GC
N
/f725468098{-9.719 18.301 M
-9.156 19.129 -8.203 19.527 QT
-7.25 19.926 -6.156 19.926 QT
-4.766 19.926 -4.18 18.738 QT
-3.594 17.551 -3.594 16.035 QT
-3.594 15.347 -3.719 14.668 QT
-3.844 13.988 -4.133 13.402 QT
-4.422 12.816 -4.938 12.465 QT
-5.453 12.113 -6.188 12.113 QT
-7.781 12.113 L
-7.984 12.113 -7.984 11.894 QT
-7.984 11.691 L
-7.984 11.504 -7.781 11.504 QT
-6.453 11.394 L
-5.609 11.394 -5.055 10.761 QT
-4.5 10.129 -4.242 9.222 QT
-3.984 8.316 -3.984 7.488 QT
-3.984 6.347 -4.523 5.605 QT
-5.063 4.863 -6.156 4.863 QT
-7.078 4.863 -7.906 5.207 QT
-8.734 5.551 -9.234 6.254 QT
-9.188 6.254 -9.148 6.246 QT
-9.109 6.238 -9.063 6.238 QT
-8.531 6.238 -8.164 6.613 QT
-7.797 6.988 -7.797 7.519 QT
-7.797 8.035 -8.164 8.41 QT
-8.531 8.785 -9.063 8.785 QT
-9.594 8.785 -9.969 8.41 QT
-10.344 8.035 -10.344 7.519 QT
-10.344 6.488 -9.727 5.722 QT
-9.109 4.957 -8.125 4.566 QT
-7.141 4.176 -6.156 4.176 QT
-5.438 4.176 -4.625 4.394 QT
-3.813 4.613 -3.156 5.011 QT
-2.5 5.41 -2.086 6.043 QT
-1.672 6.676 -1.672 7.488 QT
-1.672 8.504 -2.125 9.355 QT
-2.578 10.207 -3.359 10.832 QT
-4.141 11.457 -5.078 11.754 QT
-4.047 11.957 -3.109 12.543 QT
-2.172 13.129 -1.602 14.043 QT
-1.031 14.957 -1.031 16.004 QT
-1.031 17.332 -1.758 18.402 QT
-2.484 19.472 -3.664 20.082 QT
-4.844 20.691 -6.156 20.691 QT
-7.281 20.691 -8.414 20.261 QT
-9.547 19.832 -10.266 18.972 QT
-10.984 18.113 -10.984 16.926 QT
-10.984 16.332 -10.586 15.933 QT
-10.188 15.535 -9.594 15.535 QT
-9.203 15.535 -8.883 15.715 QT
-8.563 15.894 -8.383 16.222 QT
-8.203 16.551 -8.203 16.926 QT
-8.203 17.504 -8.609 17.902 QT
-9.016 18.301 -9.594 18.301 QT
-9.719 18.301 L
cp}def
f725468098
f
GR
GS
[0.75 0 0 0.75 574.5 132.09999] CT
0.149 GC
N
f1305826713
f
GR
GS
[0.75 0 0 0.75 0 0.5] CT
0.149 GC
2 setlinecap
1 LJ
0.667 LW
N
110 168 M
110 29 L
S
GR
GS
[0.75 0 0 0.75 0 0.5] CT
0.149 GC
2 setlinecap
1 LJ
0.667 LW
N
766 168 M
766 29 L
S
GR
GS
[0.75 0 0 0.75 0 0.5] CT
0.149 GC
2 setlinecap
1 LJ
0.667 LW
N
110 168 M
116.56 168 L
S
GR
GS
[0.75 0 0 0.75 0 0.5] CT
0.149 GC
2 setlinecap
1 LJ
0.667 LW
N
110 73.629 M
116.56 73.629 L
S
GR
GS
[0.75 0 0 0.75 0 0.5] CT
0.149 GC
2 setlinecap
1 LJ
0.667 LW
N
766 168 M
759.44 168 L
S
GR
GS
[0.75 0 0 0.75 0 0.5] CT
0.149 GC
2 setlinecap
1 LJ
0.667 LW
N
766 73.629 M
759.44 73.629 L
S
GR
GS
[0.75 0 0 0.75 76.9 126.5] CT
0.149 GC
N
f1219663315
f
GR
GS
[0.75 0 0 0.75 76.9 55.72147] CT
0.149 GC
N
/f429638810{-9.906 3.026 M
-9.672 3.729 -9.156 4.307 QT
-8.641 4.885 -7.945 5.205 QT
-7.25 5.526 -6.5 5.526 QT
-4.766 5.526 -4.109 4.174 QT
-3.453 2.822 -3.453 0.901 QT
-3.453 0.072 -3.484 -0.498 QT
-3.516 -1.068 -3.641 -1.584 QT
-3.859 -2.428 -4.422 -3.06 QT
-4.984 -3.693 -5.781 -3.693 QT
-6.594 -3.693 -7.172 -3.451 QT
-7.75 -3.209 -8.117 -2.881 QT
-8.484 -2.553 -8.766 -2.185 QT
-9.047 -1.818 -9.109 -1.803 QT
-9.391 -1.803 L
-9.438 -1.803 -9.531 -1.881 QT
-9.625 -1.959 -9.625 -2.021 QT
-9.625 -10.037 L
-9.625 -10.099 -9.547 -10.162 QT
-9.469 -10.224 -9.391 -10.224 QT
-9.313 -10.224 L
-7.703 -9.459 -5.875 -9.459 QT
-4.094 -9.459 -2.453 -10.224 QT
-2.375 -10.224 L
-2.297 -10.224 -2.227 -10.17 QT
-2.156 -10.115 -2.156 -10.037 QT
-2.156 -9.818 L
-2.156 -9.693 -2.203 -9.693 QT
-3.016 -8.615 -4.258 -8.006 QT
-5.5 -7.396 -6.813 -7.396 QT
-7.781 -7.396 -8.781 -7.662 QT
-8.781 -3.131 L
-7.984 -3.771 -7.359 -4.045 QT
-6.734 -4.318 -5.766 -4.318 QT
-4.438 -4.318 -3.391 -3.56 QT
-2.344 -2.803 -1.781 -1.576 QT
-1.219 -0.349 -1.219 0.932 QT
-1.219 2.369 -1.93 3.604 QT
-2.641 4.838 -3.859 5.565 QT
-5.078 6.291 -6.5 6.291 QT
-7.688 6.291 -8.68 5.682 QT
-9.672 5.072 -10.234 4.041 QT
-10.797 3.01 -10.797 1.838 QT
-10.797 1.307 -10.445 0.963 QT
-10.094 0.619 -9.578 0.619 QT
-9.047 0.619 -8.688 0.971 QT
-8.328 1.322 -8.328 1.838 QT
-8.328 2.354 -8.688 2.713 QT
-9.047 3.072 -9.578 3.072 QT
-9.656 3.072 -9.758 3.057 QT
-9.859 3.041 -9.906 3.026 QT
cp}def
f429638810
f
GR
GS
[0.75 0 0 0.75 0 0.5] CT
0 0.447 0.741 RC
1 LJ
2.667 LW
N
131.867 78.507 M
153.733 79.218 L
175.6 65.161 L
197.467 80.584 L
219.333 57.636 L
241.2 51.314 L
263.067 50.128 L
284.933 39.099 L
306.8 33.021 L
328.667 41.231 L
350.533 29 L
372.4 34.652 L
394.267 52.828 L
416.133 51.959 L
438 64.652 L
459.867 61.803 L
481.733 116.547 L
503.6 114.464 L
525.467 99.244 L
547.333 103.477 L
569.2 53.589 L
591.067 51.001 L
612.933 87.782 L
634.8 72.899 L
656.667 71.465 L
678.533 83.002 L
700.4 86.015 L
722.267 117.553 L
744.133 126.131 L
S
GR
GS
[0.75 0 0 0.75 0 0.5] CT
0.929 0.694 0.125 RC
1 LJ
2.667 LW
N
131.867 147.956 M
153.733 145.922 L
175.6 127.397 L
197.467 143.49 L
219.333 141.24 L
241.2 135.65 L
263.067 134.441 L
284.933 132.255 L
306.8 125.406 L
328.667 136.318 L
350.533 129.926 L
372.4 135.446 L
394.267 151.335 L
416.133 149.403 L
438 142.437 L
459.867 144.846 L
481.733 164.561 L
503.6 162.456 L
525.467 153.868 L
547.333 155.969 L
569.2 113.231 L
591.067 110.455 L
612.933 140.532 L
634.8 111.046 L
656.667 98.558 L
678.533 116.289 L
700.4 130.487 L
722.267 164.359 L
744.133 160.121 L
S
GR
GS
[0.75 0 0 0.75 0 0.5] CT
1 0 0 RC
1 LJ
2.667 LW
N
131.867 145.661 M
153.733 144.823 L
175.6 132.641 L
197.467 150.033 L
219.333 163.574 L
241.2 157.885 L
263.067 158.722 L
284.933 159.766 L
306.8 152.508 L
328.667 161.812 L
350.533 149.17 L
372.4 151.603 L
394.267 144.027 L
416.133 143.135 L
438 152.341 L
459.867 153.757 L
481.733 120.428 L
503.6 124.06 L
525.467 132.333 L
547.333 116.556 L
569.2 157.994 L
591.067 152.858 L
612.933 140.141 L
634.8 150.282 L
656.667 150.343 L
678.533 136.115 L
700.4 140.231 L
722.267 125.914 L
744.133 131.609 L
S
GR
GS
[0.75 0 0 0.75 0 0.5] CT
1 GC
N
755 118 M
755 36 L
567 36 L
567 118 L
cp
f
GR
GS
[0.75 0 0 0.75 460.35471 38.62714] CT
N
f-597267615
f
GR
GS
[0.75 0 0 0.75 460.35471 38.62714] CT
N
f1637560580
f
GR
GS
[0.75 0 0 0.75 460.35471 38.62714] CT
N
f374720792
f
GR
GS
[0.75 0 0 0.75 0 0.5] CT
0 0.447 0.741 RC
1 LJ
2.667 LW
N
570.984 50.836 M
610.819 50.836 L
S
GR
GS
[0.75 0 0 0.75 460.35471 58.25] CT
N
f1886913203
f
GR
GS
[0.75 0 0 0.75 460.35471 58.25] CT
N
f1818420723
f
GR
GS
[0.75 0 0 0.75 0 0.5] CT
0.929 0.694 0.125 RC
1 LJ
2.667 LW
N
570.984 77 M
610.819 77 L
S
GR
GS
[0.75 0 0 0.75 460.35471 77.87286] CT
N
f-1657957548
f
GR
GS
[0.75 0 0 0.75 460.35471 77.87286] CT
N
f-1984996643
f
GR
GS
[0.75 0 0 0.75 460.35471 77.87286] CT
N
f-1025401139
f
GR
GS
[0.75 0 0 0.75 460.35471 77.87286] CT
N
f1233475555
f
GR
GS
[0.75 0 0 0.75 460.35471 77.87286] CT
N
f-1264859159
f
GR
GS
[0.75 0 0 0.75 460.35471 77.87286] CT
N
f-1666518754
f
GR
GS
[0.75 0 0 0.75 460.35471 77.87286] CT
N
f1415424017
f
GR
GS
[0.75 0 0 0.75 460.35471 77.87286] CT
N
/f-1039920835{109.195 5.12 M
109.195 4.557 L
109.195 4.511 109.242 4.448 QT
112.492 0.839 L
113.242 0.026 113.703 -0.513 QT
114.164 -1.052 114.609 -1.763 QT
115.055 -2.474 115.32 -3.2 QT
115.586 -3.927 115.586 -4.755 QT
115.586 -5.614 115.265 -6.404 QT
114.945 -7.193 114.312 -7.661 QT
113.68 -8.13 112.789 -8.13 QT
111.883 -8.13 111.156 -7.583 QT
110.43 -7.036 110.133 -6.161 QT
110.211 -6.177 110.351 -6.177 QT
110.82 -6.177 111.156 -5.864 QT
111.492 -5.552 111.492 -5.036 QT
111.492 -4.568 111.156 -4.232 QT
110.82 -3.896 110.351 -3.896 QT
109.867 -3.896 109.531 -4.239 QT
109.195 -4.583 109.195 -5.036 QT
109.195 -5.833 109.492 -6.521 QT
109.789 -7.208 110.351 -7.747 QT
110.914 -8.286 111.609 -8.575 QT
112.305 -8.864 113.101 -8.864 QT
114.305 -8.864 115.336 -8.357 QT
116.367 -7.849 116.976 -6.919 QT
117.586 -5.989 117.586 -4.755 QT
117.586 -3.849 117.187 -3.029 QT
116.789 -2.208 116.164 -1.536 QT
115.539 -0.864 114.562 -0.013 QT
113.586 0.839 113.273 1.136 QT
110.898 3.417 L
112.914 3.417 L
114.398 3.417 115.398 3.393 QT
116.398 3.37 116.461 3.307 QT
116.711 3.042 116.961 1.37 QT
117.586 1.37 L
116.992 5.12 L
109.195 5.12 L
cp}def
f-1039920835
f
GR
GS
[0.75 0 0 0.75 460.35471 77.87286] CT
N
/f840793201{119.862 5.12 M
119.862 4.557 L
119.862 4.511 119.909 4.448 QT
123.159 0.839 L
123.909 0.026 124.37 -0.513 QT
124.831 -1.052 125.276 -1.763 QT
125.721 -2.474 125.987 -3.2 QT
126.252 -3.927 126.252 -4.755 QT
126.252 -5.614 125.932 -6.404 QT
125.612 -7.193 124.979 -7.661 QT
124.346 -8.13 123.456 -8.13 QT
122.549 -8.13 121.823 -7.583 QT
121.096 -7.036 120.799 -6.161 QT
120.877 -6.177 121.018 -6.177 QT
121.487 -6.177 121.823 -5.864 QT
122.159 -5.552 122.159 -5.036 QT
122.159 -4.568 121.823 -4.232 QT
121.487 -3.896 121.018 -3.896 QT
120.534 -3.896 120.198 -4.239 QT
119.862 -4.583 119.862 -5.036 QT
119.862 -5.833 120.159 -6.521 QT
120.456 -7.208 121.018 -7.747 QT
121.581 -8.286 122.276 -8.575 QT
122.971 -8.864 123.768 -8.864 QT
124.971 -8.864 126.002 -8.357 QT
127.034 -7.849 127.643 -6.919 QT
128.252 -5.989 128.252 -4.755 QT
128.252 -3.849 127.854 -3.029 QT
127.456 -2.208 126.831 -1.536 QT
126.206 -0.864 125.229 -0.013 QT
124.252 0.839 123.94 1.136 QT
121.565 3.417 L
123.581 3.417 L
125.065 3.417 126.065 3.393 QT
127.065 3.37 127.127 3.307 QT
127.377 3.042 127.627 1.37 QT
128.252 1.37 L
127.659 5.12 L
119.862 5.12 L
cp}def
f840793201
f
GR
GS
[0.75 0 0 0.75 460.35471 77.87286] CT
N
f1232456156
f
GR
GS
[0.75 0 0 0.75 0 0.5] CT
1 0 0 RC
1 LJ
2.667 LW
N
570.984 103.164 M
610.819 103.164 L
S
GR
GS
[0.75 0 0 0.75 0 0.5] CT
0.149 GC
10.0 ML
0.667 LW
N
567 118 M
567 36 L
755 36 L
755 118 L
cp
S
GR
GS
[0.75 0 0 0.75 0 0.5] CT
1 GC
N
111 570 M
765 570 L
765 426 L
111 426 L
cp
f
GR
GS
[0.75 0 0 0.75 0 0.5] CT
0.149 GC
2 setlinecap
1 LJ
0.667 LW
N
111 570 M
765 570 L
S
GR
GS
[0.75 0 0 0.75 0 0.5] CT
0.149 GC
2 setlinecap
1 LJ
0.667 LW
N
111 426 M
765 426 L
S
GR
GS
[0.75 0 0 0.75 0 0.5] CT
0.149 GC
2 setlinecap
1 LJ
0.667 LW
N
111 570 M
111 563.46 L
S
GR
GS
[0.75 0 0 0.75 0 0.5] CT
0.149 GC
2 setlinecap
1 LJ
0.667 LW
N
192.75 570 M
192.75 563.46 L
S
GR
GS
[0.75 0 0 0.75 0 0.5] CT
0.149 GC
2 setlinecap
1 LJ
0.667 LW
N
274.5 570 M
274.5 563.46 L
S
GR
GS
[0.75 0 0 0.75 0 0.5] CT
0.149 GC
2 setlinecap
1 LJ
0.667 LW
N
356.25 570 M
356.25 563.46 L
S
GR
GS
[0.75 0 0 0.75 0 0.5] CT
0.149 GC
2 setlinecap
1 LJ
0.667 LW
N
438 570 M
438 563.46 L
S
GR
GS
[0.75 0 0 0.75 0 0.5] CT
0.149 GC
2 setlinecap
1 LJ
0.667 LW
N
519.75 570 M
519.75 563.46 L
S
GR
GS
[0.75 0 0 0.75 0 0.5] CT
0.149 GC
2 setlinecap
1 LJ
0.667 LW
N
601.5 570 M
601.5 563.46 L
S
GR
GS
[0.75 0 0 0.75 0 0.5] CT
0.149 GC
2 setlinecap
1 LJ
0.667 LW
N
683.25 570 M
683.25 563.46 L
S
GR
GS
[0.75 0 0 0.75 0 0.5] CT
0.149 GC
2 setlinecap
1 LJ
0.667 LW
N
765 570 M
765 563.46 L
S
GR
GS
[0.75 0 0 0.75 0 0.5] CT
0.149 GC
2 setlinecap
1 LJ
0.667 LW
N
111 426 M
111 432.54 L
S
GR
GS
[0.75 0 0 0.75 0 0.5] CT
0.149 GC
2 setlinecap
1 LJ
0.667 LW
N
192.75 426 M
192.75 432.54 L
S
GR
GS
[0.75 0 0 0.75 0 0.5] CT
0.149 GC
2 setlinecap
1 LJ
0.667 LW
N
274.5 426 M
274.5 432.54 L
S
GR
GS
[0.75 0 0 0.75 0 0.5] CT
0.149 GC
2 setlinecap
1 LJ
0.667 LW
N
356.25 426 M
356.25 432.54 L
S
GR
GS
[0.75 0 0 0.75 0 0.5] CT
0.149 GC
2 setlinecap
1 LJ
0.667 LW
N
438 426 M
438 432.54 L
S
GR
GS
[0.75 0 0 0.75 0 0.5] CT
0.149 GC
2 setlinecap
1 LJ
0.667 LW
N
519.75 426 M
519.75 432.54 L
S
GR
GS
[0.75 0 0 0.75 0 0.5] CT
0.149 GC
2 setlinecap
1 LJ
0.667 LW
N
601.5 426 M
601.5 432.54 L
S
GR
GS
[0.75 0 0 0.75 0 0.5] CT
0.149 GC
2 setlinecap
1 LJ
0.667 LW
N
683.25 426 M
683.25 432.54 L
S
GR
GS
[0.75 0 0 0.75 0 0.5] CT
0.149 GC
2 setlinecap
1 LJ
0.667 LW
N
765 426 M
765 432.54 L
S
GR
GS
[0.75 0 0 0.75 83.25 433.60001] CT
0.149 GC
N
f-1749699357
f
GR
GS
[0.75 0 0 0.75 144.5625 433.60001] CT
0.149 GC
N
f-685938123
f
GR
GS
[0.75 0 0 0.75 205.875 433.60001] CT
0.149 GC
N
f143727194
f
GR
GS
[0.75 0 0 0.75 205.875 433.60001] CT
0.149 GC
N
f1305826713
f
GR
GS
[0.75 0 0 0.75 267.1875 433.60001] CT
0.149 GC
N
f143727194
f
GR
GS
[0.75 0 0 0.75 267.1875 433.60001] CT
0.149 GC
N
f-1909175845
f
GR
GS
[0.75 0 0 0.75 328.5 433.60001] CT
0.149 GC
N
f-678663693
f
GR
GS
[0.75 0 0 0.75 328.5 433.60001] CT
0.149 GC
N
f1305826713
f
GR
GS
[0.75 0 0 0.75 389.8125 433.60001] CT
0.149 GC
N
f-678663693
f
GR
GS
[0.75 0 0 0.75 389.8125 433.60001] CT
0.149 GC
N
f-1909175845
f
GR
GS
[0.75 0 0 0.75 451.125 433.60001] CT
0.149 GC
N
f725468098
f
GR
GS
[0.75 0 0 0.75 451.125 433.60001] CT
0.149 GC
N
f1305826713
f
GR
GS
[0.75 0 0 0.75 512.4375 433.60001] CT
0.149 GC
N
f725468098
f
GR
GS
[0.75 0 0 0.75 512.4375 433.60001] CT
0.149 GC
N
f-1909175845
f
GR
GS
[0.75 0 0 0.75 573.75 433.60001] CT
0.149 GC
N
/f1452673371{-11.328 16.191 M
-11.328 15.347 L
-3.906 4.285 L
-3.828 4.176 -3.672 4.176 QT
-3.313 4.176 L
-3.047 4.176 -3.047 4.441 QT
-3.047 15.347 L
-0.688 15.347 L
-0.688 16.191 L
-3.047 16.191 L
-3.047 18.551 L
-3.047 19.051 -2.344 19.183 QT
-1.641 19.316 -0.719 19.316 QT
-0.719 20.16 L
-7.328 20.16 L
-7.328 19.316 L
-6.391 19.316 -5.688 19.183 QT
-4.984 19.051 -4.984 18.551 QT
-4.984 16.191 L
-11.328 16.191 L
cp
-10.531 15.347 M
-4.844 15.347 L
-4.844 6.863 L
-10.531 15.347 L
cp}def
f1452673371
f
GR
GS
[0.75 0 0 0.75 573.75 433.60001] CT
0.149 GC
N
f1305826713
f
GR
GS
[0.75 0 0 0.75 0 0.5] CT
0.149 GC
2 setlinecap
1 LJ
0.667 LW
N
111 570 M
111 426 L
S
GR
GS
[0.75 0 0 0.75 0 0.5] CT
0.149 GC
2 setlinecap
1 LJ
0.667 LW
N
765 570 M
765 426 L
S
GR
GS
[0.75 0 0 0.75 0 0.5] CT
0.149 GC
2 setlinecap
1 LJ
0.667 LW
N
111 570 M
117.54 570 L
S
GR
GS
[0.75 0 0 0.75 0 0.5] CT
0.149 GC
2 setlinecap
1 LJ
0.667 LW
N
111 498 M
117.54 498 L
S
GR
GS
[0.75 0 0 0.75 0 0.5] CT
0.149 GC
2 setlinecap
1 LJ
0.667 LW
N
111 426 M
117.54 426 L
S
GR
GS
[0.75 0 0 0.75 0 0.5] CT
0.149 GC
2 setlinecap
1 LJ
0.667 LW
N
765 570 M
758.46 570 L
S
GR
GS
[0.75 0 0 0.75 0 0.5] CT
0.149 GC
2 setlinecap
1 LJ
0.667 LW
N
765 498 M
758.46 498 L
S
GR
GS
[0.75 0 0 0.75 0 0.5] CT
0.149 GC
2 setlinecap
1 LJ
0.667 LW
N
765 426 M
758.46 426 L
S
GR
GS
[0.75 0 0 0.75 77.65 428] CT
0.149 GC
N
f1219663315
f
GR
GS
[0.75 0 0 0.75 77.65 374] CT
0.149 GC
N
f429638810
f
GR
GS
[0.75 0 0 0.75 77.65 320] CT
0.149 GC
N
f1579298569
f
GR
GS
[0.75 0 0 0.75 77.65 320] CT
0.149 GC
N
f1219663315
f
GR
GS
[0 -0.75 0.75 0 56.36215 301.36277] CT
0.149 GC
N
/f-708112325{-53.03 -9.504 M
-53.03 -10.426 L
-50.342 -10.426 -50.342 -11.238 QT
-50.342 -25.52 L
-50.342 -26.348 -53.03 -26.348 QT
-53.03 -27.27 L
-38.327 -27.27 L
-37.608 -21.317 L
-38.358 -21.317 L
-38.624 -23.551 -39.131 -24.567 QT
-39.639 -25.582 -40.741 -25.965 QT
-41.842 -26.348 -44.046 -26.348 QT
-46.608 -26.348 L
-47.077 -26.348 -47.335 -26.309 QT
-47.592 -26.27 -47.756 -26.09 QT
-47.921 -25.91 -47.921 -25.52 QT
-47.921 -19.176 L
-45.999 -19.176 L
-44.686 -19.176 -44.03 -19.403 QT
-43.374 -19.629 -43.131 -20.254 QT
-42.889 -20.879 -42.889 -22.207 QT
-42.124 -22.207 L
-42.124 -15.223 L
-42.889 -15.223 L
-42.889 -16.551 -43.131 -17.184 QT
-43.374 -17.817 -44.03 -18.043 QT
-44.686 -18.27 -45.999 -18.27 QT
-47.921 -18.27 L
-47.921 -11.238 L
-47.921 -10.692 -47.608 -10.559 QT
-47.296 -10.426 -46.608 -10.426 QT
-43.842 -10.426 L
-42.046 -10.426 -40.936 -10.707 QT
-39.827 -10.988 -39.21 -11.653 QT
-38.592 -12.317 -38.256 -13.379 QT
-37.921 -14.442 -37.624 -16.317 QT
-36.874 -16.317 L
-37.967 -9.504 L
-53.03 -9.504 L
cp}def
f-708112325
f
GR
GS
[0 -0.75 0.75 0 56.36215 301.36277] CT
0.149 GC
N
/f-486610011{-35.188 -9.504 M
-35.188 -10.426 L
-34.298 -10.426 -33.727 -10.559 QT
-33.157 -10.692 -33.157 -11.238 QT
-33.157 -18.348 L
-33.157 -19.035 -33.368 -19.348 QT
-33.579 -19.66 -33.969 -19.731 QT
-34.36 -19.801 -35.188 -19.801 QT
-35.188 -20.707 L
-31.469 -20.988 L
-31.469 -18.457 L
-31.048 -19.582 -30.274 -20.285 QT
-29.501 -20.988 -28.391 -20.988 QT
-27.626 -20.988 -27.016 -20.535 QT
-26.407 -20.082 -26.407 -19.332 QT
-26.407 -18.863 -26.743 -18.512 QT
-27.079 -18.16 -27.563 -18.16 QT
-28.048 -18.16 -28.391 -18.504 QT
-28.735 -18.848 -28.735 -19.332 QT
-28.735 -20.035 -28.235 -20.317 QT
-28.391 -20.317 L
-29.454 -20.317 -30.118 -19.559 QT
-30.782 -18.801 -31.063 -17.668 QT
-31.344 -16.535 -31.344 -15.504 QT
-31.344 -11.238 L
-31.344 -10.426 -28.813 -10.426 QT
-28.813 -9.504 L
-35.188 -9.504 L
cp}def
f-486610011
f
GR
GS
[0 -0.75 0.75 0 56.36215 301.36277] CT
0.149 GC
N
/f225570699{-24.848 -9.504 M
-24.848 -10.426 L
-23.958 -10.426 -23.387 -10.559 QT
-22.817 -10.692 -22.817 -11.238 QT
-22.817 -18.348 L
-22.817 -19.035 -23.028 -19.348 QT
-23.239 -19.66 -23.629 -19.731 QT
-24.02 -19.801 -24.848 -19.801 QT
-24.848 -20.707 L
-21.129 -20.988 L
-21.129 -18.457 L
-20.708 -19.582 -19.934 -20.285 QT
-19.161 -20.988 -18.051 -20.988 QT
-17.286 -20.988 -16.676 -20.535 QT
-16.067 -20.082 -16.067 -19.332 QT
-16.067 -18.863 -16.403 -18.512 QT
-16.739 -18.16 -17.223 -18.16 QT
-17.708 -18.16 -18.051 -18.504 QT
-18.395 -18.848 -18.395 -19.332 QT
-18.395 -20.035 -17.895 -20.317 QT
-18.051 -20.317 L
-19.114 -20.317 -19.778 -19.559 QT
-20.442 -18.801 -20.723 -17.668 QT
-21.004 -16.535 -21.004 -15.504 QT
-21.004 -11.238 L
-21.004 -10.426 -18.473 -10.426 QT
-18.473 -9.504 L
-24.848 -9.504 L
cp}def
f225570699
f
GR
GS
[0 -0.75 0.75 0 56.36215 301.36277] CT
0.149 GC
N
/f191963998{-8.68 -9.207 M
-10.243 -9.207 -11.578 -10.004 QT
-12.914 -10.801 -13.688 -12.137 QT
-14.461 -13.473 -14.461 -15.035 QT
-14.461 -16.238 -14.032 -17.34 QT
-13.602 -18.442 -12.813 -19.309 QT
-12.024 -20.176 -10.969 -20.668 QT
-9.914 -21.16 -8.68 -21.16 QT
-7.086 -21.16 -5.766 -20.317 QT
-4.446 -19.473 -3.688 -18.059 QT
-2.93 -16.645 -2.93 -15.035 QT
-2.93 -13.473 -3.703 -12.137 QT
-4.477 -10.801 -5.805 -10.004 QT
-7.133 -9.207 -8.68 -9.207 QT
cp
-8.68 -9.973 M
-6.602 -9.973 -5.899 -11.481 QT
-5.196 -12.988 -5.196 -15.332 QT
-5.196 -16.645 -5.336 -17.496 QT
-5.477 -18.348 -5.946 -19.051 QT
-6.243 -19.488 -6.696 -19.809 QT
-7.149 -20.129 -7.649 -20.301 QT
-8.149 -20.473 -8.68 -20.473 QT
-9.493 -20.473 -10.219 -20.106 QT
-10.946 -19.738 -11.43 -19.051 QT
-11.914 -18.317 -12.047 -17.434 QT
-12.18 -16.551 -12.18 -15.332 QT
-12.18 -13.879 -11.93 -12.715 QT
-11.68 -11.551 -10.907 -10.762 QT
-10.133 -9.973 -8.68 -9.973 QT
cp}def
f191963998
f
GR
GS
[0 -0.75 0.75 0 56.36215 301.36277] CT
0.149 GC
N
/f-1953887529{-1.308 -9.504 M
-1.308 -10.426 L
-0.417 -10.426 0.153 -10.559 QT
0.723 -10.692 0.723 -11.238 QT
0.723 -18.348 L
0.723 -19.035 0.512 -19.348 QT
0.301 -19.66 -0.089 -19.731 QT
-0.48 -19.801 -1.308 -19.801 QT
-1.308 -20.707 L
2.411 -20.988 L
2.411 -18.457 L
2.832 -19.582 3.606 -20.285 QT
4.379 -20.988 5.489 -20.988 QT
6.254 -20.988 6.864 -20.535 QT
7.473 -20.082 7.473 -19.332 QT
7.473 -18.863 7.137 -18.512 QT
6.801 -18.16 6.317 -18.16 QT
5.832 -18.16 5.489 -18.504 QT
5.145 -18.848 5.145 -19.332 QT
5.145 -20.035 5.645 -20.317 QT
5.489 -20.317 L
4.426 -20.317 3.762 -19.559 QT
3.098 -18.801 2.817 -17.668 QT
2.536 -16.535 2.536 -15.504 QT
2.536 -11.238 L
2.536 -10.426 5.067 -10.426 QT
5.067 -9.504 L
-1.308 -9.504 L
cp}def
f-1953887529
f
GR
GS
[0 -0.75 0.75 0 56.36215 301.36277] CT
0.149 GC
N
/f-1302836169{20.238 -3.004 M
20.238 -29.004 L
23.785 -29.004 L
23.785 -27.957 L
21.269 -27.957 L
21.269 -4.051 L
23.785 -4.051 L
23.785 -3.004 L
20.238 -3.004 L
cp}def
f-1302836169
f
GR
GS
[0 -0.75 0.75 0 56.36215 301.36277] CT
0.149 GC
N
/f-1242684427{25.275 -9.504 M
25.275 -10.426 L
26.15 -10.426 26.728 -10.559 QT
27.306 -10.692 27.306 -11.238 QT
27.306 -18.348 L
27.306 -19.035 27.095 -19.348 QT
26.884 -19.66 26.486 -19.731 QT
26.087 -19.801 25.275 -19.801 QT
25.275 -20.707 L
29.04 -20.988 L
29.04 -18.457 L
29.556 -19.567 30.579 -20.278 QT
31.603 -20.988 32.806 -20.988 QT
35.806 -20.988 36.321 -18.551 QT
36.853 -19.645 37.853 -20.317 QT
38.853 -20.988 40.04 -20.988 QT
41.228 -20.988 42.032 -20.613 QT
42.837 -20.238 43.243 -19.457 QT
43.65 -18.676 43.65 -17.488 QT
43.65 -11.238 L
43.65 -10.692 44.228 -10.559 QT
44.806 -10.426 45.681 -10.426 QT
45.681 -9.504 L
39.728 -9.504 L
39.728 -10.426 L
40.618 -10.426 41.189 -10.559 QT
41.759 -10.692 41.759 -11.238 QT
41.759 -17.41 L
41.759 -18.723 41.392 -19.52 QT
41.025 -20.317 39.884 -20.317 QT
38.384 -20.317 37.407 -19.113 QT
36.431 -17.91 36.431 -16.379 QT
36.431 -11.238 L
36.431 -10.692 37.001 -10.559 QT
37.571 -10.426 38.462 -10.426 QT
38.462 -9.504 L
32.509 -9.504 L
32.509 -10.426 L
33.4 -10.426 33.97 -10.559 QT
34.54 -10.692 34.54 -11.238 QT
34.54 -17.41 L
34.54 -18.676 34.173 -19.496 QT
33.806 -20.317 32.65 -20.317 QT
31.15 -20.317 30.173 -19.113 QT
29.196 -17.91 29.196 -16.379 QT
29.196 -11.238 L
29.196 -10.692 29.775 -10.559 QT
30.353 -10.426 31.228 -10.426 QT
31.228 -9.504 L
25.275 -9.504 L
cp}def
f-1242684427
f
GR
GS
[0 -0.75 0.75 0 56.36215 301.36277] CT
0.149 GC
N
/f1906997066{47.072 -3.004 M
47.072 -4.051 L
49.587 -4.051 L
49.587 -27.957 L
47.072 -27.957 L
47.072 -29.004 L
50.634 -29.004 L
50.634 -3.004 L
47.072 -3.004 L
cp}def
f1906997066
f
GR
GS
[0.75 0 0 0.75 0 0.5] CT
0 0.447 0.741 RC
1 LJ
2.667 LW
N
127.35 539.759 M
143.7 531.571 L
160.05 529.122 L
176.4 528.289 L
192.75 554.259 L
209.1 521.418 L
225.45 556.32 L
241.8 556.48 L
258.15 546.197 L
274.5 550.41 L
290.85 537.8 L
307.2 525.237 L
323.55 516.318 L
339.9 529.542 L
356.25 541.383 L
372.6 533.389 L
388.95 505.884 L
405.3 508.935 L
421.65 502.206 L
438 502.658 L
454.35 513.283 L
470.7 509.156 L
487.05 514.201 L
503.4 515.877 L
519.75 515.772 L
536.1 523.153 L
552.45 529.137 L
568.8 531.938 L
585.15 539.253 L
601.5 526 L
617.85 516.928 L
634.2 511.758 L
650.55 513.783 L
666.9 508.882 L
683.25 506.316 L
699.6 511.796 L
715.95 529.744 L
732.3 538.195 L
748.65 529.607 L
S
GR
GS
[0.75 0 0 0.75 0 0.5] CT
0.929 0.694 0.125 RC
1 LJ
2.667 LW
N
127.35 557.427 M
143.7 569.273 L
160.05 567.603 L
176.4 569.616 L
192.75 568.544 L
209.1 560.504 L
225.45 543.801 L
241.8 542.304 L
258.15 553.118 L
274.5 545.414 L
290.85 553.8 L
307.2 569.221 L
323.55 560.182 L
339.9 563.358 L
356.25 539.718 L
372.6 557.959 L
388.95 548.535 L
405.3 544.577 L
421.65 541.967 L
438 542.761 L
454.35 555.037 L
470.7 554.575 L
487.05 559.206 L
503.4 561.319 L
519.75 560.517 L
536.1 564.273 L
552.45 568.132 L
568.8 556.158 L
585.15 555.749 L
601.5 565.728 L
617.85 551.994 L
634.2 545.494 L
650.55 559.085 L
666.9 547.992 L
683.25 542.128 L
699.6 541.761 L
715.95 569.701 L
732.3 565.771 L
748.65 564.819 L
S
GR
GS
[0.75 0 0 0.75 0 0.5] CT
1 0 0 RC
1 LJ
2.667 LW
N
127.35 463.14 M
143.7 496.498 L
160.05 487.617 L
176.4 491.605 L
192.75 457.967 L
209.1 491.912 L
225.45 524.817 L
241.8 532.994 L
258.15 516.349 L
274.5 533.378 L
290.85 516.286 L
307.2 494.395 L
323.55 480.759 L
339.9 499.592 L
356.25 524.706 L
372.6 498.876 L
388.95 454.725 L
405.3 469.721 L
421.65 463.583 L
438 463.566 L
454.35 481.726 L
470.7 475.006 L
487.05 480.954 L
503.4 482.315 L
519.75 481.602 L
536.1 487.493 L
552.45 501.794 L
568.8 511.783 L
585.15 508.396 L
601.5 488.26 L
617.85 466.04 L
634.2 460.088 L
650.55 475.416 L
666.9 480.021 L
683.25 466.818 L
699.6 466.745 L
715.95 479.976 L
732.3 486.361 L
748.65 472.692 L
S
GR
GS
[0.75 0 0 0.75 0 0.5] CT
1 GC
N
754 514 M
754 432 L
566 432 L
566 514 L
cp
f
GR
GS
[0.75 0 0 0.75 459.60471 335.62714] CT
N
f-597267615
f
GR
GS
[0.75 0 0 0.75 459.60471 335.62714] CT
N
f1637560580
f
GR
GS
[0.75 0 0 0.75 459.60471 335.62714] CT
N
f374720792
f
GR
GS
[0.75 0 0 0.75 0 0.5] CT
0 0.447 0.741 RC
1 LJ
2.667 LW
N
569.984 446.836 M
609.819 446.836 L
S
GR
GS
[0.75 0 0 0.75 459.60471 355.25] CT
N
f1886913203
f
GR
GS
[0.75 0 0 0.75 459.60471 355.25] CT
N
f1818420723
f
GR
GS
[0.75 0 0 0.75 0 0.5] CT
0.929 0.694 0.125 RC
1 LJ
2.667 LW
N
569.984 473 M
609.819 473 L
S
GR
GS
[0.75 0 0 0.75 459.60471 374.87286] CT
N
f-1657957548
f
GR
GS
[0.75 0 0 0.75 459.60471 374.87286] CT
N
f-1984996643
f
GR
GS
[0.75 0 0 0.75 459.60471 374.87286] CT
N
f-1025401139
f
GR
GS
[0.75 0 0 0.75 459.60471 374.87286] CT
N
f1233475555
f
GR
GS
[0.75 0 0 0.75 459.60471 374.87286] CT
N
f-1264859159
f
GR
GS
[0.75 0 0 0.75 459.60471 374.87286] CT
N
f-1666518754
f
GR
GS
[0.75 0 0 0.75 459.60471 374.87286] CT
N
f1415424017
f
GR
GS
[0.75 0 0 0.75 459.60471 374.87286] CT
N
f-2057051167
f
GR
GS
[0.75 0 0 0.75 459.60471 374.87286] CT
N
f-1535148082
f
GR
GS
[0.75 0 0 0.75 459.60471 374.87286] CT
N
f1232456156
f
GR
GS
[0.75 0 0 0.75 0 0.5] CT
1 0 0 RC
1 LJ
2.667 LW
N
569.984 499.164 M
609.819 499.164 L
S
GR
GS
[0.75 0 0 0.75 0 0.5] CT
0.149 GC
10.0 ML
0.667 LW
N
566 514 M
566 432 L
754 432 L
754 514 L
cp
S
GR
GS
[0.75 0 0 0.75 0 0.5] CT
1 GC
N
110 379 M
766 379 L
766 230 L
110 230 L
cp
f
GR
GS
[0.75 0 0 0.75 0 0.5] CT
0.149 GC
2 setlinecap
1 LJ
0.667 LW
N
110 379 M
766 379 L
S
GR
GS
[0.75 0 0 0.75 0 0.5] CT
0.149 GC
2 setlinecap
1 LJ
0.667 LW
N
110 230 M
766 230 L
S
GR
GS
[0.75 0 0 0.75 0 0.5] CT
0.149 GC
2 setlinecap
1 LJ
0.667 LW
N
110 379 M
110 372.44 L
S
GR
GS
[0.75 0 0 0.75 0 0.5] CT
0.149 GC
2 setlinecap
1 LJ
0.667 LW
N
212.5 379 M
212.5 372.44 L
S
GR
GS
[0.75 0 0 0.75 0 0.5] CT
0.149 GC
2 setlinecap
1 LJ
0.667 LW
N
315 379 M
315 372.44 L
S
GR
GS
[0.75 0 0 0.75 0 0.5] CT
0.149 GC
2 setlinecap
1 LJ
0.667 LW
N
417.5 379 M
417.5 372.44 L
S
GR
GS
[0.75 0 0 0.75 0 0.5] CT
0.149 GC
2 setlinecap
1 LJ
0.667 LW
N
520 379 M
520 372.44 L
S
GR
GS
[0.75 0 0 0.75 0 0.5] CT
0.149 GC
2 setlinecap
1 LJ
0.667 LW
N
622.5 379 M
622.5 372.44 L
S
GR
GS
[0.75 0 0 0.75 0 0.5] CT
0.149 GC
2 setlinecap
1 LJ
0.667 LW
N
725 379 M
725 372.44 L
S
GR
GS
[0.75 0 0 0.75 0 0.5] CT
0.149 GC
2 setlinecap
1 LJ
0.667 LW
N
110 230 M
110 236.56 L
S
GR
GS
[0.75 0 0 0.75 0 0.5] CT
0.149 GC
2 setlinecap
1 LJ
0.667 LW
N
212.5 230 M
212.5 236.56 L
S
GR
GS
[0.75 0 0 0.75 0 0.5] CT
0.149 GC
2 setlinecap
1 LJ
0.667 LW
N
315 230 M
315 236.56 L
S
GR
GS
[0.75 0 0 0.75 0 0.5] CT
0.149 GC
2 setlinecap
1 LJ
0.667 LW
N
417.5 230 M
417.5 236.56 L
S
GR
GS
[0.75 0 0 0.75 0 0.5] CT
0.149 GC
2 setlinecap
1 LJ
0.667 LW
N
520 230 M
520 236.56 L
S
GR
GS
[0.75 0 0 0.75 0 0.5] CT
0.149 GC
2 setlinecap
1 LJ
0.667 LW
N
622.5 230 M
622.5 236.56 L
S
GR
GS
[0.75 0 0 0.75 0 0.5] CT
0.149 GC
2 setlinecap
1 LJ
0.667 LW
N
725 230 M
725 236.56 L
S
GR
GS
[0.75 0 0 0.75 82.5 290.35001] CT
0.149 GC
N
f-1749699357
f
GR
GS
[0.75 0 0 0.75 159.375 290.35001] CT
0.149 GC
N
f-685938123
f
GR
GS
[0.75 0 0 0.75 236.25 290.35001] CT
0.149 GC
N
f143727194
f
GR
GS
[0.75 0 0 0.75 236.25 290.35001] CT
0.149 GC
N
f1305826713
f
GR
GS
[0.75 0 0 0.75 313.125 290.35001] CT
0.149 GC
N
f143727194
f
GR
GS
[0.75 0 0 0.75 313.125 290.35001] CT
0.149 GC
N
f-1909175845
f
GR
GS
[0.75 0 0 0.75 390 290.35001] CT
0.149 GC
N
f-678663693
f
GR
GS
[0.75 0 0 0.75 390 290.35001] CT
0.149 GC
N
f1305826713
f
GR
GS
[0.75 0 0 0.75 466.875 290.35001] CT
0.149 GC
N
f-678663693
f
GR
GS
[0.75 0 0 0.75 466.875 290.35001] CT
0.149 GC
N
f-1909175845
f
GR
GS
[0.75 0 0 0.75 543.75 290.35001] CT
0.149 GC
N
f725468098
f
GR
GS
[0.75 0 0 0.75 543.75 290.35001] CT
0.149 GC
N
f1305826713
f
GR
GS
[0.75 0 0 0.75 0 0.5] CT
0.149 GC
2 setlinecap
1 LJ
0.667 LW
N
110 379 M
110 230 L
S
GR
GS
[0.75 0 0 0.75 0 0.5] CT
0.149 GC
2 setlinecap
1 LJ
0.667 LW
N
766 379 M
766 230 L
S
GR
GS
[0.75 0 0 0.75 0 0.5] CT
0.149 GC
2 setlinecap
1 LJ
0.667 LW
N
110 379 M
116.56 379 L
S
GR
GS
[0.75 0 0 0.75 0 0.5] CT
0.149 GC
2 setlinecap
1 LJ
0.667 LW
N
110 304.5 M
116.56 304.5 L
S
GR
GS
[0.75 0 0 0.75 0 0.5] CT
0.149 GC
2 setlinecap
1 LJ
0.667 LW
N
110 230 M
116.56 230 L
S
GR
GS
[0.75 0 0 0.75 0 0.5] CT
0.149 GC
2 setlinecap
1 LJ
0.667 LW
N
766 379 M
759.44 379 L
S
GR
GS
[0.75 0 0 0.75 0 0.5] CT
0.149 GC
2 setlinecap
1 LJ
0.667 LW
N
766 304.5 M
759.44 304.5 L
S
GR
GS
[0.75 0 0 0.75 0 0.5] CT
0.149 GC
2 setlinecap
1 LJ
0.667 LW
N
766 230 M
759.44 230 L
S
GR
GS
[0.75 0 0 0.75 76.9 284.75] CT
0.149 GC
N
f1219663315
f
GR
GS
[0.75 0 0 0.75 76.9 228.875] CT
0.149 GC
N
f429638810
f
GR
GS
[0.75 0 0 0.75 76.9 173] CT
0.149 GC
N
f1579298569
f
GR
GS
[0.75 0 0 0.75 76.9 173] CT
0.149 GC
N
f1219663315
f
GR
GS
[0.75 0 0 0.75 0 0.5] CT
0 0.447 0.741 RC
1 LJ
2.667 LW
N
130.5 357.756 M
151 292.121 L
171.5 277.849 L
192 281.98 L
212.5 279.467 L
233 256.616 L
253.5 309.636 L
274 292.547 L
294.5 336.058 L
315 375.97 L
335.5 371.637 L
356 337.468 L
376.5 330.8 L
397 319.441 L
417.5 304.078 L
438 300.013 L
458.5 239.023 L
479 290.413 L
499.5 337.133 L
520 325.993 L
540.5 326.727 L
561 310.32 L
581.5 311.57 L
602 302.628 L
622.5 293.684 L
643 287.2 L
663.5 306.605 L
684 353.839 L
704.5 367.055 L
725 378.087 L
745.5 362.926 L
766 356.657 L
S
GR
GS
[0.75 0 0 0.75 0 0.5] CT
0.929 0.694 0.125 RC
1 LJ
2.667 LW
N
130.5 347.335 M
151 332.248 L
171.5 332.493 L
192 338.896 L
212.5 338.678 L
233 321.212 L
253.5 331.714 L
274 357.913 L
294.5 356.406 L
315 322.19 L
335.5 339.203 L
356 369.123 L
376.5 374.434 L
397 365.833 L
417.5 349.904 L
438 356.878 L
458.5 279.08 L
479 341.071 L
499.5 365.083 L
520 378.286 L
540.5 376.94 L
561 367.15 L
581.5 377.965 L
602 360.722 L
622.5 355.328 L
643 349.43 L
663.5 352.164 L
684 318.91 L
704.5 326.699 L
725 353.01 L
745.5 349.278 L
766 369.79 L
S
GR
GS
[0.75 0 0 0.75 0 0.5] CT
1 0 0 RC
1 LJ
2.667 LW
N
130.5 372.494 M
151 363.071 L
171.5 341.717 L
192 347.34 L
212.5 346.117 L
233 334.043 L
253.5 359.916 L
274 363.058 L
294.5 302.62 L
315 253.344 L
335.5 257.102 L
356 308.654 L
376.5 310.294 L
397 324.428 L
417.5 351.943 L
438 354.351 L
458.5 255.813 L
479 378.406 L
499.5 314.723 L
520 328.735 L
540.5 317.563 L
561 337.844 L
581.5 320.323 L
602 340.082 L
622.5 350.837 L
643 344.241 L
663.5 342.638 L
684 331.594 L
704.5 339.88 L
725 365.94 L
745.5 363.938 L
766 330.587 L
S
GR
GS
[0.75 0 0 0.75 0 0.5] CT
1 GC
N
755 319 M
755 238 L
567 238 L
567 319 L
cp
f
GR
GS
[0.75 0 0 0.75 460.35471 189.99144] CT
N
f-597267615
f
GR
GS
[0.75 0 0 0.75 460.35471 189.99144] CT
N
f1637560580
f
GR
GS
[0.75 0 0 0.75 460.35471 189.99144] CT
N
f374720792
f
GR
GS
[0.75 0 0 0.75 0 0.5] CT
0 0.447 0.741 RC
1 LJ
2.667 LW
N
570.984 252.655 M
610.819 252.655 L
S
GR
GS
[0.75 0 0 0.75 460.35471 209.375] CT
N
f1886913203
f
GR
GS
[0.75 0 0 0.75 460.35471 209.375] CT
N
f1818420723
f
GR
GS
[0.75 0 0 0.75 0 0.5] CT
0.929 0.694 0.125 RC
1 LJ
2.667 LW
N
570.984 278.5 M
610.819 278.5 L
S
GR
GS
[0.75 0 0 0.75 460.35471 228.75857] CT
N
f-1657957548
f
GR
GS
[0.75 0 0 0.75 460.35471 228.75857] CT
N
f-1984996643
f
GR
GS
[0.75 0 0 0.75 460.35471 228.75857] CT
N
f-1025401139
f
GR
GS
[0.75 0 0 0.75 460.35471 228.75857] CT
N
f1233475555
f
GR
GS
[0.75 0 0 0.75 460.35471 228.75857] CT
N
f-1264859159
f
GR
GS
[0.75 0 0 0.75 460.35471 228.75857] CT
N
f-1666518754
f
GR
GS
[0.75 0 0 0.75 460.35471 228.75857] CT
N
f1415424017
f
GR
GS
[0.75 0 0 0.75 460.35471 228.75857] CT
N
f-2057051167
f
GR
GS
[0.75 0 0 0.75 460.35471 228.75857] CT
N
f-1535148082
f
GR
GS
[0.75 0 0 0.75 460.35471 228.75857] CT
N
f1232456156
f
GR
GS
[0.75 0 0 0.75 0 0.5] CT
1 0 0 RC
1 LJ
2.667 LW
N
570.984 304.345 M
610.819 304.345 L
S
GR
GS
[0.75 0 0 0.75 0 0.5] CT
0.149 GC
10.0 ML
0.667 LW
N
567 319 M
567 238 L
755 238 L
755 319 L
cp
S
GR
GS
[0.75 0 0 0.75 115.74298 183.4059] CT
N
/f-36286322{-15.421 18.217 M
-15.421 13.311 L
-15.421 13.154 -15.233 13.154 QT
-14.968 13.154 L
-14.905 13.154 -14.858 13.201 QT
-14.811 13.248 -14.811 13.311 QT
-14.811 15.373 -13.53 16.506 QT
-12.249 17.639 -10.186 17.639 QT
-9.452 17.639 -8.835 17.217 QT
-8.218 16.795 -7.882 16.115 QT
-7.546 15.436 -7.546 14.717 QT
-7.546 14.076 -7.796 13.475 QT
-8.046 12.873 -8.53 12.436 QT
-9.015 11.998 -9.624 11.842 QT
-12.343 11.186 L
-13.702 10.826 -14.561 9.709 QT
-15.421 8.592 -15.421 7.217 QT
-15.421 6.123 -14.866 5.17 QT
-14.311 4.217 -13.374 3.662 QT
-12.436 3.107 -11.343 3.107 QT
-9.233 3.107 -7.999 4.545 QT
-7.14 3.17 L
-7.077 3.107 -6.999 3.107 QT
-6.858 3.107 L
-6.796 3.107 -6.733 3.154 QT
-6.671 3.201 -6.671 3.295 QT
-6.671 8.154 L
-6.671 8.342 -6.858 8.342 QT
-7.093 8.342 L
-7.296 8.342 -7.296 8.154 QT
-7.296 7.623 -7.475 6.99 QT
-7.655 6.357 -7.968 5.771 QT
-8.28 5.186 -8.655 4.811 QT
-9.671 3.795 -11.343 3.795 QT
-12.061 3.795 -12.663 4.154 QT
-13.265 4.514 -13.624 5.139 QT
-13.983 5.764 -13.983 6.451 QT
-13.983 7.357 -13.429 8.092 QT
-12.874 8.826 -11.968 9.061 QT
-9.233 9.732 L
-8.561 9.889 -7.96 10.318 QT
-7.358 10.748 -6.96 11.311 QT
-6.561 11.873 -6.335 12.561 QT
-6.108 13.248 -6.108 13.998 QT
-6.108 15.123 -6.632 16.139 QT
-7.155 17.154 -8.108 17.771 QT
-9.061 18.389 -10.186 18.389 QT
-10.874 18.389 -11.608 18.232 QT
-12.343 18.076 -12.952 17.756 QT
-13.561 17.436 -14.077 16.936 QT
-14.952 18.326 L
-15.015 18.389 -15.108 18.389 QT
-15.233 18.389 L
-15.421 18.389 -15.421 18.217 QT
cp}def
f-36286322
f
GR
GS
[0.75 0 0 0.75 115.74298 183.4059] CT
N
/f1809936356{0.509 18.389 M
-2.069 18.389 -2.991 16.264 QT
-3.913 14.139 -3.913 11.217 QT
-3.913 9.404 -3.585 7.795 QT
-3.256 6.186 -2.264 5.061 QT
-1.272 3.936 0.509 3.936 QT
1.9 3.936 2.775 4.607 QT
3.65 5.279 4.119 6.357 QT
4.587 7.436 4.751 8.654 QT
4.915 9.873 4.915 11.217 QT
4.915 13.029 4.587 14.6 QT
4.259 16.17 3.283 17.279 QT
2.306 18.389 0.509 18.389 QT
cp
0.509 17.842 M
1.681 17.842 2.251 16.639 QT
2.822 15.436 2.955 13.982 QT
3.087 12.529 3.087 10.889 QT
3.087 9.311 2.955 7.975 QT
2.822 6.639 2.251 5.561 QT
1.681 4.482 0.509 4.482 QT
-0.678 4.482 -1.256 5.568 QT
-1.835 6.654 -1.967 7.982 QT
-2.1 9.311 -2.1 10.889 QT
-2.1 12.061 -2.038 13.092 QT
-1.975 14.123 -1.733 15.225 QT
-1.491 16.326 -0.944 17.084 QT
-0.397 17.842 0.509 17.842 QT
cp}def
f1809936356
f
GR
GS
[0.75 0 0 0.75 115.74298 183.4059] CT
N
/f-1502209870{6.973 17.92 M
6.973 17.357 L
6.973 17.311 7.02 17.248 QT
10.27 13.639 L
11.02 12.826 11.481 12.287 QT
11.942 11.748 12.387 11.037 QT
12.832 10.326 13.098 9.6 QT
13.363 8.873 13.363 8.045 QT
13.363 7.186 13.043 6.396 QT
12.723 5.607 12.09 5.139 QT
11.457 4.67 10.567 4.67 QT
9.66 4.67 8.934 5.217 QT
8.207 5.764 7.91 6.639 QT
7.988 6.623 8.129 6.623 QT
8.598 6.623 8.934 6.936 QT
9.27 7.248 9.27 7.764 QT
9.27 8.232 8.934 8.568 QT
8.598 8.904 8.129 8.904 QT
7.645 8.904 7.309 8.561 QT
6.973 8.217 6.973 7.764 QT
6.973 6.967 7.27 6.279 QT
7.567 5.592 8.129 5.053 QT
8.692 4.514 9.387 4.225 QT
10.082 3.936 10.879 3.936 QT
12.082 3.936 13.113 4.443 QT
14.145 4.951 14.754 5.881 QT
15.363 6.811 15.363 8.045 QT
15.363 8.951 14.965 9.771 QT
14.567 10.592 13.942 11.264 QT
13.317 11.936 12.34 12.787 QT
11.363 13.639 11.051 13.936 QT
8.676 16.217 L
10.692 16.217 L
12.176 16.217 13.176 16.193 QT
14.176 16.17 14.238 16.107 QT
14.488 15.842 14.738 14.17 QT
15.363 14.17 L
14.77 17.92 L
6.973 17.92 L
cp}def
f-1502209870
f
GR
GS
[0.75 0 0 0.75 115.05999 28.05475] CT
N
f-36286322
f
GR
GS
[0.75 0 0 0.75 115.05999 28.05475] CT
N
f1809936356
f
GR
GS
[0.75 0 0 0.75 115.05999 28.05475] CT
N
/f299594887{7.879 17.92 M
7.879 17.186 L
10.504 17.186 10.504 16.514 QT
10.504 5.498 L
9.41 6.014 7.754 6.014 QT
7.754 5.279 L
10.332 5.279 11.645 3.936 QT
11.942 3.936 L
12.004 3.936 12.074 3.99 QT
12.145 4.045 12.145 4.123 QT
12.145 16.514 L
12.145 17.186 14.77 17.186 QT
14.77 17.92 L
7.879 17.92 L
cp}def
f299594887
f
GR
GS
[0.75 0 0 0.75 115.40148 332.14637] CT
N
f-36286322
f
GR
GS
[0.75 0 0 0.75 115.40148 332.14637] CT
N
f1809936356
f
GR
GS
[0.75 0 0 0.75 115.40148 332.14637] CT
N
/f-1086558016{7.926 16.295 M
8.41 17.014 9.246 17.365 QT
10.082 17.717 11.035 17.717 QT
12.254 17.717 12.77 16.678 QT
13.285 15.639 13.285 14.311 QT
13.285 13.717 13.176 13.123 QT
13.067 12.529 12.809 12.014 QT
12.551 11.498 12.106 11.193 QT
11.66 10.889 11.02 10.889 QT
9.613 10.889 L
9.426 10.889 9.426 10.686 QT
9.426 10.514 L
9.426 10.342 9.613 10.342 QT
10.77 10.248 L
11.52 10.248 12.004 9.693 QT
12.488 9.139 12.715 8.35 QT
12.942 7.561 12.942 6.842 QT
12.942 5.826 12.473 5.186 QT
12.004 4.545 11.035 4.545 QT
10.238 4.545 9.504 4.842 QT
8.77 5.139 8.348 5.764 QT
8.395 5.748 8.418 5.74 QT
8.442 5.732 8.488 5.732 QT
8.957 5.732 9.278 6.061 QT
9.598 6.389 9.598 6.857 QT
9.598 7.311 9.278 7.639 QT
8.957 7.967 8.488 7.967 QT
8.035 7.967 7.707 7.639 QT
7.379 7.311 7.379 6.857 QT
7.379 5.951 7.918 5.287 QT
8.457 4.623 9.317 4.279 QT
10.176 3.936 11.035 3.936 QT
11.676 3.936 12.379 4.123 QT
13.082 4.311 13.66 4.662 QT
14.238 5.014 14.598 5.568 QT
14.957 6.123 14.957 6.842 QT
14.957 7.717 14.567 8.467 QT
14.176 9.217 13.488 9.756 QT
12.801 10.295 11.973 10.561 QT
12.895 10.748 13.715 11.256 QT
14.535 11.764 15.028 12.568 QT
15.52 13.373 15.52 14.295 QT
15.52 15.451 14.887 16.389 QT
14.254 17.326 13.215 17.857 QT
12.176 18.389 11.035 18.389 QT
10.051 18.389 9.059 18.014 QT
8.067 17.639 7.434 16.889 QT
6.801 16.139 6.801 15.092 QT
6.801 14.561 7.153 14.217 QT
7.504 13.873 8.035 13.873 QT
8.363 13.873 8.645 14.029 QT
8.926 14.186 9.09 14.475 QT
9.254 14.764 9.254 15.092 QT
9.254 15.607 8.895 15.951 QT
8.535 16.295 8.035 16.295 QT
7.926 16.295 L
cp}def
f-1086558016
f
GR
GS
[0.75 0 0 0.75 114.71849 480.0605] CT
N
f-36286322
f
GR
GS
[0.75 0 0 0.75 114.71849 480.0605] CT
N
f1809936356
f
GR
GS
[0.75 0 0 0.75 114.71849 480.0605] CT
N
/f1843971345{6.504 14.451 M
6.504 13.717 L
13.004 4.029 L
13.067 3.936 13.223 3.936 QT
13.52 3.936 L
13.754 3.936 13.754 4.17 QT
13.754 13.717 L
15.817 13.717 L
15.817 14.451 L
13.754 14.451 L
13.754 16.514 L
13.754 16.951 14.371 17.068 QT
14.988 17.186 15.801 17.186 QT
15.801 17.92 L
10.02 17.92 L
10.02 17.186 L
10.832 17.186 11.442 17.068 QT
12.051 16.951 12.051 16.514 QT
12.051 14.451 L
6.504 14.451 L
cp
7.207 13.717 M
12.176 13.717 L
12.176 6.279 L
7.207 13.717 L
cp}def
f1843971345
f
GR
%%Trailer
%%Pages: 1
%%EOF
