%!PS-Adobe-3.0 EPSF-3.0
%%Creator: (MATLAB, The Mathworks, Inc. Version 9.5.0.944444 \(R2018b\). Operating System: Windows 10)
%%Title: (C:/Users/navsas/Dropbox/ION GNSS+2019 Extended Abstract [DET_DAUIN]/VTC-19/LaTex/fig/satellitesunfilteredplot.eps)
%%CreationDate: 2019-07-08T13:32:15
%%Pages: (atend)
%%BoundingBox: 0 0 701 360
%%LanguageLevel: 3
%%EndComments
%%BeginProlog
%%BeginResource: procset (Apache XML Graphics Std ProcSet) 1.2 0
%%Version: 1.2 0
%%Copyright: (Copyright 2001-2003,2010 The Apache Software Foundation. License terms: http://www.apache.org/licenses/LICENSE-2.0)
/bd{bind def}bind def
/ld{load def}bd
/GR/grestore ld
/GS/gsave ld
/RM/rmoveto ld
/C/curveto ld
/t/show ld
/L/lineto ld
/ML/setmiterlimit ld
/CT/concat ld
/f/fill ld
/N/newpath ld
/S/stroke ld
/CC/setcmykcolor ld
/A/ashow ld
/cp/closepath ld
/RC/setrgbcolor ld
/LJ/setlinejoin ld
/GC/setgray ld
/LW/setlinewidth ld
/M/moveto ld
/re {4 2 roll M
1 index 0 rlineto
0 exch rlineto
neg 0 rlineto
cp } bd
/_ctm matrix def
/_tm matrix def
/BT { _ctm currentmatrix pop matrix _tm copy pop 0 0 moveto } bd
/ET { _ctm setmatrix } bd
/iTm { _ctm setmatrix _tm concat } bd
/Tm { _tm astore pop iTm 0 0 moveto } bd
/ux 0.0 def
/uy 0.0 def
/F {
  /Tp exch def
  /Tf exch def
  Tf findfont Tp scalefont setfont
  /cf Tf def  /cs Tp def
} bd
/ULS {currentpoint /uy exch def /ux exch def} bd
/ULE {
  /Tcx currentpoint pop def
  gsave
  newpath
  cf findfont cs scalefont dup
  /FontMatrix get 0 get /Ts exch def /FontInfo get dup
  /UnderlinePosition get Ts mul /To exch def
  /UnderlineThickness get Ts mul /Tt exch def
  ux uy To add moveto  Tcx uy To add lineto
  Tt setlinewidth stroke
  grestore
} bd
/OLE {
  /Tcx currentpoint pop def
  gsave
  newpath
  cf findfont cs scalefont dup
  /FontMatrix get 0 get /Ts exch def /FontInfo get dup
  /UnderlinePosition get Ts mul /To exch def
  /UnderlineThickness get Ts mul /Tt exch def
  ux uy To add cs add moveto Tcx uy To add cs add lineto
  Tt setlinewidth stroke
  grestore
} bd
/SOE {
  /Tcx currentpoint pop def
  gsave
  newpath
  cf findfont cs scalefont dup
  /FontMatrix get 0 get /Ts exch def /FontInfo get dup
  /UnderlinePosition get Ts mul /To exch def
  /UnderlineThickness get Ts mul /Tt exch def
  ux uy To add cs 10 mul 26 idiv add moveto Tcx uy To add cs 10 mul 26 idiv add lineto
  Tt setlinewidth stroke
  grestore
} bd
/QT {
/Y22 exch store
/X22 exch store
/Y21 exch store
/X21 exch store
currentpoint
/Y21 load 2 mul add 3 div exch
/X21 load 2 mul add 3 div exch
/X21 load 2 mul /X22 load add 3 div
/Y21 load 2 mul /Y22 load add 3 div
/X22 load /Y22 load curveto
} bd
/SSPD {
dup length /d exch dict def
{
/v exch def
/k exch def
currentpagedevice k known {
/cpdv currentpagedevice k get def
v cpdv ne {
/upd false def
/nullv v type /nulltype eq def
/nullcpdv cpdv type /nulltype eq def
nullv nullcpdv or
{
/upd true def
} {
/sametype v type cpdv type eq def
sametype {
v type /arraytype eq {
/vlen v length def
/cpdvlen cpdv length def
vlen cpdvlen eq {
0 1 vlen 1 sub {
/i exch def
/obj v i get def
/cpdobj cpdv i get def
obj cpdobj ne {
/upd true def
exit
} if
} for
} {
/upd true def
} ifelse
} {
v type /dicttype eq {
v {
/dv exch def
/dk exch def
/cpddv cpdv dk get def
dv cpddv ne {
/upd true def
exit
} if
} forall
} {
/upd true def
} ifelse
} ifelse
} if
} ifelse
upd true eq {
d k v put
} if
} if
} if
} forall
d length 0 gt {
d setpagedevice
} if
} bd
/RE { % /NewFontName [NewEncodingArray] /FontName RE -
  findfont dup length dict begin
  {
    1 index /FID ne
    {def} {pop pop} ifelse
  } forall
  /Encoding exch def
  /FontName 1 index def
  currentdict definefont pop
  end
} bind def
%%EndResource
%%BeginResource: procset (Apache XML Graphics EPS ProcSet) 1.0 0
%%Version: 1.0 0
%%Copyright: (Copyright 2002-2003 The Apache Software Foundation. License terms: http://www.apache.org/licenses/LICENSE-2.0)
/BeginEPSF { %def
/b4_Inc_state save def         % Save state for cleanup
/dict_count countdictstack def % Count objects on dict stack
/op_count count 1 sub def      % Count objects on operand stack
userdict begin                 % Push userdict on dict stack
/showpage { } def              % Redefine showpage, { } = null proc
0 setgray 0 setlinecap         % Prepare graphics state
1 setlinewidth 0 setlinejoin
10 setmiterlimit [ ] 0 setdash newpath
/languagelevel where           % If level not equal to 1 then
{pop languagelevel             % set strokeadjust and
1 ne                           % overprint to their defaults.
{false setstrokeadjust false setoverprint
} if
} if
} bd
/EndEPSF { %def
count op_count sub {pop} repeat            % Clean up stacks
countdictstack dict_count sub {end} repeat
b4_Inc_state restore
} bd
%%EndResource
%FOPBeginFontDict
%%IncludeResource: font Courier-Oblique
%%IncludeResource: font Courier-BoldOblique
%%IncludeResource: font Courier-Bold
%%IncludeResource: font ZapfDingbats
%%IncludeResource: font Symbol
%%IncludeResource: font Helvetica
%%IncludeResource: font Helvetica-Oblique
%%IncludeResource: font Helvetica-Bold
%%IncludeResource: font Helvetica-BoldOblique
%%IncludeResource: font Times-Roman
%%IncludeResource: font Times-Italic
%%IncludeResource: font Times-Bold
%%IncludeResource: font Times-BoldItalic
%%IncludeResource: font Courier
%FOPEndFontDict
%%BeginResource: encoding WinAnsiEncoding
/WinAnsiEncoding [
/.notdef /.notdef /.notdef /.notdef /.notdef
/.notdef /.notdef /.notdef /.notdef /.notdef
/.notdef /.notdef /.notdef /.notdef /.notdef
/.notdef /.notdef /.notdef /.notdef /.notdef
/.notdef /.notdef /.notdef /.notdef /.notdef
/.notdef /.notdef /.notdef /.notdef /.notdef
/.notdef /.notdef /space /exclam /quotedbl
/numbersign /dollar /percent /ampersand /quotesingle
/parenleft /parenright /asterisk /plus /comma
/hyphen /period /slash /zero /one
/two /three /four /five /six
/seven /eight /nine /colon /semicolon
/less /equal /greater /question /at
/A /B /C /D /E
/F /G /H /I /J
/K /L /M /N /O
/P /Q /R /S /T
/U /V /W /X /Y
/Z /bracketleft /backslash /bracketright /asciicircum
/underscore /quoteleft /a /b /c
/d /e /f /g /h
/i /j /k /l /m
/n /o /p /q /r
/s /t /u /v /w
/x /y /z /braceleft /bar
/braceright /asciitilde /bullet /Euro /bullet
/quotesinglbase /florin /quotedblbase /ellipsis /dagger
/daggerdbl /circumflex /perthousand /Scaron /guilsinglleft
/OE /bullet /Zcaron /bullet /bullet
/quoteleft /quoteright /quotedblleft /quotedblright /bullet
/endash /emdash /asciitilde /trademark /scaron
/guilsinglright /oe /bullet /zcaron /Ydieresis
/space /exclamdown /cent /sterling /currency
/yen /brokenbar /section /dieresis /copyright
/ordfeminine /guillemotleft /logicalnot /sfthyphen /registered
/macron /degree /plusminus /twosuperior /threesuperior
/acute /mu /paragraph /middot /cedilla
/onesuperior /ordmasculine /guillemotright /onequarter /onehalf
/threequarters /questiondown /Agrave /Aacute /Acircumflex
/Atilde /Adieresis /Aring /AE /Ccedilla
/Egrave /Eacute /Ecircumflex /Edieresis /Igrave
/Iacute /Icircumflex /Idieresis /Eth /Ntilde
/Ograve /Oacute /Ocircumflex /Otilde /Odieresis
/multiply /Oslash /Ugrave /Uacute /Ucircumflex
/Udieresis /Yacute /Thorn /germandbls /agrave
/aacute /acircumflex /atilde /adieresis /aring
/ae /ccedilla /egrave /eacute /ecircumflex
/edieresis /igrave /iacute /icircumflex /idieresis
/eth /ntilde /ograve /oacute /ocircumflex
/otilde /odieresis /divide /oslash /ugrave
/uacute /ucircumflex /udieresis /yacute /thorn
/ydieresis
] def
%%EndResource
%FOPBeginFontReencode
/Courier-Oblique findfont
dup length dict begin
  {1 index /FID ne {def} {pop pop} ifelse} forall
  /Encoding WinAnsiEncoding def
  currentdict
end
/Courier-Oblique exch definefont pop
/Courier-BoldOblique findfont
dup length dict begin
  {1 index /FID ne {def} {pop pop} ifelse} forall
  /Encoding WinAnsiEncoding def
  currentdict
end
/Courier-BoldOblique exch definefont pop
/Courier-Bold findfont
dup length dict begin
  {1 index /FID ne {def} {pop pop} ifelse} forall
  /Encoding WinAnsiEncoding def
  currentdict
end
/Courier-Bold exch definefont pop
/Helvetica findfont
dup length dict begin
  {1 index /FID ne {def} {pop pop} ifelse} forall
  /Encoding WinAnsiEncoding def
  currentdict
end
/Helvetica exch definefont pop
/Helvetica-Oblique findfont
dup length dict begin
  {1 index /FID ne {def} {pop pop} ifelse} forall
  /Encoding WinAnsiEncoding def
  currentdict
end
/Helvetica-Oblique exch definefont pop
/Helvetica-Bold findfont
dup length dict begin
  {1 index /FID ne {def} {pop pop} ifelse} forall
  /Encoding WinAnsiEncoding def
  currentdict
end
/Helvetica-Bold exch definefont pop
/Helvetica-BoldOblique findfont
dup length dict begin
  {1 index /FID ne {def} {pop pop} ifelse} forall
  /Encoding WinAnsiEncoding def
  currentdict
end
/Helvetica-BoldOblique exch definefont pop
/Times-Roman findfont
dup length dict begin
  {1 index /FID ne {def} {pop pop} ifelse} forall
  /Encoding WinAnsiEncoding def
  currentdict
end
/Times-Roman exch definefont pop
/Times-Italic findfont
dup length dict begin
  {1 index /FID ne {def} {pop pop} ifelse} forall
  /Encoding WinAnsiEncoding def
  currentdict
end
/Times-Italic exch definefont pop
/Times-Bold findfont
dup length dict begin
  {1 index /FID ne {def} {pop pop} ifelse} forall
  /Encoding WinAnsiEncoding def
  currentdict
end
/Times-Bold exch definefont pop
/Times-BoldItalic findfont
dup length dict begin
  {1 index /FID ne {def} {pop pop} ifelse} forall
  /Encoding WinAnsiEncoding def
  currentdict
end
/Times-BoldItalic exch definefont pop
/Courier findfont
dup length dict begin
  {1 index /FID ne {def} {pop pop} ifelse} forall
  /Encoding WinAnsiEncoding def
  currentdict
end
/Courier exch definefont pop
%FOPEndFontReencode
%%EndProlog
%%Page: 1 1
%%PageBoundingBox: 0 0 701 360
%%BeginPageSetup
[1 0 0 -1 0 360] CT
%%EndPageSetup
GS
[0.75 0 0 0.75 0 0] CT
1 GC
N
0 0 935 480 re
f
GR
GS
[0.75 0 0 0.75 0 0] CT
1 GC
N
0 0 935 480 re
f
GR
GS
[0.75 0 0 0.75 0 0] CT
1 GC
N
122 401 M
846 401 L
846 36 L
122 36 L
cp
f
GR
GS
[0.75 0 0 0.75 0 0] CT
0.149 GC
2 setlinecap
1 LJ
1.333 LW
N
122 401 M
846 401 L
S
GR
GS
[0.75 0 0 0.75 0 0] CT
0.149 GC
2 setlinecap
1 LJ
1.333 LW
N
122 36 M
846 36 L
S
GR
GS
[0.75 0 0 0.75 0 0] CT
0.149 GC
2 setlinecap
1 LJ
1.333 LW
N
122 401 M
122 393.76 L
S
GR
GS
[0.75 0 0 0.75 0 0] CT
0.149 GC
2 setlinecap
1 LJ
1.333 LW
N
242.667 401 M
242.667 393.76 L
S
GR
GS
[0.75 0 0 0.75 0 0] CT
0.149 GC
2 setlinecap
1 LJ
1.333 LW
N
363.333 401 M
363.333 393.76 L
S
GR
GS
[0.75 0 0 0.75 0 0] CT
0.149 GC
2 setlinecap
1 LJ
1.333 LW
N
484 401 M
484 393.76 L
S
GR
GS
[0.75 0 0 0.75 0 0] CT
0.149 GC
2 setlinecap
1 LJ
1.333 LW
N
604.667 401 M
604.667 393.76 L
S
GR
GS
[0.75 0 0 0.75 0 0] CT
0.149 GC
2 setlinecap
1 LJ
1.333 LW
N
725.333 401 M
725.333 393.76 L
S
GR
GS
[0.75 0 0 0.75 0 0] CT
0.149 GC
2 setlinecap
1 LJ
1.333 LW
N
846 401 M
846 393.76 L
S
GR
GS
[0.75 0 0 0.75 0 0] CT
0.149 GC
2 setlinecap
1 LJ
1.333 LW
N
122 36 M
122 43.24 L
S
GR
GS
[0.75 0 0 0.75 0 0] CT
0.149 GC
2 setlinecap
1 LJ
1.333 LW
N
242.667 36 M
242.667 43.24 L
S
GR
GS
[0.75 0 0 0.75 0 0] CT
0.149 GC
2 setlinecap
1 LJ
1.333 LW
N
363.333 36 M
363.333 43.24 L
S
GR
GS
[0.75 0 0 0.75 0 0] CT
0.149 GC
2 setlinecap
1 LJ
1.333 LW
N
484 36 M
484 43.24 L
S
GR
GS
[0.75 0 0 0.75 0 0] CT
0.149 GC
2 setlinecap
1 LJ
1.333 LW
N
604.667 36 M
604.667 43.24 L
S
GR
GS
[0.75 0 0 0.75 0 0] CT
0.149 GC
2 setlinecap
1 LJ
1.333 LW
N
725.333 36 M
725.333 43.24 L
S
GR
GS
[0.75 0 0 0.75 0 0] CT
0.149 GC
2 setlinecap
1 LJ
1.333 LW
N
846 36 M
846 43.24 L
S
GR
GS
[0.75 0 0 0.75 91.5 306.75] CT
0.149 GC
N
0.083 22.994 M
-3.229 22.994 -4.417 20.267 QT
-5.604 17.541 -5.604 13.791 QT
-5.604 11.447 -5.182 9.376 QT
-4.76 7.306 -3.487 5.861 QT
-2.214 4.416 0.083 4.416 QT
1.865 4.416 2.997 5.283 QT
4.13 6.15 4.724 7.533 QT
5.318 8.916 5.536 10.486 QT
5.755 12.056 5.755 13.791 QT
5.755 16.119 5.326 18.142 QT
4.896 20.166 3.646 21.58 QT
2.396 22.994 0.083 22.994 QT
cp
0.083 22.291 M
1.583 22.291 2.326 20.751 QT
3.068 19.212 3.24 17.337 QT
3.411 15.462 3.411 13.353 QT
3.411 11.322 3.24 9.611 QT
3.068 7.9 2.333 6.509 QT
1.599 5.119 0.083 5.119 QT
-1.448 5.119 -2.182 6.517 QT
-2.917 7.916 -3.089 9.619 QT
-3.26 11.322 -3.26 13.353 QT
-3.26 14.853 -3.19 16.189 QT
-3.12 17.525 -2.807 18.939 QT
-2.495 20.353 -1.784 21.322 QT
-1.073 22.291 0.083 22.291 QT
cp
f
GR
GS
[0.75 0 0 0.75 182 306.75] CT
0.149 GC
N
-17.5 22.4 M
-17.5 21.447 L
-14.125 21.447 -14.125 20.587 QT
-14.125 6.416 L
-15.516 7.087 -17.656 7.087 QT
-17.656 6.15 L
-14.344 6.15 -12.656 4.416 QT
-12.281 4.416 L
-12.188 4.416 -12.102 4.486 QT
-12.016 4.556 -12.016 4.65 QT
-12.016 20.587 L
-12.016 21.447 -8.641 21.447 QT
-8.641 22.4 L
-17.5 22.4 L
cp
f
GR
GS
[0.75 0 0 0.75 182 306.75] CT
0.149 GC
N
/f177720031{0.083 22.994 M
-3.229 22.994 -4.417 20.267 QT
-5.604 17.541 -5.604 13.791 QT
-5.604 11.447 -5.182 9.376 QT
-4.76 7.306 -3.487 5.861 QT
-2.214 4.416 0.083 4.416 QT
1.865 4.416 2.997 5.283 QT
4.13 6.15 4.724 7.533 QT
5.318 8.916 5.536 10.486 QT
5.755 12.056 5.755 13.791 QT
5.755 16.119 5.326 18.142 QT
4.896 20.166 3.646 21.58 QT
2.396 22.994 0.083 22.994 QT
cp
0.083 22.291 M
1.583 22.291 2.326 20.751 QT
3.068 19.212 3.24 17.337 QT
3.411 15.462 3.411 13.353 QT
3.411 11.322 3.24 9.611 QT
3.068 7.9 2.333 6.509 QT
1.599 5.119 0.083 5.119 QT
-1.448 5.119 -2.182 6.517 QT
-2.917 7.916 -3.089 9.619 QT
-3.26 11.322 -3.26 13.353 QT
-3.26 14.853 -3.19 16.189 QT
-3.12 17.525 -2.807 18.939 QT
-2.495 20.353 -1.784 21.322 QT
-1.073 22.291 0.083 22.291 QT
cp}def
f177720031
f
GR
GS
[0.75 0 0 0.75 182 306.75] CT
0.149 GC
N
/f1112785499{13.417 22.994 M
10.104 22.994 8.917 20.267 QT
7.729 17.541 7.729 13.791 QT
7.729 11.447 8.151 9.376 QT
8.573 7.306 9.846 5.861 QT
11.12 4.416 13.417 4.416 QT
15.198 4.416 16.331 5.283 QT
17.464 6.15 18.057 7.533 QT
18.651 8.916 18.87 10.486 QT
19.089 12.056 19.089 13.791 QT
19.089 16.119 18.659 18.142 QT
18.229 20.166 16.979 21.58 QT
15.729 22.994 13.417 22.994 QT
cp
13.417 22.291 M
14.917 22.291 15.659 20.751 QT
16.401 19.212 16.573 17.337 QT
16.745 15.462 16.745 13.353 QT
16.745 11.322 16.573 9.611 QT
16.401 7.9 15.667 6.509 QT
14.932 5.119 13.417 5.119 QT
11.885 5.119 11.151 6.517 QT
10.417 7.916 10.245 9.619 QT
10.073 11.322 10.073 13.353 QT
10.073 14.853 10.143 16.189 QT
10.214 17.525 10.526 18.939 QT
10.839 20.353 11.55 21.322 QT
12.26 22.291 13.417 22.291 QT
cp}def
f1112785499
f
GR
GS
[0.75 0 0 0.75 272.50001 306.75] CT
0.149 GC
N
/f44339815{-18.656 22.4 M
-18.656 21.681 L
-18.656 21.603 -18.609 21.525 QT
-14.406 16.884 L
-13.453 15.853 -12.867 15.158 QT
-12.281 14.462 -11.695 13.556 QT
-11.109 12.65 -10.773 11.705 QT
-10.438 10.759 -10.438 9.697 QT
-10.438 8.603 -10.852 7.587 QT
-11.266 6.572 -12.07 5.97 QT
-12.875 5.369 -14.031 5.369 QT
-15.203 5.369 -16.141 6.072 QT
-17.078 6.775 -17.453 7.9 QT
-17.344 7.869 -17.172 7.869 QT
-16.563 7.869 -16.133 8.275 QT
-15.703 8.681 -15.703 9.337 QT
-15.703 9.947 -16.133 10.376 QT
-16.563 10.806 -17.172 10.806 QT
-17.797 10.806 -18.227 10.369 QT
-18.656 9.931 -18.656 9.337 QT
-18.656 8.322 -18.273 7.431 QT
-17.891 6.541 -17.172 5.845 QT
-16.453 5.15 -15.547 4.783 QT
-14.641 4.416 -13.625 4.416 QT
-12.094 4.416 -10.758 5.072 QT
-9.422 5.728 -8.648 6.916 QT
-7.875 8.103 -7.875 9.697 QT
-7.875 10.884 -8.391 11.939 QT
-8.906 12.994 -9.703 13.853 QT
-10.5 14.712 -11.758 15.806 QT
-13.016 16.9 -13.406 17.275 QT
-16.469 20.212 L
-13.875 20.212 L
-11.953 20.212 -10.672 20.181 QT
-9.391 20.15 -9.313 20.072 QT
-8.984 19.744 -8.656 17.587 QT
-7.875 17.587 L
-8.641 22.4 L
-18.656 22.4 L
cp}def
f44339815
f
GR
GS
[0.75 0 0 0.75 272.50001 306.75] CT
0.149 GC
N
f177720031
f
GR
GS
[0.75 0 0 0.75 272.50001 306.75] CT
0.149 GC
N
f1112785499
f
GR
GS
[0.75 0 0 0.75 363 306.75] CT
0.149 GC
N
/f-89277197{-17.422 20.322 M
-16.797 21.244 -15.727 21.689 QT
-14.656 22.134 -13.438 22.134 QT
-11.859 22.134 -11.203 20.798 QT
-10.547 19.462 -10.547 17.759 QT
-10.547 16.994 -10.688 16.228 QT
-10.828 15.462 -11.156 14.806 QT
-11.484 14.15 -12.055 13.751 QT
-12.625 13.353 -13.453 13.353 QT
-15.25 13.353 L
-15.484 13.353 -15.484 13.103 QT
-15.484 12.869 L
-15.484 12.65 -15.25 12.65 QT
-13.766 12.541 L
-12.813 12.541 -12.188 11.83 QT
-11.563 11.119 -11.273 10.095 QT
-10.984 9.072 -10.984 8.15 QT
-10.984 6.853 -11.586 6.025 QT
-12.188 5.197 -13.438 5.197 QT
-14.469 5.197 -15.398 5.587 QT
-16.328 5.978 -16.891 6.759 QT
-16.828 6.744 -16.789 6.744 QT
-16.75 6.744 -16.703 6.744 QT
-16.094 6.744 -15.688 7.166 QT
-15.281 7.587 -15.281 8.181 QT
-15.281 8.759 -15.688 9.181 QT
-16.094 9.603 -16.703 9.603 QT
-17.297 9.603 -17.719 9.181 QT
-18.141 8.759 -18.141 8.181 QT
-18.141 7.009 -17.445 6.158 QT
-16.75 5.306 -15.648 4.861 QT
-14.547 4.416 -13.438 4.416 QT
-12.609 4.416 -11.703 4.658 QT
-10.797 4.9 -10.063 5.361 QT
-9.328 5.822 -8.859 6.533 QT
-8.391 7.244 -8.391 8.15 QT
-8.391 9.275 -8.898 10.244 QT
-9.406 11.212 -10.289 11.908 QT
-11.172 12.603 -12.219 12.947 QT
-11.047 13.166 -9.992 13.83 QT
-8.938 14.494 -8.297 15.517 QT
-7.656 16.541 -7.656 17.728 QT
-7.656 19.228 -8.477 20.431 QT
-9.297 21.634 -10.625 22.314 QT
-11.953 22.994 -13.438 22.994 QT
-14.703 22.994 -15.977 22.509 QT
-17.25 22.025 -18.055 21.064 QT
-18.859 20.103 -18.859 18.759 QT
-18.859 18.087 -18.414 17.642 QT
-17.969 17.197 -17.297 17.197 QT
-16.859 17.197 -16.5 17.4 QT
-16.141 17.603 -15.938 17.97 QT
-15.734 18.337 -15.734 18.759 QT
-15.734 19.416 -16.195 19.869 QT
-16.656 20.322 -17.297 20.322 QT
-17.422 20.322 L
cp}def
f-89277197
f
GR
GS
[0.75 0 0 0.75 363 306.75] CT
0.149 GC
N
f177720031
f
GR
GS
[0.75 0 0 0.75 363 306.75] CT
0.149 GC
N
f1112785499
f
GR
GS
[0.75 0 0 0.75 453.50002 306.75] CT
0.149 GC
N
/f1241499762{-19.25 17.947 M
-19.25 16.994 L
-10.906 4.556 L
-10.813 4.416 -10.625 4.416 QT
-10.234 4.416 L
-9.922 4.416 -9.922 4.728 QT
-9.922 16.994 L
-7.281 16.994 L
-7.281 17.947 L
-9.922 17.947 L
-9.922 20.587 L
-9.922 21.15 -9.133 21.298 QT
-8.344 21.447 -7.297 21.447 QT
-7.297 22.4 L
-14.734 22.4 L
-14.734 21.447 L
-13.703 21.447 -12.906 21.298 QT
-12.109 21.15 -12.109 20.587 QT
-12.109 17.947 L
-19.25 17.947 L
cp
-18.359 16.994 M
-11.953 16.994 L
-11.953 7.431 L
-18.359 16.994 L
cp}def
f1241499762
f
GR
GS
[0.75 0 0 0.75 453.50002 306.75] CT
0.149 GC
N
f177720031
f
GR
GS
[0.75 0 0 0.75 453.50002 306.75] CT
0.149 GC
N
f1112785499
f
GR
GS
[0.75 0 0 0.75 543.99998 306.75] CT
0.149 GC
N
/f1239691831{-17.656 19.322 M
-17.375 20.119 -16.805 20.767 QT
-16.234 21.416 -15.445 21.775 QT
-14.656 22.134 -13.813 22.134 QT
-11.859 22.134 -11.125 20.619 QT
-10.391 19.103 -10.391 16.947 QT
-10.391 16.009 -10.422 15.369 QT
-10.453 14.728 -10.594 14.134 QT
-10.844 13.181 -11.477 12.47 QT
-12.109 11.759 -13.016 11.759 QT
-13.922 11.759 -14.578 12.041 QT
-15.234 12.322 -15.641 12.689 QT
-16.047 13.056 -16.359 13.462 QT
-16.672 13.869 -16.75 13.9 QT
-17.063 13.9 L
-17.125 13.9 -17.227 13.814 QT
-17.328 13.728 -17.328 13.65 QT
-17.328 4.634 L
-17.328 4.556 -17.242 4.486 QT
-17.156 4.416 -17.063 4.416 QT
-16.984 4.416 L
-15.156 5.291 -13.125 5.291 QT
-11.109 5.291 -9.25 4.416 QT
-9.172 4.416 L
-9.078 4.416 -9 4.486 QT
-8.922 4.556 -8.922 4.634 QT
-8.922 4.884 L
-8.922 5.009 -8.984 5.009 QT
-9.906 6.244 -11.297 6.923 QT
-12.688 7.603 -14.172 7.603 QT
-15.25 7.603 -16.391 7.306 QT
-16.391 12.4 L
-15.484 11.681 -14.781 11.369 QT
-14.078 11.056 -12.984 11.056 QT
-11.5 11.056 -10.32 11.916 QT
-9.141 12.775 -8.508 14.15 QT
-7.875 15.525 -7.875 16.962 QT
-7.875 18.587 -8.672 19.97 QT
-9.469 21.353 -10.836 22.173 QT
-12.203 22.994 -13.813 22.994 QT
-15.141 22.994 -16.258 22.306 QT
-17.375 21.619 -18.016 20.462 QT
-18.656 19.306 -18.656 17.994 QT
-18.656 17.384 -18.258 17.001 QT
-17.859 16.619 -17.266 16.619 QT
-16.672 16.619 -16.273 17.009 QT
-15.875 17.4 -15.875 17.994 QT
-15.875 18.572 -16.273 18.978 QT
-16.672 19.384 -17.266 19.384 QT
-17.359 19.384 -17.477 19.361 QT
-17.594 19.337 -17.656 19.322 QT
cp}def
f1239691831
f
GR
GS
[0.75 0 0 0.75 543.99998 306.75] CT
0.149 GC
N
f177720031
f
GR
GS
[0.75 0 0 0.75 543.99998 306.75] CT
0.149 GC
N
f1112785499
f
GR
GS
[0.75 0 0 0.75 634.5 306.75] CT
0.149 GC
N
/f-1277202920{-13.25 22.994 M
-14.922 22.994 -16.047 22.103 QT
-17.172 21.212 -17.781 19.798 QT
-18.391 18.384 -18.625 16.83 QT
-18.859 15.275 -18.859 13.666 QT
-18.859 11.541 -18.031 9.392 QT
-17.203 7.244 -15.586 5.83 QT
-13.969 4.416 -11.766 4.416 QT
-10.844 4.416 -10.039 4.767 QT
-9.234 5.119 -8.781 5.798 QT
-8.328 6.478 -8.328 7.431 QT
-8.328 7.994 -8.703 8.369 QT
-9.078 8.744 -9.641 8.744 QT
-10.172 8.744 -10.547 8.361 QT
-10.922 7.978 -10.922 7.431 QT
-10.922 6.916 -10.547 6.533 QT
-10.172 6.15 -9.641 6.15 QT
-9.5 6.15 L
-9.828 5.65 -10.461 5.423 QT
-11.094 5.197 -11.766 5.197 QT
-12.578 5.197 -13.273 5.548 QT
-13.969 5.9 -14.516 6.509 QT
-15.063 7.119 -15.438 7.853 QT
-15.813 8.587 -16.016 9.525 QT
-16.219 10.462 -16.273 11.275 QT
-16.328 12.087 -16.328 13.322 QT
-15.844 12.228 -14.977 11.517 QT
-14.109 10.806 -13.016 10.806 QT
-11.813 10.806 -10.82 11.298 QT
-9.828 11.791 -9.117 12.65 QT
-8.406 13.509 -8.031 14.619 QT
-7.656 15.728 -7.656 16.869 QT
-7.656 18.447 -8.367 19.876 QT
-9.078 21.306 -10.352 22.15 QT
-11.625 22.994 -13.25 22.994 QT
cp
-13.25 22.134 M
-12.203 22.134 -11.57 21.658 QT
-10.938 21.181 -10.641 20.4 QT
-10.344 19.619 -10.273 18.822 QT
-10.203 18.025 -10.203 16.869 QT
-10.203 15.337 -10.352 14.251 QT
-10.5 13.166 -11.141 12.345 QT
-11.781 11.525 -13.125 11.525 QT
-14.219 11.525 -14.922 12.259 QT
-15.625 12.994 -15.945 14.126 QT
-16.266 15.259 -16.266 16.291 QT
-16.266 16.65 -16.25 16.837 QT
-16.25 16.869 -16.25 16.9 QT
-16.25 16.931 -16.266 16.962 QT
-16.266 18.134 -16.031 19.314 QT
-15.797 20.494 -15.125 21.314 QT
-14.453 22.134 -13.25 22.134 QT
cp}def
f-1277202920
f
GR
GS
[0.75 0 0 0.75 634.5 306.75] CT
0.149 GC
N
f177720031
f
GR
GS
[0.75 0 0 0.75 634.5 306.75] CT
0.149 GC
N
f1112785499
f
GR
GS
[0.75 0 0 0.75 363.75025 330.38876] CT
0.149 GC
N
/f715256087{-56.098 22.4 M
-56.098 21.447 L
-53.317 21.447 -53.317 20.587 QT
-53.317 5.759 L
-53.317 4.9 -56.098 4.9 QT
-56.098 3.962 L
-40.832 3.962 L
-40.082 10.134 L
-40.848 10.134 L
-41.145 7.806 -41.668 6.751 QT
-42.192 5.697 -43.332 5.298 QT
-44.473 4.9 -46.77 4.9 QT
-49.426 4.9 L
-49.91 4.9 -50.184 4.939 QT
-50.457 4.978 -50.629 5.173 QT
-50.801 5.369 -50.801 5.759 QT
-50.801 12.353 L
-48.801 12.353 L
-47.426 12.353 -46.754 12.126 QT
-46.082 11.9 -45.824 11.244 QT
-45.567 10.587 -45.567 9.197 QT
-44.77 9.197 L
-44.77 16.447 L
-45.567 16.447 L
-45.567 15.087 -45.824 14.423 QT
-46.082 13.759 -46.754 13.533 QT
-47.426 13.306 -48.801 13.306 QT
-50.801 13.306 L
-50.801 20.587 L
-50.801 21.181 -50.465 21.314 QT
-50.129 21.447 -49.426 21.447 QT
-46.567 21.447 L
-44.692 21.447 -43.535 21.15 QT
-42.379 20.853 -41.739 20.166 QT
-41.098 19.478 -40.754 18.376 QT
-40.41 17.275 -40.098 15.322 QT
-39.332 15.322 L
-40.457 22.4 L
-56.098 22.4 L
cp}def
f715256087
f
GR
GS
[0.75 0 0 0.75 363.75025 330.38876] CT
0.149 GC
N
/f1996770945{-38.075 27.634 M
-38.075 26.697 L
-37.153 26.697 -36.559 26.541 QT
-35.965 26.384 -35.965 25.822 QT
-35.965 12.822 L
-35.965 12.072 -36.497 11.892 QT
-37.028 11.712 -38.075 11.712 QT
-38.075 10.759 L
-34.09 10.462 L
-34.09 12.15 L
-33.34 11.322 -32.364 10.892 QT
-31.387 10.462 -30.278 10.462 QT
-28.684 10.462 -27.403 11.33 QT
-26.122 12.197 -25.403 13.603 QT
-24.684 15.009 -24.684 16.572 QT
-24.684 18.212 -25.481 19.619 QT
-26.278 21.025 -27.653 21.861 QT
-29.028 22.697 -30.684 22.697 QT
-32.653 22.697 -34.012 21.103 QT
-34.012 25.822 L
-34.012 26.384 -33.411 26.541 QT
-32.809 26.697 -31.903 26.697 QT
-31.903 27.634 L
-38.075 27.634 L
cp
-34.012 19.775 M
-33.528 20.744 -32.684 21.369 QT
-31.84 21.994 -30.84 21.994 QT
-29.903 21.994 -29.184 21.494 QT
-28.465 20.994 -27.981 20.15 QT
-27.497 19.306 -27.262 18.376 QT
-27.028 17.447 -27.028 16.572 QT
-27.028 15.494 -27.418 14.236 QT
-27.809 12.978 -28.606 12.111 QT
-29.403 11.244 -30.543 11.244 QT
-31.637 11.244 -32.551 11.806 QT
-33.465 12.369 -34.012 13.322 QT
-34.012 19.775 L
cp}def
f1996770945
f
GR
GS
[0.75 0 0 0.75 363.75025 330.38876] CT
0.149 GC
N
/f-1811329156{-16.472 22.697 M
-18.097 22.697 -19.48 21.876 QT
-20.863 21.056 -21.668 19.673 QT
-22.472 18.291 -22.472 16.65 QT
-22.472 15.416 -22.027 14.267 QT
-21.582 13.119 -20.761 12.212 QT
-19.941 11.306 -18.847 10.798 QT
-17.753 10.291 -16.472 10.291 QT
-14.816 10.291 -13.449 11.173 QT
-12.082 12.056 -11.293 13.525 QT
-10.503 14.994 -10.503 16.65 QT
-10.503 18.275 -11.308 19.666 QT
-12.113 21.056 -13.488 21.876 QT
-14.863 22.697 -16.472 22.697 QT
cp
-16.472 21.916 M
-14.316 21.916 -13.589 20.345 QT
-12.863 18.775 -12.863 16.353 QT
-12.863 14.994 -13.003 14.103 QT
-13.144 13.212 -13.644 12.478 QT
-13.941 12.041 -14.41 11.705 QT
-14.878 11.369 -15.402 11.189 QT
-15.925 11.009 -16.472 11.009 QT
-17.316 11.009 -18.074 11.392 QT
-18.832 11.775 -19.332 12.478 QT
-19.832 13.244 -19.972 14.166 QT
-20.113 15.087 -20.113 16.353 QT
-20.113 17.869 -19.847 19.072 QT
-19.582 20.275 -18.785 21.095 QT
-17.988 21.916 -16.472 21.916 QT
cp}def
f-1811329156
f
GR
GS
[0.75 0 0 0.75 363.75025 330.38876] CT
0.149 GC
N
/f-310920149{-2.429 22.697 M
-4.054 22.697 -5.39 21.853 QT
-6.726 21.009 -7.492 19.587 QT
-8.257 18.166 -8.257 16.572 QT
-8.257 14.978 -7.5 13.517 QT
-6.742 12.056 -5.398 11.173 QT
-4.054 10.291 -2.429 10.291 QT
-0.836 10.291 0.461 10.916 QT
1.758 11.541 1.758 12.947 QT
1.758 13.478 1.383 13.869 QT
1.008 14.259 0.461 14.259 QT
-0.07 14.259 -0.453 13.869 QT
-0.836 13.478 -0.836 12.947 QT
-0.836 12.478 -0.531 12.126 QT
-0.226 11.775 0.227 11.681 QT
-0.711 11.087 -2.398 11.087 QT
-3.695 11.087 -4.484 11.947 QT
-5.273 12.806 -5.586 14.072 QT
-5.898 15.337 -5.898 16.572 QT
-5.898 17.884 -5.515 19.103 QT
-5.132 20.322 -4.265 21.119 QT
-3.398 21.916 -2.101 21.916 QT
-0.82 21.916 0.078 21.126 QT
0.977 20.337 1.305 19.072 QT
1.305 18.916 1.524 18.916 QT
1.852 18.916 L
1.93 18.916 1.993 18.994 QT
2.055 19.072 2.055 19.15 QT
2.055 19.228 L
1.649 20.837 0.438 21.767 QT
-0.773 22.697 -2.429 22.697 QT
cp}def
f-310920149
f
GR
GS
[0.75 0 0 0.75 363.75025 330.38876] CT
0.149 GC
N
/f-1966931042{2.76 22.4 M
2.76 21.447 L
3.697 21.447 4.283 21.306 QT
4.869 21.166 4.869 20.587 QT
4.869 6.416 L
4.869 5.697 4.658 5.376 QT
4.447 5.056 4.033 4.978 QT
3.619 4.9 2.76 4.9 QT
2.76 3.962 L
6.776 3.666 L
6.776 12.947 L
7.338 11.822 8.354 11.142 QT
9.369 10.462 10.604 10.462 QT
12.463 10.462 13.408 11.361 QT
14.354 12.259 14.354 14.103 QT
14.354 20.587 L
14.354 21.166 14.947 21.306 QT
15.541 21.447 16.463 21.447 QT
16.463 22.4 L
10.276 22.4 L
10.276 21.447 L
11.197 21.447 11.791 21.306 QT
12.385 21.166 12.385 20.587 QT
12.385 14.181 L
12.385 12.869 12.002 12.017 QT
11.619 11.166 10.447 11.166 QT
8.869 11.166 7.861 12.416 QT
6.854 13.666 6.854 15.275 QT
6.854 20.587 L
6.854 21.166 7.447 21.306 QT
8.041 21.447 8.947 21.447 QT
8.947 22.4 L
2.76 22.4 L
cp}def
f-1966931042
f
GR
GS
[0.75 0 0 0.75 363.75025 330.38876] CT
0.149 GC
N
/f932262502{34.042 29.103 M
32.542 27.916 31.448 26.376 QT
30.354 24.837 29.667 23.095 QT
28.979 21.353 28.635 19.455 QT
28.292 17.556 28.292 15.65 QT
28.292 13.712 28.635 11.814 QT
28.979 9.916 29.682 8.166 QT
30.385 6.416 31.479 4.884 QT
32.573 3.353 34.042 2.197 QT
34.042 2.15 34.167 2.15 QT
34.417 2.15 L
34.495 2.15 34.565 2.22 QT
34.635 2.291 34.635 2.384 QT
34.635 2.509 34.573 2.556 QT
33.26 3.853 32.385 5.33 QT
31.51 6.806 30.971 8.47 QT
30.432 10.134 30.198 11.923 QT
29.964 13.712 29.964 15.65 QT
29.964 24.228 34.557 28.681 QT
34.635 28.775 34.635 28.916 QT
34.635 28.978 34.557 29.064 QT
34.479 29.15 34.417 29.15 QT
34.167 29.15 L
34.042 29.15 34.042 29.103 QT
cp}def
f932262502
f
GR
GS
[0.75 0 0 0.75 363.75025 330.38876] CT
0.149 GC
N
/f-252573450{36.928 22.478 M
36.928 18.072 L
36.928 17.869 37.178 17.869 QT
37.506 17.869 L
37.662 17.869 37.709 18.072 QT
38.459 21.994 41.35 21.994 QT
42.631 21.994 43.49 21.416 QT
44.35 20.837 44.35 19.619 QT
44.35 18.744 43.678 18.134 QT
43.006 17.525 42.084 17.291 QT
40.287 16.947 L
39.365 16.744 38.623 16.337 QT
37.881 15.931 37.404 15.251 QT
36.928 14.572 36.928 13.666 QT
36.928 12.478 37.561 11.72 QT
38.193 10.962 39.193 10.626 QT
40.193 10.291 41.35 10.291 QT
42.74 10.291 43.756 11.041 QT
44.537 10.369 L
44.537 10.291 44.678 10.291 QT
44.865 10.291 L
44.943 10.291 45.014 10.369 QT
45.084 10.447 45.084 10.525 QT
45.084 14.056 L
45.084 14.306 44.865 14.306 QT
44.537 14.306 L
44.303 14.306 44.303 14.056 QT
44.303 12.65 43.522 11.791 QT
42.74 10.931 41.318 10.931 QT
40.115 10.931 39.225 11.376 QT
38.334 11.822 38.334 12.916 QT
38.334 13.666 38.975 14.15 QT
39.615 14.634 40.475 14.853 QT
42.303 15.181 L
43.225 15.4 44.022 15.9 QT
44.818 16.4 45.287 17.166 QT
45.756 17.931 45.756 18.9 QT
45.756 19.869 45.42 20.587 QT
45.084 21.306 44.482 21.783 QT
43.881 22.259 43.061 22.478 QT
42.24 22.697 41.35 22.697 QT
39.662 22.697 38.459 21.572 QT
37.475 22.634 L
37.475 22.697 37.334 22.697 QT
37.178 22.697 L
36.928 22.697 36.928 22.478 QT
cp}def
f-252573450
f
GR
GS
[0.75 0 0 0.75 363.75025 330.38876] CT
0.149 GC
N
/f334490459{48.306 29.15 M
48.071 29.15 48.071 28.916 QT
48.071 28.791 48.118 28.744 QT
52.743 24.228 52.743 15.65 QT
52.743 7.072 48.181 2.619 QT
48.071 2.541 48.071 2.384 QT
48.071 2.291 48.142 2.22 QT
48.212 2.15 48.306 2.15 QT
48.556 2.15 L
48.634 2.15 48.696 2.197 QT
50.634 3.728 51.923 5.916 QT
53.212 8.103 53.813 10.587 QT
54.415 13.072 54.415 15.65 QT
54.415 17.556 54.095 19.408 QT
53.774 21.259 53.063 23.064 QT
52.353 24.869 51.274 26.392 QT
50.196 27.916 48.696 29.103 QT
48.634 29.15 48.556 29.15 QT
48.306 29.15 L
cp}def
f334490459
f
GR
GS
[0.75 0 0 0.75 0 0] CT
0.149 GC
2 setlinecap
1 LJ
1.333 LW
N
122 401 M
122 36 L
S
GR
GS
[0.75 0 0 0.75 0 0] CT
0.149 GC
2 setlinecap
1 LJ
1.333 LW
N
846 401 M
846 36 L
S
GR
GS
[0.75 0 0 0.75 0 0] CT
0.149 GC
2 setlinecap
1 LJ
1.333 LW
N
122 401 M
129.24 401 L
S
GR
GS
[0.75 0 0 0.75 0 0] CT
0.149 GC
2 setlinecap
1 LJ
1.333 LW
N
122 352.333 M
129.24 352.333 L
S
GR
GS
[0.75 0 0 0.75 0 0] CT
0.149 GC
2 setlinecap
1 LJ
1.333 LW
N
122 303.667 M
129.24 303.667 L
S
GR
GS
[0.75 0 0 0.75 0 0] CT
0.149 GC
2 setlinecap
1 LJ
1.333 LW
N
122 255 M
129.24 255 L
S
GR
GS
[0.75 0 0 0.75 0 0] CT
0.149 GC
2 setlinecap
1 LJ
1.333 LW
N
122 206.333 M
129.24 206.333 L
S
GR
GS
[0.75 0 0 0.75 0 0] CT
0.149 GC
2 setlinecap
1 LJ
1.333 LW
N
122 157.667 M
129.24 157.667 L
S
GR
GS
[0.75 0 0 0.75 0 0] CT
0.149 GC
2 setlinecap
1 LJ
1.333 LW
N
122 109 M
129.24 109 L
S
GR
GS
[0.75 0 0 0.75 0 0] CT
0.149 GC
2 setlinecap
1 LJ
1.333 LW
N
122 60.333 M
129.24 60.333 L
S
GR
GS
[0.75 0 0 0.75 0 0] CT
0.149 GC
2 setlinecap
1 LJ
1.333 LW
N
846 401 M
838.76 401 L
S
GR
GS
[0.75 0 0 0.75 0 0] CT
0.149 GC
2 setlinecap
1 LJ
1.333 LW
N
846 352.333 M
838.76 352.333 L
S
GR
GS
[0.75 0 0 0.75 0 0] CT
0.149 GC
2 setlinecap
1 LJ
1.333 LW
N
846 303.667 M
838.76 303.667 L
S
GR
GS
[0.75 0 0 0.75 0 0] CT
0.149 GC
2 setlinecap
1 LJ
1.333 LW
N
846 255 M
838.76 255 L
S
GR
GS
[0.75 0 0 0.75 0 0] CT
0.149 GC
2 setlinecap
1 LJ
1.333 LW
N
846 206.333 M
838.76 206.333 L
S
GR
GS
[0.75 0 0 0.75 0 0] CT
0.149 GC
2 setlinecap
1 LJ
1.333 LW
N
846 157.667 M
838.76 157.667 L
S
GR
GS
[0.75 0 0 0.75 0 0] CT
0.149 GC
2 setlinecap
1 LJ
1.333 LW
N
846 109 M
838.76 109 L
S
GR
GS
[0.75 0 0 0.75 0 0] CT
0.149 GC
2 setlinecap
1 LJ
1.333 LW
N
846 60.333 M
838.76 60.333 L
S
GR
GS
[0.75 0 0 0.75 85.5 300.75] CT
0.149 GC
N
/f408188114{-6.583 6.994 M
-9.896 6.994 -11.083 4.267 QT
-12.271 1.541 -12.271 -2.209 QT
-12.271 -4.553 -11.849 -6.624 QT
-11.427 -8.694 -10.154 -10.139 QT
-8.88 -11.584 -6.583 -11.584 QT
-4.802 -11.584 -3.669 -10.717 QT
-2.536 -9.85 -1.943 -8.467 QT
-1.349 -7.084 -1.13 -5.514 QT
-0.911 -3.944 -0.911 -2.209 QT
-0.911 0.119 -1.341 2.142 QT
-1.771 4.166 -3.021 5.58 QT
-4.271 6.994 -6.583 6.994 QT
cp
-6.583 6.291 M
-5.083 6.291 -4.341 4.751 QT
-3.599 3.212 -3.427 1.337 QT
-3.255 -0.538 -3.255 -2.647 QT
-3.255 -4.678 -3.427 -6.389 QT
-3.599 -8.1 -4.333 -9.491 QT
-5.068 -10.881 -6.583 -10.881 QT
-8.115 -10.881 -8.849 -9.483 QT
-9.583 -8.084 -9.755 -6.381 QT
-9.927 -4.678 -9.927 -2.647 QT
-9.927 -1.147 -9.857 0.189 QT
-9.786 1.525 -9.474 2.939 QT
-9.161 4.353 -8.451 5.322 QT
-7.74 6.291 -6.583 6.291 QT
cp}def
f408188114
f
GR
GS
[0.75 0 0 0.75 85.5 264.25001] CT
0.149 GC
N
/f-679582782{-25.323 6.4 M
-25.323 5.681 L
-25.323 5.603 -25.276 5.525 QT
-21.073 0.884 L
-20.12 -0.147 -19.534 -0.842 QT
-18.948 -1.538 -18.362 -2.444 QT
-17.776 -3.35 -17.44 -4.295 QT
-17.104 -5.241 -17.104 -6.303 QT
-17.104 -7.397 -17.518 -8.413 QT
-17.932 -9.428 -18.737 -10.03 QT
-19.542 -10.631 -20.698 -10.631 QT
-21.87 -10.631 -22.807 -9.928 QT
-23.745 -9.225 -24.12 -8.1 QT
-24.01 -8.131 -23.839 -8.131 QT
-23.229 -8.131 -22.8 -7.725 QT
-22.37 -7.319 -22.37 -6.663 QT
-22.37 -6.053 -22.8 -5.624 QT
-23.229 -5.194 -23.839 -5.194 QT
-24.464 -5.194 -24.893 -5.631 QT
-25.323 -6.069 -25.323 -6.663 QT
-25.323 -7.678 -24.94 -8.569 QT
-24.557 -9.459 -23.839 -10.155 QT
-23.12 -10.85 -22.214 -11.217 QT
-21.307 -11.584 -20.292 -11.584 QT
-18.76 -11.584 -17.425 -10.928 QT
-16.089 -10.272 -15.315 -9.084 QT
-14.542 -7.897 -14.542 -6.303 QT
-14.542 -5.116 -15.057 -4.061 QT
-15.573 -3.006 -16.37 -2.147 QT
-17.167 -1.288 -18.425 -0.194 QT
-19.682 0.9 -20.073 1.275 QT
-23.135 4.212 L
-20.542 4.212 L
-18.62 4.212 -17.339 4.181 QT
-16.057 4.15 -15.979 4.072 QT
-15.651 3.744 -15.323 1.587 QT
-14.542 1.587 L
-15.307 6.4 L
-25.323 6.4 L
cp}def
f-679582782
f
GR
GS
[0.75 0 0 0.75 85.5 264.25001] CT
0.149 GC
N
f408188114
f
GR
GS
[0.75 0 0 0.75 85.5 227.74999] CT
0.149 GC
N
/f273029967{-25.917 1.947 M
-25.917 0.994 L
-17.573 -11.444 L
-17.479 -11.584 -17.292 -11.584 QT
-16.901 -11.584 L
-16.589 -11.584 -16.589 -11.272 QT
-16.589 0.994 L
-13.948 0.994 L
-13.948 1.947 L
-16.589 1.947 L
-16.589 4.587 L
-16.589 5.15 -15.8 5.298 QT
-15.01 5.447 -13.964 5.447 QT
-13.964 6.4 L
-21.401 6.4 L
-21.401 5.447 L
-20.37 5.447 -19.573 5.298 QT
-18.776 5.15 -18.776 4.587 QT
-18.776 1.947 L
-25.917 1.947 L
cp
-25.026 0.994 M
-18.62 0.994 L
-18.62 -8.569 L
-25.026 0.994 L
cp}def
f273029967
f
GR
GS
[0.75 0 0 0.75 85.5 227.74999] CT
0.149 GC
N
f408188114
f
GR
GS
[0.75 0 0 0.75 85.5 191.25] CT
0.149 GC
N
/f-1602695310{-19.917 6.994 M
-21.589 6.994 -22.714 6.103 QT
-23.839 5.212 -24.448 3.798 QT
-25.057 2.384 -25.292 0.83 QT
-25.526 -0.725 -25.526 -2.334 QT
-25.526 -4.459 -24.698 -6.608 QT
-23.87 -8.756 -22.253 -10.17 QT
-20.635 -11.584 -18.432 -11.584 QT
-17.51 -11.584 -16.706 -11.233 QT
-15.901 -10.881 -15.448 -10.202 QT
-14.995 -9.522 -14.995 -8.569 QT
-14.995 -8.006 -15.37 -7.631 QT
-15.745 -7.256 -16.307 -7.256 QT
-16.839 -7.256 -17.214 -7.639 QT
-17.589 -8.022 -17.589 -8.569 QT
-17.589 -9.084 -17.214 -9.467 QT
-16.839 -9.85 -16.307 -9.85 QT
-16.167 -9.85 L
-16.495 -10.35 -17.128 -10.577 QT
-17.76 -10.803 -18.432 -10.803 QT
-19.245 -10.803 -19.94 -10.452 QT
-20.635 -10.1 -21.182 -9.491 QT
-21.729 -8.881 -22.104 -8.147 QT
-22.479 -7.413 -22.682 -6.475 QT
-22.885 -5.538 -22.94 -4.725 QT
-22.995 -3.913 -22.995 -2.678 QT
-22.51 -3.772 -21.643 -4.483 QT
-20.776 -5.194 -19.682 -5.194 QT
-18.479 -5.194 -17.487 -4.702 QT
-16.495 -4.209 -15.784 -3.35 QT
-15.073 -2.491 -14.698 -1.381 QT
-14.323 -0.272 -14.323 0.869 QT
-14.323 2.447 -15.034 3.876 QT
-15.745 5.306 -17.018 6.15 QT
-18.292 6.994 -19.917 6.994 QT
cp
-19.917 6.134 M
-18.87 6.134 -18.237 5.658 QT
-17.604 5.181 -17.307 4.4 QT
-17.01 3.619 -16.94 2.822 QT
-16.87 2.025 -16.87 0.869 QT
-16.87 -0.663 -17.018 -1.749 QT
-17.167 -2.834 -17.807 -3.655 QT
-18.448 -4.475 -19.792 -4.475 QT
-20.885 -4.475 -21.589 -3.741 QT
-22.292 -3.006 -22.612 -1.874 QT
-22.932 -0.741 -22.932 0.291 QT
-22.932 0.65 -22.917 0.837 QT
-22.917 0.869 -22.917 0.9 QT
-22.917 0.931 -22.932 0.962 QT
-22.932 2.134 -22.698 3.314 QT
-22.464 4.494 -21.792 5.314 QT
-21.12 6.134 -19.917 6.134 QT
cp}def
f-1602695310
f
GR
GS
[0.75 0 0 0.75 85.5 191.25] CT
0.149 GC
N
f408188114
f
GR
GS
[0.75 0 0 0.75 85.5 154.75] CT
0.149 GC
N
/f-743440171{-25.526 2.306 M
-25.526 0.681 -24.464 -0.569 QT
-23.401 -1.819 -21.729 -2.647 QT
-22.729 -3.288 L
-23.651 -3.897 -24.229 -4.905 QT
-24.807 -5.913 -24.807 -7.022 QT
-24.807 -8.319 -24.128 -9.358 QT
-23.448 -10.397 -22.323 -10.991 QT
-21.198 -11.584 -19.917 -11.584 QT
-18.714 -11.584 -17.604 -11.092 QT
-16.495 -10.6 -15.776 -9.694 QT
-15.057 -8.788 -15.057 -7.538 QT
-15.057 -6.631 -15.479 -5.85 QT
-15.901 -5.069 -16.651 -4.452 QT
-17.401 -3.834 -18.245 -3.397 QT
-16.698 -2.413 L
-15.635 -1.709 -14.979 -0.577 QT
-14.323 0.556 -14.323 1.806 QT
-14.323 3.275 -15.112 4.478 QT
-15.901 5.681 -17.19 6.337 QT
-18.479 6.994 -19.917 6.994 QT
-21.307 6.994 -22.612 6.423 QT
-23.917 5.853 -24.721 4.783 QT
-25.526 3.712 -25.526 2.306 QT
cp
-24.073 2.306 M
-24.073 3.369 -23.487 4.251 QT
-22.901 5.134 -21.932 5.634 QT
-20.964 6.134 -19.917 6.134 QT
-18.354 6.134 -17.073 5.22 QT
-15.792 4.306 -15.792 2.791 QT
-15.792 2.275 -15.995 1.767 QT
-16.198 1.259 -16.557 0.845 QT
-16.917 0.431 -17.37 0.166 QT
-20.995 -2.178 L
-21.839 -1.741 -22.542 -1.053 QT
-23.245 -0.366 -23.659 0.494 QT
-24.073 1.353 -24.073 2.306 QT
cp
-22.214 -5.944 M
-18.948 -3.834 L
-17.807 -4.491 -17.081 -5.428 QT
-16.354 -6.366 -16.354 -7.538 QT
-16.354 -8.444 -16.862 -9.202 QT
-17.37 -9.959 -18.19 -10.381 QT
-19.01 -10.803 -19.948 -10.803 QT
-20.76 -10.803 -21.589 -10.491 QT
-22.417 -10.178 -22.956 -9.545 QT
-23.495 -8.913 -23.495 -8.069 QT
-23.495 -6.803 -22.214 -5.944 QT
cp}def
f-743440171
f
GR
GS
[0.75 0 0 0.75 85.5 154.75] CT
0.149 GC
N
f408188114
f
GR
GS
[0.75 0 0 0.75 85.5 118.25] CT
0.149 GC
N
/f-102012382{-37.5 6.4 M
-37.5 5.447 L
-34.125 5.447 -34.125 4.587 QT
-34.125 -9.584 L
-35.516 -8.913 -37.656 -8.913 QT
-37.656 -9.85 L
-34.344 -9.85 -32.656 -11.584 QT
-32.281 -11.584 L
-32.188 -11.584 -32.102 -11.514 QT
-32.016 -11.444 -32.016 -11.35 QT
-32.016 4.587 L
-32.016 5.447 -28.641 5.447 QT
-28.641 6.4 L
-37.5 6.4 L
cp}def
f-102012382
f
GR
GS
[0.75 0 0 0.75 85.5 118.25] CT
0.149 GC
N
/f-1863677302{-19.917 6.994 M
-23.229 6.994 -24.417 4.267 QT
-25.604 1.541 -25.604 -2.209 QT
-25.604 -4.553 -25.182 -6.624 QT
-24.76 -8.694 -23.487 -10.139 QT
-22.214 -11.584 -19.917 -11.584 QT
-18.135 -11.584 -17.003 -10.717 QT
-15.87 -9.85 -15.276 -8.467 QT
-14.682 -7.084 -14.464 -5.514 QT
-14.245 -3.944 -14.245 -2.209 QT
-14.245 0.119 -14.675 2.142 QT
-15.104 4.166 -16.354 5.58 QT
-17.604 6.994 -19.917 6.994 QT
cp
-19.917 6.291 M
-18.417 6.291 -17.675 4.751 QT
-16.932 3.212 -16.76 1.337 QT
-16.589 -0.538 -16.589 -2.647 QT
-16.589 -4.678 -16.76 -6.389 QT
-16.932 -8.1 -17.667 -9.491 QT
-18.401 -10.881 -19.917 -10.881 QT
-21.448 -10.881 -22.182 -9.483 QT
-22.917 -8.084 -23.089 -6.381 QT
-23.26 -4.678 -23.26 -2.647 QT
-23.26 -1.147 -23.19 0.189 QT
-23.12 1.525 -22.807 2.939 QT
-22.495 4.353 -21.784 5.322 QT
-21.073 6.291 -19.917 6.291 QT
cp}def
f-1863677302
f
GR
GS
[0.75 0 0 0.75 85.5 118.25] CT
0.149 GC
N
f408188114
f
GR
GS
[0.75 0 0 0.75 85.5 81.75] CT
0.149 GC
N
f-102012382
f
GR
GS
[0.75 0 0 0.75 85.5 81.75] CT
0.149 GC
N
f-679582782
f
GR
GS
[0.75 0 0 0.75 85.5 81.75] CT
0.149 GC
N
f408188114
f
GR
GS
[0.75 0 0 0.75 85.5 45.25] CT
0.149 GC
N
f-102012382
f
GR
GS
[0.75 0 0 0.75 85.5 45.25] CT
0.149 GC
N
f273029967
f
GR
GS
[0.75 0 0 0.75 85.5 45.25] CT
0.149 GC
N
f408188114
f
GR
GS
[0 -0.75 0.75 0 52.49991 163.87487] CT
0.149 GC
N
/f-1995095113{-61.517 -9.6 M
-61.517 -10.553 L
-58.736 -10.553 -58.736 -11.413 QT
-58.736 -26.241 L
-58.736 -27.1 -61.517 -27.1 QT
-61.517 -28.038 L
-53.033 -28.038 L
-51.517 -28.038 -49.853 -27.491 QT
-48.189 -26.944 -47.064 -25.827 QT
-45.939 -24.709 -45.939 -23.147 QT
-45.939 -22.022 -46.618 -21.131 QT
-47.298 -20.241 -48.361 -19.639 QT
-49.423 -19.038 -50.533 -18.772 QT
-49.314 -18.35 -48.408 -17.428 QT
-47.501 -16.506 -47.314 -15.319 QT
-46.923 -12.928 L
-46.673 -11.303 -46.376 -10.506 QT
-46.079 -9.709 -45.095 -9.709 QT
-44.251 -9.709 -43.837 -10.491 QT
-43.423 -11.272 -43.423 -12.194 QT
-43.423 -12.288 -43.337 -12.358 QT
-43.251 -12.428 -43.158 -12.428 QT
-42.908 -12.428 L
-42.642 -12.428 -42.642 -12.084 QT
-42.642 -11.334 -42.931 -10.631 QT
-43.22 -9.928 -43.767 -9.467 QT
-44.314 -9.006 -45.064 -9.006 QT
-47.017 -9.006 -48.423 -9.975 QT
-49.829 -10.944 -49.829 -12.819 QT
-49.829 -15.209 L
-49.829 -16.569 -50.767 -17.53 QT
-51.704 -18.491 -53.064 -18.491 QT
-56.298 -18.491 L
-56.298 -11.413 L
-56.298 -10.553 -53.517 -10.553 QT
-53.517 -9.6 L
-61.517 -9.6 L
cp
-56.298 -19.178 M
-53.423 -19.178 L
-51.173 -19.178 -50.001 -20.084 QT
-48.829 -20.991 -48.829 -23.147 QT
-48.829 -25.303 -49.986 -26.202 QT
-51.142 -27.1 -53.423 -27.1 QT
-54.939 -27.1 L
-55.423 -27.1 -55.689 -27.061 QT
-55.954 -27.022 -56.126 -26.827 QT
-56.298 -26.631 -56.298 -26.241 QT
-56.298 -19.178 L
cp}def
f-1995095113
f
GR
GS
[0 -0.75 0.75 0 52.49991 163.87487] CT
0.149 GC
N
/f1089275222{-41.7 -12.256 M
-41.7 -13.866 -40.434 -14.874 QT
-39.168 -15.881 -37.395 -16.295 QT
-35.622 -16.709 -34.028 -16.709 QT
-34.028 -17.819 L
-34.028 -18.584 -34.372 -19.319 QT
-34.715 -20.053 -35.356 -20.522 QT
-35.997 -20.991 -36.778 -20.991 QT
-38.575 -20.991 -39.512 -20.194 QT
-38.997 -20.194 -38.661 -19.803 QT
-38.325 -19.413 -38.325 -18.897 QT
-38.325 -18.35 -38.708 -17.967 QT
-39.09 -17.584 -39.606 -17.584 QT
-40.153 -17.584 -40.536 -17.967 QT
-40.918 -18.35 -40.918 -18.897 QT
-40.918 -20.319 -39.629 -21.014 QT
-38.34 -21.709 -36.778 -21.709 QT
-35.684 -21.709 -34.575 -21.241 QT
-33.465 -20.772 -32.762 -19.897 QT
-32.059 -19.022 -32.059 -17.866 QT
-32.059 -11.788 L
-32.059 -11.256 -31.833 -10.819 QT
-31.606 -10.381 -31.137 -10.381 QT
-30.684 -10.381 -30.465 -10.827 QT
-30.247 -11.272 -30.247 -11.788 QT
-30.247 -13.522 L
-29.465 -13.522 L
-29.465 -11.788 L
-29.465 -11.178 -29.778 -10.631 QT
-30.09 -10.084 -30.629 -9.764 QT
-31.168 -9.444 -31.778 -9.444 QT
-32.575 -9.444 -33.145 -10.053 QT
-33.715 -10.663 -33.793 -11.506 QT
-34.293 -10.491 -35.262 -9.897 QT
-36.231 -9.303 -37.34 -9.303 QT
-38.372 -9.303 -39.372 -9.6 QT
-40.372 -9.897 -41.036 -10.553 QT
-41.7 -11.209 -41.7 -12.256 QT
cp
-39.512 -12.256 M
-39.512 -11.303 -38.809 -10.655 QT
-38.106 -10.006 -37.168 -10.006 QT
-36.293 -10.006 -35.583 -10.444 QT
-34.872 -10.881 -34.45 -11.631 QT
-34.028 -12.381 -34.028 -13.209 QT
-34.028 -16.022 L
-35.247 -16.022 -36.536 -15.616 QT
-37.825 -15.209 -38.668 -14.358 QT
-39.512 -13.506 -39.512 -12.256 QT
cp}def
f1089275222
f
GR
GS
[0 -0.75 0.75 0 52.49991 163.87487] CT
0.149 GC
N
/f-1214189525{-28.648 -9.6 M
-28.648 -10.553 L
-27.71 -10.553 -27.124 -10.694 QT
-26.538 -10.834 -26.538 -11.413 QT
-26.538 -18.772 L
-26.538 -19.506 -26.749 -19.827 QT
-26.96 -20.147 -27.374 -20.217 QT
-27.788 -20.288 -28.648 -20.288 QT
-28.648 -21.241 L
-24.726 -21.538 L
-24.726 -18.897 L
-24.179 -20.053 -23.116 -20.795 QT
-22.054 -21.538 -20.804 -21.538 QT
-18.944 -21.538 -17.999 -20.639 QT
-17.054 -19.741 -17.054 -17.897 QT
-17.054 -11.413 L
-17.054 -10.834 -16.46 -10.694 QT
-15.866 -10.553 -14.944 -10.553 QT
-14.944 -9.6 L
-21.132 -9.6 L
-21.132 -10.553 L
-20.21 -10.553 -19.616 -10.694 QT
-19.023 -10.834 -19.023 -11.413 QT
-19.023 -17.819 L
-19.023 -19.131 -19.405 -19.983 QT
-19.788 -20.834 -20.96 -20.834 QT
-22.538 -20.834 -23.546 -19.584 QT
-24.554 -18.334 -24.554 -16.725 QT
-24.554 -11.413 L
-24.554 -10.834 -23.96 -10.694 QT
-23.366 -10.553 -22.46 -10.553 QT
-22.46 -9.6 L
-28.648 -9.6 L
cp}def
f-1214189525
f
GR
GS
[0 -0.75 0.75 0 52.49991 163.87487] CT
0.149 GC
N
/f921052904{-13.88 -7.491 M
-13.88 -8.459 -13.177 -9.178 QT
-12.473 -9.897 -11.52 -10.194 QT
-12.052 -10.6 -12.341 -11.217 QT
-12.63 -11.834 -12.63 -12.538 QT
-12.63 -13.803 -11.817 -14.788 QT
-13.067 -15.991 -13.067 -17.569 QT
-13.067 -18.413 -12.7 -19.147 QT
-12.333 -19.881 -11.684 -20.42 QT
-11.036 -20.959 -10.247 -21.249 QT
-9.458 -21.538 -8.63 -21.538 QT
-7.02 -21.538 -5.739 -20.6 QT
-5.192 -21.194 -4.434 -21.514 QT
-3.677 -21.834 -2.864 -21.834 QT
-2.27 -21.834 -1.903 -21.42 QT
-1.536 -21.006 -1.536 -20.428 QT
-1.536 -20.1 -1.786 -19.85 QT
-2.036 -19.6 -2.364 -19.6 QT
-2.708 -19.6 -2.958 -19.85 QT
-3.208 -20.1 -3.208 -20.428 QT
-3.208 -20.928 -2.88 -21.116 QT
-4.286 -21.116 -5.286 -20.163 QT
-4.802 -19.678 -4.505 -18.967 QT
-4.208 -18.256 -4.208 -17.569 QT
-4.208 -16.413 -4.841 -15.499 QT
-5.473 -14.584 -6.505 -14.077 QT
-7.536 -13.569 -8.63 -13.569 QT
-10.114 -13.569 -11.333 -14.366 QT
-11.723 -13.85 -11.723 -13.194 QT
-11.723 -12.475 -11.255 -11.944 QT
-10.786 -11.413 -10.067 -11.413 QT
-7.848 -11.413 L
-6.239 -11.413 -4.95 -11.116 QT
-3.661 -10.819 -2.786 -9.952 QT
-1.911 -9.084 -1.911 -7.491 QT
-1.911 -6.303 -2.911 -5.522 QT
-3.911 -4.741 -5.302 -4.389 QT
-6.692 -4.038 -7.88 -4.038 QT
-9.083 -4.038 -10.481 -4.389 QT
-11.88 -4.741 -12.88 -5.522 QT
-13.88 -6.303 -13.88 -7.491 QT
cp
-12.364 -7.491 M
-12.364 -6.584 -11.622 -5.967 QT
-10.88 -5.35 -9.841 -5.053 QT
-8.802 -4.756 -7.88 -4.756 QT
-6.973 -4.756 -5.927 -5.053 QT
-4.88 -5.35 -4.153 -5.967 QT
-3.427 -6.584 -3.427 -7.491 QT
-3.427 -8.897 -4.716 -9.311 QT
-6.005 -9.725 -7.848 -9.725 QT
-10.067 -9.725 L
-10.692 -9.725 -11.208 -9.428 QT
-11.723 -9.131 -12.044 -8.6 QT
-12.364 -8.069 -12.364 -7.491 QT
cp
-8.63 -14.288 M
-6.333 -14.288 -6.333 -17.569 QT
-6.333 -18.975 -6.825 -19.889 QT
-7.317 -20.803 -8.63 -20.803 QT
-9.942 -20.803 -10.434 -19.889 QT
-10.927 -18.975 -10.927 -17.569 QT
-10.927 -16.663 -10.739 -15.936 QT
-10.552 -15.209 -10.052 -14.749 QT
-9.552 -14.288 -8.63 -14.288 QT
cp}def
f921052904
f
GR
GS
[0 -0.75 0.75 0 52.49991 163.87487] CT
0.149 GC
N
/f-667380654{5.422 -9.303 M
3.782 -9.303 2.407 -10.163 QT
1.032 -11.022 0.243 -12.467 QT
-0.546 -13.913 -0.546 -15.522 QT
-0.546 -17.1 0.172 -18.522 QT
0.891 -19.944 2.18 -20.827 QT
3.469 -21.709 5.047 -21.709 QT
6.282 -21.709 7.196 -21.288 QT
8.11 -20.866 8.704 -20.131 QT
9.297 -19.397 9.602 -18.397 QT
9.907 -17.397 9.907 -16.194 QT
9.907 -15.834 9.626 -15.834 QT
1.813 -15.834 L
1.813 -15.553 L
1.813 -13.303 2.719 -11.694 QT
3.626 -10.084 5.672 -10.084 QT
6.501 -10.084 7.204 -10.452 QT
7.907 -10.819 8.43 -11.483 QT
8.954 -12.147 9.126 -12.897 QT
9.157 -12.991 9.227 -13.061 QT
9.297 -13.131 9.391 -13.131 QT
9.626 -13.131 L
9.907 -13.131 9.907 -12.788 QT
9.532 -11.256 8.266 -10.28 QT
7.001 -9.303 5.422 -9.303 QT
cp
1.844 -16.506 M
8.001 -16.506 L
8.001 -17.522 7.719 -18.561 QT
7.438 -19.6 6.774 -20.295 QT
6.11 -20.991 5.047 -20.991 QT
3.516 -20.991 2.68 -19.561 QT
1.844 -18.131 1.844 -16.506 QT
cp}def
f-667380654
f
GR
GS
[0 -0.75 0.75 0 52.49991 163.87487] CT
0.149 GC
N
/f320198268{27.819 -2.897 M
26.319 -4.084 25.226 -5.624 QT
24.132 -7.163 23.444 -8.905 QT
22.757 -10.647 22.413 -12.545 QT
22.069 -14.444 22.069 -16.35 QT
22.069 -18.288 22.413 -20.186 QT
22.757 -22.084 23.46 -23.834 QT
24.163 -25.584 25.257 -27.116 QT
26.351 -28.647 27.819 -29.803 QT
27.819 -29.85 27.944 -29.85 QT
28.194 -29.85 L
28.273 -29.85 28.343 -29.78 QT
28.413 -29.709 28.413 -29.616 QT
28.413 -29.491 28.351 -29.444 QT
27.038 -28.147 26.163 -26.67 QT
25.288 -25.194 24.749 -23.53 QT
24.21 -21.866 23.976 -20.077 QT
23.741 -18.288 23.741 -16.35 QT
23.741 -7.772 28.335 -3.319 QT
28.413 -3.225 28.413 -3.084 QT
28.413 -3.022 28.335 -2.936 QT
28.257 -2.85 28.194 -2.85 QT
27.944 -2.85 L
27.819 -2.85 27.819 -2.897 QT
cp}def
f320198268
f
GR
GS
[0 -0.75 0.75 0 52.49991 163.87487] CT
0.149 GC
N
/f-976764053{30.612 -9.6 M
30.612 -10.553 L
31.549 -10.553 32.135 -10.694 QT
32.721 -10.834 32.721 -11.413 QT
32.721 -18.772 L
32.721 -19.506 32.51 -19.827 QT
32.299 -20.147 31.885 -20.217 QT
31.471 -20.288 30.612 -20.288 QT
30.612 -21.241 L
34.534 -21.538 L
34.534 -18.897 L
35.08 -20.053 36.143 -20.795 QT
37.205 -21.538 38.455 -21.538 QT
41.565 -21.538 42.096 -19.006 QT
42.643 -20.131 43.682 -20.834 QT
44.721 -21.538 45.971 -21.538 QT
47.19 -21.538 48.026 -21.139 QT
48.862 -20.741 49.284 -19.928 QT
49.705 -19.116 49.705 -17.897 QT
49.705 -11.413 L
49.705 -10.834 50.307 -10.694 QT
50.909 -10.553 51.815 -10.553 QT
51.815 -9.6 L
45.643 -9.6 L
45.643 -10.553 L
46.565 -10.553 47.159 -10.694 QT
47.752 -10.834 47.752 -11.413 QT
47.752 -17.819 L
47.752 -19.178 47.37 -20.006 QT
46.987 -20.834 45.799 -20.834 QT
44.237 -20.834 43.221 -19.584 QT
42.205 -18.334 42.205 -16.725 QT
42.205 -11.413 L
42.205 -10.834 42.799 -10.694 QT
43.393 -10.553 44.315 -10.553 QT
44.315 -9.6 L
38.127 -9.6 L
38.127 -10.553 L
39.049 -10.553 39.643 -10.694 QT
40.237 -10.834 40.237 -11.413 QT
40.237 -17.819 L
40.237 -19.131 39.854 -19.983 QT
39.471 -20.834 38.299 -20.834 QT
36.721 -20.834 35.713 -19.584 QT
34.705 -18.334 34.705 -16.725 QT
34.705 -11.413 L
34.705 -10.834 35.299 -10.694 QT
35.893 -10.553 36.799 -10.553 QT
36.799 -9.6 L
30.612 -9.6 L
cp}def
f-976764053
f
GR
GS
[0 -0.75 0.75 0 52.49991 163.87487] CT
0.149 GC
N
/f-879261752{53.787 -2.85 M
53.553 -2.85 53.553 -3.084 QT
53.553 -3.209 53.6 -3.256 QT
58.225 -7.772 58.225 -16.35 QT
58.225 -24.928 53.662 -29.381 QT
53.553 -29.459 53.553 -29.616 QT
53.553 -29.709 53.623 -29.78 QT
53.693 -29.85 53.787 -29.85 QT
54.037 -29.85 L
54.115 -29.85 54.178 -29.803 QT
56.115 -28.272 57.404 -26.084 QT
58.693 -23.897 59.295 -21.413 QT
59.897 -18.928 59.897 -16.35 QT
59.897 -14.444 59.576 -12.592 QT
59.256 -10.741 58.545 -8.936 QT
57.834 -7.131 56.756 -5.608 QT
55.678 -4.084 54.178 -2.897 QT
54.115 -2.85 54.037 -2.85 QT
53.787 -2.85 L
cp}def
f-879261752
f
GR
GS
[0.75 0 0 0.75 0 0] CT
0 0.447 0.741 RC
1 LJ
1.333 LW
N
123.207 321.596 M
124.413 319.097 L
125.62 325.902 L
126.827 326.642 L
128.033 336.61 L
129.24 342.071 L
130.447 355.187 L
131.653 361.979 L
132.86 355.356 L
134.067 361.387 L
135.273 344.381 L
136.48 348.895 L
137.687 343.556 L
138.893 346.307 L
140.1 342.983 L
141.307 348.723 L
142.513 345.997 L
143.72 355.931 L
144.927 351.828 L
146.133 332.689 L
147.34 332.973 L
148.547 340.565 L
149.753 368.593 L
150.96 354.587 L
152.167 376.545 L
153.373 386.051 L
154.58 385.842 L
155.787 386.732 L
156.993 379.594 L
158.2 383.895 L
159.407 377.967 L
160.613 377.47 L
161.82 382.464 L
163.027 369.721 L
164.233 360.737 L
165.44 354.397 L
166.647 351.182 L
167.853 356.915 L
169.06 361.958 L
170.267 357.916 L
171.473 358.263 L
172.68 324.648 L
173.887 319.285 L
175.093 309.518 L
176.3 333.875 L
177.507 314.223 L
178.713 327.526 L
179.92 333.357 L
181.127 337.627 L
182.333 348.636 L
183.54 342.259 L
184.747 342.528 L
185.953 330.692 L
187.16 338.251 L
188.367 337.289 L
189.573 338.874 L
190.78 328.784 L
191.987 343.952 L
193.193 335.154 L
194.4 335.557 L
195.607 325.656 L
196.813 306.387 L
198.02 295.597 L
199.227 271.451 L
200.433 295.927 L
201.64 276.985 L
202.847 277.168 L
204.053 260.599 L
205.26 279.326 L
206.467 274.12 L
207.673 301.62 L
208.88 298.617 L
210.087 339.439 L
211.293 345.229 L
212.5 354.134 L
213.707 347.691 L
214.913 355.245 L
216.12 362.964 L
217.327 363.784 L
218.533 359.698 L
219.74 361.281 L
220.947 356.763 L
222.153 358.68 L
223.36 346.216 L
224.567 353.848 L
225.773 346.699 L
226.98 331.673 L
228.187 345.993 L
229.393 331.629 L
230.6 336.227 L
231.807 333.343 L
233.013 339.594 L
234.22 345.778 L
235.427 345.511 L
236.633 355.442 L
237.84 344.371 L
239.047 342.91 L
240.253 353.8 L
241.46 340.752 L
242.667 341.785 L
243.873 326.655 L
245.08 327.266 L
246.287 320.553 L
247.493 313.318 L
248.7 310.291 L
249.907 269.67 L
251.113 306.076 L
252.32 315.397 L
253.527 313.626 L
254.733 327.863 L
255.94 314.636 L
257.147 312.064 L
258.353 312.965 L
259.56 317.724 L
260.767 294.846 L
261.973 291.385 L
263.18 302.444 L
264.387 311.683 L
265.593 306.263 L
266.8 327.028 L
268.007 347.983 L
269.213 339.105 L
270.42 355.848 L
271.627 350.138 L
272.833 354.849 L
274.04 351.425 L
275.247 355.715 L
276.453 351.829 L
277.66 347.853 L
278.867 343.212 L
280.073 336.202 L
281.28 334.59 L
282.487 347.349 L
283.693 317.167 L
284.9 322.945 L
286.107 317.356 L
287.313 323.529 L
288.52 323.649 L
289.727 334.959 L
290.933 325.608 L
292.14 329.923 L
293.347 338.972 L
294.553 338.945 L
295.76 338.203 L
296.967 334.978 L
298.173 333.511 L
299.38 330.51 L
300.587 331.268 L
301.793 322.424 L
303 322.53 L
304.207 316.43 L
305.413 312.29 L
306.62 309.595 L
307.827 324.264 L
309.033 317.659 L
310.24 320.31 L
311.447 323.615 L
312.653 329.923 L
313.86 328.981 L
315.067 311.136 L
316.273 322.042 L
317.48 306.981 L
318.687 290.684 L
319.893 307.883 L
321.1 288.895 L
322.307 292.613 L
323.513 294.063 L
324.72 304.337 L
325.927 306.497 L
327.133 302.07 L
328.34 309.5 L
329.547 311.846 L
330.753 298.875 L
331.96 312.859 L
333.167 317.343 L
334.373 332.753 L
335.58 324.072 L
336.787 331.52 L
337.993 334.585 L
339.2 340.261 L
340.407 333.785 L
341.613 349.213 L
342.82 353.388 L
344.027 362.245 L
345.233 358.393 L
346.44 372.444 L
347.647 362.408 L
348.853 370.826 L
350.06 359.825 L
351.267 360.684 L
352.473 341.685 L
353.68 336.142 L
354.887 349.625 L
356.093 350.57 L
357.3 343.39 L
358.507 338.2 L
359.713 339.577 L
360.92 335.595 L
362.127 335.278 L
363.333 339.935 L
364.54 345.96 L
365.747 339.371 L
366.953 342.72 L
368.16 356.493 L
369.367 332.5 L
370.573 334.125 L
371.78 344.782 L
372.987 344.17 L
374.193 355.359 L
375.4 359.158 L
376.607 352.873 L
377.813 355.863 L
379.02 345.862 L
380.227 349.774 L
381.433 348.251 L
382.64 332.543 L
383.847 354.837 L
385.053 352.099 L
386.26 349.71 L
387.467 348.655 L
388.673 348.408 L
389.88 344.03 L
391.087 342.096 L
392.293 349.157 L
393.5 342.327 L
394.707 347.346 L
395.913 342.372 L
397.12 321.15 L
398.327 333.299 L
399.533 309.65 L
400.74 308.215 L
401.947 309.686 L
403.153 306.278 L
404.36 311.416 L
405.567 322.826 L
406.773 346.557 L
407.98 351.939 L
409.187 349.666 L
410.393 352.729 L
411.6 350.328 L
412.807 349.053 L
414.013 357.132 L
415.22 360.954 L
416.427 368.6 L
417.633 368.556 L
418.84 366.894 L
420.047 369.991 L
421.253 366.708 L
422.46 356.661 L
423.667 363.231 L
424.873 376.687 L
426.08 378.388 L
427.287 373.218 L
428.493 373.374 L
429.7 379.567 L
430.907 360.482 L
432.113 357.279 L
433.32 363.791 L
434.527 372.357 L
435.733 358.518 L
436.94 336.453 L
438.147 343.674 L
439.353 333.532 L
440.56 316.797 L
441.767 305.316 L
442.973 312.845 L
444.18 303.239 L
445.387 304.592 L
446.593 306.702 L
447.8 295.298 L
449.007 321.908 L
450.213 293.563 L
451.42 308.539 L
452.627 307.399 L
453.833 315.917 L
455.04 322.875 L
456.247 331.483 L
457.453 312.515 L
458.66 315.741 L
459.867 320.712 L
461.073 339.328 L
462.28 340.668 L
463.487 328.399 L
464.693 334.325 L
465.9 322.597 L
467.107 345.434 L
468.313 341.17 L
469.52 348.387 L
470.727 355.421 L
471.933 352.725 L
473.14 362.979 L
474.347 380.221 L
475.553 377.384 L
476.76 374.071 L
477.967 383.961 L
479.173 377.371 L
480.38 390.5 L
481.587 380.638 L
482.793 379.515 L
484 384.04 L
485.207 380.61 L
486.413 367.241 L
487.62 379.037 L
488.827 372.118 L
490.033 367.33 L
491.24 381.398 L
492.447 368.607 L
493.653 379.842 L
494.86 367.989 L
496.067 384.243 L
497.273 363.553 L
498.48 373.59 L
499.687 359.579 L
500.893 370.681 L
502.1 362.819 L
503.307 375.362 L
504.513 380.417 L
505.72 380.975 L
506.927 368.519 L
508.133 384.056 L
509.34 311.321 L
510.547 269.922 L
511.753 273.66 L
512.96 269.161 L
514.167 248.599 L
515.373 284.983 L
516.58 256.193 L
517.787 272.465 L
518.993 300.36 L
520.2 279.845 L
521.407 319.825 L
522.613 304.884 L
523.82 322.436 L
525.027 343.639 L
526.233 337.015 L
527.44 340.388 L
528.647 332.656 L
529.853 335.912 L
531.06 336.17 L
532.267 326.628 L
533.473 337.9 L
534.68 327.932 L
535.887 330.384 L
537.093 322.309 L
538.3 323.416 L
539.507 306.423 L
540.713 299.575 L
541.92 317.21 L
543.127 308.598 L
544.333 320.208 L
545.54 304.042 L
546.747 322.463 L
547.953 346.234 L
549.16 322.948 L
550.367 311.883 L
551.573 333.476 L
552.78 334.728 L
553.987 337.386 L
555.193 318.685 L
556.4 326.627 L
557.607 320.818 L
558.813 329.338 L
560.02 330.602 L
561.227 330.91 L
562.433 322.493 L
563.64 335.077 L
564.847 320.39 L
566.053 325.502 L
567.26 326.467 L
568.467 346.987 L
569.673 350.867 L
570.88 225.803 L
572.087 209.072 L
573.293 200.412 L
574.5 187.397 L
575.707 202.521 L
576.913 159.533 L
578.12 192.18 L
579.327 153.695 L
580.533 163.15 L
581.74 149.377 L
582.947 158.37 L
584.153 174.771 L
585.36 149.568 L
586.567 148.589 L
587.773 167.404 L
588.98 147.458 L
590.187 171.291 L
591.393 200.01 L
592.6 175.305 L
593.807 204.086 L
595.013 196.766 L
596.22 219.888 L
597.427 190.35 L
598.633 154.489 L
599.84 191.744 L
601.047 167.879 L
602.253 162.084 L
603.46 203.678 L
604.667 299.088 L
605.873 210.009 L
607.08 208.812 L
608.287 193.809 L
609.493 213.508 L
610.7 214.091 L
611.907 236.116 L
613.113 267.899 L
614.32 271.329 L
615.527 290.399 L
616.733 363.993 L
617.94 300.845 L
619.147 376.867 L
620.353 311.291 L
621.56 364.908 L
622.767 304.734 L
623.973 287.556 L
625.18 291.363 L
626.387 373.577 L
627.593 253.196 L
628.8 264.478 L
630.007 271.891 L
631.213 256.656 L
632.42 250.895 L
633.627 230.773 L
634.833 269.81 L
636.04 269.117 L
637.247 273.803 L
638.453 296.937 L
639.66 294.419 L
640.867 320.342 L
642.073 341.87 L
643.28 352.625 L
644.487 357.026 L
645.693 353.994 L
646.9 345.395 L
648.107 357.365 L
649.313 354.776 L
650.52 350.568 L
651.727 370 L
652.933 356.366 L
654.14 345.679 L
655.347 365.461 L
656.553 341.068 L
657.76 352.395 L
658.967 360.894 L
660.173 375.323 L
661.38 359.207 L
662.587 351.078 L
663.793 339.357 L
665 326.781 L
666.207 321.169 L
667.413 337.252 L
668.62 342.615 L
669.827 329.567 L
671.033 301.404 L
672.24 345.128 L
673.447 351.8 L
674.653 347.199 L
675.86 357.586 L
677.067 322.436 L
678.273 338.246 L
679.48 340.784 L
680.687 312.511 L
681.893 292.805 L
683.1 295.473 L
684.307 296.113 L
685.513 288.72 L
686.72 284.028 L
687.927 271.344 L
689.133 284.577 L
690.34 268.715 L
691.547 266.5 L
692.753 262.271 L
693.96 274.528 L
695.167 273.24 L
696.373 270.956 L
697.58 296.652 L
698.787 302.405 L
699.993 330.937 L
701.2 348.695 L
702.407 386.595 L
703.613 376.61 L
704.82 374.294 L
706.027 373.423 L
707.233 358.057 L
708.44 349.196 L
709.647 361.596 L
710.853 323.381 L
712.06 344.622 L
713.267 348.677 L
714.473 356.314 L
715.68 342.276 L
716.887 359.44 L
718.093 349.628 L
719.3 337.488 L
720.507 318.48 L
721.713 290.863 L
722.92 292.13 L
724.127 269.783 L
725.333 267.068 L
726.54 271.1 L
727.747 269.101 L
728.953 264.764 L
730.16 275.674 L
731.367 277.099 L
732.573 311.07 L
733.78 306.191 L
734.987 319.711 L
736.193 325.073 L
737.4 329.499 L
738.607 304.761 L
739.813 302.146 L
741.02 330.645 L
742.227 281.437 L
743.433 251.913 L
744.64 288.604 L
745.847 312.491 L
747.053 298.586 L
748.26 289.424 L
749.467 282.386 L
750.673 296.696 L
751.88 294.972 L
753.087 304.266 L
754.293 332.47 L
755.5 347.633 L
756.707 353.478 L
757.913 360.163 L
759.12 343.871 L
760.327 346.066 L
761.533 348.975 L
762.74 324.978 L
763.947 315.285 L
765.153 328.552 L
766.36 309.613 L
767.567 286.611 L
768.773 292.492 L
769.98 299.037 L
771.187 281.939 L
772.393 281.86 L
773.6 280.946 L
774.807 279.79 L
776.013 280.148 L
777.22 293.402 L
778.427 286.076 L
779.633 270.337 L
780.84 284.321 L
782.047 290.339 L
783.253 280.639 L
784.46 266.563 L
785.667 301.13 L
786.873 287.045 L
788.08 295.961 L
789.287 311.547 L
790.493 302.568 L
791.7 285.159 L
792.907 295.992 L
794.113 294.124 L
795.32 272.662 L
796.527 281.214 L
797.733 292.878 L
798.94 284.241 L
800.147 280.41 L
801.353 310.201 L
802.56 316.827 L
803.767 334.29 L
804.973 334.971 L
806.18 334.239 L
807.387 323.877 L
808.593 320.685 L
809.8 346.196 L
811.007 335.107 L
812.213 332.894 L
813.42 313.131 L
814.627 346.785 L
815.833 340.551 L
817.04 326.365 L
818.247 317.528 L
819.453 364.796 L
820.66 359.12 L
821.867 318.997 L
823.073 340.132 L
824.28 320.262 L
825.487 332.759 L
826.693 323.266 L
827.9 323.765 L
829.107 313.661 L
830.313 305.018 L
831.52 231.713 L
832.727 265.406 L
833.933 246.374 L
835.14 242.164 L
836.347 217.198 L
837.553 222.459 L
838.76 184.253 L
839.967 180.903 L
841.173 175.786 L
842.38 144.607 L
843.587 365.278 L
844.793 355.024 L
846 357.965 L
846.086 358.283 L
S
GR
GS
[0.75 0 0 0.75 0 0] CT
0.851 0.325 0.098 RC
1 LJ
1.333 LW
N
123.207 335.237 M
124.413 367.8 L
125.62 314.391 L
126.827 349.875 L
128.033 333.663 L
129.24 363.091 L
130.447 364.964 L
131.653 357.435 L
132.86 353.15 L
134.067 337.919 L
135.273 341.587 L
136.48 337.73 L
137.687 333.501 L
138.893 301.09 L
140.1 308.836 L
141.307 304.055 L
142.513 337.062 L
143.72 351.007 L
144.927 340.509 L
146.133 344.344 L
147.34 352.595 L
148.547 337.764 L
149.753 360.315 L
150.96 305.763 L
152.167 371.57 L
153.373 309.498 L
154.58 305.402 L
155.787 276.521 L
156.993 296.266 L
158.2 219.824 L
159.407 231.716 L
160.613 187.532 L
161.82 225.207 L
163.027 181.929 L
164.233 150.373 L
165.44 186.218 L
166.647 187.718 L
167.853 191.484 L
169.06 225.379 L
170.267 196.812 L
171.473 183.042 L
172.68 237.058 L
173.887 328.974 L
175.093 308.621 L
176.3 345.743 L
177.507 337.852 L
178.713 206.5 L
179.92 130.941 L
181.127 116.131 L
182.333 126.733 L
183.54 74.417 L
184.747 51.099 L
185.953 335.307 L
187.16 337.177 L
188.367 347.232 L
189.573 343.547 L
190.78 351.193 L
191.987 361.319 L
193.193 352.926 L
194.4 343.48 L
195.607 343.877 L
196.813 334.411 L
198.02 294.694 L
199.227 254.936 L
200.433 283.575 L
201.64 274.114 L
202.847 264.401 L
204.053 298.544 L
205.26 310.9 L
206.467 323.973 L
207.673 328.181 L
208.88 312.146 L
210.087 232.329 L
211.293 202.947 L
212.5 312.097 L
213.707 313.699 L
214.913 325.082 L
216.12 336.595 L
217.327 341.807 L
218.533 344.457 L
219.74 341.065 L
220.947 330.658 L
222.153 336.369 L
223.36 318.664 L
224.567 340.821 L
225.773 68.687 L
226.517 35.956 L
S
GR
GS
[0.75 0 0 0.75 0 0] CT
0.851 0.325 0.098 RC
1 LJ
1.333 LW
N
228.961 35.956 M
229.393 45.316 L
230.6 341.585 L
231.807 105.997 L
233.013 114.402 L
234.22 87.771 L
235.427 111.504 L
236.633 107.169 L
237.84 134.287 L
239.047 131.341 L
240.253 90.25 L
241.46 319.187 L
242.667 334.102 L
243.873 313.675 L
245.08 268.602 L
246.287 306.668 L
247.493 301.814 L
248.7 298.544 L
249.907 254.968 L
251.113 271.3 L
252.32 290.15 L
253.527 302.478 L
254.733 307.793 L
255.94 304.193 L
257.147 309.68 L
258.353 314.638 L
259.56 328.065 L
260.767 310.463 L
261.973 302.352 L
263.18 309.993 L
264.387 320.488 L
265.593 314.266 L
266.8 334.858 L
268.007 342.97 L
269.213 340.222 L
270.42 347.428 L
271.627 344.788 L
272.833 347.596 L
274.04 317.325 L
275.247 339.613 L
276.453 324.298 L
277.66 325.112 L
278.867 337.478 L
280.073 319.253 L
281.28 334.127 L
282.487 325.911 L
283.693 341.26 L
284.9 345.132 L
286.107 339.534 L
287.313 338.037 L
288.52 329.935 L
289.727 337.202 L
290.933 325.332 L
292.14 326.495 L
293.347 328.709 L
294.553 328.819 L
295.76 325.913 L
296.967 320.385 L
298.173 320.89 L
299.38 317.068 L
300.587 320.569 L
301.793 305.869 L
303 300.436 L
304.207 316.817 L
305.413 311.134 L
306.62 318.818 L
307.827 320.621 L
309.033 331.786 L
310.24 299.82 L
311.447 303.116 L
312.653 309.941 L
313.86 329.868 L
315.067 318.295 L
316.273 320.497 L
317.48 311.977 L
318.687 298.275 L
319.893 294.08 L
321.1 243.818 L
322.307 240.396 L
323.513 296.833 L
324.72 299.118 L
325.927 299.559 L
327.133 296.001 L
328.34 265.092 L
329.547 277.616 L
330.753 271.444 L
331.96 268.336 L
333.167 275.694 L
334.373 305.256 L
335.58 289.325 L
336.787 295.892 L
337.993 299.172 L
339.2 310.456 L
340.407 290.165 L
341.613 333.272 L
342.82 375.504 L
344.027 360.366 L
345.233 389.815 L
346.44 368.207 L
347.647 366.815 L
348.853 372.115 L
350.06 354.156 L
351.267 354.8 L
352.473 339.072 L
353.68 310.893 L
354.887 330.127 L
356.093 334.316 L
357.3 326.582 L
358.507 351.854 L
359.713 349.197 L
360.92 349.03 L
362.127 353.511 L
363.333 356.103 L
364.54 360.379 L
365.747 364.369 L
366.953 361.142 L
368.16 357.829 L
369.367 357.638 L
370.573 358.234 L
371.78 357.792 L
372.987 360.292 L
374.193 366.256 L
375.4 355.013 L
376.607 347.64 L
377.813 346.637 L
379.02 338.05 L
380.227 338.768 L
381.433 340.518 L
382.64 318.807 L
383.847 352.423 L
385.053 340.153 L
386.26 339.307 L
387.467 343.324 L
388.673 344.652 L
389.88 354.401 L
391.087 351.204 L
392.293 367.945 L
393.5 360.694 L
394.707 377.83 L
395.913 369.825 L
397.12 355.085 L
398.327 370.447 L
399.533 347.966 L
400.74 343.028 L
401.947 339.87 L
403.153 322.101 L
404.36 328.582 L
405.567 328.369 L
406.773 350.395 L
407.98 344.56 L
409.187 340.337 L
410.393 351.121 L
411.6 346.403 L
412.807 332.375 L
414.013 348.519 L
415.22 356.617 L
416.427 341.989 L
417.633 355.67 L
418.84 334.416 L
420.047 345.641 L
421.253 343.537 L
422.46 326.121 L
423.667 339.808 L
424.873 353.457 L
426.08 373.688 L
427.287 374.366 L
428.493 371.297 L
429.7 379.651 L
430.907 364.636 L
432.113 360.661 L
433.32 364.614 L
434.527 360.996 L
435.733 346.996 L
436.94 310.537 L
438.147 318.996 L
439.353 313.064 L
440.56 297.857 L
441.767 307.341 L
442.973 308.633 L
444.18 283.62 L
445.387 290.398 L
446.593 281.759 L
447.8 300.699 L
449.007 312.169 L
450.213 280.097 L
451.42 293.823 L
452.627 284.123 L
453.833 304.209 L
455.04 309.779 L
456.247 317.262 L
457.453 307.244 L
458.66 330.359 L
459.867 317.413 L
461.073 340.528 L
462.28 357.982 L
463.487 345.167 L
464.693 362.439 L
465.9 363.898 L
467.107 373.637 L
468.313 373.023 L
469.52 374.345 L
470.727 383.203 L
471.933 379.213 L
473.14 372.045 L
474.347 382.273 L
475.553 376.378 L
476.76 385.239 L
477.967 356.869 L
479.173 377.137 L
480.38 364.202 L
481.587 348.438 L
482.793 376.667 L
484 369.553 L
485.207 346.31 L
486.413 352.077 L
487.62 370.462 L
488.827 363.621 L
490.033 356.974 L
491.24 374.027 L
492.447 351.662 L
493.653 358.937 L
494.86 355.552 L
496.067 376.588 L
497.273 351.283 L
498.48 365.307 L
499.687 355.817 L
500.893 367.519 L
502.1 349.749 L
503.307 350.979 L
504.513 358.686 L
505.72 371.532 L
506.927 362.326 L
508.133 366.019 L
509.34 343.308 L
510.547 373.887 L
511.753 388.652 L
512.96 385.711 L
514.167 379.547 L
515.373 382.935 L
516.58 366.035 L
517.787 376.286 L
518.993 380.571 L
520.2 358.422 L
521.407 373.341 L
522.613 365.486 L
523.82 256.597 L
525.027 304.914 L
526.233 313.321 L
527.44 316.711 L
528.647 335.104 L
529.853 330.043 L
531.06 335.675 L
532.267 333.022 L
533.473 340.195 L
534.68 340.547 L
535.887 344.459 L
537.093 353.538 L
538.3 346.208 L
539.507 340.144 L
540.713 305.428 L
541.92 299.318 L
543.127 302.118 L
544.333 256.471 L
545.54 193.659 L
546.747 157.436 L
547.953 60.558 L
549.16 148.928 L
550.367 66.719 L
551.573 52.769 L
552.78 348.71 L
553.987 156.638 L
555.193 88.981 L
556.4 154.544 L
557.607 202.057 L
558.813 215.811 L
560.02 229.714 L
561.227 248.252 L
562.433 255.954 L
563.64 274.242 L
564.847 296.91 L
566.053 352.863 L
567.26 316.788 L
568.467 321.258 L
569.673 353.292 L
570.88 350.011 L
572.087 306.023 L
573.293 335.764 L
574.5 348.996 L
575.707 337.385 L
576.913 252.058 L
578.12 349.908 L
579.327 166.576 L
580.533 272.24 L
581.74 194.656 L
582.947 216.153 L
584.153 196.225 L
585.36 120.431 L
586.567 98.213 L
587.773 115.267 L
588.98 107.592 L
590.187 92.361 L
591.393 123.301 L
592.6 66.021 L
593.807 76.039 L
595.013 63.275 L
596.22 80.47 L
597.427 80.093 L
598.633 58.668 L
599.84 118.155 L
601.047 149.673 L
602.253 153.133 L
603.46 325.84 L
604.667 182.953 L
605.873 191.97 L
607.08 230.457 L
608.287 226.421 L
609.493 274.001 L
610.7 296.065 L
611.907 368.962 L
613.113 378.478 L
614.32 338.962 L
615.527 368.987 L
616.733 363.654 L
617.94 365.922 L
619.147 363.209 L
620.353 349.389 L
621.56 337.978 L
622.767 330.488 L
623.973 336.174 L
625.18 324.765 L
626.387 369.358 L
627.593 168.501 L
628.8 183.85 L
630.007 362.586 L
631.213 163.489 L
632.42 180.273 L
633.627 159.438 L
634.833 190.329 L
636.04 179.605 L
637.247 202.686 L
638.453 193.312 L
639.66 203.841 L
640.867 210.922 L
642.073 225.422 L
643.28 250.824 L
644.487 259.865 L
645.693 275.873 L
646.9 275.692 L
648.107 267.029 L
649.313 285.807 L
650.52 260.714 L
651.727 280.115 L
652.933 241.915 L
654.14 207.461 L
655.347 182.17 L
656.553 200.362 L
657.76 185.365 L
658.967 222.275 L
660.173 186.684 L
661.38 192.073 L
662.587 182.332 L
663.793 152.031 L
665 146.178 L
666.207 159.644 L
667.413 175.524 L
668.62 170.701 L
669.827 162.483 L
671.033 123.57 L
672.24 109.465 L
673.447 138.227 L
674.653 125.559 L
675.86 363.799 L
677.067 340.445 L
678.273 341.33 L
679.48 340.455 L
680.687 305.048 L
681.893 289.129 L
683.1 287.148 L
684.307 285.693 L
685.513 276.967 L
686.72 289.915 L
687.927 275.386 L
689.133 301.779 L
690.34 291.992 L
691.547 287.211 L
692.753 282.76 L
693.96 309.758 L
695.167 309.517 L
696.373 300.768 L
697.58 333.109 L
698.787 345.993 L
699.993 364.406 L
701.2 370.117 L
702.407 351.922 L
703.613 358.467 L
704.82 348.304 L
706.027 223.669 L
707.233 286.406 L
708.44 332.51 L
709.647 328.464 L
710.853 354.519 L
712.06 360.545 L
713.267 367.279 L
714.473 368.481 L
715.68 350.19 L
716.887 325.311 L
718.093 333.765 L
719.3 332.955 L
720.507 337.626 L
721.713 315.37 L
722.92 352.055 L
724.127 291.939 L
725.333 349.039 L
726.54 293.593 L
727.747 261.144 L
728.953 298.447 L
730.16 296.115 L
731.367 277.628 L
732.573 337.637 L
733.78 319.037 L
734.987 229.006 L
736.193 313.362 L
737.4 305.051 L
738.607 297.524 L
739.813 115.956 L
741.02 253.817 L
742.227 262.409 L
743.433 311.612 L
744.64 224.624 L
745.847 329.491 L
747.053 269.948 L
748.26 229.221 L
749.467 219.485 L
750.673 256.378 L
751.88 247.01 L
753.087 122.688 L
754.293 297.349 L
755.5 366.868 L
756.707 321.135 L
757.913 362.032 L
759.12 341.443 L
760.327 357.398 L
761.533 366.051 L
762.74 330.107 L
763.947 326.092 L
765.153 328.503 L
766.36 306.479 L
767.567 324.032 L
768.773 327.614 L
769.98 326.278 L
771.187 328.331 L
772.393 325.495 L
773.6 301.879 L
774.807 264.836 L
776.013 286.933 L
777.22 269.371 L
778.427 271.079 L
779.633 243.997 L
780.84 230.117 L
782.047 210.333 L
783.253 295.669 L
784.46 294.916 L
785.667 326.59 L
786.873 313.695 L
788.08 316.648 L
789.287 356.556 L
790.493 344.421 L
791.7 304.759 L
792.907 314.396 L
794.113 289.431 L
795.32 287.509 L
796.527 277.467 L
797.733 284.784 L
798.94 285.18 L
800.147 276.741 L
801.353 298.155 L
802.56 311.935 L
803.767 297.514 L
804.973 307.174 L
806.18 330.215 L
807.387 319.835 L
808.593 316.859 L
809.8 323.815 L
811.007 295.498 L
812.213 283.597 L
813.42 260.861 L
814.627 187.259 L
815.833 107.846 L
817.04 149.229 L
818.247 141.85 L
819.453 104.688 L
820.66 85.163 L
821.867 58.359 L
823.073 67.016 L
824.28 73.958 L
825.487 73.493 L
826.693 48.777 L
827.9 67.562 L
829.107 80.822 L
830.313 66.646 L
831.52 87.755 L
832.727 134.159 L
833.933 115.265 L
835.14 125.089 L
836.347 127.14 L
837.553 135.651 L
838.76 123.58 L
839.967 122.819 L
841.173 169.818 L
842.38 191.876 L
843.587 235.659 L
844.793 233.037 L
846 251.72 L
846.086 253.392 L
S
GR
GS
[0.75 0 0 0.75 0 0] CT
0.467 0.675 0.188 RC
1 LJ
1.333 LW
N
123.207 352.333 M
124.413 352.333 L
125.62 352.333 L
126.827 352.333 L
128.033 352.333 L
129.24 352.333 L
130.447 352.333 L
131.653 352.333 L
132.86 352.333 L
134.067 352.333 L
135.273 352.333 L
136.48 352.333 L
137.687 352.333 L
138.893 352.333 L
140.1 352.333 L
141.307 352.333 L
142.513 352.333 L
143.72 352.333 L
144.927 352.333 L
146.133 352.333 L
147.34 352.333 L
148.547 352.333 L
149.753 352.333 L
150.96 352.333 L
152.167 352.333 L
153.373 352.333 L
154.58 352.333 L
155.787 352.333 L
156.993 352.333 L
158.2 352.333 L
159.407 352.333 L
160.613 352.333 L
161.82 352.333 L
163.027 352.333 L
164.233 352.333 L
165.44 352.333 L
166.647 352.333 L
167.853 352.333 L
169.06 352.333 L
170.267 352.333 L
171.473 352.333 L
172.68 352.333 L
173.887 352.333 L
175.093 352.333 L
176.3 352.333 L
177.507 352.333 L
178.713 352.333 L
179.92 352.333 L
181.127 352.333 L
182.333 352.333 L
183.54 352.333 L
184.747 352.333 L
185.953 352.333 L
187.16 352.333 L
188.367 352.333 L
189.573 352.333 L
190.78 352.333 L
191.987 352.333 L
193.193 352.333 L
194.4 352.333 L
195.607 352.333 L
196.813 352.333 L
198.02 352.333 L
199.227 352.333 L
200.433 352.333 L
201.64 352.333 L
202.847 352.333 L
204.053 352.333 L
205.26 352.333 L
206.467 352.333 L
207.673 352.333 L
208.88 352.333 L
210.087 352.333 L
211.293 352.333 L
212.5 352.333 L
213.707 352.333 L
214.913 352.333 L
216.12 352.333 L
217.327 352.333 L
218.533 352.333 L
219.74 352.333 L
220.947 352.333 L
222.153 352.333 L
223.36 352.333 L
224.567 352.333 L
225.773 352.333 L
226.98 352.333 L
228.187 352.333 L
229.393 352.333 L
230.6 352.333 L
231.807 352.333 L
233.013 352.333 L
234.22 352.333 L
235.427 352.333 L
236.633 352.333 L
237.84 352.333 L
239.047 352.333 L
240.253 352.333 L
241.46 352.333 L
242.667 352.333 L
243.873 352.333 L
245.08 352.333 L
246.287 352.333 L
247.493 352.333 L
248.7 352.333 L
249.907 352.333 L
251.113 352.333 L
252.32 352.333 L
253.527 352.333 L
254.733 352.333 L
255.94 352.333 L
257.147 352.333 L
258.353 352.333 L
259.56 352.333 L
260.767 352.333 L
261.973 352.333 L
263.18 352.333 L
264.387 352.333 L
265.593 352.333 L
266.8 352.333 L
268.007 352.333 L
269.213 352.333 L
270.42 352.333 L
271.627 352.333 L
272.833 352.333 L
274.04 352.333 L
275.247 352.333 L
276.453 352.333 L
277.66 352.333 L
278.867 352.333 L
280.073 352.333 L
281.28 352.333 L
282.487 352.333 L
283.693 352.333 L
284.9 352.333 L
286.107 352.333 L
287.313 352.333 L
288.52 352.333 L
289.727 352.333 L
290.933 352.333 L
292.14 352.333 L
293.347 352.333 L
294.553 352.333 L
295.76 352.333 L
296.967 352.333 L
298.173 352.333 L
299.38 352.333 L
300.587 352.333 L
301.793 352.333 L
303 352.333 L
304.207 352.333 L
305.413 352.333 L
306.62 352.333 L
307.827 352.333 L
309.033 352.333 L
310.24 352.333 L
311.447 352.333 L
312.653 352.333 L
313.86 352.333 L
315.067 352.333 L
316.273 352.333 L
317.48 352.333 L
318.687 352.333 L
319.893 352.333 L
321.1 352.333 L
322.307 352.333 L
323.513 352.333 L
324.72 352.333 L
325.927 352.333 L
327.133 352.333 L
328.34 352.333 L
329.547 352.333 L
330.753 352.333 L
331.96 352.333 L
333.167 352.333 L
334.373 352.333 L
335.58 352.333 L
336.787 352.333 L
337.993 352.333 L
339.2 352.333 L
340.407 352.333 L
341.613 352.333 L
342.82 352.333 L
344.027 352.333 L
345.233 352.333 L
346.44 352.333 L
347.647 352.333 L
348.853 352.333 L
350.06 352.333 L
351.267 352.333 L
352.473 352.333 L
353.68 352.333 L
354.887 352.333 L
356.093 352.333 L
357.3 352.333 L
358.507 352.333 L
359.713 352.333 L
360.92 352.333 L
362.127 352.333 L
363.333 352.333 L
364.54 352.333 L
365.747 352.333 L
366.953 352.333 L
368.16 352.333 L
369.367 352.333 L
370.573 352.333 L
371.78 352.333 L
372.987 352.333 L
374.193 352.333 L
375.4 352.333 L
376.607 352.333 L
377.813 352.333 L
379.02 352.333 L
380.227 352.333 L
381.433 352.333 L
382.64 352.333 L
383.847 352.333 L
385.053 352.333 L
386.26 352.333 L
387.467 352.333 L
388.673 352.333 L
389.88 352.333 L
391.087 352.333 L
392.293 352.333 L
393.5 352.333 L
394.707 352.333 L
395.913 352.333 L
397.12 352.333 L
398.327 352.333 L
399.533 352.333 L
400.74 352.333 L
401.947 352.333 L
403.153 352.333 L
404.36 352.333 L
405.567 352.333 L
406.773 352.333 L
407.98 352.333 L
409.187 352.333 L
410.393 352.333 L
411.6 352.333 L
412.807 352.333 L
414.013 352.333 L
415.22 352.333 L
416.427 352.333 L
417.633 352.333 L
418.84 352.333 L
420.047 352.333 L
421.253 352.333 L
422.46 352.333 L
423.667 352.333 L
424.873 352.333 L
426.08 352.333 L
427.287 352.333 L
428.493 352.333 L
429.7 352.333 L
430.907 352.333 L
432.113 352.333 L
433.32 352.333 L
434.527 352.333 L
435.733 352.333 L
436.94 352.333 L
438.147 352.333 L
439.353 352.333 L
440.56 352.333 L
441.767 352.333 L
442.973 352.333 L
444.18 352.333 L
445.387 352.333 L
446.593 352.333 L
447.8 352.333 L
449.007 352.333 L
450.213 352.333 L
451.42 352.333 L
452.627 352.333 L
453.833 352.333 L
455.04 352.333 L
456.247 352.333 L
457.453 352.333 L
458.66 352.333 L
459.867 352.333 L
461.073 352.333 L
462.28 352.333 L
463.487 352.333 L
464.693 352.333 L
465.9 352.333 L
467.107 352.333 L
468.313 352.333 L
469.52 352.333 L
470.727 352.333 L
471.933 352.333 L
473.14 352.333 L
474.347 352.333 L
475.553 352.333 L
476.76 352.333 L
477.967 352.333 L
479.173 352.333 L
480.38 352.333 L
481.587 352.333 L
482.793 352.333 L
484 352.333 L
485.207 352.333 L
486.413 352.333 L
487.62 352.333 L
488.827 352.333 L
490.033 352.333 L
491.24 352.333 L
492.447 352.333 L
493.653 352.333 L
494.86 352.333 L
496.067 352.333 L
497.273 352.333 L
498.48 352.333 L
499.687 352.333 L
500.893 352.333 L
502.1 352.333 L
503.307 352.333 L
504.513 352.333 L
505.72 352.333 L
506.927 352.333 L
508.133 352.333 L
509.34 352.333 L
510.547 352.333 L
511.753 352.333 L
512.96 352.333 L
514.167 352.333 L
515.373 352.333 L
516.58 352.333 L
517.787 352.333 L
518.993 352.333 L
520.2 352.333 L
521.407 352.333 L
522.613 352.333 L
523.82 352.333 L
525.027 352.333 L
526.233 352.333 L
527.44 352.333 L
528.647 352.333 L
529.853 352.333 L
531.06 352.333 L
532.267 352.333 L
533.473 352.333 L
534.68 352.333 L
535.887 352.333 L
537.093 352.333 L
538.3 352.333 L
539.507 352.333 L
540.713 352.333 L
541.92 352.333 L
543.127 352.333 L
544.333 352.333 L
545.54 352.333 L
546.747 352.333 L
547.953 352.333 L
549.16 352.333 L
550.367 352.333 L
551.573 352.333 L
552.78 352.333 L
553.987 352.333 L
555.193 352.333 L
556.4 352.333 L
557.607 352.333 L
558.813 352.333 L
560.02 352.333 L
561.227 352.333 L
562.433 352.333 L
563.64 352.333 L
564.847 352.333 L
566.053 352.333 L
567.26 352.333 L
568.467 352.333 L
569.673 352.333 L
570.88 352.333 L
572.087 352.333 L
573.293 352.333 L
574.5 352.333 L
575.707 352.333 L
576.913 352.333 L
578.12 352.333 L
579.327 352.333 L
580.533 352.333 L
581.74 352.333 L
582.947 352.333 L
584.153 352.333 L
585.36 352.333 L
586.567 352.333 L
587.773 352.333 L
588.98 352.333 L
590.187 352.333 L
591.393 352.333 L
592.6 352.333 L
593.807 352.333 L
595.013 352.333 L
596.22 352.333 L
597.427 352.333 L
598.633 352.333 L
599.84 352.333 L
601.047 352.333 L
602.253 352.333 L
603.46 352.333 L
604.667 352.333 L
605.873 352.333 L
607.08 352.333 L
608.287 352.333 L
609.493 352.333 L
610.7 352.333 L
611.907 352.333 L
613.113 352.333 L
614.32 352.333 L
615.527 352.333 L
616.733 352.333 L
617.94 352.333 L
619.147 352.333 L
620.353 352.333 L
621.56 352.333 L
622.767 352.333 L
623.973 352.333 L
625.18 352.333 L
626.387 352.333 L
627.593 352.333 L
628.8 352.333 L
630.007 352.333 L
631.213 352.333 L
632.42 352.333 L
633.627 352.333 L
634.833 352.333 L
636.04 352.333 L
637.247 352.333 L
638.453 352.333 L
639.66 352.333 L
640.867 352.333 L
642.073 352.333 L
643.28 352.333 L
644.487 352.333 L
645.693 352.333 L
646.9 352.333 L
648.107 352.333 L
649.313 352.333 L
650.52 352.333 L
651.727 352.333 L
652.933 352.333 L
654.14 352.333 L
655.347 352.333 L
656.553 352.333 L
657.76 352.333 L
658.967 352.333 L
660.173 352.333 L
661.38 352.333 L
662.587 352.333 L
663.793 352.333 L
665 352.333 L
666.207 352.333 L
667.413 352.333 L
668.62 352.333 L
669.827 352.333 L
671.033 352.333 L
672.24 352.333 L
673.447 352.333 L
674.653 352.333 L
675.86 352.333 L
677.067 352.333 L
678.273 352.333 L
679.48 352.333 L
680.687 352.333 L
681.893 352.333 L
683.1 352.333 L
684.307 352.333 L
685.513 352.333 L
686.72 352.333 L
687.927 352.333 L
689.133 352.333 L
690.34 352.333 L
691.547 352.333 L
692.753 352.333 L
693.96 352.333 L
695.167 352.333 L
696.373 352.333 L
697.58 352.333 L
698.787 352.333 L
699.993 352.333 L
701.2 352.333 L
702.407 352.333 L
703.613 352.333 L
704.82 352.333 L
706.027 352.333 L
707.233 352.333 L
708.44 352.333 L
709.647 352.333 L
710.853 352.333 L
712.06 352.333 L
713.267 352.333 L
714.473 352.333 L
715.68 352.333 L
716.887 352.333 L
718.093 352.333 L
719.3 352.333 L
720.507 352.333 L
721.713 352.333 L
722.92 352.333 L
724.127 352.333 L
725.333 352.333 L
726.54 352.333 L
727.747 352.333 L
728.953 352.333 L
730.16 352.333 L
731.367 352.333 L
732.573 352.333 L
733.78 352.333 L
734.987 352.333 L
736.193 352.333 L
737.4 352.333 L
738.607 352.333 L
739.813 352.333 L
741.02 352.333 L
742.227 352.333 L
743.433 352.333 L
744.64 352.333 L
745.847 352.333 L
747.053 352.333 L
748.26 352.333 L
749.467 352.333 L
750.673 352.333 L
751.88 352.333 L
753.087 352.333 L
754.293 352.333 L
755.5 352.333 L
756.707 352.333 L
757.913 352.333 L
759.12 352.333 L
760.327 352.333 L
761.533 352.333 L
762.74 352.333 L
763.947 352.333 L
765.153 352.333 L
766.36 352.333 L
767.567 352.333 L
768.773 352.333 L
769.98 352.333 L
771.187 352.333 L
772.393 352.333 L
773.6 352.333 L
774.807 352.333 L
776.013 352.333 L
777.22 352.333 L
778.427 352.333 L
779.633 352.333 L
780.84 352.333 L
782.047 352.333 L
783.253 352.333 L
784.46 352.333 L
785.667 352.333 L
786.873 352.333 L
788.08 352.333 L
789.287 352.333 L
790.493 352.333 L
791.7 352.333 L
792.907 352.333 L
794.113 352.333 L
795.32 352.333 L
796.527 352.333 L
797.733 352.333 L
798.94 352.333 L
800.147 352.333 L
801.353 352.333 L
802.56 352.333 L
803.767 352.333 L
804.973 352.333 L
806.18 352.333 L
807.387 352.333 L
808.593 352.333 L
809.8 352.333 L
811.007 352.333 L
812.213 352.333 L
813.42 352.333 L
814.627 352.333 L
815.833 352.333 L
817.04 352.333 L
818.247 352.333 L
819.453 352.333 L
820.66 352.333 L
821.867 352.333 L
823.073 352.333 L
824.28 352.333 L
825.487 352.333 L
826.693 352.333 L
827.9 352.333 L
829.107 352.333 L
830.313 352.333 L
831.52 352.333 L
832.727 352.333 L
833.933 352.333 L
835.14 352.333 L
836.347 352.333 L
837.553 352.333 L
838.76 352.333 L
839.967 352.333 L
841.173 352.333 L
842.38 352.333 L
843.587 352.333 L
844.793 352.333 L
846 352.333 L
S
GR
GS
[0.75 0 0 0.75 0 0] CT
1 GC
N
835 138 M
835 47 L
662 47 L
662 138 L
cp
f
GR
GS
[0.75 0 0 0.75 531.66866 47.49617] CT
N
/f-1830405052{0.797 5.76 M
0.797 4.916 L
3.266 4.916 3.266 4.151 QT
3.266 -9.037 L
3.266 -9.787 0.797 -9.787 QT
0.797 -10.631 L
9.344 -10.631 L
10.656 -10.631 11.969 -10.092 QT
13.281 -9.553 14.133 -8.521 QT
14.984 -7.49 14.984 -6.131 QT
14.984 -4.787 14.125 -3.779 QT
13.266 -2.771 11.969 -2.248 QT
10.672 -1.724 9.344 -1.724 QT
5.5 -1.724 L
5.5 4.151 L
5.5 4.916 7.969 4.916 QT
7.969 5.76 L
0.797 5.76 L
cp
5.422 -2.443 M
8.688 -2.443 L
10.016 -2.443 10.836 -2.826 QT
11.656 -3.209 12.031 -4.014 QT
12.406 -4.818 12.406 -6.131 QT
12.406 -8.084 11.547 -8.935 QT
10.688 -9.787 8.688 -9.787 QT
6.641 -9.787 L
6.219 -9.787 5.977 -9.756 QT
5.734 -9.724 5.578 -9.553 QT
5.422 -9.381 5.422 -9.037 QT
5.422 -2.443 L
cp}def
f-1830405052
f
GR
GS
[0.75 0 0 0.75 531.66866 47.49617] CT
N
/f-370551762{24.786 6.026 M
19.13 -9.037 L
18.911 -9.537 18.318 -9.662 QT
17.724 -9.787 16.786 -9.787 QT
16.786 -10.631 L
23.396 -10.631 L
23.396 -9.787 L
21.396 -9.787 21.396 -9.178 QT
21.411 -9.131 21.419 -9.107 QT
21.427 -9.084 21.427 -9.037 QT
26.021 3.213 L
30.38 -8.381 L
30.427 -8.474 30.427 -8.662 QT
30.427 -9.256 29.888 -9.521 QT
29.349 -9.787 28.677 -9.787 QT
28.677 -10.631 L
33.849 -10.631 L
33.849 -9.787 L
32.958 -9.787 32.271 -9.459 QT
31.583 -9.131 31.286 -8.381 QT
25.865 6.026 L
25.786 6.291 25.474 6.291 QT
25.177 6.291 L
24.849 6.291 24.786 6.026 QT
cp}def
f-370551762
f
GR
GS
[0.75 0 0 0.75 531.66866 47.49617] CT
N
/f-467109162{38.396 5.76 M
38.396 4.916 L
39.599 4.916 40.732 4.783 QT
41.865 4.651 41.865 4.151 QT
41.865 -9.037 L
41.865 -9.553 41.583 -9.67 QT
41.302 -9.787 40.646 -9.787 QT
39.646 -9.787 L
37.662 -9.787 36.833 -8.928 QT
36.396 -8.49 36.208 -7.537 QT
36.021 -6.584 35.896 -5.146 QT
35.208 -5.146 L
35.662 -10.631 L
50.318 -10.631 L
50.771 -5.146 L
50.068 -5.146 L
49.927 -6.693 49.763 -7.599 QT
49.599 -8.506 49.146 -8.928 QT
48.302 -9.787 46.333 -9.787 QT
45.333 -9.787 L
44.896 -9.787 44.654 -9.756 QT
44.412 -9.724 44.263 -9.553 QT
44.115 -9.381 44.115 -9.037 QT
44.115 4.151 L
44.115 4.651 45.247 4.783 QT
46.38 4.916 47.583 4.916 QT
47.583 5.76 L
38.396 5.76 L
cp}def
f-467109162
f
GR
GS
[0.75 0 0 0.75 531.66866 47.49617] CT
N
/f-1443658756{51.932 1.322 M
51.932 -0.178 L
58.292 -0.178 L
58.292 1.322 L
51.932 1.322 L
cp}def
f-1443658756
f
GR
GS
[0.75 0 0 0.75 531.66866 47.49617] CT
N
/f1344707165{60.464 5.76 M
60.464 4.916 L
62.932 4.916 62.932 4.151 QT
62.932 -9.037 L
62.932 -9.787 60.464 -9.787 QT
60.464 -10.631 L
67.995 -10.631 L
69.354 -10.631 70.831 -10.146 QT
72.307 -9.662 73.307 -8.67 QT
74.307 -7.678 74.307 -6.287 QT
74.307 -5.287 73.706 -4.49 QT
73.104 -3.693 72.159 -3.162 QT
71.214 -2.631 70.229 -2.396 QT
71.307 -2.021 72.112 -1.201 QT
72.917 -0.381 73.089 0.666 QT
73.432 2.807 L
73.667 4.244 73.925 4.955 QT
74.182 5.666 75.057 5.666 QT
75.807 5.666 76.175 4.971 QT
76.542 4.276 76.542 3.447 QT
76.542 3.369 76.62 3.307 QT
76.698 3.244 76.776 3.244 QT
76.995 3.244 L
77.229 3.244 77.229 3.557 QT
77.229 4.213 76.971 4.838 QT
76.714 5.463 76.229 5.877 QT
75.745 6.291 75.073 6.291 QT
73.339 6.291 72.096 5.424 QT
70.854 4.557 70.854 2.901 QT
70.854 0.76 L
70.854 -0.428 70.018 -1.287 QT
69.182 -2.146 67.979 -2.146 QT
65.089 -2.146 L
65.089 4.151 L
65.089 4.916 67.573 4.916 QT
67.573 5.76 L
60.464 5.76 L
cp
65.089 -2.756 M
67.667 -2.756 L
69.651 -2.756 70.698 -3.56 QT
71.745 -4.365 71.745 -6.287 QT
71.745 -8.193 70.714 -8.99 QT
69.682 -9.787 67.667 -9.787 QT
66.307 -9.787 L
65.885 -9.787 65.643 -9.756 QT
65.401 -9.724 65.245 -9.553 QT
65.089 -9.381 65.089 -9.037 QT
65.089 -2.756 L
cp}def
f1344707165
f
GR
GS
[0.75 0 0 0.75 0 0] CT
0 0.447 0.741 RC
1 LJ
1.333 LW
N
665.991 63.328 M
705.898 63.328 L
S
GR
GS
[0.75 0 0 0.75 531.66866 69.375] CT
N
/f-2015056922{0.797 5.76 M
0.797 4.916 L
3.266 4.916 3.266 4.151 QT
3.266 -9.037 L
3.266 -9.787 0.797 -9.787 QT
0.797 -10.631 L
9.641 -10.631 L
11.281 -10.631 12.641 -9.928 QT
14 -9.224 14.961 -8.037 QT
15.922 -6.849 16.445 -5.349 QT
16.969 -3.849 16.969 -2.287 QT
16.969 -0.756 16.445 0.682 QT
15.922 2.119 14.93 3.268 QT
13.938 4.416 12.586 5.088 QT
11.234 5.76 9.641 5.76 QT
0.797 5.76 L
cp
5.422 4.151 M
5.422 4.666 5.719 4.791 QT
6.016 4.916 6.641 4.916 QT
9.031 4.916 L
10.25 4.916 11.359 4.385 QT
12.469 3.854 13.203 2.901 QT
13.953 1.885 14.211 0.643 QT
14.469 -0.599 14.469 -2.287 QT
14.469 -4.021 14.211 -5.334 QT
13.953 -6.646 13.203 -7.678 QT
12.484 -8.709 11.383 -9.248 QT
10.281 -9.787 9.031 -9.787 QT
6.641 -9.787 L
6.219 -9.787 5.977 -9.756 QT
5.734 -9.724 5.578 -9.553 QT
5.422 -9.381 5.422 -9.037 QT
5.422 4.151 L
cp}def
f-2015056922
f
GR
GS
[0.75 0 0 0.75 531.66866 69.375] CT
N
/f1754494550{19.13 5.76 M
19.13 4.916 L
21.599 4.916 21.599 4.151 QT
21.599 -9.037 L
21.599 -9.787 19.13 -9.787 QT
19.13 -10.631 L
27.974 -10.631 L
29.615 -10.631 30.974 -9.928 QT
32.333 -9.224 33.294 -8.037 QT
34.255 -6.849 34.779 -5.349 QT
35.302 -3.849 35.302 -2.287 QT
35.302 -0.756 34.779 0.682 QT
34.255 2.119 33.263 3.268 QT
32.271 4.416 30.919 5.088 QT
29.568 5.76 27.974 5.76 QT
19.13 5.76 L
cp
23.755 4.151 M
23.755 4.666 24.052 4.791 QT
24.349 4.916 24.974 4.916 QT
27.365 4.916 L
28.583 4.916 29.693 4.385 QT
30.802 3.854 31.536 2.901 QT
32.286 1.885 32.544 0.643 QT
32.802 -0.599 32.802 -2.287 QT
32.802 -4.021 32.544 -5.334 QT
32.286 -6.646 31.536 -7.678 QT
30.818 -8.709 29.716 -9.248 QT
28.615 -9.787 27.365 -9.787 QT
24.974 -9.787 L
24.552 -9.787 24.31 -9.756 QT
24.068 -9.724 23.911 -9.553 QT
23.755 -9.381 23.755 -9.037 QT
23.755 4.151 L
cp}def
f1754494550
f
GR
GS
[0.75 0 0 0.75 531.66866 69.375] CT
N
/f1117690553{37.464 5.76 M
37.464 4.916 L
39.932 4.916 39.932 4.151 QT
39.932 -9.037 L
39.932 -9.787 37.464 -9.787 QT
37.464 -10.631 L
44.995 -10.631 L
46.354 -10.631 47.831 -10.146 QT
49.307 -9.662 50.307 -8.67 QT
51.307 -7.678 51.307 -6.287 QT
51.307 -5.287 50.706 -4.49 QT
50.104 -3.693 49.159 -3.162 QT
48.214 -2.631 47.229 -2.396 QT
48.307 -2.021 49.112 -1.201 QT
49.917 -0.381 50.089 0.666 QT
50.432 2.807 L
50.667 4.244 50.925 4.955 QT
51.182 5.666 52.057 5.666 QT
52.807 5.666 53.175 4.971 QT
53.542 4.276 53.542 3.447 QT
53.542 3.369 53.62 3.307 QT
53.698 3.244 53.776 3.244 QT
53.995 3.244 L
54.229 3.244 54.229 3.557 QT
54.229 4.213 53.971 4.838 QT
53.714 5.463 53.229 5.877 QT
52.745 6.291 52.073 6.291 QT
50.339 6.291 49.096 5.424 QT
47.854 4.557 47.854 2.901 QT
47.854 0.76 L
47.854 -0.428 47.018 -1.287 QT
46.182 -2.146 44.979 -2.146 QT
42.089 -2.146 L
42.089 4.151 L
42.089 4.916 44.573 4.916 QT
44.573 5.76 L
37.464 5.76 L
cp
42.089 -2.756 M
44.667 -2.756 L
46.651 -2.756 47.698 -3.56 QT
48.745 -4.365 48.745 -6.287 QT
48.745 -8.193 47.714 -8.99 QT
46.682 -9.787 44.667 -9.787 QT
43.307 -9.787 L
42.885 -9.787 42.643 -9.756 QT
42.401 -9.724 42.245 -9.553 QT
42.089 -9.381 42.089 -9.037 QT
42.089 -2.756 L
cp}def
f1117690553
f
GR
GS
[0.75 0 0 0.75 0 0] CT
0.851 0.325 0.098 RC
1 LJ
1.333 LW
N
665.991 92.5 M
705.898 92.5 L
S
GR
GS
[0.75 0 0 0.75 531.66866 91.25383] CT
N
/f967503587{4.063 5.76 M
4.063 4.916 L
5.266 4.916 6.398 4.783 QT
7.531 4.651 7.531 4.151 QT
7.531 -9.037 L
7.531 -9.553 7.25 -9.67 QT
6.969 -9.787 6.313 -9.787 QT
5.313 -9.787 L
3.328 -9.787 2.5 -8.928 QT
2.063 -8.49 1.875 -7.537 QT
1.688 -6.584 1.563 -5.146 QT
0.875 -5.146 L
1.328 -10.631 L
15.984 -10.631 L
16.438 -5.146 L
15.734 -5.146 L
15.594 -6.693 15.43 -7.599 QT
15.266 -8.506 14.813 -8.928 QT
13.969 -9.787 12 -9.787 QT
11 -9.787 L
10.563 -9.787 10.32 -9.756 QT
10.078 -9.724 9.93 -9.553 QT
9.781 -9.381 9.781 -9.037 QT
9.781 4.151 L
9.781 4.651 10.914 4.783 QT
12.047 4.916 13.25 4.916 QT
13.25 5.76 L
4.063 5.76 L
cp}def
f967503587
f
GR
GS
[0.75 0 0 0.75 531.66866 91.25383] CT
N
/f209351859{15.958 5.76 M
15.958 4.916 L
16.771 4.916 17.302 4.783 QT
17.833 4.651 17.833 4.151 QT
17.833 -2.396 L
17.833 -3.037 17.638 -3.326 QT
17.443 -3.615 17.083 -3.678 QT
16.724 -3.74 15.958 -3.74 QT
15.958 -4.584 L
19.396 -4.849 L
19.396 -2.506 L
19.771 -3.553 20.49 -4.201 QT
21.208 -4.849 22.224 -4.849 QT
22.943 -4.849 23.505 -4.428 QT
24.068 -4.006 24.068 -3.318 QT
24.068 -2.881 23.755 -2.56 QT
23.443 -2.24 22.99 -2.24 QT
22.536 -2.24 22.224 -2.553 QT
21.911 -2.865 21.911 -3.318 QT
21.911 -3.959 22.365 -4.224 QT
22.224 -4.224 L
21.255 -4.224 20.638 -3.521 QT
20.021 -2.818 19.763 -1.779 QT
19.505 -0.74 19.505 0.213 QT
19.505 4.151 L
19.505 4.916 21.833 4.916 QT
21.833 5.76 L
15.958 5.76 L
cp}def
f209351859
f
GR
GS
[0.75 0 0 0.75 531.66866 91.25383] CT
N
/f-278272143{27.327 2.901 M
27.327 -2.396 L
27.327 -3.037 27.132 -3.326 QT
26.936 -3.615 26.577 -3.678 QT
26.218 -3.74 25.452 -3.74 QT
25.452 -4.584 L
29.077 -4.849 L
29.077 2.901 L
29.077 3.838 29.218 4.361 QT
29.358 4.885 29.796 5.143 QT
30.233 5.401 31.186 5.401 QT
32.483 5.401 33.241 4.322 QT
33.999 3.244 33.999 1.869 QT
33.999 -2.396 L
33.999 -3.037 33.804 -3.326 QT
33.608 -3.615 33.249 -3.678 QT
32.89 -3.74 32.124 -3.74 QT
32.124 -4.584 L
35.749 -4.849 L
35.749 3.572 L
35.749 4.213 35.944 4.502 QT
36.14 4.791 36.499 4.854 QT
36.858 4.916 37.624 4.916 QT
37.624 5.76 L
34.077 6.026 L
34.077 3.994 L
33.624 4.901 32.827 5.463 QT
32.03 6.026 31.077 6.026 QT
29.358 6.026 28.343 5.291 QT
27.327 4.557 27.327 2.901 QT
cp}def
f-278272143
f
GR
GS
[0.75 0 0 0.75 531.66866 91.25383] CT
N
/f26345290{44.051 6.026 M
42.582 6.026 41.356 5.26 QT
40.129 4.494 39.434 3.213 QT
38.739 1.932 38.739 0.494 QT
38.739 -0.912 39.379 -2.178 QT
40.02 -3.443 41.16 -4.224 QT
42.301 -5.006 43.707 -5.006 QT
44.801 -5.006 45.621 -4.631 QT
46.442 -4.256 46.965 -3.599 QT
47.489 -2.943 47.762 -2.053 QT
48.035 -1.162 48.035 -0.099 QT
48.035 0.213 47.785 0.213 QT
40.832 0.213 L
40.832 0.479 L
40.832 2.463 41.637 3.893 QT
42.442 5.322 44.254 5.322 QT
44.989 5.322 45.621 4.994 QT
46.254 4.666 46.715 4.08 QT
47.176 3.494 47.332 2.822 QT
47.364 2.744 47.426 2.682 QT
47.489 2.619 47.567 2.619 QT
47.785 2.619 L
48.035 2.619 48.035 2.916 QT
47.692 4.276 46.567 5.151 QT
45.442 6.026 44.051 6.026 QT
cp
40.864 -0.381 M
46.332 -0.381 L
46.332 -1.287 46.082 -2.209 QT
45.832 -3.131 45.246 -3.748 QT
44.66 -4.365 43.707 -4.365 QT
42.348 -4.365 41.606 -3.092 QT
40.864 -1.818 40.864 -0.381 QT
cp}def
f26345290
f
GR
GS
[0.75 0 0 0.75 531.66866 91.25383] CT
N
/f498535724{57.53 5.76 M
57.53 4.916 L
59.999 4.916 59.999 4.151 QT
59.999 -9.037 L
59.999 -9.787 57.53 -9.787 QT
57.53 -10.631 L
65.061 -10.631 L
66.421 -10.631 67.897 -10.146 QT
69.374 -9.662 70.374 -8.67 QT
71.374 -7.678 71.374 -6.287 QT
71.374 -5.287 70.772 -4.49 QT
70.171 -3.693 69.226 -3.162 QT
68.28 -2.631 67.296 -2.396 QT
68.374 -2.021 69.179 -1.201 QT
69.983 -0.381 70.155 0.666 QT
70.499 2.807 L
70.733 4.244 70.991 4.955 QT
71.249 5.666 72.124 5.666 QT
72.874 5.666 73.241 4.971 QT
73.608 4.276 73.608 3.447 QT
73.608 3.369 73.686 3.307 QT
73.765 3.244 73.843 3.244 QT
74.061 3.244 L
74.296 3.244 74.296 3.557 QT
74.296 4.213 74.038 4.838 QT
73.78 5.463 73.296 5.877 QT
72.811 6.291 72.14 6.291 QT
70.405 6.291 69.163 5.424 QT
67.921 4.557 67.921 2.901 QT
67.921 0.76 L
67.921 -0.428 67.085 -1.287 QT
66.249 -2.146 65.046 -2.146 QT
62.155 -2.146 L
62.155 4.151 L
62.155 4.916 64.64 4.916 QT
64.64 5.76 L
57.53 5.76 L
cp
62.155 -2.756 M
64.733 -2.756 L
66.718 -2.756 67.765 -3.56 QT
68.811 -4.365 68.811 -6.287 QT
68.811 -8.193 67.78 -8.99 QT
66.749 -9.787 64.733 -9.787 QT
63.374 -9.787 L
62.952 -9.787 62.71 -9.756 QT
62.468 -9.724 62.311 -9.553 QT
62.155 -9.381 62.155 -9.037 QT
62.155 -2.756 L
cp}def
f498535724
f
GR
GS
[0.75 0 0 0.75 531.66866 91.25383] CT
N
/f-1932780751{75.369 3.401 M
75.369 1.979 76.494 1.08 QT
77.619 0.182 79.189 -0.185 QT
80.759 -0.553 82.181 -0.553 QT
82.181 -1.537 L
82.181 -2.24 81.877 -2.889 QT
81.572 -3.537 81.002 -3.951 QT
80.431 -4.365 79.728 -4.365 QT
78.134 -4.365 77.306 -3.646 QT
77.759 -3.646 78.064 -3.303 QT
78.369 -2.959 78.369 -2.506 QT
78.369 -2.021 78.025 -1.685 QT
77.681 -1.349 77.213 -1.349 QT
76.728 -1.349 76.392 -1.685 QT
76.056 -2.021 76.056 -2.506 QT
76.056 -3.771 77.205 -4.389 QT
78.353 -5.006 79.728 -5.006 QT
80.713 -5.006 81.697 -4.584 QT
82.681 -4.162 83.306 -3.389 QT
83.931 -2.615 83.931 -1.584 QT
83.931 3.807 L
83.931 4.276 84.127 4.674 QT
84.322 5.072 84.744 5.072 QT
85.15 5.072 85.345 4.674 QT
85.541 4.276 85.541 3.807 QT
85.541 2.276 L
86.244 2.276 L
86.244 3.807 L
86.244 4.354 85.963 4.838 QT
85.681 5.322 85.205 5.611 QT
84.728 5.901 84.181 5.901 QT
83.478 5.901 82.963 5.354 QT
82.447 4.807 82.4 4.057 QT
81.947 4.963 81.08 5.494 QT
80.213 6.026 79.228 6.026 QT
78.322 6.026 77.431 5.76 QT
76.541 5.494 75.955 4.908 QT
75.369 4.322 75.369 3.401 QT
cp
77.306 3.401 M
77.306 4.244 77.931 4.822 QT
78.556 5.401 79.4 5.401 QT
80.166 5.401 80.798 5.01 QT
81.431 4.619 81.806 3.955 QT
82.181 3.291 82.181 2.541 QT
82.181 0.057 L
81.088 0.057 79.947 0.408 QT
78.806 0.76 78.056 1.526 QT
77.306 2.291 77.306 3.401 QT
cp}def
f-1932780751
f
GR
GS
[0.75 0 0 0.75 531.66866 91.25383] CT
N
/f97849676{87.119 5.76 M
87.119 4.916 L
87.931 4.916 88.463 4.783 QT
88.994 4.651 88.994 4.151 QT
88.994 -2.396 L
88.994 -3.037 88.799 -3.326 QT
88.603 -3.615 88.244 -3.678 QT
87.884 -3.74 87.119 -3.74 QT
87.119 -4.584 L
90.603 -4.849 L
90.603 -2.506 L
91.072 -3.537 92.017 -4.193 QT
92.963 -4.849 94.072 -4.849 QT
95.744 -4.849 96.58 -4.053 QT
97.416 -3.256 97.416 -1.615 QT
97.416 4.151 L
97.416 4.651 97.947 4.783 QT
98.478 4.916 99.291 4.916 QT
99.291 5.76 L
93.791 5.76 L
93.791 4.916 L
94.619 4.916 95.142 4.783 QT
95.666 4.651 95.666 4.151 QT
95.666 -1.537 L
95.666 -2.709 95.33 -3.467 QT
94.994 -4.224 93.931 -4.224 QT
92.541 -4.224 91.642 -3.115 QT
90.744 -2.006 90.744 -0.584 QT
90.744 4.151 L
90.744 4.651 91.275 4.783 QT
91.806 4.916 92.619 4.916 QT
92.619 5.76 L
87.119 5.76 L
cp}def
f97849676
f
GR
GS
[0.75 0 0 0.75 531.66866 91.25383] CT
N
/f-1291573309{100.405 7.635 M
100.405 6.776 101.023 6.135 QT
101.64 5.494 102.499 5.229 QT
102.015 4.869 101.765 4.315 QT
101.515 3.76 101.515 3.151 QT
101.515 2.026 102.233 1.151 QT
101.124 0.072 101.124 -1.318 QT
101.124 -2.068 101.452 -2.724 QT
101.78 -3.381 102.351 -3.865 QT
102.921 -4.349 103.624 -4.599 QT
104.327 -4.849 105.062 -4.849 QT
106.499 -4.849 107.64 -4.021 QT
108.124 -4.537 108.796 -4.826 QT
109.468 -5.115 110.202 -5.115 QT
110.718 -5.115 111.046 -4.748 QT
111.374 -4.381 111.374 -3.865 QT
111.374 -3.568 111.148 -3.349 QT
110.921 -3.131 110.64 -3.131 QT
110.327 -3.131 110.108 -3.349 QT
109.89 -3.568 109.89 -3.865 QT
109.89 -4.303 110.171 -4.49 QT
108.937 -4.49 108.046 -3.631 QT
108.483 -3.193 108.741 -2.568 QT
108.999 -1.943 108.999 -1.318 QT
108.999 -0.303 108.437 0.51 QT
107.874 1.322 106.96 1.776 QT
106.046 2.229 105.062 2.229 QT
103.749 2.229 102.671 1.51 QT
102.327 1.979 102.327 2.572 QT
102.327 3.197 102.741 3.674 QT
103.155 4.151 103.796 4.151 QT
105.765 4.151 L
107.187 4.151 108.335 4.408 QT
109.483 4.666 110.265 5.44 QT
111.046 6.213 111.046 7.635 QT
111.046 8.697 110.155 9.393 QT
109.265 10.088 108.03 10.401 QT
106.796 10.713 105.733 10.713 QT
104.671 10.713 103.429 10.401 QT
102.187 10.088 101.296 9.393 QT
100.405 8.697 100.405 7.635 QT
cp
101.749 7.635 M
101.749 8.447 102.405 8.994 QT
103.062 9.541 103.991 9.799 QT
104.921 10.057 105.733 10.057 QT
106.546 10.057 107.468 9.799 QT
108.39 9.541 109.046 8.994 QT
109.702 8.447 109.702 7.635 QT
109.702 6.385 108.554 6.01 QT
107.405 5.635 105.765 5.635 QT
103.796 5.635 L
103.233 5.635 102.773 5.901 QT
102.312 6.166 102.03 6.643 QT
101.749 7.119 101.749 7.635 QT
cp
105.062 1.588 M
107.108 1.588 107.108 -1.318 QT
107.108 -2.568 106.671 -3.389 QT
106.233 -4.209 105.062 -4.209 QT
103.89 -4.209 103.46 -3.389 QT
103.03 -2.568 103.03 -1.318 QT
103.03 -0.521 103.194 0.119 QT
103.358 0.76 103.804 1.174 QT
104.249 1.588 105.062 1.588 QT
cp}def
f-1291573309
f
GR
GS
[0.75 0 0 0.75 531.66866 91.25383] CT
N
/f-38918081{117.718 6.026 M
116.249 6.026 115.023 5.26 QT
113.796 4.494 113.101 3.213 QT
112.405 1.932 112.405 0.494 QT
112.405 -0.912 113.046 -2.178 QT
113.687 -3.443 114.827 -4.224 QT
115.968 -5.006 117.374 -5.006 QT
118.468 -5.006 119.288 -4.631 QT
120.108 -4.256 120.632 -3.599 QT
121.155 -2.943 121.429 -2.053 QT
121.702 -1.162 121.702 -0.099 QT
121.702 0.213 121.452 0.213 QT
114.499 0.213 L
114.499 0.479 L
114.499 2.463 115.304 3.893 QT
116.108 5.322 117.921 5.322 QT
118.655 5.322 119.288 4.994 QT
119.921 4.666 120.382 4.08 QT
120.843 3.494 120.999 2.822 QT
121.03 2.744 121.093 2.682 QT
121.155 2.619 121.233 2.619 QT
121.452 2.619 L
121.702 2.619 121.702 2.916 QT
121.358 4.276 120.233 5.151 QT
119.108 6.026 117.718 6.026 QT
cp
114.53 -0.381 M
119.999 -0.381 L
119.999 -1.287 119.749 -2.209 QT
119.499 -3.131 118.913 -3.748 QT
118.327 -4.365 117.374 -4.365 QT
116.015 -4.365 115.273 -3.092 QT
114.53 -1.818 114.53 -0.381 QT
cp}def
f-38918081
f
GR
GS
[0.75 0 0 0.75 0 0] CT
0.467 0.675 0.188 RC
1 LJ
1.333 LW
N
665.991 121.672 M
705.898 121.672 L
S
GR
GS
[0.75 0 0 0.75 0 0] CT
1 GC
10.0 ML
1.333 LW
N
662 138 M
662 47 L
835 47 L
835 138 L
cp
S
GR
%%Trailer
%%Pages: 1
%%EOF
