%!PS-Adobe-3.0 EPSF-3.0
%%Creator: (MATLAB, The Mathworks, Inc. Version 9.2.0.556344 \(R2017a\). Operating System: Windows 8)
%%Title: (C:/Users/Alex/Documents/PhD Docs/Conferences/2018_04_PLANS/Final Review Alex/fig/Simu00_ranking_042018_bigText_new.eps)
%%CreationDate: 2018-04-24T15:49:05
%%Pages: (atend)
%%BoundingBox: 0 0 652 497
%%LanguageLevel: 3
%%EndComments
%%BeginProlog
%%BeginResource: procset (Apache XML Graphics Std ProcSet) 1.2 0
%%Version: 1.2 0
%%Copyright: (Copyright 2001-2003,2010 The Apache Software Foundation. License terms: http://www.apache.org/licenses/LICENSE-2.0)
/bd{bind def}bind def
/ld{load def}bd
/GR/grestore ld
/M/moveto ld
/LJ/setlinejoin ld
/C/curveto ld
/f/fill ld
/LW/setlinewidth ld
/GC/setgray ld
/t/show ld
/N/newpath ld
/CT/concat ld
/cp/closepath ld
/S/stroke ld
/L/lineto ld
/CC/setcmykcolor ld
/A/ashow ld
/GS/gsave ld
/RC/setrgbcolor ld
/RM/rmoveto ld
/ML/setmiterlimit ld
/re {4 2 roll M
1 index 0 rlineto
0 exch rlineto
neg 0 rlineto
cp } bd
/_ctm matrix def
/_tm matrix def
/BT { _ctm currentmatrix pop matrix _tm copy pop 0 0 moveto } bd
/ET { _ctm setmatrix } bd
/iTm { _ctm setmatrix _tm concat } bd
/Tm { _tm astore pop iTm 0 0 moveto } bd
/ux 0.0 def
/uy 0.0 def
/F {
  /Tp exch def
  /Tf exch def
  Tf findfont Tp scalefont setfont
  /cf Tf def  /cs Tp def
} bd
/ULS {currentpoint /uy exch def /ux exch def} bd
/ULE {
  /Tcx currentpoint pop def
  gsave
  newpath
  cf findfont cs scalefont dup
  /FontMatrix get 0 get /Ts exch def /FontInfo get dup
  /UnderlinePosition get Ts mul /To exch def
  /UnderlineThickness get Ts mul /Tt exch def
  ux uy To add moveto  Tcx uy To add lineto
  Tt setlinewidth stroke
  grestore
} bd
/OLE {
  /Tcx currentpoint pop def
  gsave
  newpath
  cf findfont cs scalefont dup
  /FontMatrix get 0 get /Ts exch def /FontInfo get dup
  /UnderlinePosition get Ts mul /To exch def
  /UnderlineThickness get Ts mul /Tt exch def
  ux uy To add cs add moveto Tcx uy To add cs add lineto
  Tt setlinewidth stroke
  grestore
} bd
/SOE {
  /Tcx currentpoint pop def
  gsave
  newpath
  cf findfont cs scalefont dup
  /FontMatrix get 0 get /Ts exch def /FontInfo get dup
  /UnderlinePosition get Ts mul /To exch def
  /UnderlineThickness get Ts mul /Tt exch def
  ux uy To add cs 10 mul 26 idiv add moveto Tcx uy To add cs 10 mul 26 idiv add lineto
  Tt setlinewidth stroke
  grestore
} bd
/QT {
/Y22 exch store
/X22 exch store
/Y21 exch store
/X21 exch store
currentpoint
/Y21 load 2 mul add 3 div exch
/X21 load 2 mul add 3 div exch
/X21 load 2 mul /X22 load add 3 div
/Y21 load 2 mul /Y22 load add 3 div
/X22 load /Y22 load curveto
} bd
/SSPD {
dup length /d exch dict def
{
/v exch def
/k exch def
currentpagedevice k known {
/cpdv currentpagedevice k get def
v cpdv ne {
/upd false def
/nullv v type /nulltype eq def
/nullcpdv cpdv type /nulltype eq def
nullv nullcpdv or
{
/upd true def
} {
/sametype v type cpdv type eq def
sametype {
v type /arraytype eq {
/vlen v length def
/cpdvlen cpdv length def
vlen cpdvlen eq {
0 1 vlen 1 sub {
/i exch def
/obj v i get def
/cpdobj cpdv i get def
obj cpdobj ne {
/upd true def
exit
} if
} for
} {
/upd true def
} ifelse
} {
v type /dicttype eq {
v {
/dv exch def
/dk exch def
/cpddv cpdv dk get def
dv cpddv ne {
/upd true def
exit
} if
} forall
} {
/upd true def
} ifelse
} ifelse
} if
} ifelse
upd true eq {
d k v put
} if
} if
} if
} forall
d length 0 gt {
d setpagedevice
} if
} bd
/RE { % /NewFontName [NewEncodingArray] /FontName RE -
  findfont dup length dict begin
  {
    1 index /FID ne
    {def} {pop pop} ifelse
  } forall
  /Encoding exch def
  /FontName 1 index def
  currentdict definefont pop
  end
} bind def
%%EndResource
%%BeginResource: procset (Apache XML Graphics EPS ProcSet) 1.0 0
%%Version: 1.0 0
%%Copyright: (Copyright 2002-2003 The Apache Software Foundation. License terms: http://www.apache.org/licenses/LICENSE-2.0)
/BeginEPSF { %def
/b4_Inc_state save def         % Save state for cleanup
/dict_count countdictstack def % Count objects on dict stack
/op_count count 1 sub def      % Count objects on operand stack
userdict begin                 % Push userdict on dict stack
/showpage { } def              % Redefine showpage, { } = null proc
0 setgray 0 setlinecap         % Prepare graphics state
1 setlinewidth 0 setlinejoin
10 setmiterlimit [ ] 0 setdash newpath
/languagelevel where           % If level not equal to 1 then
{pop languagelevel             % set strokeadjust and
1 ne                           % overprint to their defaults.
{false setstrokeadjust false setoverprint
} if
} if
} bd
/EndEPSF { %def
count op_count sub {pop} repeat            % Clean up stacks
countdictstack dict_count sub {end} repeat
b4_Inc_state restore
} bd
%%EndResource
%FOPBeginFontDict
%%IncludeResource: font Courier-Bold
%%IncludeResource: font Helvetica
%%IncludeResource: font Courier-BoldOblique
%%IncludeResource: font Courier-Oblique
%%IncludeResource: font Times-Roman
%%IncludeResource: font Helvetica-BoldOblique
%%IncludeResource: font Helvetica-Bold
%%IncludeResource: font Helvetica-Oblique
%%IncludeResource: font Times-BoldItalic
%%IncludeResource: font Courier
%%IncludeResource: font Times-Italic
%%IncludeResource: font Times-Bold
%%IncludeResource: font Symbol
%%IncludeResource: font ZapfDingbats
%FOPEndFontDict
%%BeginResource: encoding WinAnsiEncoding
/WinAnsiEncoding [
/.notdef /.notdef /.notdef /.notdef /.notdef
/.notdef /.notdef /.notdef /.notdef /.notdef
/.notdef /.notdef /.notdef /.notdef /.notdef
/.notdef /.notdef /.notdef /.notdef /.notdef
/.notdef /.notdef /.notdef /.notdef /.notdef
/.notdef /.notdef /.notdef /.notdef /.notdef
/.notdef /.notdef /space /exclam /quotedbl
/numbersign /dollar /percent /ampersand /quotesingle
/parenleft /parenright /asterisk /plus /comma
/hyphen /period /slash /zero /one
/two /three /four /five /six
/seven /eight /nine /colon /semicolon
/less /equal /greater /question /at
/A /B /C /D /E
/F /G /H /I /J
/K /L /M /N /O
/P /Q /R /S /T
/U /V /W /X /Y
/Z /bracketleft /backslash /bracketright /asciicircum
/underscore /quoteleft /a /b /c
/d /e /f /g /h
/i /j /k /l /m
/n /o /p /q /r
/s /t /u /v /w
/x /y /z /braceleft /bar
/braceright /asciitilde /bullet /Euro /bullet
/quotesinglbase /florin /quotedblbase /ellipsis /dagger
/daggerdbl /circumflex /perthousand /Scaron /guilsinglleft
/OE /bullet /Zcaron /bullet /bullet
/quoteleft /quoteright /quotedblleft /quotedblright /bullet
/endash /emdash /asciitilde /trademark /scaron
/guilsinglright /oe /bullet /zcaron /Ydieresis
/space /exclamdown /cent /sterling /currency
/yen /brokenbar /section /dieresis /copyright
/ordfeminine /guillemotleft /logicalnot /sfthyphen /registered
/macron /degree /plusminus /twosuperior /threesuperior
/acute /mu /paragraph /middot /cedilla
/onesuperior /ordmasculine /guillemotright /onequarter /onehalf
/threequarters /questiondown /Agrave /Aacute /Acircumflex
/Atilde /Adieresis /Aring /AE /Ccedilla
/Egrave /Eacute /Ecircumflex /Edieresis /Igrave
/Iacute /Icircumflex /Idieresis /Eth /Ntilde
/Ograve /Oacute /Ocircumflex /Otilde /Odieresis
/multiply /Oslash /Ugrave /Uacute /Ucircumflex
/Udieresis /Yacute /Thorn /germandbls /agrave
/aacute /acircumflex /atilde /adieresis /aring
/ae /ccedilla /egrave /eacute /ecircumflex
/edieresis /igrave /iacute /icircumflex /idieresis
/eth /ntilde /ograve /oacute /ocircumflex
/otilde /odieresis /divide /oslash /ugrave
/uacute /ucircumflex /udieresis /yacute /thorn
/ydieresis
] def
%%EndResource
%FOPBeginFontReencode
/Courier-Bold findfont
dup length dict begin
  {1 index /FID ne {def} {pop pop} ifelse} forall
  /Encoding WinAnsiEncoding def
  currentdict
end
/Courier-Bold exch definefont pop
/Helvetica findfont
dup length dict begin
  {1 index /FID ne {def} {pop pop} ifelse} forall
  /Encoding WinAnsiEncoding def
  currentdict
end
/Helvetica exch definefont pop
/Courier-BoldOblique findfont
dup length dict begin
  {1 index /FID ne {def} {pop pop} ifelse} forall
  /Encoding WinAnsiEncoding def
  currentdict
end
/Courier-BoldOblique exch definefont pop
/Courier-Oblique findfont
dup length dict begin
  {1 index /FID ne {def} {pop pop} ifelse} forall
  /Encoding WinAnsiEncoding def
  currentdict
end
/Courier-Oblique exch definefont pop
/Times-Roman findfont
dup length dict begin
  {1 index /FID ne {def} {pop pop} ifelse} forall
  /Encoding WinAnsiEncoding def
  currentdict
end
/Times-Roman exch definefont pop
/Helvetica-BoldOblique findfont
dup length dict begin
  {1 index /FID ne {def} {pop pop} ifelse} forall
  /Encoding WinAnsiEncoding def
  currentdict
end
/Helvetica-BoldOblique exch definefont pop
/Helvetica-Bold findfont
dup length dict begin
  {1 index /FID ne {def} {pop pop} ifelse} forall
  /Encoding WinAnsiEncoding def
  currentdict
end
/Helvetica-Bold exch definefont pop
/Helvetica-Oblique findfont
dup length dict begin
  {1 index /FID ne {def} {pop pop} ifelse} forall
  /Encoding WinAnsiEncoding def
  currentdict
end
/Helvetica-Oblique exch definefont pop
/Times-BoldItalic findfont
dup length dict begin
  {1 index /FID ne {def} {pop pop} ifelse} forall
  /Encoding WinAnsiEncoding def
  currentdict
end
/Times-BoldItalic exch definefont pop
/Courier findfont
dup length dict begin
  {1 index /FID ne {def} {pop pop} ifelse} forall
  /Encoding WinAnsiEncoding def
  currentdict
end
/Courier exch definefont pop
/Times-Italic findfont
dup length dict begin
  {1 index /FID ne {def} {pop pop} ifelse} forall
  /Encoding WinAnsiEncoding def
  currentdict
end
/Times-Italic exch definefont pop
/Times-Bold findfont
dup length dict begin
  {1 index /FID ne {def} {pop pop} ifelse} forall
  /Encoding WinAnsiEncoding def
  currentdict
end
/Times-Bold exch definefont pop
%FOPEndFontReencode
%%EndProlog
%%Page: 1 1
%%PageBoundingBox: 0 0 652 497
%%BeginPageSetup
[1 0 0 -1 0 497] CT
%%EndPageSetup
GS
[0.75 0 0 0.75 0 0.5] CT
1 GC
N
0 0 869 662 re
f
GR
GS
[0.75 0 0 0.75 0 0.5] CT
1 GC
N
0 0 869 662 re
f
GR
GS
[0.75 0 0 0.75 0 0.5] CT
1 GC
N
113 589 M
786 589 L
786 50 L
113 50 L
cp
f
GR
GS
[0.75 0 0 0.75 0 0.5] CT
0.873 GC
1 LJ
0.667 LW
N
113 589 M
113 50 L
S
GR
GS
[0.75 0 0 0.75 0 0.5] CT
0.873 GC
1 LJ
0.667 LW
N
197.125 589 M
197.125 50 L
S
GR
GS
[0.75 0 0 0.75 0 0.5] CT
0.873 GC
1 LJ
0.667 LW
N
281.25 589 M
281.25 50 L
S
GR
GS
[0.75 0 0 0.75 0 0.5] CT
0.873 GC
1 LJ
0.667 LW
N
365.375 589 M
365.375 50 L
S
GR
GS
[0.75 0 0 0.75 0 0.5] CT
0.873 GC
1 LJ
0.667 LW
N
449.5 589 M
449.5 50 L
S
GR
GS
[0.75 0 0 0.75 0 0.5] CT
0.873 GC
1 LJ
0.667 LW
N
533.625 589 M
533.625 50 L
S
GR
GS
[0.75 0 0 0.75 0 0.5] CT
0.873 GC
1 LJ
0.667 LW
N
617.75 589 M
617.75 50 L
S
GR
GS
[0.75 0 0 0.75 0 0.5] CT
0.873 GC
1 LJ
0.667 LW
N
701.875 589 M
701.875 50 L
S
GR
GS
[0.75 0 0 0.75 0 0.5] CT
0.873 GC
1 LJ
0.667 LW
N
786 589 M
786 50 L
S
GR
GS
[0.75 0 0 0.75 0 0.5] CT
0.873 GC
1 LJ
0.667 LW
N
786 589 M
113 589 L
S
GR
GS
[0.75 0 0 0.75 0 0.5] CT
0.873 GC
1 LJ
0.667 LW
N
786 481.2 M
113 481.2 L
S
GR
GS
[0.75 0 0 0.75 0 0.5] CT
0.873 GC
1 LJ
0.667 LW
N
786 373.4 M
113 373.4 L
S
GR
GS
[0.75 0 0 0.75 0 0.5] CT
0.873 GC
1 LJ
0.667 LW
N
786 265.6 M
113 265.6 L
S
GR
GS
[0.75 0 0 0.75 0 0.5] CT
0.873 GC
1 LJ
0.667 LW
N
786 157.8 M
113 157.8 L
S
GR
GS
[0.75 0 0 0.75 0 0.5] CT
0.873 GC
1 LJ
0.667 LW
N
786 50 M
113 50 L
S
GR
GS
[0.75 0 0 0.75 0 0.5] CT
0.149 GC
1 LJ
0.667 LW
N
113 589 M
786 589 L
S
GR
GS
[0.75 0 0 0.75 0 0.5] CT
0.149 GC
1 LJ
0.667 LW
N
113 50 M
786 50 L
S
GR
GS
[0.75 0 0 0.75 0 0.5] CT
0.149 GC
2 setlinecap
1 LJ
0.667 LW
N
113 589 M
113 582.27 L
S
GR
GS
[0.75 0 0 0.75 0 0.5] CT
0.149 GC
2 setlinecap
1 LJ
0.667 LW
N
197.125 589 M
197.125 582.27 L
S
GR
GS
[0.75 0 0 0.75 0 0.5] CT
0.149 GC
2 setlinecap
1 LJ
0.667 LW
N
281.25 589 M
281.25 582.27 L
S
GR
GS
[0.75 0 0 0.75 0 0.5] CT
0.149 GC
2 setlinecap
1 LJ
0.667 LW
N
365.375 589 M
365.375 582.27 L
S
GR
GS
[0.75 0 0 0.75 0 0.5] CT
0.149 GC
2 setlinecap
1 LJ
0.667 LW
N
449.5 589 M
449.5 582.27 L
S
GR
GS
[0.75 0 0 0.75 0 0.5] CT
0.149 GC
2 setlinecap
1 LJ
0.667 LW
N
533.625 589 M
533.625 582.27 L
S
GR
GS
[0.75 0 0 0.75 0 0.5] CT
0.149 GC
2 setlinecap
1 LJ
0.667 LW
N
617.75 589 M
617.75 582.27 L
S
GR
GS
[0.75 0 0 0.75 0 0.5] CT
0.149 GC
2 setlinecap
1 LJ
0.667 LW
N
701.875 589 M
701.875 582.27 L
S
GR
GS
[0.75 0 0 0.75 0 0.5] CT
0.149 GC
2 setlinecap
1 LJ
0.667 LW
N
786 589 M
786 582.27 L
S
GR
GS
[0.75 0 0 0.75 0 0.5] CT
0.149 GC
2 setlinecap
1 LJ
0.667 LW
N
113 50 M
113 56.73 L
S
GR
GS
[0.75 0 0 0.75 0 0.5] CT
0.149 GC
2 setlinecap
1 LJ
0.667 LW
N
197.125 50 M
197.125 56.73 L
S
GR
GS
[0.75 0 0 0.75 0 0.5] CT
0.149 GC
2 setlinecap
1 LJ
0.667 LW
N
281.25 50 M
281.25 56.73 L
S
GR
GS
[0.75 0 0 0.75 0 0.5] CT
0.149 GC
2 setlinecap
1 LJ
0.667 LW
N
365.375 50 M
365.375 56.73 L
S
GR
GS
[0.75 0 0 0.75 0 0.5] CT
0.149 GC
2 setlinecap
1 LJ
0.667 LW
N
449.5 50 M
449.5 56.73 L
S
GR
GS
[0.75 0 0 0.75 0 0.5] CT
0.149 GC
2 setlinecap
1 LJ
0.667 LW
N
533.625 50 M
533.625 56.73 L
S
GR
GS
[0.75 0 0 0.75 0 0.5] CT
0.149 GC
2 setlinecap
1 LJ
0.667 LW
N
617.75 50 M
617.75 56.73 L
S
GR
GS
[0.75 0 0 0.75 0 0.5] CT
0.149 GC
2 setlinecap
1 LJ
0.667 LW
N
701.875 50 M
701.875 56.73 L
S
GR
GS
[0.75 0 0 0.75 0 0.5] CT
0.149 GC
2 setlinecap
1 LJ
0.667 LW
N
786 50 M
786 56.73 L
S
GR
GS
[0.75 0 0 0.75 84.75 447.05002] CT
0.149 GC
N
-2.854 14.211 M
-2.417 14.867 -1.667 15.18 QT
-0.917 15.492 -0.042 15.492 QT
1.052 15.492 1.521 14.555 QT
1.99 13.617 1.99 12.414 QT
1.99 11.883 1.888 11.344 QT
1.786 10.805 1.56 10.336 QT
1.333 9.867 0.927 9.594 QT
0.521 9.321 -0.057 9.321 QT
-1.323 9.321 L
-1.495 9.321 -1.495 9.133 QT
-1.495 8.977 L
-1.495 8.821 -1.323 8.821 QT
-0.276 8.742 L
0.396 8.742 0.833 8.242 QT
1.271 7.742 1.474 7.024 QT
1.677 6.305 1.677 5.649 QT
1.677 4.742 1.255 4.156 QT
0.833 3.571 -0.042 3.571 QT
-0.776 3.571 -1.432 3.844 QT
-2.089 4.117 -2.479 4.68 QT
-2.432 4.664 -2.409 4.664 QT
-2.385 4.664 -2.354 4.664 QT
-1.917 4.664 -1.628 4.961 QT
-1.339 5.258 -1.339 5.664 QT
-1.339 6.071 -1.628 6.367 QT
-1.917 6.664 -2.354 6.664 QT
-2.76 6.664 -3.057 6.367 QT
-3.354 6.071 -3.354 5.664 QT
-3.354 4.852 -2.862 4.25 QT
-2.37 3.649 -1.596 3.336 QT
-0.823 3.024 -0.042 3.024 QT
0.536 3.024 1.169 3.196 QT
1.802 3.367 2.326 3.688 QT
2.849 4.008 3.177 4.508 QT
3.505 5.008 3.505 5.649 QT
3.505 6.446 3.146 7.125 QT
2.786 7.805 2.169 8.297 QT
1.552 8.789 0.802 9.024 QT
1.63 9.18 2.372 9.649 QT
3.115 10.117 3.568 10.836 QT
4.021 11.555 4.021 12.399 QT
4.021 13.446 3.443 14.297 QT
2.865 15.149 1.927 15.625 QT
0.99 16.102 -0.042 16.102 QT
-0.932 16.102 -1.831 15.758 QT
-2.729 15.414 -3.299 14.742 QT
-3.87 14.071 -3.87 13.117 QT
-3.87 12.649 -3.557 12.328 QT
-3.245 12.008 -2.76 12.008 QT
-2.464 12.008 -2.206 12.156 QT
-1.948 12.305 -1.807 12.563 QT
-1.667 12.821 -1.667 13.117 QT
-1.667 13.586 -1.987 13.899 QT
-2.307 14.211 -2.76 14.211 QT
-2.854 14.211 L
cp
f
GR
GS
[0.75 0 0 0.75 147.84375 447.05002] CT
0.149 GC
N
-8.38 15.68 M
-8.38 15.164 L
-8.38 15.117 -8.349 15.071 QT
-5.396 11.805 L
-4.724 11.071 -4.31 10.586 QT
-3.896 10.102 -3.49 9.461 QT
-3.083 8.821 -2.849 8.156 QT
-2.615 7.492 -2.615 6.742 QT
-2.615 5.961 -2.896 5.25 QT
-3.177 4.539 -3.747 4.117 QT
-4.318 3.696 -5.13 3.696 QT
-5.958 3.696 -6.615 4.188 QT
-7.271 4.68 -7.536 5.477 QT
-7.474 5.461 -7.333 5.461 QT
-6.911 5.461 -6.607 5.742 QT
-6.302 6.024 -6.302 6.492 QT
-6.302 6.914 -6.607 7.219 QT
-6.911 7.524 -7.333 7.524 QT
-7.786 7.524 -8.083 7.211 QT
-8.38 6.899 -8.38 6.492 QT
-8.38 5.774 -8.115 5.149 QT
-7.849 4.524 -7.341 4.031 QT
-6.833 3.539 -6.201 3.281 QT
-5.568 3.024 -4.849 3.024 QT
-3.771 3.024 -2.833 3.485 QT
-1.896 3.946 -1.349 4.781 QT
-0.802 5.617 -0.802 6.742 QT
-0.802 7.571 -1.161 8.313 QT
-1.521 9.055 -2.083 9.664 QT
-2.646 10.274 -3.529 11.039 QT
-4.411 11.805 -4.693 12.071 QT
-6.849 14.133 L
-5.021 14.133 L
-3.677 14.133 -2.771 14.11 QT
-1.865 14.086 -1.802 14.039 QT
-1.583 13.805 -1.349 12.289 QT
-0.802 12.289 L
-1.333 15.68 L
-8.38 15.68 L
cp
f
GR
GS
[0.75 0 0 0.75 147.84375 447.05002] CT
0.149 GC
N
1.766 15.68 M
1.766 15.008 L
4.141 15.008 4.141 14.414 QT
4.141 4.43 L
3.156 4.914 1.656 4.914 QT
1.656 4.242 L
3.984 4.242 5.172 3.024 QT
5.438 3.024 L
5.5 3.024 5.563 3.078 QT
5.625 3.133 5.625 3.196 QT
5.625 14.414 L
5.625 15.008 8 15.008 QT
8 15.68 L
1.766 15.68 L
cp
f
GR
GS
[0.75 0 0 0.75 210.9375 447.05002] CT
0.149 GC
N
-1.37 15.196 M
-1.37 14.133 -1.182 13.117 QT
-0.995 12.102 -0.635 11.117 QT
-0.276 10.133 0.232 9.18 QT
0.74 8.227 1.333 7.399 QT
3.068 4.977 L
0.896 4.977 L
-2.479 4.977 -2.573 5.071 QT
-2.823 5.383 -3.057 6.836 QT
-3.604 6.836 L
-2.979 2.836 L
-2.417 2.836 L
-2.417 2.899 L
-2.417 3.242 -1.26 3.344 QT
-0.104 3.446 1.005 3.446 QT
4.552 3.446 L
4.552 3.93 L
4.552 3.946 4.544 3.961 QT
4.536 3.977 4.521 3.992 QT
1.911 7.664 L
0.943 9.086 0.701 10.836 QT
0.458 12.586 0.458 15.196 QT
0.458 15.555 0.193 15.828 QT
-0.073 16.102 -0.448 16.102 QT
-0.823 16.102 -1.096 15.828 QT
-1.37 15.555 -1.37 15.196 QT
cp
f
GR
GS
[0.75 0 0 0.75 274.03125 447.05002] CT
0.149 GC
N
-7.568 15.68 M
-7.568 15.008 L
-5.193 15.008 -5.193 14.414 QT
-5.193 4.43 L
-6.177 4.914 -7.677 4.914 QT
-7.677 4.242 L
-5.349 4.242 -4.161 3.024 QT
-3.896 3.024 L
-3.833 3.024 -3.771 3.078 QT
-3.708 3.133 -3.708 3.196 QT
-3.708 14.414 L
-3.708 15.008 -1.333 15.008 QT
-1.333 15.68 L
-7.568 15.68 L
cp
f
GR
GS
[0.75 0 0 0.75 274.03125 447.05002] CT
0.149 GC
N
0.953 15.68 M
0.953 15.164 L
0.953 15.117 0.984 15.071 QT
3.938 11.805 L
4.609 11.071 5.023 10.586 QT
5.438 10.102 5.844 9.461 QT
6.25 8.821 6.484 8.156 QT
6.719 7.492 6.719 6.742 QT
6.719 5.961 6.438 5.25 QT
6.156 4.539 5.586 4.117 QT
5.016 3.696 4.203 3.696 QT
3.375 3.696 2.719 4.188 QT
2.063 4.68 1.797 5.477 QT
1.859 5.461 2 5.461 QT
2.422 5.461 2.727 5.742 QT
3.031 6.024 3.031 6.492 QT
3.031 6.914 2.727 7.219 QT
2.422 7.524 2 7.524 QT
1.547 7.524 1.25 7.211 QT
0.953 6.899 0.953 6.492 QT
0.953 5.774 1.219 5.149 QT
1.484 4.524 1.992 4.031 QT
2.5 3.539 3.133 3.281 QT
3.766 3.024 4.484 3.024 QT
5.563 3.024 6.5 3.485 QT
7.438 3.946 7.984 4.781 QT
8.531 5.617 8.531 6.742 QT
8.531 7.571 8.172 8.313 QT
7.813 9.055 7.25 9.664 QT
6.688 10.274 5.805 11.039 QT
4.922 11.805 4.641 12.071 QT
2.484 14.133 L
4.313 14.133 L
5.656 14.133 6.563 14.11 QT
7.469 14.086 7.531 14.039 QT
7.75 13.805 7.984 12.289 QT
8.531 12.289 L
8 15.68 L
0.953 15.68 L
cp
f
GR
GS
[0.75 0 0 0.75 337.125 447.05002] CT
0.149 GC
N
/f550733744{-7.568 15.68 M
-7.568 15.008 L
-5.193 15.008 -5.193 14.414 QT
-5.193 4.43 L
-6.177 4.914 -7.677 4.914 QT
-7.677 4.242 L
-5.349 4.242 -4.161 3.024 QT
-3.896 3.024 L
-3.833 3.024 -3.771 3.078 QT
-3.708 3.133 -3.708 3.196 QT
-3.708 14.414 L
-3.708 15.008 -1.333 15.008 QT
-1.333 15.68 L
-7.568 15.68 L
cp}def
f550733744
f
GR
GS
[0.75 0 0 0.75 337.125 447.05002] CT
0.149 GC
N
/f1197934472{1.766 15.68 M
1.766 15.008 L
4.141 15.008 4.141 14.414 QT
4.141 4.43 L
3.156 4.914 1.656 4.914 QT
1.656 4.242 L
3.984 4.242 5.172 3.024 QT
5.438 3.024 L
5.5 3.024 5.563 3.078 QT
5.625 3.133 5.625 3.196 QT
5.625 14.414 L
5.625 15.008 8 15.008 QT
8 15.68 L
1.766 15.68 L
cp}def
f1197934472
f
GR
GS
[0.75 0 0 0.75 400.21875 447.05002] CT
0.149 GC
N
f550733744
f
GR
GS
[0.75 0 0 0.75 400.21875 447.05002] CT
0.149 GC
N
/f-1758423061{4.75 16.102 M
3.578 16.102 2.789 15.477 QT
2 14.852 1.563 13.852 QT
1.125 12.852 0.961 11.758 QT
0.797 10.664 0.797 9.539 QT
0.797 8.039 1.383 6.524 QT
1.969 5.008 3.102 4.016 QT
4.234 3.024 5.797 3.024 QT
6.453 3.024 7.016 3.274 QT
7.578 3.524 7.891 4 QT
8.203 4.477 8.203 5.149 QT
8.203 5.539 7.945 5.805 QT
7.688 6.071 7.297 6.071 QT
6.922 6.071 6.656 5.797 QT
6.391 5.524 6.391 5.149 QT
6.391 4.774 6.656 4.508 QT
6.922 4.242 7.297 4.242 QT
7.391 4.242 L
7.156 3.899 6.711 3.735 QT
6.266 3.571 5.797 3.571 QT
5.219 3.571 4.734 3.821 QT
4.25 4.071 3.859 4.5 QT
3.469 4.93 3.211 5.446 QT
2.953 5.961 2.805 6.617 QT
2.656 7.274 2.625 7.852 QT
2.594 8.43 2.594 9.289 QT
2.922 8.524 3.531 8.024 QT
4.141 7.524 4.922 7.524 QT
5.766 7.524 6.461 7.867 QT
7.156 8.211 7.656 8.821 QT
8.156 9.43 8.422 10.211 QT
8.688 10.992 8.688 11.789 QT
8.688 12.899 8.188 13.906 QT
7.688 14.914 6.789 15.508 QT
5.891 16.102 4.75 16.102 QT
cp
4.75 15.492 M
5.484 15.492 5.93 15.156 QT
6.375 14.821 6.586 14.274 QT
6.797 13.727 6.844 13.164 QT
6.891 12.602 6.891 11.789 QT
6.891 10.711 6.789 9.946 QT
6.688 9.18 6.234 8.602 QT
5.781 8.024 4.844 8.024 QT
4.078 8.024 3.578 8.547 QT
3.078 9.071 2.852 9.86 QT
2.625 10.649 2.625 11.383 QT
2.625 11.633 2.641 11.758 QT
2.641 11.789 2.641 11.813 QT
2.641 11.836 2.625 11.852 QT
2.625 12.68 2.789 13.508 QT
2.953 14.336 3.43 14.914 QT
3.906 15.492 4.75 15.492 QT
cp}def
f-1758423061
f
GR
GS
[0.75 0 0 0.75 463.3125 447.05002] CT
0.149 GC
N
/f-421612205{-8.38 15.68 M
-8.38 15.164 L
-8.38 15.117 -8.349 15.071 QT
-5.396 11.805 L
-4.724 11.071 -4.31 10.586 QT
-3.896 10.102 -3.49 9.461 QT
-3.083 8.821 -2.849 8.156 QT
-2.615 7.492 -2.615 6.742 QT
-2.615 5.961 -2.896 5.25 QT
-3.177 4.539 -3.747 4.117 QT
-4.318 3.696 -5.13 3.696 QT
-5.958 3.696 -6.615 4.188 QT
-7.271 4.68 -7.536 5.477 QT
-7.474 5.461 -7.333 5.461 QT
-6.911 5.461 -6.607 5.742 QT
-6.302 6.024 -6.302 6.492 QT
-6.302 6.914 -6.607 7.219 QT
-6.911 7.524 -7.333 7.524 QT
-7.786 7.524 -8.083 7.211 QT
-8.38 6.899 -8.38 6.492 QT
-8.38 5.774 -8.115 5.149 QT
-7.849 4.524 -7.341 4.031 QT
-6.833 3.539 -6.201 3.281 QT
-5.568 3.024 -4.849 3.024 QT
-3.771 3.024 -2.833 3.485 QT
-1.896 3.946 -1.349 4.781 QT
-0.802 5.617 -0.802 6.742 QT
-0.802 7.571 -1.161 8.313 QT
-1.521 9.055 -2.083 9.664 QT
-2.646 10.274 -3.529 11.039 QT
-4.411 11.805 -4.693 12.071 QT
-6.849 14.133 L
-5.021 14.133 L
-3.677 14.133 -2.771 14.11 QT
-1.865 14.086 -1.802 14.039 QT
-1.583 13.805 -1.349 12.289 QT
-0.802 12.289 L
-1.333 15.68 L
-8.38 15.68 L
cp}def
f-421612205
f
GR
GS
[0.75 0 0 0.75 463.3125 447.05002] CT
0.149 GC
N
/f263836605{3.297 15.196 M
3.297 14.133 3.484 13.117 QT
3.672 12.102 4.031 11.117 QT
4.391 10.133 4.898 9.18 QT
5.406 8.227 6 7.399 QT
7.734 4.977 L
5.563 4.977 L
2.188 4.977 2.094 5.071 QT
1.844 5.383 1.609 6.836 QT
1.063 6.836 L
1.688 2.836 L
2.25 2.836 L
2.25 2.899 L
2.25 3.242 3.406 3.344 QT
4.563 3.446 5.672 3.446 QT
9.219 3.446 L
9.219 3.93 L
9.219 3.946 9.211 3.961 QT
9.203 3.977 9.188 3.992 QT
6.578 7.664 L
5.609 9.086 5.367 10.836 QT
5.125 12.586 5.125 15.196 QT
5.125 15.555 4.859 15.828 QT
4.594 16.102 4.219 16.102 QT
3.844 16.102 3.57 15.828 QT
3.297 15.555 3.297 15.196 QT
cp}def
f263836605
f
GR
GS
[0.75 0 0 0.75 526.40625 447.05002] CT
0.149 GC
N
f-421612205
f
GR
GS
[0.75 0 0 0.75 526.40625 447.05002] CT
0.149 GC
N
/f424309639{1.656 13.524 M
1.844 14.071 2.25 14.524 QT
2.656 14.977 3.203 15.235 QT
3.75 15.492 4.344 15.492 QT
5.719 15.492 6.242 14.43 QT
6.766 13.367 6.766 11.836 QT
6.766 11.18 6.742 10.727 QT
6.719 10.274 6.609 9.867 QT
6.438 9.196 6 8.696 QT
5.563 8.196 4.922 8.196 QT
4.281 8.196 3.82 8.391 QT
3.359 8.586 3.07 8.844 QT
2.781 9.102 2.563 9.391 QT
2.344 9.68 2.281 9.696 QT
2.063 9.696 L
2.016 9.696 1.953 9.633 QT
1.891 9.571 1.891 9.524 QT
1.891 3.18 L
1.891 3.133 1.945 3.078 QT
2 3.024 2.063 3.024 QT
2.125 3.024 L
3.406 3.633 4.844 3.633 QT
6.25 3.633 7.563 3.024 QT
7.609 3.024 L
7.688 3.024 7.742 3.071 QT
7.797 3.117 7.797 3.18 QT
7.797 3.352 L
7.797 3.446 7.75 3.446 QT
7.109 4.305 6.133 4.789 QT
5.156 5.274 4.094 5.274 QT
3.344 5.274 2.547 5.055 QT
2.547 8.649 L
3.172 8.133 3.672 7.914 QT
4.172 7.696 4.938 7.696 QT
5.984 7.696 6.813 8.305 QT
7.641 8.914 8.086 9.883 QT
8.531 10.852 8.531 11.852 QT
8.531 12.992 7.969 13.969 QT
7.406 14.946 6.445 15.524 QT
5.484 16.102 4.344 16.102 QT
3.422 16.102 2.633 15.617 QT
1.844 15.133 1.398 14.313 QT
0.953 13.492 0.953 12.586 QT
0.953 12.149 1.227 11.883 QT
1.5 11.617 1.922 11.617 QT
2.344 11.617 2.625 11.891 QT
2.906 12.164 2.906 12.586 QT
2.906 12.992 2.625 13.274 QT
2.344 13.555 1.922 13.555 QT
1.859 13.555 1.773 13.539 QT
1.688 13.524 1.656 13.524 QT
cp}def
f424309639
f
GR
GS
[0.75 0 0 0.75 589.5 447.05002] CT
0.149 GC
N
/f2010966090{-3.87 12.789 M
-3.87 11.649 -3.12 10.774 QT
-2.37 9.899 -1.182 9.321 QT
-1.885 8.867 L
-2.542 8.43 -2.948 7.719 QT
-3.354 7.008 -3.354 6.242 QT
-3.354 5.321 -2.878 4.594 QT
-2.401 3.867 -1.612 3.446 QT
-0.823 3.024 0.083 3.024 QT
0.927 3.024 1.708 3.367 QT
2.49 3.711 2.997 4.352 QT
3.505 4.992 3.505 5.867 QT
3.505 6.508 3.208 7.055 QT
2.911 7.602 2.38 8.039 QT
1.849 8.477 1.255 8.789 QT
2.349 9.477 L
3.099 9.977 3.56 10.774 QT
4.021 11.571 4.021 12.446 QT
4.021 13.477 3.466 14.321 QT
2.911 15.164 2.005 15.633 QT
1.099 16.102 0.083 16.102 QT
-0.901 16.102 -1.815 15.703 QT
-2.729 15.305 -3.299 14.547 QT
-3.87 13.789 -3.87 12.789 QT
cp
-2.839 12.789 M
-2.839 13.539 -2.424 14.164 QT
-2.01 14.789 -1.331 15.141 QT
-0.651 15.492 0.083 15.492 QT
1.193 15.492 2.091 14.852 QT
2.99 14.211 2.99 13.133 QT
2.99 12.774 2.841 12.414 QT
2.693 12.055 2.443 11.766 QT
2.193 11.477 1.88 11.289 QT
-0.682 9.633 L
-1.276 9.961 -1.768 10.438 QT
-2.26 10.914 -2.549 11.524 QT
-2.839 12.133 -2.839 12.789 QT
cp
-1.526 6.992 M
0.771 8.477 L
1.568 8.024 2.076 7.36 QT
2.583 6.696 2.583 5.867 QT
2.583 5.227 2.232 4.696 QT
1.88 4.164 1.302 3.867 QT
0.724 3.571 0.068 3.571 QT
-0.51 3.571 -1.096 3.797 QT
-1.682 4.024 -2.057 4.461 QT
-2.432 4.899 -2.432 5.492 QT
-2.432 6.383 -1.526 6.992 QT
cp}def
f2010966090
f
GR
GS
[0.75 0 0 0.75 337.12525 464.85002] CT
0.149 GC
N
/f-751796569{-21.541 17.248 M
-21.541 16.514 L
-19.385 16.514 -19.385 15.842 QT
-19.385 4.31 L
-19.385 3.639 -21.541 3.639 QT
-21.541 2.904 L
-14.073 2.904 L
-12.916 2.904 -11.768 3.373 QT
-10.619 3.842 -9.877 4.748 QT
-9.135 5.654 -9.135 6.857 QT
-9.135 8.014 -9.885 8.896 QT
-10.635 9.779 -11.776 10.24 QT
-12.916 10.701 -14.073 10.701 QT
-17.432 10.701 L
-17.432 15.842 L
-17.432 16.514 -15.276 16.514 QT
-15.276 17.248 L
-21.541 17.248 L
cp
-17.494 10.076 M
-14.651 10.076 L
-13.494 10.076 -12.776 9.74 QT
-12.057 9.404 -11.721 8.701 QT
-11.385 7.998 -11.385 6.857 QT
-11.385 5.139 -12.135 4.389 QT
-12.885 3.639 -14.651 3.639 QT
-16.432 3.639 L
-16.807 3.639 -17.018 3.67 QT
-17.229 3.701 -17.362 3.849 QT
-17.494 3.998 -17.494 4.31 QT
-17.494 10.076 L
cp}def
f-751796569
f
GR
GS
[0.75 0 0 0.75 337.12525 464.85002] CT
0.149 GC
N
/f-988543504{-7.567 17.248 M
-7.567 16.514 L
-5.411 16.514 -5.411 15.842 QT
-5.411 4.31 L
-5.411 3.639 -7.567 3.639 QT
-7.567 2.904 L
-0.973 2.904 L
0.198 2.904 1.495 3.326 QT
2.792 3.748 3.667 4.623 QT
4.542 5.498 4.542 6.701 QT
4.542 7.592 4.011 8.279 QT
3.48 8.967 2.652 9.435 QT
1.823 9.904 0.964 10.107 QT
1.917 10.435 2.62 11.154 QT
3.323 11.873 3.464 12.795 QT
3.761 14.67 L
3.98 15.92 4.198 16.545 QT
4.417 17.17 5.198 17.17 QT
5.855 17.17 6.175 16.56 QT
6.495 15.951 6.495 15.232 QT
6.495 15.154 6.566 15.099 QT
6.636 15.045 6.698 15.045 QT
6.902 15.045 L
7.105 15.045 7.105 15.326 QT
7.105 15.889 6.878 16.443 QT
6.652 16.998 6.222 17.357 QT
5.792 17.717 5.214 17.717 QT
3.698 17.717 2.605 16.959 QT
1.511 16.201 1.511 14.748 QT
1.511 12.873 L
1.511 11.826 0.784 11.084 QT
0.058 10.342 -1.005 10.342 QT
-3.52 10.342 L
-3.52 15.842 L
-3.52 16.514 -1.364 16.514 QT
-1.364 17.248 L
-7.567 17.248 L
cp
-3.52 9.795 M
-1.27 9.795 L
0.464 9.795 1.378 9.092 QT
2.292 8.389 2.292 6.701 QT
2.292 5.029 1.386 4.334 QT
0.48 3.639 -1.27 3.639 QT
-2.458 3.639 L
-2.833 3.639 -3.044 3.67 QT
-3.255 3.701 -3.388 3.849 QT
-3.52 3.998 -3.52 4.31 QT
-3.52 9.795 L
cp}def
f-988543504
f
GR
GS
[0.75 0 0 0.75 337.12525 464.85002] CT
0.149 GC
N
/f-1075891050{7.485 17.248 M
7.485 16.514 L
9.657 16.514 9.657 15.264 QT
9.657 3.764 L
8.969 3.639 7.485 3.639 QT
7.485 2.904 L
11.516 2.904 L
11.61 2.904 11.657 2.982 QT
19.094 13.92 L
19.094 4.889 L
19.094 3.639 16.923 3.639 QT
16.923 2.904 L
21.923 2.904 L
21.923 3.639 L
19.766 3.639 19.766 4.889 QT
19.766 17.06 L
19.766 17.123 19.68 17.185 QT
19.594 17.248 19.548 17.248 QT
19.298 17.248 L
19.188 17.248 19.157 17.17 QT
10.329 4.185 L
10.329 15.264 L
10.329 16.514 12.501 16.514 QT
12.501 17.248 L
7.485 17.248 L
cp}def
f-1075891050
f
GR
GS
[0.75 0 0 0.75 0 0.5] CT
0.149 GC
1 LJ
0.667 LW
N
113 589 M
113 50 L
S
GR
GS
[0.75 0 0 0.75 0 0.5] CT
0.149 GC
1 LJ
0.667 LW
N
786 589 M
786 50 L
S
GR
GS
[0.75 0 0 0.75 0 0.5] CT
0.149 GC
2 setlinecap
1 LJ
0.667 LW
N
113 589 M
119.73 589 L
S
GR
GS
[0.75 0 0 0.75 0 0.5] CT
0.149 GC
2 setlinecap
1 LJ
0.667 LW
N
113 481.2 M
119.73 481.2 L
S
GR
GS
[0.75 0 0 0.75 0 0.5] CT
0.149 GC
2 setlinecap
1 LJ
0.667 LW
N
113 373.4 M
119.73 373.4 L
S
GR
GS
[0.75 0 0 0.75 0 0.5] CT
0.149 GC
2 setlinecap
1 LJ
0.667 LW
N
113 265.6 M
119.73 265.6 L
S
GR
GS
[0.75 0 0 0.75 0 0.5] CT
0.149 GC
2 setlinecap
1 LJ
0.667 LW
N
113 157.8 M
119.73 157.8 L
S
GR
GS
[0.75 0 0 0.75 0 0.5] CT
0.149 GC
2 setlinecap
1 LJ
0.667 LW
N
113 50 M
119.73 50 L
S
GR
GS
[0.75 0 0 0.75 0 0.5] CT
0.149 GC
2 setlinecap
1 LJ
0.667 LW
N
786 589 M
779.27 589 L
S
GR
GS
[0.75 0 0 0.75 0 0.5] CT
0.149 GC
2 setlinecap
1 LJ
0.667 LW
N
786 481.2 M
779.27 481.2 L
S
GR
GS
[0.75 0 0 0.75 0 0.5] CT
0.149 GC
2 setlinecap
1 LJ
0.667 LW
N
786 373.4 M
779.27 373.4 L
S
GR
GS
[0.75 0 0 0.75 0 0.5] CT
0.149 GC
2 setlinecap
1 LJ
0.667 LW
N
786 265.6 M
779.27 265.6 L
S
GR
GS
[0.75 0 0 0.75 0 0.5] CT
0.149 GC
2 setlinecap
1 LJ
0.667 LW
N
786 157.8 M
779.27 157.8 L
S
GR
GS
[0.75 0 0 0.75 0 0.5] CT
0.149 GC
2 setlinecap
1 LJ
0.667 LW
N
786 50 M
779.27 50 L
S
GR
GS
[0.75 0 0 0.75 79.95 442.25] CT
0.149 GC
N
/f-373173538{-4.583 4.902 M
-6.911 4.902 -7.747 2.98 QT
-8.583 1.058 -8.583 -1.583 QT
-8.583 -3.223 -8.286 -4.684 QT
-7.99 -6.145 -7.091 -7.161 QT
-6.193 -8.176 -4.583 -8.176 QT
-3.333 -8.176 -2.536 -7.567 QT
-1.74 -6.958 -1.318 -5.981 QT
-0.896 -5.004 -0.747 -3.903 QT
-0.599 -2.801 -0.599 -1.583 QT
-0.599 0.058 -0.896 1.48 QT
-1.193 2.902 -2.076 3.902 QT
-2.958 4.902 -4.583 4.902 QT
cp
-4.583 4.402 M
-3.521 4.402 -3.005 3.316 QT
-2.49 2.23 -2.365 0.917 QT
-2.24 -0.395 -2.24 -1.879 QT
-2.24 -3.317 -2.365 -4.52 QT
-2.49 -5.723 -3.005 -6.7 QT
-3.521 -7.676 -4.583 -7.676 QT
-5.661 -7.676 -6.177 -6.7 QT
-6.693 -5.723 -6.818 -4.52 QT
-6.943 -3.317 -6.943 -1.879 QT
-6.943 -0.833 -6.888 0.105 QT
-6.833 1.042 -6.615 2.042 QT
-6.396 3.042 -5.896 3.722 QT
-5.396 4.402 -4.583 4.402 QT
cp}def
f-373173538
f
GR
GS
[0.75 0 0 0.75 79.95 361.40001] CT
0.149 GC
N
/f-1029259981{-19.102 4.902 M
-21.43 4.902 -22.266 2.98 QT
-23.102 1.058 -23.102 -1.583 QT
-23.102 -3.223 -22.805 -4.684 QT
-22.508 -6.145 -21.61 -7.161 QT
-20.711 -8.176 -19.102 -8.176 QT
-17.852 -8.176 -17.055 -7.567 QT
-16.258 -6.958 -15.836 -5.981 QT
-15.414 -5.004 -15.266 -3.903 QT
-15.118 -2.801 -15.118 -1.583 QT
-15.118 0.058 -15.414 1.48 QT
-15.711 2.902 -16.594 3.902 QT
-17.477 4.902 -19.102 4.902 QT
cp
-19.102 4.402 M
-18.039 4.402 -17.524 3.316 QT
-17.008 2.23 -16.883 0.917 QT
-16.758 -0.395 -16.758 -1.879 QT
-16.758 -3.317 -16.883 -4.52 QT
-17.008 -5.723 -17.524 -6.7 QT
-18.039 -7.676 -19.102 -7.676 QT
-20.18 -7.676 -20.696 -6.7 QT
-21.211 -5.723 -21.336 -4.52 QT
-21.461 -3.317 -21.461 -1.879 QT
-21.461 -0.833 -21.407 0.105 QT
-21.352 1.042 -21.133 2.042 QT
-20.914 3.042 -20.414 3.722 QT
-19.914 4.402 -19.102 4.402 QT
cp}def
f-1029259981
f
GR
GS
[0.75 0 0 0.75 79.95 361.40001] CT
0.149 GC
N
/f1678544296{-12.925 3.433 M
-12.925 3.011 -12.605 2.699 QT
-12.284 2.386 -11.878 2.386 QT
-11.612 2.386 -11.362 2.527 QT
-11.112 2.667 -10.972 2.917 QT
-10.831 3.167 -10.831 3.433 QT
-10.831 3.855 -11.136 4.167 QT
-11.44 4.48 -11.878 4.48 QT
-12.284 4.48 -12.605 4.167 QT
-12.925 3.855 -12.925 3.433 QT
cp}def
f1678544296
f
GR
GS
[0.75 0 0 0.75 79.95 361.40001] CT
0.149 GC
N
/f2038076345{-7.677 2.324 M
-7.49 2.871 -7.083 3.324 QT
-6.677 3.777 -6.13 4.035 QT
-5.583 4.292 -4.99 4.292 QT
-3.615 4.292 -3.091 3.23 QT
-2.568 2.167 -2.568 0.636 QT
-2.568 -0.02 -2.591 -0.473 QT
-2.615 -0.926 -2.724 -1.333 QT
-2.896 -2.004 -3.333 -2.504 QT
-3.771 -3.004 -4.411 -3.004 QT
-5.052 -3.004 -5.513 -2.809 QT
-5.974 -2.614 -6.263 -2.356 QT
-6.552 -2.098 -6.771 -1.809 QT
-6.99 -1.52 -7.052 -1.504 QT
-7.271 -1.504 L
-7.318 -1.504 -7.38 -1.567 QT
-7.443 -1.629 -7.443 -1.676 QT
-7.443 -8.02 L
-7.443 -8.067 -7.388 -8.122 QT
-7.333 -8.176 -7.271 -8.176 QT
-7.208 -8.176 L
-5.927 -7.567 -4.49 -7.567 QT
-3.083 -7.567 -1.771 -8.176 QT
-1.724 -8.176 L
-1.646 -8.176 -1.591 -8.129 QT
-1.536 -8.083 -1.536 -8.02 QT
-1.536 -7.848 L
-1.536 -7.754 -1.583 -7.754 QT
-2.224 -6.895 -3.201 -6.411 QT
-4.177 -5.926 -5.24 -5.926 QT
-5.99 -5.926 -6.786 -6.145 QT
-6.786 -2.551 L
-6.161 -3.067 -5.661 -3.286 QT
-5.161 -3.504 -4.396 -3.504 QT
-3.349 -3.504 -2.521 -2.895 QT
-1.693 -2.286 -1.247 -1.317 QT
-0.802 -0.348 -0.802 0.652 QT
-0.802 1.792 -1.365 2.769 QT
-1.927 3.746 -2.888 4.324 QT
-3.849 4.902 -4.99 4.902 QT
-5.911 4.902 -6.701 4.417 QT
-7.49 3.933 -7.935 3.113 QT
-8.38 2.292 -8.38 1.386 QT
-8.38 0.949 -8.107 0.683 QT
-7.833 0.417 -7.411 0.417 QT
-6.99 0.417 -6.708 0.691 QT
-6.427 0.964 -6.427 1.386 QT
-6.427 1.792 -6.708 2.074 QT
-6.99 2.355 -7.411 2.355 QT
-7.474 2.355 -7.56 2.339 QT
-7.646 2.324 -7.677 2.324 QT
cp}def
f2038076345
f
GR
GS
[0.75 0 0 0.75 79.95 280.55] CT
0.149 GC
N
/f-344800598{-7.568 4.48 M
-7.568 3.808 L
-5.193 3.808 -5.193 3.214 QT
-5.193 -6.77 L
-6.177 -6.286 -7.677 -6.286 QT
-7.677 -6.958 L
-5.349 -6.958 -4.161 -8.176 QT
-3.896 -8.176 L
-3.833 -8.176 -3.771 -8.122 QT
-3.708 -8.067 -3.708 -8.004 QT
-3.708 3.214 L
-3.708 3.808 -1.333 3.808 QT
-1.333 4.48 L
-7.568 4.48 L
cp}def
f-344800598
f
GR
GS
[0.75 0 0 0.75 79.95 199.7] CT
0.149 GC
N
/f-2016941877{-22.086 4.48 M
-22.086 3.808 L
-19.711 3.808 -19.711 3.214 QT
-19.711 -6.77 L
-20.696 -6.286 -22.196 -6.286 QT
-22.196 -6.958 L
-19.868 -6.958 -18.68 -8.176 QT
-18.414 -8.176 L
-18.352 -8.176 -18.289 -8.122 QT
-18.227 -8.067 -18.227 -8.004 QT
-18.227 3.214 L
-18.227 3.808 -15.852 3.808 QT
-15.852 4.48 L
-22.086 4.48 L
cp}def
f-2016941877
f
GR
GS
[0.75 0 0 0.75 79.95 199.7] CT
0.149 GC
N
f1678544296
f
GR
GS
[0.75 0 0 0.75 79.95 199.7] CT
0.149 GC
N
f2038076345
f
GR
GS
[0.75 0 0 0.75 79.95 118.85] CT
0.149 GC
N
/f221929001{-8.38 4.48 M
-8.38 3.964 L
-8.38 3.917 -8.349 3.871 QT
-5.396 0.605 L
-4.724 -0.129 -4.31 -0.614 QT
-3.896 -1.098 -3.49 -1.739 QT
-3.083 -2.379 -2.849 -3.044 QT
-2.615 -3.708 -2.615 -4.458 QT
-2.615 -5.239 -2.896 -5.95 QT
-3.177 -6.661 -3.747 -7.083 QT
-4.318 -7.504 -5.13 -7.504 QT
-5.958 -7.504 -6.615 -7.012 QT
-7.271 -6.52 -7.536 -5.723 QT
-7.474 -5.739 -7.333 -5.739 QT
-6.911 -5.739 -6.607 -5.458 QT
-6.302 -5.176 -6.302 -4.708 QT
-6.302 -4.286 -6.607 -3.981 QT
-6.911 -3.676 -7.333 -3.676 QT
-7.786 -3.676 -8.083 -3.989 QT
-8.38 -4.301 -8.38 -4.708 QT
-8.38 -5.426 -8.115 -6.051 QT
-7.849 -6.676 -7.341 -7.169 QT
-6.833 -7.661 -6.201 -7.919 QT
-5.568 -8.176 -4.849 -8.176 QT
-3.771 -8.176 -2.833 -7.715 QT
-1.896 -7.254 -1.349 -6.419 QT
-0.802 -5.583 -0.802 -4.458 QT
-0.802 -3.629 -1.161 -2.887 QT
-1.521 -2.145 -2.083 -1.536 QT
-2.646 -0.926 -3.529 -0.161 QT
-4.411 0.605 -4.693 0.871 QT
-6.849 2.933 L
-5.021 2.933 L
-3.677 2.933 -2.771 2.91 QT
-1.865 2.886 -1.802 2.839 QT
-1.583 2.605 -1.349 1.089 QT
-0.802 1.089 L
-1.333 4.48 L
-8.38 4.48 L
cp}def
f221929001
f
GR
GS
[0.75 0 0 0.75 79.95 38] CT
0.149 GC
N
/f-1921952046{-22.899 4.48 M
-22.899 3.964 L
-22.899 3.917 -22.868 3.871 QT
-19.914 0.605 L
-19.243 -0.129 -18.828 -0.614 QT
-18.414 -1.098 -18.008 -1.739 QT
-17.602 -2.379 -17.368 -3.044 QT
-17.133 -3.708 -17.133 -4.458 QT
-17.133 -5.239 -17.414 -5.95 QT
-17.696 -6.661 -18.266 -7.083 QT
-18.836 -7.504 -19.649 -7.504 QT
-20.477 -7.504 -21.133 -7.012 QT
-21.789 -6.52 -22.055 -5.723 QT
-21.993 -5.739 -21.852 -5.739 QT
-21.43 -5.739 -21.125 -5.458 QT
-20.821 -5.176 -20.821 -4.708 QT
-20.821 -4.286 -21.125 -3.981 QT
-21.43 -3.676 -21.852 -3.676 QT
-22.305 -3.676 -22.602 -3.989 QT
-22.899 -4.301 -22.899 -4.708 QT
-22.899 -5.426 -22.633 -6.051 QT
-22.368 -6.676 -21.86 -7.169 QT
-21.352 -7.661 -20.719 -7.919 QT
-20.086 -8.176 -19.368 -8.176 QT
-18.289 -8.176 -17.352 -7.715 QT
-16.414 -7.254 -15.868 -6.419 QT
-15.321 -5.583 -15.321 -4.458 QT
-15.321 -3.629 -15.68 -2.887 QT
-16.039 -2.145 -16.602 -1.536 QT
-17.164 -0.926 -18.047 -0.161 QT
-18.93 0.605 -19.211 0.871 QT
-21.368 2.933 L
-19.539 2.933 L
-18.196 2.933 -17.289 2.91 QT
-16.383 2.886 -16.321 2.839 QT
-16.102 2.605 -15.868 1.089 QT
-15.321 1.089 L
-15.852 4.48 L
-22.899 4.48 L
cp}def
f-1921952046
f
GR
GS
[0.75 0 0 0.75 79.95 38] CT
0.149 GC
N
f1678544296
f
GR
GS
[0.75 0 0 0.75 79.95 38] CT
0.149 GC
N
f2038076345
f
GR
GS
[0 -0.75 0.75 0 59.06106 240.12482] CT
0.149 GC
N
/f-1499884106{-145.333 -7.392 M
-145.333 -8.126 L
-143.067 -8.126 -143.067 -8.798 QT
-143.067 -20.33 L
-143.067 -21.001 -145.333 -21.001 QT
-145.333 -21.736 L
-138.848 -21.736 L
-138.848 -21.001 L
-141.114 -21.001 -141.114 -20.33 QT
-141.114 -8.798 L
-141.114 -8.126 -138.848 -8.126 QT
-138.848 -7.392 L
-145.333 -7.392 L
cp}def
f-1499884106
f
GR
GS
[0 -0.75 0.75 0 59.06106 240.12482] CT
0.149 GC
N
/f1370503045{-137.84 -7.392 M
-137.84 -8.126 L
-137.121 -8.126 -136.66 -8.244 QT
-136.199 -8.361 -136.199 -8.798 QT
-136.199 -14.533 L
-136.199 -15.095 -136.371 -15.345 QT
-136.543 -15.595 -136.856 -15.65 QT
-137.168 -15.705 -137.84 -15.705 QT
-137.84 -16.439 L
-134.793 -16.673 L
-134.793 -14.626 L
-134.371 -15.517 -133.543 -16.095 QT
-132.715 -16.673 -131.746 -16.673 QT
-130.293 -16.673 -129.559 -15.978 QT
-128.824 -15.283 -128.824 -13.845 QT
-128.824 -8.798 L
-128.824 -8.361 -128.363 -8.244 QT
-127.902 -8.126 -127.184 -8.126 QT
-127.184 -7.392 L
-131.996 -7.392 L
-131.996 -8.126 L
-131.277 -8.126 -130.816 -8.244 QT
-130.356 -8.361 -130.356 -8.798 QT
-130.356 -13.783 L
-130.356 -14.798 -130.652 -15.462 QT
-130.949 -16.126 -131.871 -16.126 QT
-133.09 -16.126 -133.879 -15.15 QT
-134.668 -14.173 -134.668 -12.939 QT
-134.668 -8.798 L
-134.668 -8.361 -134.199 -8.244 QT
-133.731 -8.126 -133.027 -8.126 QT
-133.027 -7.392 L
-137.84 -7.392 L
cp}def
f1370503045
f
GR
GS
[0 -0.75 0.75 0 59.06106 240.12482] CT
0.149 GC
N
/f-1239288563{-125.487 -9.908 M
-125.487 -15.705 L
-127.222 -15.705 L
-127.222 -16.251 L
-125.847 -16.251 -125.206 -17.533 QT
-124.565 -18.814 -124.565 -20.314 QT
-123.956 -20.314 L
-123.956 -16.439 L
-120.987 -16.439 L
-120.987 -15.705 L
-123.956 -15.705 L
-123.956 -9.955 L
-123.956 -9.08 -123.667 -8.423 QT
-123.378 -7.767 -122.612 -7.767 QT
-121.894 -7.767 -121.573 -8.462 QT
-121.253 -9.158 -121.253 -9.955 QT
-121.253 -11.189 L
-120.659 -11.189 L
-120.659 -9.908 L
-120.659 -9.251 -120.901 -8.611 QT
-121.144 -7.97 -121.612 -7.564 QT
-122.081 -7.158 -122.753 -7.158 QT
-124.019 -7.158 -124.753 -7.908 QT
-125.487 -8.658 -125.487 -9.908 QT
cp}def
f-1239288563
f
GR
GS
[0 -0.75 0.75 0 59.06106 240.12482] CT
0.149 GC
N
/f-1816989619{-114.408 -7.158 M
-115.69 -7.158 -116.76 -7.83 QT
-117.83 -8.501 -118.447 -9.626 QT
-119.065 -10.751 -119.065 -12.001 QT
-119.065 -13.22 -118.502 -14.33 QT
-117.94 -15.439 -116.94 -16.119 QT
-115.94 -16.798 -114.705 -16.798 QT
-113.752 -16.798 -113.033 -16.478 QT
-112.315 -16.158 -111.854 -15.587 QT
-111.393 -15.017 -111.158 -14.236 QT
-110.924 -13.455 -110.924 -12.517 QT
-110.924 -12.236 -111.143 -12.236 QT
-117.221 -12.236 L
-117.221 -12.017 L
-117.221 -10.267 -116.518 -9.017 QT
-115.815 -7.767 -114.221 -7.767 QT
-113.58 -7.767 -113.033 -8.056 QT
-112.486 -8.345 -112.08 -8.861 QT
-111.674 -9.376 -111.533 -9.955 QT
-111.518 -10.033 -111.455 -10.087 QT
-111.393 -10.142 -111.33 -10.142 QT
-111.143 -10.142 L
-110.924 -10.142 -110.924 -9.876 QT
-111.221 -8.689 -112.205 -7.923 QT
-113.19 -7.158 -114.408 -7.158 QT
cp
-117.205 -12.767 M
-112.408 -12.767 L
-112.408 -13.548 -112.635 -14.361 QT
-112.861 -15.173 -113.369 -15.712 QT
-113.877 -16.251 -114.705 -16.251 QT
-115.893 -16.251 -116.549 -15.142 QT
-117.205 -14.033 -117.205 -12.767 QT
cp}def
f-1816989619
f
GR
GS
[0 -0.75 0.75 0 59.06106 240.12482] CT
0.149 GC
N
/f1350907903{-109.97 -7.392 M
-109.97 -8.126 L
-109.251 -8.126 -108.79 -8.244 QT
-108.329 -8.361 -108.329 -8.798 QT
-108.329 -14.533 L
-108.329 -15.095 -108.501 -15.345 QT
-108.673 -15.595 -108.993 -15.65 QT
-109.314 -15.705 -109.97 -15.705 QT
-109.97 -16.439 L
-106.97 -16.673 L
-106.97 -14.626 L
-106.626 -15.533 -106.001 -16.103 QT
-105.376 -16.673 -104.485 -16.673 QT
-103.86 -16.673 -103.368 -16.306 QT
-102.876 -15.939 -102.876 -15.33 QT
-102.876 -14.955 -103.15 -14.673 QT
-103.423 -14.392 -103.814 -14.392 QT
-104.204 -14.392 -104.485 -14.666 QT
-104.767 -14.939 -104.767 -15.33 QT
-104.767 -15.892 -104.36 -16.126 QT
-104.485 -16.126 L
-105.345 -16.126 -105.876 -15.509 QT
-106.407 -14.892 -106.634 -13.986 QT
-106.86 -13.08 -106.86 -12.236 QT
-106.86 -8.798 L
-106.86 -8.126 -104.829 -8.126 QT
-104.829 -7.392 L
-109.97 -7.392 L
cp}def
f1350907903
f
GR
GS
[0 -0.75 0.75 0 59.06106 240.12482] CT
0.149 GC
N
/f966335980{-94.958 -7.392 M
-94.958 -8.126 L
-93.083 -8.126 -92.646 -9.376 QT
-88.239 -22.205 L
-88.177 -22.423 -87.896 -22.423 QT
-87.63 -22.423 L
-87.349 -22.423 -87.286 -22.205 QT
-82.693 -8.798 L
-82.489 -8.361 -81.943 -8.244 QT
-81.396 -8.126 -80.583 -8.126 QT
-80.583 -7.392 L
-86.427 -7.392 L
-86.427 -8.126 L
-84.693 -8.126 -84.693 -8.689 QT
-84.693 -8.798 L
-85.833 -12.08 L
-90.927 -12.08 L
-91.864 -9.376 L
-91.88 -9.298 -91.88 -9.158 QT
-91.88 -8.626 -91.388 -8.376 QT
-90.896 -8.126 -90.318 -8.126 QT
-90.318 -7.392 L
-94.958 -7.392 L
cp
-90.677 -12.814 M
-86.068 -12.814 L
-88.38 -19.517 L
-90.677 -12.814 L
cp}def
f966335980
f
GR
GS
[0 -0.75 0.75 0 59.06106 240.12482] CT
0.149 GC
N
/f1898432545{-79.652 -5.751 M
-79.652 -6.501 -79.105 -7.056 QT
-78.558 -7.611 -77.808 -7.861 QT
-78.23 -8.173 -78.449 -8.658 QT
-78.668 -9.142 -78.668 -9.673 QT
-78.668 -10.658 -78.043 -11.423 QT
-79.011 -12.361 -79.011 -13.58 QT
-79.011 -14.236 -78.73 -14.814 QT
-78.449 -15.392 -77.941 -15.814 QT
-77.433 -16.236 -76.824 -16.455 QT
-76.214 -16.673 -75.558 -16.673 QT
-74.308 -16.673 -73.324 -15.939 QT
-72.886 -16.408 -72.3 -16.658 QT
-71.714 -16.908 -71.074 -16.908 QT
-70.621 -16.908 -70.332 -16.587 QT
-70.043 -16.267 -70.043 -15.814 QT
-70.043 -15.548 -70.238 -15.353 QT
-70.433 -15.158 -70.699 -15.158 QT
-70.964 -15.158 -71.16 -15.353 QT
-71.355 -15.548 -71.355 -15.814 QT
-71.355 -16.205 -71.089 -16.361 QT
-72.183 -16.361 -72.964 -15.611 QT
-72.574 -15.22 -72.347 -14.673 QT
-72.121 -14.126 -72.121 -13.58 QT
-72.121 -12.689 -72.613 -11.978 QT
-73.105 -11.267 -73.91 -10.876 QT
-74.714 -10.486 -75.558 -10.486 QT
-76.714 -10.486 -77.668 -11.111 QT
-77.964 -10.689 -77.964 -10.189 QT
-77.964 -9.626 -77.597 -9.212 QT
-77.23 -8.798 -76.683 -8.798 QT
-74.964 -8.798 L
-73.714 -8.798 -72.707 -8.572 QT
-71.699 -8.345 -71.019 -7.666 QT
-70.339 -6.986 -70.339 -5.751 QT
-70.339 -4.83 -71.113 -4.22 QT
-71.886 -3.611 -72.972 -3.337 QT
-74.058 -3.064 -74.98 -3.064 QT
-75.918 -3.064 -77.003 -3.337 QT
-78.089 -3.611 -78.871 -4.22 QT
-79.652 -4.83 -79.652 -5.751 QT
cp
-78.464 -5.751 M
-78.464 -5.048 -77.894 -4.572 QT
-77.324 -4.095 -76.511 -3.861 QT
-75.699 -3.626 -74.98 -3.626 QT
-74.277 -3.626 -73.464 -3.861 QT
-72.652 -4.095 -72.082 -4.572 QT
-71.511 -5.048 -71.511 -5.751 QT
-71.511 -6.845 -72.519 -7.173 QT
-73.527 -7.501 -74.964 -7.501 QT
-76.683 -7.501 L
-77.168 -7.501 -77.574 -7.267 QT
-77.98 -7.033 -78.222 -6.619 QT
-78.464 -6.205 -78.464 -5.751 QT
cp
-75.558 -11.048 M
-73.777 -11.048 -73.777 -13.58 QT
-73.777 -14.689 -74.16 -15.4 QT
-74.543 -16.111 -75.558 -16.111 QT
-76.589 -16.111 -76.972 -15.4 QT
-77.355 -14.689 -77.355 -13.58 QT
-77.355 -12.892 -77.207 -12.33 QT
-77.058 -11.767 -76.668 -11.408 QT
-76.277 -11.048 -75.558 -11.048 QT
cp}def
f1898432545
f
GR
GS
[0 -0.75 0.75 0 59.06106 240.12482] CT
0.149 GC
N
/f178387345{-64.729 -7.158 M
-66.01 -7.158 -67.081 -7.83 QT
-68.151 -8.501 -68.768 -9.626 QT
-69.385 -10.751 -69.385 -12.001 QT
-69.385 -13.22 -68.823 -14.33 QT
-68.26 -15.439 -67.26 -16.119 QT
-66.26 -16.798 -65.026 -16.798 QT
-64.073 -16.798 -63.354 -16.478 QT
-62.635 -16.158 -62.174 -15.587 QT
-61.713 -15.017 -61.479 -14.236 QT
-61.245 -13.455 -61.245 -12.517 QT
-61.245 -12.236 -61.463 -12.236 QT
-67.541 -12.236 L
-67.541 -12.017 L
-67.541 -10.267 -66.838 -9.017 QT
-66.135 -7.767 -64.541 -7.767 QT
-63.901 -7.767 -63.354 -8.056 QT
-62.807 -8.345 -62.401 -8.861 QT
-61.995 -9.376 -61.854 -9.955 QT
-61.838 -10.033 -61.776 -10.087 QT
-61.713 -10.142 -61.651 -10.142 QT
-61.463 -10.142 L
-61.245 -10.142 -61.245 -9.876 QT
-61.541 -8.689 -62.526 -7.923 QT
-63.51 -7.158 -64.729 -7.158 QT
cp
-67.526 -12.767 M
-62.729 -12.767 L
-62.729 -13.548 -62.956 -14.361 QT
-63.182 -15.173 -63.69 -15.712 QT
-64.198 -16.251 -65.026 -16.251 QT
-66.213 -16.251 -66.87 -15.142 QT
-67.526 -14.033 -67.526 -12.767 QT
cp}def
f178387345
f
GR
GS
[0 -0.75 0.75 0 59.06106 240.12482] CT
0.149 GC
N
/f-160017462{-60.212 -7.392 M
-60.212 -8.126 L
-59.494 -8.126 -59.033 -8.244 QT
-58.572 -8.361 -58.572 -8.798 QT
-58.572 -14.533 L
-58.572 -15.095 -58.744 -15.345 QT
-58.916 -15.595 -59.228 -15.65 QT
-59.541 -15.705 -60.212 -15.705 QT
-60.212 -16.439 L
-57.166 -16.673 L
-57.166 -14.626 L
-56.744 -15.517 -55.916 -16.095 QT
-55.087 -16.673 -54.119 -16.673 QT
-52.666 -16.673 -51.931 -15.978 QT
-51.197 -15.283 -51.197 -13.845 QT
-51.197 -8.798 L
-51.197 -8.361 -50.736 -8.244 QT
-50.275 -8.126 -49.556 -8.126 QT
-49.556 -7.392 L
-54.369 -7.392 L
-54.369 -8.126 L
-53.65 -8.126 -53.189 -8.244 QT
-52.728 -8.361 -52.728 -8.798 QT
-52.728 -13.783 L
-52.728 -14.798 -53.025 -15.462 QT
-53.322 -16.126 -54.244 -16.126 QT
-55.462 -16.126 -56.251 -15.15 QT
-57.041 -14.173 -57.041 -12.939 QT
-57.041 -8.798 L
-57.041 -8.361 -56.572 -8.244 QT
-56.103 -8.126 -55.4 -8.126 QT
-55.4 -7.392 L
-60.212 -7.392 L
cp}def
f-160017462
f
GR
GS
[0 -0.75 0.75 0 59.06106 240.12482] CT
0.149 GC
N
/f-734512672{-47.86 -9.908 M
-47.86 -15.705 L
-49.594 -15.705 L
-49.594 -16.251 L
-48.219 -16.251 -47.578 -17.533 QT
-46.938 -18.814 -46.938 -20.314 QT
-46.328 -20.314 L
-46.328 -16.439 L
-43.36 -16.439 L
-43.36 -15.705 L
-46.328 -15.705 L
-46.328 -9.955 L
-46.328 -9.08 -46.039 -8.423 QT
-45.75 -7.767 -44.985 -7.767 QT
-44.266 -7.767 -43.946 -8.462 QT
-43.625 -9.158 -43.625 -9.955 QT
-43.625 -11.189 L
-43.032 -11.189 L
-43.032 -9.908 L
-43.032 -9.251 -43.274 -8.611 QT
-43.516 -7.97 -43.985 -7.564 QT
-44.453 -7.158 -45.125 -7.158 QT
-46.391 -7.158 -47.125 -7.908 QT
-47.86 -8.658 -47.86 -9.908 QT
cp}def
f-734512672
f
GR
GS
[0 -0.75 0.75 0 59.06106 240.12482] CT
0.149 GC
N
/f-2135108308{-34.468 -7.392 M
-34.468 -8.126 L
-32.311 -8.126 -32.311 -8.798 QT
-32.311 -20.33 L
-32.311 -21.001 -34.468 -21.001 QT
-34.468 -21.736 L
-27.874 -21.736 L
-26.702 -21.736 -25.405 -21.314 QT
-24.108 -20.892 -23.233 -20.017 QT
-22.358 -19.142 -22.358 -17.939 QT
-22.358 -17.048 -22.889 -16.361 QT
-23.421 -15.673 -24.249 -15.205 QT
-25.077 -14.736 -25.936 -14.533 QT
-24.983 -14.205 -24.28 -13.486 QT
-23.577 -12.767 -23.436 -11.845 QT
-23.139 -9.97 L
-22.921 -8.72 -22.702 -8.095 QT
-22.483 -7.47 -21.702 -7.47 QT
-21.046 -7.47 -20.725 -8.08 QT
-20.405 -8.689 -20.405 -9.408 QT
-20.405 -9.486 -20.335 -9.541 QT
-20.264 -9.595 -20.202 -9.595 QT
-19.999 -9.595 L
-19.796 -9.595 -19.796 -9.314 QT
-19.796 -8.751 -20.022 -8.197 QT
-20.249 -7.642 -20.679 -7.283 QT
-21.108 -6.923 -21.686 -6.923 QT
-23.202 -6.923 -24.296 -7.681 QT
-25.389 -8.439 -25.389 -9.892 QT
-25.389 -11.767 L
-25.389 -12.814 -26.116 -13.556 QT
-26.843 -14.298 -27.905 -14.298 QT
-30.421 -14.298 L
-30.421 -8.798 L
-30.421 -8.126 -28.264 -8.126 QT
-28.264 -7.392 L
-34.468 -7.392 L
cp
-30.421 -14.845 M
-28.171 -14.845 L
-26.436 -14.845 -25.522 -15.548 QT
-24.608 -16.251 -24.608 -17.939 QT
-24.608 -19.611 -25.514 -20.306 QT
-26.421 -21.001 -28.171 -21.001 QT
-29.358 -21.001 L
-29.733 -21.001 -29.944 -20.97 QT
-30.155 -20.939 -30.288 -20.791 QT
-30.421 -20.642 -30.421 -20.33 QT
-30.421 -14.845 L
cp}def
f-2135108308
f
GR
GS
[0 -0.75 0.75 0 59.06106 240.12482] CT
0.149 GC
N
/f2096556972{-19.212 -9.455 M
-19.212 -10.705 -18.228 -11.486 QT
-17.243 -12.267 -15.868 -12.595 QT
-14.493 -12.923 -13.243 -12.923 QT
-13.243 -13.783 L
-13.243 -14.392 -13.509 -14.955 QT
-13.775 -15.517 -14.282 -15.884 QT
-14.79 -16.251 -15.384 -16.251 QT
-16.79 -16.251 -17.509 -15.626 QT
-17.118 -15.626 -16.853 -15.322 QT
-16.587 -15.017 -16.587 -14.626 QT
-16.587 -14.205 -16.884 -13.908 QT
-17.181 -13.611 -17.587 -13.611 QT
-18.009 -13.611 -18.306 -13.908 QT
-18.603 -14.205 -18.603 -14.626 QT
-18.603 -15.736 -17.603 -16.267 QT
-16.603 -16.798 -15.384 -16.798 QT
-14.54 -16.798 -13.681 -16.439 QT
-12.822 -16.08 -12.267 -15.4 QT
-11.712 -14.72 -11.712 -13.814 QT
-11.712 -9.095 L
-11.712 -8.689 -11.54 -8.345 QT
-11.368 -8.001 -11.009 -8.001 QT
-10.65 -8.001 -10.486 -8.345 QT
-10.322 -8.689 -10.322 -9.095 QT
-10.322 -10.439 L
-9.697 -10.439 L
-9.697 -9.095 L
-9.697 -8.626 -9.947 -8.197 QT
-10.197 -7.767 -10.611 -7.517 QT
-11.025 -7.267 -11.509 -7.267 QT
-12.118 -7.267 -12.564 -7.744 QT
-13.009 -8.22 -13.056 -8.876 QT
-13.447 -8.095 -14.204 -7.626 QT
-14.962 -7.158 -15.837 -7.158 QT
-16.634 -7.158 -17.407 -7.392 QT
-18.181 -7.626 -18.697 -8.134 QT
-19.212 -8.642 -19.212 -9.455 QT
cp
-17.509 -9.455 M
-17.509 -8.72 -16.97 -8.212 QT
-16.431 -7.705 -15.681 -7.705 QT
-15.009 -7.705 -14.454 -8.048 QT
-13.9 -8.392 -13.572 -8.97 QT
-13.243 -9.548 -13.243 -10.205 QT
-13.243 -12.392 L
-14.197 -12.392 -15.197 -12.08 QT
-16.197 -11.767 -16.853 -11.095 QT
-17.509 -10.423 -17.509 -9.455 QT
cp}def
f2096556972
f
GR
GS
[0 -0.75 0.75 0 59.06106 240.12482] CT
0.149 GC
N
/f633394916{-9.164 -7.392 M
-9.164 -8.126 L
-8.445 -8.126 -7.985 -8.244 QT
-7.524 -8.361 -7.524 -8.798 QT
-7.524 -14.533 L
-7.524 -15.095 -7.695 -15.345 QT
-7.867 -15.595 -8.18 -15.65 QT
-8.492 -15.705 -9.164 -15.705 QT
-9.164 -16.439 L
-6.117 -16.673 L
-6.117 -14.626 L
-5.695 -15.517 -4.867 -16.095 QT
-4.039 -16.673 -3.07 -16.673 QT
-1.617 -16.673 -0.883 -15.978 QT
-0.149 -15.283 -0.149 -13.845 QT
-0.149 -8.798 L
-0.149 -8.361 0.312 -8.244 QT
0.773 -8.126 1.492 -8.126 QT
1.492 -7.392 L
-3.32 -7.392 L
-3.32 -8.126 L
-2.602 -8.126 -2.141 -8.244 QT
-1.68 -8.361 -1.68 -8.798 QT
-1.68 -13.783 L
-1.68 -14.798 -1.977 -15.462 QT
-2.274 -16.126 -3.195 -16.126 QT
-4.414 -16.126 -5.203 -15.15 QT
-5.992 -14.173 -5.992 -12.939 QT
-5.992 -8.798 L
-5.992 -8.361 -5.524 -8.244 QT
-5.055 -8.126 -4.352 -8.126 QT
-4.352 -7.392 L
-9.164 -7.392 L
cp}def
f633394916
f
GR
GS
[0 -0.75 0.75 0 59.06106 240.12482] CT
0.149 GC
N
/f-352670196{2.196 -5.751 M
2.196 -6.501 2.743 -7.056 QT
3.29 -7.611 4.04 -7.861 QT
3.618 -8.173 3.399 -8.658 QT
3.181 -9.142 3.181 -9.673 QT
3.181 -10.658 3.806 -11.423 QT
2.837 -12.361 2.837 -13.58 QT
2.837 -14.236 3.118 -14.814 QT
3.399 -15.392 3.907 -15.814 QT
4.415 -16.236 5.024 -16.455 QT
5.634 -16.673 6.29 -16.673 QT
7.54 -16.673 8.524 -15.939 QT
8.962 -16.408 9.548 -16.658 QT
10.134 -16.908 10.774 -16.908 QT
11.228 -16.908 11.517 -16.587 QT
11.806 -16.267 11.806 -15.814 QT
11.806 -15.548 11.61 -15.353 QT
11.415 -15.158 11.149 -15.158 QT
10.884 -15.158 10.689 -15.353 QT
10.493 -15.548 10.493 -15.814 QT
10.493 -16.205 10.759 -16.361 QT
9.665 -16.361 8.884 -15.611 QT
9.274 -15.22 9.501 -14.673 QT
9.728 -14.126 9.728 -13.58 QT
9.728 -12.689 9.235 -11.978 QT
8.743 -11.267 7.939 -10.876 QT
7.134 -10.486 6.29 -10.486 QT
5.134 -10.486 4.181 -11.111 QT
3.884 -10.689 3.884 -10.189 QT
3.884 -9.626 4.251 -9.212 QT
4.618 -8.798 5.165 -8.798 QT
6.884 -8.798 L
8.134 -8.798 9.142 -8.572 QT
10.149 -8.345 10.829 -7.666 QT
11.509 -6.986 11.509 -5.751 QT
11.509 -4.83 10.735 -4.22 QT
9.962 -3.611 8.876 -3.337 QT
7.79 -3.064 6.868 -3.064 QT
5.931 -3.064 4.845 -3.337 QT
3.759 -3.611 2.978 -4.22 QT
2.196 -4.83 2.196 -5.751 QT
cp
3.384 -5.751 M
3.384 -5.048 3.954 -4.572 QT
4.524 -4.095 5.337 -3.861 QT
6.149 -3.626 6.868 -3.626 QT
7.571 -3.626 8.384 -3.861 QT
9.196 -4.095 9.767 -4.572 QT
10.337 -5.048 10.337 -5.751 QT
10.337 -6.845 9.329 -7.173 QT
8.321 -7.501 6.884 -7.501 QT
5.165 -7.501 L
4.681 -7.501 4.274 -7.267 QT
3.868 -7.033 3.626 -6.619 QT
3.384 -6.205 3.384 -5.751 QT
cp
6.29 -11.048 M
8.071 -11.048 8.071 -13.58 QT
8.071 -14.689 7.689 -15.4 QT
7.306 -16.111 6.29 -16.111 QT
5.259 -16.111 4.876 -15.4 QT
4.493 -14.689 4.493 -13.58 QT
4.493 -12.892 4.642 -12.33 QT
4.79 -11.767 5.181 -11.408 QT
5.571 -11.048 6.29 -11.048 QT
cp}def
f-352670196
f
GR
GS
[0 -0.75 0.75 0 59.06106 240.12482] CT
0.149 GC
N
/f268435078{17.119 -7.158 M
15.838 -7.158 14.768 -7.83 QT
13.697 -8.501 13.08 -9.626 QT
12.463 -10.751 12.463 -12.001 QT
12.463 -13.22 13.026 -14.33 QT
13.588 -15.439 14.588 -16.119 QT
15.588 -16.798 16.822 -16.798 QT
17.776 -16.798 18.494 -16.478 QT
19.213 -16.158 19.674 -15.587 QT
20.135 -15.017 20.369 -14.236 QT
20.604 -13.455 20.604 -12.517 QT
20.604 -12.236 20.385 -12.236 QT
14.307 -12.236 L
14.307 -12.017 L
14.307 -10.267 15.01 -9.017 QT
15.713 -7.767 17.307 -7.767 QT
17.947 -7.767 18.494 -8.056 QT
19.041 -8.345 19.447 -8.861 QT
19.854 -9.376 19.994 -9.955 QT
20.01 -10.033 20.072 -10.087 QT
20.135 -10.142 20.197 -10.142 QT
20.385 -10.142 L
20.604 -10.142 20.604 -9.876 QT
20.307 -8.689 19.322 -7.923 QT
18.338 -7.158 17.119 -7.158 QT
cp
14.322 -12.767 M
19.119 -12.767 L
19.119 -13.548 18.893 -14.361 QT
18.666 -15.173 18.158 -15.712 QT
17.651 -16.251 16.822 -16.251 QT
15.635 -16.251 14.979 -15.142 QT
14.322 -14.033 14.322 -12.767 QT
cp}def
f268435078
f
GR
GS
[0 -0.75 0.75 0 59.06106 240.12482] CT
0.149 GC
N
/f-1693555034{29.027 -7.095 M
29.027 -12.001 L
29.027 -12.158 29.215 -12.158 QT
29.48 -12.158 L
29.543 -12.158 29.59 -12.111 QT
29.637 -12.064 29.637 -12.001 QT
29.637 -9.939 30.918 -8.806 QT
32.199 -7.673 34.262 -7.673 QT
34.996 -7.673 35.613 -8.095 QT
36.23 -8.517 36.566 -9.197 QT
36.902 -9.876 36.902 -10.595 QT
36.902 -11.236 36.652 -11.837 QT
36.402 -12.439 35.918 -12.876 QT
35.433 -13.314 34.824 -13.47 QT
32.105 -14.126 L
30.746 -14.486 29.887 -15.603 QT
29.027 -16.72 29.027 -18.095 QT
29.027 -19.189 29.582 -20.142 QT
30.137 -21.095 31.074 -21.65 QT
32.012 -22.205 33.105 -22.205 QT
35.215 -22.205 36.449 -20.767 QT
37.308 -22.142 L
37.371 -22.205 37.449 -22.205 QT
37.59 -22.205 L
37.652 -22.205 37.715 -22.158 QT
37.777 -22.111 37.777 -22.017 QT
37.777 -17.158 L
37.777 -16.97 37.59 -16.97 QT
37.355 -16.97 L
37.152 -16.97 37.152 -17.158 QT
37.152 -17.689 36.972 -18.322 QT
36.793 -18.955 36.48 -19.541 QT
36.168 -20.126 35.793 -20.501 QT
34.777 -21.517 33.105 -21.517 QT
32.387 -21.517 31.785 -21.158 QT
31.183 -20.798 30.824 -20.173 QT
30.465 -19.548 30.465 -18.861 QT
30.465 -17.955 31.019 -17.22 QT
31.574 -16.486 32.48 -16.251 QT
35.215 -15.58 L
35.887 -15.423 36.488 -14.994 QT
37.09 -14.564 37.488 -14.001 QT
37.887 -13.439 38.113 -12.751 QT
38.34 -12.064 38.34 -11.314 QT
38.34 -10.189 37.816 -9.173 QT
37.293 -8.158 36.34 -7.541 QT
35.387 -6.923 34.262 -6.923 QT
33.574 -6.923 32.84 -7.08 QT
32.105 -7.236 31.496 -7.556 QT
30.887 -7.876 30.371 -8.376 QT
29.496 -6.986 L
29.433 -6.923 29.34 -6.923 QT
29.215 -6.923 L
29.027 -6.923 29.027 -7.095 QT
cp}def
f-1693555034
f
GR
GS
[0 -0.75 0.75 0 59.06106 240.12482] CT
0.149 GC
N
/f-1962069759{42.81 -7.392 M
42.81 -8.126 L
43.872 -8.126 44.864 -8.244 QT
45.856 -8.361 45.856 -8.798 QT
45.856 -20.33 L
45.856 -20.783 45.606 -20.892 QT
45.356 -21.001 44.794 -21.001 QT
43.903 -21.001 L
42.169 -21.001 41.45 -20.236 QT
41.075 -19.861 40.911 -19.025 QT
40.747 -18.189 40.622 -16.923 QT
40.028 -16.923 L
40.419 -21.736 L
53.247 -21.736 L
53.653 -16.923 L
53.028 -16.923 L
52.903 -18.283 52.755 -19.08 QT
52.606 -19.876 52.231 -20.236 QT
51.481 -21.001 49.763 -21.001 QT
48.888 -21.001 L
48.497 -21.001 48.286 -20.97 QT
48.075 -20.939 47.942 -20.791 QT
47.81 -20.642 47.81 -20.33 QT
47.81 -8.798 L
47.81 -8.361 48.81 -8.244 QT
49.81 -8.126 50.856 -8.126 QT
50.856 -7.392 L
42.81 -7.392 L
cp}def
f-1962069759
f
GR
GS
[0 -0.75 0.75 0 59.06106 240.12482] CT
0.149 GC
N
/f1673422173{54.795 -7.392 M
54.795 -8.126 L
56.952 -8.126 56.952 -8.798 QT
56.952 -20.33 L
56.952 -21.001 54.795 -21.001 QT
54.795 -21.736 L
62.53 -21.736 L
63.967 -21.736 65.155 -21.119 QT
66.342 -20.501 67.186 -19.462 QT
68.03 -18.423 68.483 -17.111 QT
68.936 -15.798 68.936 -14.423 QT
68.936 -13.095 68.475 -11.837 QT
68.014 -10.58 67.147 -9.572 QT
66.28 -8.564 65.1 -7.978 QT
63.92 -7.392 62.53 -7.392 QT
54.795 -7.392 L
cp
58.842 -8.798 M
58.842 -8.345 59.1 -8.236 QT
59.358 -8.126 59.905 -8.126 QT
61.983 -8.126 L
63.061 -8.126 64.03 -8.595 QT
64.999 -9.064 65.639 -9.892 QT
66.311 -10.783 66.53 -11.869 QT
66.749 -12.955 66.749 -14.423 QT
66.749 -15.955 66.53 -17.103 QT
66.311 -18.251 65.639 -19.158 QT
65.014 -20.048 64.053 -20.525 QT
63.092 -21.001 61.983 -21.001 QT
59.905 -21.001 L
59.53 -21.001 59.319 -20.97 QT
59.108 -20.939 58.975 -20.791 QT
58.842 -20.642 58.842 -20.33 QT
58.842 -8.798 L
cp}def
f1673422173
f
GR
GS
[0 -0.75 0.75 0 59.06106 240.12482] CT
0.149 GC
N
/f-1041370694{76.856 -11.283 M
76.856 -12.58 L
82.419 -12.58 L
82.419 -11.283 L
76.856 -11.283 L
cp}def
f-1041370694
f
GR
GS
[0 -0.75 0.75 0 59.06106 240.12482] CT
0.149 GC
N
/f934383264{94.233 -7.158 M
93.311 -7.158 92.584 -7.603 QT
91.858 -8.048 91.467 -8.806 QT
91.077 -9.564 91.077 -10.486 QT
91.077 -11.455 91.514 -12.533 QT
91.952 -13.611 92.717 -14.501 QT
93.483 -15.392 94.444 -15.916 QT
95.405 -16.439 96.42 -16.439 QT
101.717 -16.439 L
101.936 -16.439 102.084 -16.298 QT
102.233 -16.158 102.233 -15.908 QT
102.233 -15.611 102.014 -15.376 QT
101.795 -15.142 101.483 -15.142 QT
98.92 -15.142 L
99.53 -14.236 99.53 -12.955 QT
99.53 -11.908 99.116 -10.884 QT
98.702 -9.861 97.975 -9.009 QT
97.248 -8.158 96.28 -7.658 QT
95.311 -7.158 94.233 -7.158 QT
cp
94.264 -7.705 M
95.405 -7.705 96.295 -8.603 QT
97.186 -9.501 97.655 -10.798 QT
98.123 -12.095 98.123 -13.205 QT
98.123 -14.111 97.623 -14.626 QT
97.123 -15.142 96.233 -15.142 QT
95.014 -15.142 94.162 -14.322 QT
93.311 -13.501 92.881 -12.259 QT
92.452 -11.017 92.452 -9.876 QT
92.452 -8.97 92.928 -8.337 QT
93.405 -7.705 94.264 -7.705 QT
cp}def
f934383264
f
GR
GS
[0 -0.75 0.75 0 59.06106 240.12482] CT
0.149 GC
N
/f299700369{102.638 -4.312 M
102.497 -4.312 102.497 -4.5 QT
102.544 -4.812 102.669 -4.812 QT
103.497 -4.812 103.794 -4.859 QT
104.122 -4.937 104.2 -5.281 QT
106.122 -12.968 L
106.153 -13.109 106.153 -13.14 QT
106.153 -13.234 106.106 -13.273 QT
106.06 -13.312 105.966 -13.328 QT
105.685 -13.39 104.903 -13.39 QT
104.763 -13.39 104.763 -13.562 QT
104.81 -13.75 104.833 -13.812 QT
104.856 -13.875 104.997 -13.875 QT
108.903 -13.875 L
109.044 -13.875 109.044 -13.687 QT
109.044 -13.656 109.02 -13.578 QT
108.997 -13.5 108.966 -13.445 QT
108.935 -13.39 108.856 -13.39 QT
108.044 -13.39 107.731 -13.328 QT
107.419 -13.25 107.341 -12.906 QT
105.419 -5.218 L
105.388 -5.046 105.388 -5.031 QT
105.388 -5 105.395 -4.968 QT
105.403 -4.937 105.435 -4.914 QT
105.466 -4.89 105.497 -4.882 QT
105.528 -4.875 105.575 -4.859 QT
105.841 -4.812 106.638 -4.812 QT
106.778 -4.812 106.778 -4.625 QT
106.731 -4.421 106.7 -4.367 QT
106.669 -4.312 106.528 -4.312 QT
102.638 -4.312 L
cp}def
f299700369
f
GR
GS
[0 -0.75 0.75 0 59.06106 240.12482] CT
0.149 GC
N
/f-1429552031{119.846 -2.142 M
119.846 -23.142 L
122.721 -23.142 L
122.721 -22.298 L
120.689 -22.298 L
120.689 -2.986 L
122.721 -2.986 L
122.721 -2.142 L
119.846 -2.142 L
cp}def
f-1429552031
f
GR
GS
[0 -0.75 0.75 0 59.06106 240.12482] CT
0.149 GC
N
/f-251565797{123.69 -7.392 M
123.69 -8.126 L
124.409 -8.126 124.87 -8.244 QT
125.33 -8.361 125.33 -8.798 QT
125.33 -14.533 L
125.33 -15.095 125.159 -15.345 QT
124.987 -15.595 124.674 -15.65 QT
124.362 -15.705 123.69 -15.705 QT
123.69 -16.439 L
126.737 -16.673 L
126.737 -14.626 L
127.159 -15.517 127.987 -16.095 QT
128.815 -16.673 129.784 -16.673 QT
132.205 -16.673 132.627 -14.705 QT
133.049 -15.58 133.854 -16.126 QT
134.659 -16.673 135.627 -16.673 QT
136.58 -16.673 137.229 -16.369 QT
137.877 -16.064 138.205 -15.431 QT
138.534 -14.798 138.534 -13.845 QT
138.534 -8.798 L
138.534 -8.361 139.002 -8.244 QT
139.471 -8.126 140.174 -8.126 QT
140.174 -7.392 L
135.377 -7.392 L
135.377 -8.126 L
136.08 -8.126 136.549 -8.244 QT
137.018 -8.361 137.018 -8.798 QT
137.018 -13.783 L
137.018 -14.83 136.713 -15.478 QT
136.409 -16.126 135.487 -16.126 QT
134.284 -16.126 133.495 -15.15 QT
132.705 -14.173 132.705 -12.939 QT
132.705 -8.798 L
132.705 -8.361 133.166 -8.244 QT
133.627 -8.126 134.346 -8.126 QT
134.346 -7.392 L
129.534 -7.392 L
129.534 -8.126 L
130.252 -8.126 130.713 -8.244 QT
131.174 -8.361 131.174 -8.798 QT
131.174 -13.783 L
131.174 -14.798 130.877 -15.462 QT
130.58 -16.126 129.659 -16.126 QT
128.44 -16.126 127.651 -15.15 QT
126.862 -14.173 126.862 -12.939 QT
126.862 -8.798 L
126.862 -8.361 127.33 -8.244 QT
127.799 -8.126 128.502 -8.126 QT
128.502 -7.392 L
123.69 -7.392 L
cp}def
f-251565797
f
GR
GS
[0 -0.75 0.75 0 59.06106 240.12482] CT
0.149 GC
N
/f712788810{140.645 -2.142 M
140.645 -2.986 L
142.676 -2.986 L
142.676 -22.298 L
140.645 -22.298 L
140.645 -23.142 L
143.52 -23.142 L
143.52 -2.142 L
140.645 -2.142 L
cp}def
f712788810
f
GR
GS
[0.75 0 0 0.75 0 0.5] CT
1 LJ
1.333 LW
N
113 463.647 M
197.125 406.097 L
281.25 398.233 L
365.375 388.949 L
449.5 341.59 L
533.625 333.038 L
617.75 228.116 L
701.875 218.38 L
786 139.604 L
S
GR
GS
[0.75 0 0 0.75 84.75 348.23555] CT
N
4.389 -0.5 M
4.389 -3.2 2.2 -5.389 -0.5 -5.389 C
-3.2 -5.389 -5.389 -3.2 -5.389 -0.5 C
-5.389 2.2 -3.2 4.389 -0.5 4.389 C
2.2 4.389 4.389 2.2 4.389 -0.5 C
f
GR
GS
[0.75 0 0 0.75 84.75 348.23555] CT
10.0 ML
1.333 LW
N
4.389 -0.5 M
4.389 -3.2 2.2 -5.389 -0.5 -5.389 C
-3.2 -5.389 -5.389 -3.2 -5.389 -0.5 C
-5.389 2.2 -3.2 4.389 -0.5 4.389 C
2.2 4.389 4.389 2.2 4.389 -0.5 C
S
GR
GS
[0.75 0 0 0.75 147.84375 305.07283] CT
N
/f335342531{4.389 -0.5 M
4.389 -3.2 2.2 -5.389 -0.5 -5.389 C
-3.2 -5.389 -5.389 -3.2 -5.389 -0.5 C
-5.389 2.2 -3.2 4.389 -0.5 4.389 C
2.2 4.389 4.389 2.2 4.389 -0.5 C}def
f335342531
f
GR
GS
[0.75 0 0 0.75 147.84375 305.07283] CT
10.0 ML
1.333 LW
N
4.389 -0.5 M
4.389 -3.2 2.2 -5.389 -0.5 -5.389 C
-3.2 -5.389 -5.389 -3.2 -5.389 -0.5 C
-5.389 2.2 -3.2 4.389 -0.5 4.389 C
2.2 4.389 4.389 2.2 4.389 -0.5 C
S
GR
GS
[0.75 0 0 0.75 210.9375 299.17489] CT
N
f335342531
f
GR
GS
[0.75 0 0 0.75 210.9375 299.17489] CT
10.0 ML
1.333 LW
N
4.389 -0.5 M
4.389 -3.2 2.2 -5.389 -0.5 -5.389 C
-3.2 -5.389 -5.389 -3.2 -5.389 -0.5 C
-5.389 2.2 -3.2 4.389 -0.5 4.389 C
2.2 4.389 4.389 2.2 4.389 -0.5 C
S
GR
GS
[0.75 0 0 0.75 274.03125 292.21169] CT
N
f335342531
f
GR
GS
[0.75 0 0 0.75 274.03125 292.21169] CT
10.0 ML
1.333 LW
N
4.389 -0.5 M
4.389 -3.2 2.2 -5.389 -0.5 -5.389 C
-3.2 -5.389 -5.389 -3.2 -5.389 -0.5 C
-5.389 2.2 -3.2 4.389 -0.5 4.389 C
2.2 4.389 4.389 2.2 4.389 -0.5 C
S
GR
GS
[0.75 0 0 0.75 337.125 256.69231] CT
N
f335342531
f
GR
GS
[0.75 0 0 0.75 337.125 256.69231] CT
10.0 ML
1.333 LW
N
4.389 -0.5 M
4.389 -3.2 2.2 -5.389 -0.5 -5.389 C
-3.2 -5.389 -5.389 -3.2 -5.389 -0.5 C
-5.389 2.2 -3.2 4.389 -0.5 4.389 C
2.2 4.389 4.389 2.2 4.389 -0.5 C
S
GR
GS
[0.75 0 0 0.75 400.21875 250.27868] CT
N
f335342531
f
GR
GS
[0.75 0 0 0.75 400.21875 250.27868] CT
10.0 ML
1.333 LW
N
4.389 -0.5 M
4.389 -3.2 2.2 -5.389 -0.5 -5.389 C
-3.2 -5.389 -5.389 -3.2 -5.389 -0.5 C
-5.389 2.2 -3.2 4.389 -0.5 4.389 C
2.2 4.389 4.389 2.2 4.389 -0.5 C
S
GR
GS
[0.75 0 0 0.75 463.3125 171.58677] CT
N
f335342531
f
GR
GS
[0.75 0 0 0.75 463.3125 171.58677] CT
10.0 ML
1.333 LW
N
4.389 -0.5 M
4.389 -3.2 2.2 -5.389 -0.5 -5.389 C
-3.2 -5.389 -5.389 -3.2 -5.389 -0.5 C
-5.389 2.2 -3.2 4.389 -0.5 4.389 C
2.2 4.389 4.389 2.2 4.389 -0.5 C
S
GR
GS
[0.75 0 0 0.75 526.40625 164.28498] CT
N
f335342531
f
GR
GS
[0.75 0 0 0.75 526.40625 164.28498] CT
10.0 ML
1.333 LW
N
4.389 -0.5 M
4.389 -3.2 2.2 -5.389 -0.5 -5.389 C
-3.2 -5.389 -5.389 -3.2 -5.389 -0.5 C
-5.389 2.2 -3.2 4.389 -0.5 4.389 C
2.2 4.389 4.389 2.2 4.389 -0.5 C
S
GR
GS
[0.75 0 0 0.75 589.5 105.20268] CT
N
f335342531
f
GR
GS
[0.75 0 0 0.75 589.5 105.20268] CT
10.0 ML
1.333 LW
N
4.389 -0.5 M
4.389 -3.2 2.2 -5.389 -0.5 -5.389 C
-3.2 -5.389 -5.389 -3.2 -5.389 -0.5 C
-5.389 2.2 -3.2 4.389 -0.5 4.389 C
2.2 4.389 4.389 2.2 4.389 -0.5 C
S
GR
GS
[0.75 0 0 0.75 0 0.5] CT
1 0 0 RC
[10 6] 0 setdash
2 LJ
1.333 LW
N
113 568.572 M
197.125 407.592 L
281.25 424.611 L
365.375 363.212 L
449.5 304.644 L
533.625 333.152 L
617.75 76.381 L
701.875 69.234 L
786 88.176 L
S
GR
GS
[0.75 0 0 0.75 84.75 426.92883] CT
1 0 0 RC
N
f335342531
f
GR
GS
[0.75 0 0 0.75 84.75 426.92883] CT
1 0 0 RC
10.0 ML
1.333 LW
N
4.389 -0.5 M
4.389 -3.2 2.2 -5.389 -0.5 -5.389 C
-3.2 -5.389 -5.389 -3.2 -5.389 -0.5 C
-5.389 2.2 -3.2 4.389 -0.5 4.389 C
2.2 4.389 4.389 2.2 4.389 -0.5 C
S
GR
GS
[0.75 0 0 0.75 147.84375 306.19396] CT
1 0 0 RC
N
f335342531
f
GR
GS
[0.75 0 0 0.75 147.84375 306.19396] CT
1 0 0 RC
10.0 ML
1.333 LW
N
4.389 -0.5 M
4.389 -3.2 2.2 -5.389 -0.5 -5.389 C
-3.2 -5.389 -5.389 -3.2 -5.389 -0.5 C
-5.389 2.2 -3.2 4.389 -0.5 4.389 C
2.2 4.389 4.389 2.2 4.389 -0.5 C
S
GR
GS
[0.75 0 0 0.75 210.9375 318.9579] CT
1 0 0 RC
N
f335342531
f
GR
GS
[0.75 0 0 0.75 210.9375 318.9579] CT
1 0 0 RC
10.0 ML
1.333 LW
N
4.389 -0.5 M
4.389 -3.2 2.2 -5.389 -0.5 -5.389 C
-3.2 -5.389 -5.389 -3.2 -5.389 -0.5 C
-5.389 2.2 -3.2 4.389 -0.5 4.389 C
2.2 4.389 4.389 2.2 4.389 -0.5 C
S
GR
GS
[0.75 0 0 0.75 274.03125 272.90864] CT
1 0 0 RC
N
f335342531
f
GR
GS
[0.75 0 0 0.75 274.03125 272.90864] CT
1 0 0 RC
10.0 ML
1.333 LW
N
4.389 -0.5 M
4.389 -3.2 2.2 -5.389 -0.5 -5.389 C
-3.2 -5.389 -5.389 -3.2 -5.389 -0.5 C
-5.389 2.2 -3.2 4.389 -0.5 4.389 C
2.2 4.389 4.389 2.2 4.389 -0.5 C
S
GR
GS
[0.75 0 0 0.75 337.125 228.98303] CT
1 0 0 RC
N
f335342531
f
GR
GS
[0.75 0 0 0.75 337.125 228.98303] CT
1 0 0 RC
10.0 ML
1.333 LW
N
4.389 -0.5 M
4.389 -3.2 2.2 -5.389 -0.5 -5.389 C
-3.2 -5.389 -5.389 -3.2 -5.389 -0.5 C
-5.389 2.2 -3.2 4.389 -0.5 4.389 C
2.2 4.389 4.389 2.2 4.389 -0.5 C
S
GR
GS
[0.75 0 0 0.75 400.21875 250.36398] CT
1 0 0 RC
N
f335342531
f
GR
GS
[0.75 0 0 0.75 400.21875 250.36398] CT
1 0 0 RC
10.0 ML
1.333 LW
N
4.389 -0.5 M
4.389 -3.2 2.2 -5.389 -0.5 -5.389 C
-3.2 -5.389 -5.389 -3.2 -5.389 -0.5 C
-5.389 2.2 -3.2 4.389 -0.5 4.389 C
2.2 4.389 4.389 2.2 4.389 -0.5 C
S
GR
GS
[0.75 0 0 0.75 463.3125 57.78538] CT
1 0 0 RC
N
f335342531
f
GR
GS
[0.75 0 0 0.75 463.3125 57.78538] CT
1 0 0 RC
10.0 ML
1.333 LW
N
4.389 -0.5 M
4.389 -3.2 2.2 -5.389 -0.5 -5.389 C
-3.2 -5.389 -5.389 -3.2 -5.389 -0.5 C
-5.389 2.2 -3.2 4.389 -0.5 4.389 C
2.2 4.389 4.389 2.2 4.389 -0.5 C
S
GR
GS
[0.75 0 0 0.75 526.40625 52.42542] CT
1 0 0 RC
N
f335342531
f
GR
GS
[0.75 0 0 0.75 526.40625 52.42542] CT
1 0 0 RC
10.0 ML
1.333 LW
N
4.389 -0.5 M
4.389 -3.2 2.2 -5.389 -0.5 -5.389 C
-3.2 -5.389 -5.389 -3.2 -5.389 -0.5 C
-5.389 2.2 -3.2 4.389 -0.5 4.389 C
2.2 4.389 4.389 2.2 4.389 -0.5 C
S
GR
GS
[0.75 0 0 0.75 589.5 66.63232] CT
1 0 0 RC
N
f335342531
f
GR
GS
[0.75 0 0 0.75 589.5 66.63232] CT
1 0 0 RC
10.0 ML
1.333 LW
N
4.389 -0.5 M
4.389 -3.2 2.2 -5.389 -0.5 -5.389 C
-3.2 -5.389 -5.389 -3.2 -5.389 -0.5 C
-5.389 2.2 -3.2 4.389 -0.5 4.389 C
2.2 4.389 4.389 2.2 4.389 -0.5 C
S
GR
GS
[0.75 0 0 0.75 0 0.5] CT
1 GC
N
/f1474644446{225 576 M
225 546 L
674 546 L
674 576 L
cp}def
f1474644446
f
GR
GS
[0.75 0 0 0.75 203.96855 421.06314] CT
N
/f1886913203{1.172 5.417 M
1.172 0.511 L
1.172 0.354 1.359 0.354 QT
1.625 0.354 L
1.688 0.354 1.734 0.401 QT
1.781 0.448 1.781 0.511 QT
1.781 2.573 3.063 3.706 QT
4.344 4.839 6.406 4.839 QT
7.141 4.839 7.758 4.417 QT
8.375 3.995 8.711 3.315 QT
9.047 2.636 9.047 1.917 QT
9.047 1.276 8.797 0.675 QT
8.547 0.073 8.063 -0.364 QT
7.578 -0.802 6.969 -0.958 QT
4.25 -1.614 L
2.891 -1.974 2.031 -3.091 QT
1.172 -4.208 1.172 -5.583 QT
1.172 -6.677 1.727 -7.63 QT
2.281 -8.583 3.219 -9.138 QT
4.156 -9.693 5.25 -9.693 QT
7.359 -9.693 8.594 -8.255 QT
9.453 -9.63 L
9.516 -9.693 9.594 -9.693 QT
9.734 -9.693 L
9.797 -9.693 9.859 -9.646 QT
9.922 -9.599 9.922 -9.505 QT
9.922 -4.646 L
9.922 -4.458 9.734 -4.458 QT
9.5 -4.458 L
9.297 -4.458 9.297 -4.646 QT
9.297 -5.177 9.117 -5.81 QT
8.938 -6.443 8.625 -7.029 QT
8.313 -7.614 7.938 -7.989 QT
6.922 -9.005 5.25 -9.005 QT
4.531 -9.005 3.93 -8.646 QT
3.328 -8.286 2.969 -7.661 QT
2.609 -7.036 2.609 -6.349 QT
2.609 -5.443 3.164 -4.708 QT
3.719 -3.974 4.625 -3.739 QT
7.359 -3.068 L
8.031 -2.911 8.633 -2.482 QT
9.234 -2.052 9.633 -1.489 QT
10.031 -0.927 10.258 -0.239 QT
10.484 0.448 10.484 1.198 QT
10.484 2.323 9.961 3.339 QT
9.438 4.354 8.484 4.971 QT
7.531 5.589 6.406 5.589 QT
5.719 5.589 4.984 5.432 QT
4.25 5.276 3.641 4.956 QT
3.031 4.636 2.516 4.136 QT
1.641 5.526 L
1.578 5.589 1.484 5.589 QT
1.359 5.589 L
1.172 5.589 1.172 5.417 QT
cp}def
f1886913203
f
GR
GS
[0.75 0 0 0.75 203.96855 421.06314] CT
N
/f165545024{12.493 5.12 M
12.493 4.386 L
13.211 4.386 13.672 4.268 QT
14.133 4.151 14.133 3.714 QT
14.133 -2.021 L
14.133 -2.833 13.821 -3.013 QT
13.508 -3.193 12.586 -3.193 QT
12.586 -3.927 L
15.618 -4.161 L
15.618 3.714 L
15.618 4.151 16.016 4.268 QT
16.414 4.386 17.086 4.386 QT
17.086 5.12 L
12.493 5.12 L
cp
13.383 -7.771 M
13.383 -8.224 13.735 -8.575 QT
14.086 -8.927 14.539 -8.927 QT
14.836 -8.927 15.11 -8.771 QT
15.383 -8.614 15.539 -8.341 QT
15.696 -8.068 15.696 -7.771 QT
15.696 -7.318 15.344 -6.966 QT
14.993 -6.614 14.539 -6.614 QT
14.086 -6.614 13.735 -6.966 QT
13.383 -7.318 13.383 -7.771 QT
cp}def
f165545024
f
GR
GS
[0.75 0 0 0.75 203.96855 421.06314] CT
N
/f-1595314038{18.403 5.12 M
18.403 4.386 L
19.122 4.386 19.583 4.268 QT
20.043 4.151 20.043 3.714 QT
20.043 -2.021 L
20.043 -2.583 19.872 -2.833 QT
19.7 -3.083 19.387 -3.138 QT
19.075 -3.193 18.403 -3.193 QT
18.403 -3.927 L
21.45 -4.161 L
21.45 -2.114 L
21.872 -3.005 22.7 -3.583 QT
23.528 -4.161 24.497 -4.161 QT
26.918 -4.161 27.34 -2.193 QT
27.762 -3.068 28.567 -3.614 QT
29.372 -4.161 30.34 -4.161 QT
31.293 -4.161 31.942 -3.857 QT
32.59 -3.552 32.918 -2.919 QT
33.247 -2.286 33.247 -1.333 QT
33.247 3.714 L
33.247 4.151 33.715 4.268 QT
34.184 4.386 34.887 4.386 QT
34.887 5.12 L
30.09 5.12 L
30.09 4.386 L
30.793 4.386 31.262 4.268 QT
31.731 4.151 31.731 3.714 QT
31.731 -1.271 L
31.731 -2.318 31.426 -2.966 QT
31.122 -3.614 30.2 -3.614 QT
28.997 -3.614 28.208 -2.638 QT
27.418 -1.661 27.418 -0.427 QT
27.418 3.714 L
27.418 4.151 27.879 4.268 QT
28.34 4.386 29.059 4.386 QT
29.059 5.12 L
24.247 5.12 L
24.247 4.386 L
24.965 4.386 25.426 4.268 QT
25.887 4.151 25.887 3.714 QT
25.887 -1.271 L
25.887 -2.286 25.59 -2.95 QT
25.293 -3.614 24.372 -3.614 QT
23.153 -3.614 22.364 -2.638 QT
21.575 -1.661 21.575 -0.427 QT
21.575 3.714 L
21.575 4.151 22.043 4.268 QT
22.512 4.386 23.215 4.386 QT
23.215 5.12 L
18.403 5.12 L
cp}def
f-1595314038
f
GR
GS
[0.75 0 0 0.75 203.96855 421.06314] CT
N
/f517584619{37.321 3.964 M
37.321 3.495 37.673 3.151 QT
38.024 2.807 38.478 2.807 QT
38.759 2.807 39.04 2.964 QT
39.321 3.12 39.478 3.393 QT
39.634 3.667 39.634 3.964 QT
39.634 4.417 39.29 4.768 QT
38.946 5.12 38.478 5.12 QT
38.024 5.12 37.673 4.768 QT
37.321 4.417 37.321 3.964 QT
cp}def
f517584619
f
GR
GS
[0.75 0 0 0.75 203.96855 421.06314] CT
N
/f1259223006{51.604 5.12 M
51.604 4.386 L
53.776 4.386 53.776 3.714 QT
53.776 -7.818 L
53.776 -8.489 51.604 -8.489 QT
51.604 -9.224 L
63.479 -9.224 L
64.072 -4.411 L
63.463 -4.411 L
63.244 -6.224 62.838 -7.044 QT
62.432 -7.864 61.541 -8.177 QT
60.651 -8.489 58.854 -8.489 QT
56.791 -8.489 L
56.416 -8.489 56.205 -8.458 QT
55.994 -8.427 55.862 -8.279 QT
55.729 -8.13 55.729 -7.818 QT
55.729 -2.693 L
57.276 -2.693 L
58.354 -2.693 58.877 -2.872 QT
59.401 -3.052 59.604 -3.56 QT
59.807 -4.068 59.807 -5.146 QT
60.416 -5.146 L
60.416 0.495 L
59.807 0.495 L
59.807 -0.568 59.604 -1.083 QT
59.401 -1.599 58.877 -1.779 QT
58.354 -1.958 57.276 -1.958 QT
55.729 -1.958 L
55.729 3.714 L
55.729 4.167 55.987 4.276 QT
56.244 4.386 56.791 4.386 QT
59.026 4.386 L
60.479 4.386 61.377 4.151 QT
62.276 3.917 62.776 3.378 QT
63.276 2.839 63.541 1.987 QT
63.807 1.136 64.041 -0.38 QT
64.651 -0.38 L
63.776 5.12 L
51.604 5.12 L
cp}def
f1259223006
f
GR
GS
[0.75 0 0 0.75 203.96855 421.06314] CT
N
/f-1939439012{66.185 5.182 M
66.185 1.761 L
66.185 1.589 66.357 1.589 QT
66.622 1.589 L
66.747 1.589 66.779 1.761 QT
67.372 4.807 69.607 4.807 QT
70.607 4.807 71.279 4.354 QT
71.95 3.901 71.95 2.964 QT
71.95 2.276 71.427 1.8 QT
70.904 1.323 70.185 1.151 QT
68.779 0.87 L
68.075 0.714 67.497 0.401 QT
66.919 0.089 66.552 -0.443 QT
66.185 -0.974 66.185 -1.661 QT
66.185 -2.599 66.669 -3.185 QT
67.154 -3.771 67.935 -4.029 QT
68.716 -4.286 69.607 -4.286 QT
70.685 -4.286 71.497 -3.724 QT
72.091 -4.239 L
72.091 -4.286 72.2 -4.286 QT
72.357 -4.286 L
72.419 -4.286 72.466 -4.232 QT
72.513 -4.177 72.513 -4.114 QT
72.513 -1.364 L
72.513 -1.177 72.357 -1.177 QT
72.091 -1.177 L
71.904 -1.177 71.904 -1.364 QT
71.904 -2.474 71.294 -3.138 QT
70.685 -3.802 69.591 -3.802 QT
68.654 -3.802 67.958 -3.45 QT
67.263 -3.099 67.263 -2.255 QT
67.263 -1.661 67.763 -1.294 QT
68.263 -0.927 68.935 -0.755 QT
70.357 -0.489 L
71.075 -0.318 71.693 0.065 QT
72.31 0.448 72.677 1.05 QT
73.044 1.651 73.044 2.386 QT
73.044 3.151 72.779 3.714 QT
72.513 4.276 72.044 4.643 QT
71.575 5.011 70.943 5.182 QT
70.31 5.354 69.607 5.354 QT
68.294 5.354 67.372 4.479 QT
66.607 5.307 L
66.607 5.354 66.482 5.354 QT
66.357 5.354 L
66.185 5.354 66.185 5.182 QT
cp}def
f-1939439012
f
GR
GS
[0.75 0 0 0.75 203.96855 421.06314] CT
N
/f-889975274{76.037 2.604 M
76.037 -3.193 L
74.303 -3.193 L
74.303 -3.739 L
75.678 -3.739 76.318 -5.021 QT
76.959 -6.302 76.959 -7.802 QT
77.568 -7.802 L
77.568 -3.927 L
80.537 -3.927 L
80.537 -3.193 L
77.568 -3.193 L
77.568 2.557 L
77.568 3.432 77.857 4.089 QT
78.146 4.745 78.912 4.745 QT
79.631 4.745 79.951 4.05 QT
80.271 3.354 80.271 2.557 QT
80.271 1.323 L
80.865 1.323 L
80.865 2.604 L
80.865 3.261 80.623 3.901 QT
80.381 4.542 79.912 4.948 QT
79.443 5.354 78.771 5.354 QT
77.506 5.354 76.771 4.604 QT
76.037 3.854 76.037 2.604 QT
cp}def
f-889975274
f
GR
GS
[0.75 0 0 0.75 203.96855 421.06314] CT
N
/f-1042766473{82.833 5.12 M
82.833 4.386 L
83.552 4.386 84.013 4.268 QT
84.474 4.151 84.474 3.714 QT
84.474 -2.021 L
84.474 -2.833 84.162 -3.013 QT
83.849 -3.193 82.927 -3.193 QT
82.927 -3.927 L
85.958 -4.161 L
85.958 3.714 L
85.958 4.151 86.357 4.268 QT
86.755 4.386 87.427 4.386 QT
87.427 5.12 L
82.833 5.12 L
cp
83.724 -7.771 M
83.724 -8.224 84.076 -8.575 QT
84.427 -8.927 84.88 -8.927 QT
85.177 -8.927 85.451 -8.771 QT
85.724 -8.614 85.88 -8.341 QT
86.037 -8.068 86.037 -7.771 QT
86.037 -7.318 85.685 -6.966 QT
85.333 -6.614 84.88 -6.614 QT
84.427 -6.614 84.076 -6.966 QT
83.724 -7.318 83.724 -7.771 QT
cp}def
f-1042766473
f
GR
GS
[0.75 0 0 0.75 203.96855 421.06314] CT
N
/f-1591872418{88.744 5.12 M
88.744 4.386 L
89.462 4.386 89.923 4.268 QT
90.384 4.151 90.384 3.714 QT
90.384 -2.021 L
90.384 -2.583 90.212 -2.833 QT
90.041 -3.083 89.728 -3.138 QT
89.416 -3.193 88.744 -3.193 QT
88.744 -3.927 L
91.791 -4.161 L
91.791 -2.114 L
92.212 -3.005 93.041 -3.583 QT
93.869 -4.161 94.837 -4.161 QT
97.259 -4.161 97.681 -2.193 QT
98.103 -3.068 98.908 -3.614 QT
99.712 -4.161 100.681 -4.161 QT
101.634 -4.161 102.283 -3.857 QT
102.931 -3.552 103.259 -2.919 QT
103.587 -2.286 103.587 -1.333 QT
103.587 3.714 L
103.587 4.151 104.056 4.268 QT
104.525 4.386 105.228 4.386 QT
105.228 5.12 L
100.431 5.12 L
100.431 4.386 L
101.134 4.386 101.603 4.268 QT
102.072 4.151 102.072 3.714 QT
102.072 -1.271 L
102.072 -2.318 101.767 -2.966 QT
101.462 -3.614 100.541 -3.614 QT
99.337 -3.614 98.548 -2.638 QT
97.759 -1.661 97.759 -0.427 QT
97.759 3.714 L
97.759 4.151 98.22 4.268 QT
98.681 4.386 99.4 4.386 QT
99.4 5.12 L
94.587 5.12 L
94.587 4.386 L
95.306 4.386 95.767 4.268 QT
96.228 4.151 96.228 3.714 QT
96.228 -1.271 L
96.228 -2.286 95.931 -2.95 QT
95.634 -3.614 94.712 -3.614 QT
93.494 -3.614 92.705 -2.638 QT
91.916 -1.661 91.916 -0.427 QT
91.916 3.714 L
91.916 4.151 92.384 4.268 QT
92.853 4.386 93.556 4.386 QT
93.556 5.12 L
88.744 5.12 L
cp}def
f-1591872418
f
GR
GS
[0.75 0 0 0.75 203.96855 421.06314] CT
N
/f1814841295{106.74 3.057 M
106.74 1.807 107.725 1.026 QT
108.709 0.245 110.084 -0.083 QT
111.459 -0.411 112.709 -0.411 QT
112.709 -1.271 L
112.709 -1.88 112.443 -2.443 QT
112.178 -3.005 111.67 -3.372 QT
111.162 -3.739 110.568 -3.739 QT
109.162 -3.739 108.443 -3.114 QT
108.834 -3.114 109.1 -2.81 QT
109.365 -2.505 109.365 -2.114 QT
109.365 -1.693 109.068 -1.396 QT
108.772 -1.099 108.365 -1.099 QT
107.943 -1.099 107.647 -1.396 QT
107.35 -1.693 107.35 -2.114 QT
107.35 -3.224 108.35 -3.755 QT
109.35 -4.286 110.568 -4.286 QT
111.412 -4.286 112.272 -3.927 QT
113.131 -3.568 113.686 -2.888 QT
114.24 -2.208 114.24 -1.302 QT
114.24 3.417 L
114.24 3.823 114.412 4.167 QT
114.584 4.511 114.943 4.511 QT
115.303 4.511 115.467 4.167 QT
115.631 3.823 115.631 3.417 QT
115.631 2.073 L
116.256 2.073 L
116.256 3.417 L
116.256 3.886 116.006 4.315 QT
115.756 4.745 115.342 4.995 QT
114.928 5.245 114.443 5.245 QT
113.834 5.245 113.389 4.768 QT
112.943 4.292 112.897 3.636 QT
112.506 4.417 111.748 4.886 QT
110.99 5.354 110.115 5.354 QT
109.318 5.354 108.545 5.12 QT
107.772 4.886 107.256 4.378 QT
106.74 3.87 106.74 3.057 QT
cp
108.443 3.057 M
108.443 3.792 108.982 4.3 QT
109.522 4.807 110.272 4.807 QT
110.943 4.807 111.498 4.464 QT
112.053 4.12 112.381 3.542 QT
112.709 2.964 112.709 2.307 QT
112.709 0.12 L
111.756 0.12 110.756 0.432 QT
109.756 0.745 109.1 1.417 QT
108.443 2.089 108.443 3.057 QT
cp}def
f1814841295
f
GR
GS
[0.75 0 0 0.75 203.96855 421.06314] CT
N
/f-1421181250{118.704 2.604 M
118.704 -3.193 L
116.97 -3.193 L
116.97 -3.739 L
118.345 -3.739 118.985 -5.021 QT
119.626 -6.302 119.626 -7.802 QT
120.235 -7.802 L
120.235 -3.927 L
123.204 -3.927 L
123.204 -3.193 L
120.235 -3.193 L
120.235 2.557 L
120.235 3.432 120.524 4.089 QT
120.813 4.745 121.579 4.745 QT
122.298 4.745 122.618 4.05 QT
122.938 3.354 122.938 2.557 QT
122.938 1.323 L
123.532 1.323 L
123.532 2.604 L
123.532 3.261 123.29 3.901 QT
123.048 4.542 122.579 4.948 QT
122.11 5.354 121.438 5.354 QT
120.173 5.354 119.438 4.604 QT
118.704 3.854 118.704 2.604 QT
cp}def
f-1421181250
f
GR
GS
[0.75 0 0 0.75 203.96855 421.06314] CT
N
/f-252550715{130.094 5.354 M
128.813 5.354 127.742 4.682 QT
126.672 4.011 126.055 2.886 QT
125.438 1.761 125.438 0.511 QT
125.438 -0.708 126 -1.818 QT
126.563 -2.927 127.563 -3.607 QT
128.563 -4.286 129.797 -4.286 QT
130.75 -4.286 131.469 -3.966 QT
132.188 -3.646 132.649 -3.075 QT
133.11 -2.505 133.344 -1.724 QT
133.578 -0.943 133.578 -0.005 QT
133.578 0.276 133.36 0.276 QT
127.281 0.276 L
127.281 0.495 L
127.281 2.245 127.985 3.495 QT
128.688 4.745 130.281 4.745 QT
130.922 4.745 131.469 4.456 QT
132.016 4.167 132.422 3.651 QT
132.828 3.136 132.969 2.557 QT
132.985 2.479 133.047 2.425 QT
133.11 2.37 133.172 2.37 QT
133.36 2.37 L
133.578 2.37 133.578 2.636 QT
133.281 3.823 132.297 4.589 QT
131.313 5.354 130.094 5.354 QT
cp
127.297 -0.255 M
132.094 -0.255 L
132.094 -1.036 131.867 -1.849 QT
131.641 -2.661 131.133 -3.2 QT
130.625 -3.739 129.797 -3.739 QT
128.61 -3.739 127.953 -2.63 QT
127.297 -1.521 127.297 -0.255 QT
cp}def
f-252550715
f
GR
GS
[0.75 0 0 0.75 0 0.5] CT
1 LJ
1.333 LW
N
228.996 560.751 M
268.961 560.751 L
S
GR
GS
[0.75 0 0 0.75 186.73394 421.06314] CT
N
f335342531
f
GR
GS
[0.75 0 0 0.75 186.73394 421.06314] CT
10.0 ML
1.333 LW
N
4.389 -0.5 M
4.389 -3.2 2.2 -5.389 -0.5 -5.389 C
-3.2 -5.389 -5.389 -3.2 -5.389 -0.5 C
-5.389 2.2 -3.2 4.389 -0.5 4.389 C
2.2 4.389 4.389 2.2 4.389 -0.5 C
S
GR
GS
[0.75 0 0 0.75 340.60233 421.06314] CT
N
/f-597267615{0.672 5.12 M
0.672 4.386 L
2.547 4.386 2.984 3.136 QT
7.391 -9.693 L
7.453 -9.911 7.734 -9.911 QT
8 -9.911 L
8.281 -9.911 8.344 -9.693 QT
12.938 3.714 L
13.141 4.151 13.688 4.268 QT
14.234 4.386 15.047 4.386 QT
15.047 5.12 L
9.203 5.12 L
9.203 4.386 L
10.938 4.386 10.938 3.823 QT
10.938 3.714 L
9.797 0.432 L
4.703 0.432 L
3.766 3.136 L
3.75 3.214 3.75 3.354 QT
3.75 3.886 4.242 4.136 QT
4.734 4.386 5.313 4.386 QT
5.313 5.12 L
0.672 5.12 L
cp
4.953 -0.302 M
9.563 -0.302 L
7.25 -7.005 L
4.953 -0.302 L
cp}def
f-597267615
f
GR
GS
[0.75 0 0 0.75 340.60233 421.06314] CT
N
/f-1168933433{16.625 5.12 M
16.625 4.386 L
17.344 4.386 17.805 4.268 QT
18.266 4.151 18.266 3.714 QT
18.266 -2.021 L
18.266 -2.583 18.094 -2.833 QT
17.922 -3.083 17.609 -3.138 QT
17.297 -3.193 16.625 -3.193 QT
16.625 -3.927 L
19.672 -4.161 L
19.672 -2.114 L
20.094 -3.005 20.922 -3.583 QT
21.75 -4.161 22.719 -4.161 QT
24.172 -4.161 24.906 -3.466 QT
25.641 -2.771 25.641 -1.333 QT
25.641 3.714 L
25.641 4.151 26.102 4.268 QT
26.563 4.386 27.281 4.386 QT
27.281 5.12 L
22.469 5.12 L
22.469 4.386 L
23.188 4.386 23.648 4.268 QT
24.109 4.151 24.109 3.714 QT
24.109 -1.271 L
24.109 -2.286 23.813 -2.95 QT
23.516 -3.614 22.594 -3.614 QT
21.375 -3.614 20.586 -2.638 QT
19.797 -1.661 19.797 -0.427 QT
19.797 3.714 L
19.797 4.151 20.266 4.268 QT
20.734 4.386 21.438 4.386 QT
21.438 5.12 L
16.625 5.12 L
cp}def
f-1168933433
f
GR
GS
[0.75 0 0 0.75 340.60233 421.06314] CT
N
/f-1418112550{28.696 3.057 M
28.696 1.807 29.68 1.026 QT
30.664 0.245 32.039 -0.083 QT
33.414 -0.411 34.664 -0.411 QT
34.664 -1.271 L
34.664 -1.88 34.399 -2.443 QT
34.133 -3.005 33.625 -3.372 QT
33.118 -3.739 32.524 -3.739 QT
31.118 -3.739 30.399 -3.114 QT
30.789 -3.114 31.055 -2.81 QT
31.321 -2.505 31.321 -2.114 QT
31.321 -1.693 31.024 -1.396 QT
30.727 -1.099 30.321 -1.099 QT
29.899 -1.099 29.602 -1.396 QT
29.305 -1.693 29.305 -2.114 QT
29.305 -3.224 30.305 -3.755 QT
31.305 -4.286 32.524 -4.286 QT
33.368 -4.286 34.227 -3.927 QT
35.086 -3.568 35.641 -2.888 QT
36.196 -2.208 36.196 -1.302 QT
36.196 3.417 L
36.196 3.823 36.368 4.167 QT
36.539 4.511 36.899 4.511 QT
37.258 4.511 37.422 4.167 QT
37.586 3.823 37.586 3.417 QT
37.586 2.073 L
38.211 2.073 L
38.211 3.417 L
38.211 3.886 37.961 4.315 QT
37.711 4.745 37.297 4.995 QT
36.883 5.245 36.399 5.245 QT
35.789 5.245 35.344 4.768 QT
34.899 4.292 34.852 3.636 QT
34.461 4.417 33.703 4.886 QT
32.946 5.354 32.071 5.354 QT
31.274 5.354 30.5 5.12 QT
29.727 4.886 29.211 4.378 QT
28.696 3.87 28.696 3.057 QT
cp
30.399 3.057 M
30.399 3.792 30.938 4.3 QT
31.477 4.807 32.227 4.807 QT
32.899 4.807 33.453 4.464 QT
34.008 4.12 34.336 3.542 QT
34.664 2.964 34.664 2.307 QT
34.664 0.12 L
33.711 0.12 32.711 0.432 QT
31.711 0.745 31.055 1.417 QT
30.399 2.089 30.399 3.057 QT
cp}def
f-1418112550
f
GR
GS
[0.75 0 0 0.75 340.60233 421.06314] CT
N
/f149381581{39.159 5.12 M
39.159 4.386 L
39.878 4.386 40.339 4.268 QT
40.8 4.151 40.8 3.714 QT
40.8 -7.302 L
40.8 -7.864 40.636 -8.122 QT
40.472 -8.38 40.151 -8.435 QT
39.831 -8.489 39.159 -8.489 QT
39.159 -9.224 L
42.284 -9.458 L
42.284 3.714 L
42.284 4.151 42.745 4.268 QT
43.206 4.386 43.909 4.386 QT
43.909 5.12 L
39.159 5.12 L
cp}def
f149381581
f
GR
GS
[0.75 0 0 0.75 340.60233 421.06314] CT
N
/f-1897066136{45.898 8.573 M
46.288 8.886 46.773 8.886 QT
48.101 8.886 48.929 6.886 QT
49.648 5.12 L
46.507 -2.599 L
46.304 -2.974 45.906 -3.083 QT
45.507 -3.193 44.851 -3.193 QT
44.851 -3.927 L
49.257 -3.927 L
49.257 -3.193 L
48.101 -3.193 48.101 -2.693 QT
48.101 -2.614 48.116 -2.568 QT
50.46 3.167 L
52.554 -1.989 L
52.616 -2.161 52.616 -2.349 QT
52.616 -2.614 52.476 -2.802 QT
52.335 -2.989 52.116 -3.091 QT
51.898 -3.193 51.616 -3.193 QT
51.616 -3.927 L
55.116 -3.927 L
55.116 -3.193 L
54.46 -3.193 53.976 -2.896 QT
53.491 -2.599 53.226 -2.021 QT
49.585 6.886 L
49.304 7.557 48.921 8.128 QT
48.538 8.698 47.984 9.065 QT
47.429 9.432 46.773 9.432 QT
46.007 9.432 45.429 8.925 QT
44.851 8.417 44.851 7.667 QT
44.851 7.276 45.116 7.011 QT
45.382 6.745 45.773 6.745 QT
46.038 6.745 46.249 6.862 QT
46.46 6.979 46.577 7.182 QT
46.695 7.386 46.695 7.667 QT
46.695 7.995 46.468 8.268 QT
46.241 8.542 45.898 8.573 QT
cp}def
f-1897066136
f
GR
GS
[0.75 0 0 0.75 340.60233 421.06314] CT
N
/f1710379367{57.845 2.604 M
57.845 -3.193 L
56.11 -3.193 L
56.11 -3.739 L
57.485 -3.739 58.126 -5.021 QT
58.766 -6.302 58.766 -7.802 QT
59.376 -7.802 L
59.376 -3.927 L
62.345 -3.927 L
62.345 -3.193 L
59.376 -3.193 L
59.376 2.557 L
59.376 3.432 59.665 4.089 QT
59.954 4.745 60.72 4.745 QT
61.438 4.745 61.759 4.05 QT
62.079 3.354 62.079 2.557 QT
62.079 1.323 L
62.673 1.323 L
62.673 2.604 L
62.673 3.261 62.43 3.901 QT
62.188 4.542 61.72 4.948 QT
61.251 5.354 60.579 5.354 QT
59.313 5.354 58.579 4.604 QT
57.845 3.854 57.845 2.604 QT
cp}def
f1710379367
f
GR
GS
[0.75 0 0 0.75 340.60233 421.06314] CT
N
/f-1314359804{64.641 5.12 M
64.641 4.386 L
65.36 4.386 65.821 4.268 QT
66.281 4.151 66.281 3.714 QT
66.281 -2.021 L
66.281 -2.833 65.969 -3.013 QT
65.656 -3.193 64.735 -3.193 QT
64.735 -3.927 L
67.766 -4.161 L
67.766 3.714 L
67.766 4.151 68.164 4.268 QT
68.563 4.386 69.235 4.386 QT
69.235 5.12 L
64.641 5.12 L
cp
65.531 -7.771 M
65.531 -8.224 65.883 -8.575 QT
66.235 -8.927 66.688 -8.927 QT
66.985 -8.927 67.258 -8.771 QT
67.531 -8.614 67.688 -8.341 QT
67.844 -8.068 67.844 -7.771 QT
67.844 -7.318 67.492 -6.966 QT
67.141 -6.614 66.688 -6.614 QT
66.235 -6.614 65.883 -6.966 QT
65.531 -7.318 65.531 -7.771 QT
cp}def
f-1314359804
f
GR
GS
[0.75 0 0 0.75 340.60233 421.06314] CT
N
/f335183859{75.161 5.354 M
73.879 5.354 72.848 4.69 QT
71.817 4.026 71.223 2.925 QT
70.629 1.823 70.629 0.589 QT
70.629 -0.646 71.215 -1.786 QT
71.801 -2.927 72.84 -3.607 QT
73.879 -4.286 75.161 -4.286 QT
76.379 -4.286 77.395 -3.81 QT
78.411 -3.333 78.411 -2.239 QT
78.411 -1.818 78.114 -1.521 QT
77.817 -1.224 77.395 -1.224 QT
76.989 -1.224 76.692 -1.521 QT
76.395 -1.818 76.395 -2.239 QT
76.395 -2.599 76.629 -2.872 QT
76.864 -3.146 77.223 -3.224 QT
76.489 -3.677 75.176 -3.677 QT
74.176 -3.677 73.559 -3.013 QT
72.942 -2.349 72.692 -1.364 QT
72.442 -0.38 72.442 0.589 QT
72.442 1.604 72.746 2.55 QT
73.051 3.495 73.723 4.12 QT
74.395 4.745 75.411 4.745 QT
76.411 4.745 77.106 4.136 QT
77.801 3.526 78.051 2.542 QT
78.051 2.417 78.223 2.417 QT
78.473 2.417 L
78.536 2.417 78.59 2.471 QT
78.645 2.526 78.645 2.604 QT
78.645 2.651 L
78.317 3.901 77.379 4.628 QT
76.442 5.354 75.161 5.354 QT
cp}def
f335183859
f
GR
GS
[0.75 0 0 0.75 340.60233 421.06314] CT
N
/f253899740{87.159 5.12 M
87.159 4.386 L
89.331 4.386 89.331 3.714 QT
89.331 -7.818 L
89.331 -8.489 87.159 -8.489 QT
87.159 -9.224 L
99.034 -9.224 L
99.628 -4.411 L
99.019 -4.411 L
98.8 -6.224 98.394 -7.044 QT
97.987 -7.864 97.097 -8.177 QT
96.206 -8.489 94.409 -8.489 QT
92.347 -8.489 L
91.972 -8.489 91.761 -8.458 QT
91.55 -8.427 91.417 -8.279 QT
91.284 -8.13 91.284 -7.818 QT
91.284 -2.693 L
92.831 -2.693 L
93.909 -2.693 94.433 -2.872 QT
94.956 -3.052 95.159 -3.56 QT
95.362 -4.068 95.362 -5.146 QT
95.972 -5.146 L
95.972 0.495 L
95.362 0.495 L
95.362 -0.568 95.159 -1.083 QT
94.956 -1.599 94.433 -1.779 QT
93.909 -1.958 92.831 -1.958 QT
91.284 -1.958 L
91.284 3.714 L
91.284 4.167 91.542 4.276 QT
91.8 4.386 92.347 4.386 QT
94.581 4.386 L
96.034 4.386 96.933 4.151 QT
97.831 3.917 98.331 3.378 QT
98.831 2.839 99.097 1.987 QT
99.362 1.136 99.597 -0.38 QT
100.206 -0.38 L
99.331 5.12 L
87.159 5.12 L
cp}def
f253899740
f
GR
GS
[0.75 0 0 0.75 340.60233 421.06314] CT
N
/f-1422770973{101.287 5.12 M
101.287 4.386 L
102.1 4.386 102.803 4.073 QT
103.506 3.761 104.006 3.136 QT
105.912 0.714 L
103.428 -2.521 L
103.053 -2.974 102.623 -3.083 QT
102.194 -3.193 101.397 -3.193 QT
101.397 -3.927 L
105.772 -3.927 L
105.772 -3.193 L
105.49 -3.193 105.248 -3.068 QT
105.006 -2.943 105.006 -2.708 QT
105.006 -2.63 105.069 -2.521 QT
106.756 -0.333 L
108.006 -1.958 L
108.272 -2.271 108.272 -2.568 QT
108.272 -2.833 108.1 -3.013 QT
107.928 -3.193 107.647 -3.193 QT
107.647 -3.927 L
111.522 -3.927 L
111.522 -3.193 L
110.709 -3.193 109.998 -2.88 QT
109.287 -2.568 108.787 -1.958 QT
107.131 0.167 L
109.819 3.714 L
110.209 4.182 110.639 4.284 QT
111.069 4.386 111.881 4.386 QT
111.881 5.12 L
107.506 5.12 L
107.506 4.386 L
107.772 4.386 108.006 4.261 QT
108.24 4.136 108.24 3.901 QT
108.24 3.807 108.178 3.714 QT
106.287 1.214 L
104.787 3.136 L
104.537 3.401 104.537 3.761 QT
104.537 4.011 104.717 4.198 QT
104.897 4.386 105.131 4.386 QT
105.131 5.12 L
101.287 5.12 L
cp}def
f-1422770973
f
GR
GS
[0.75 0 0 0.75 340.60233 421.06314] CT
N
/f1072756466{114.437 2.604 M
114.437 -3.193 L
112.703 -3.193 L
112.703 -3.739 L
114.078 -3.739 114.718 -5.021 QT
115.359 -6.302 115.359 -7.802 QT
115.968 -7.802 L
115.968 -3.927 L
118.937 -3.927 L
118.937 -3.193 L
115.968 -3.193 L
115.968 2.557 L
115.968 3.432 116.258 4.089 QT
116.547 4.745 117.312 4.745 QT
118.031 4.745 118.351 4.05 QT
118.672 3.354 118.672 2.557 QT
118.672 1.323 L
119.265 1.323 L
119.265 2.604 L
119.265 3.261 119.023 3.901 QT
118.781 4.542 118.312 4.948 QT
117.843 5.354 117.172 5.354 QT
115.906 5.354 115.172 4.604 QT
114.437 3.854 114.437 2.604 QT
cp}def
f1072756466
f
GR
GS
[0.75 0 0 0.75 340.60233 421.06314] CT
N
/f-869544129{121.14 5.12 M
121.14 4.386 L
121.859 4.386 122.319 4.268 QT
122.78 4.151 122.78 3.714 QT
122.78 -2.021 L
122.78 -2.583 122.609 -2.833 QT
122.437 -3.083 122.116 -3.138 QT
121.796 -3.193 121.14 -3.193 QT
121.14 -3.927 L
124.14 -4.161 L
124.14 -2.114 L
124.484 -3.021 125.109 -3.591 QT
125.734 -4.161 126.624 -4.161 QT
127.249 -4.161 127.741 -3.794 QT
128.234 -3.427 128.234 -2.818 QT
128.234 -2.443 127.96 -2.161 QT
127.687 -1.88 127.296 -1.88 QT
126.905 -1.88 126.624 -2.154 QT
126.343 -2.427 126.343 -2.818 QT
126.343 -3.38 126.749 -3.614 QT
126.624 -3.614 L
125.765 -3.614 125.234 -2.997 QT
124.702 -2.38 124.476 -1.474 QT
124.249 -0.568 124.249 0.276 QT
124.249 3.714 L
124.249 4.386 126.28 4.386 QT
126.28 5.12 L
121.14 5.12 L
cp}def
f-869544129
f
GR
GS
[0.75 0 0 0.75 340.60233 421.06314] CT
N
/f2053660203{129.792 3.057 M
129.792 1.807 130.777 1.026 QT
131.761 0.245 133.136 -0.083 QT
134.511 -0.411 135.761 -0.411 QT
135.761 -1.271 L
135.761 -1.88 135.495 -2.443 QT
135.23 -3.005 134.722 -3.372 QT
134.214 -3.739 133.62 -3.739 QT
132.214 -3.739 131.495 -3.114 QT
131.886 -3.114 132.152 -2.81 QT
132.417 -2.505 132.417 -2.114 QT
132.417 -1.693 132.12 -1.396 QT
131.823 -1.099 131.417 -1.099 QT
130.995 -1.099 130.698 -1.396 QT
130.402 -1.693 130.402 -2.114 QT
130.402 -3.224 131.402 -3.755 QT
132.402 -4.286 133.62 -4.286 QT
134.464 -4.286 135.323 -3.927 QT
136.183 -3.568 136.738 -2.888 QT
137.292 -2.208 137.292 -1.302 QT
137.292 3.417 L
137.292 3.823 137.464 4.167 QT
137.636 4.511 137.995 4.511 QT
138.355 4.511 138.519 4.167 QT
138.683 3.823 138.683 3.417 QT
138.683 2.073 L
139.308 2.073 L
139.308 3.417 L
139.308 3.886 139.058 4.315 QT
138.808 4.745 138.394 4.995 QT
137.98 5.245 137.495 5.245 QT
136.886 5.245 136.441 4.768 QT
135.995 4.292 135.948 3.636 QT
135.558 4.417 134.8 4.886 QT
134.042 5.354 133.167 5.354 QT
132.37 5.354 131.597 5.12 QT
130.823 4.886 130.308 4.378 QT
129.792 3.87 129.792 3.057 QT
cp
131.495 3.057 M
131.495 3.792 132.034 4.3 QT
132.573 4.807 133.323 4.807 QT
133.995 4.807 134.55 4.464 QT
135.105 4.12 135.433 3.542 QT
135.761 2.964 135.761 2.307 QT
135.761 0.12 L
134.808 0.12 133.808 0.432 QT
132.808 0.745 132.152 1.417 QT
131.495 2.089 131.495 3.057 QT
cp}def
f2053660203
f
GR
GS
[0.75 0 0 0.75 340.60233 421.06314] CT
N
/f738686689{140.162 9.198 M
140.162 8.464 L
140.881 8.464 141.342 8.339 QT
141.803 8.214 141.803 7.792 QT
141.803 -2.333 L
141.803 -2.911 141.389 -3.052 QT
140.975 -3.193 140.162 -3.193 QT
140.162 -3.927 L
143.271 -4.161 L
143.271 -2.864 L
143.834 -3.489 144.6 -3.825 QT
145.365 -4.161 146.225 -4.161 QT
147.475 -4.161 148.467 -3.489 QT
149.459 -2.818 150.021 -1.724 QT
150.584 -0.63 150.584 0.589 QT
150.584 1.854 149.959 2.956 QT
149.334 4.057 148.264 4.706 QT
147.193 5.354 145.912 5.354 QT
144.381 5.354 143.334 4.12 QT
143.334 7.792 L
143.334 8.214 143.795 8.339 QT
144.256 8.464 144.975 8.464 QT
144.975 9.198 L
140.162 9.198 L
cp
143.334 3.073 M
143.693 3.823 144.35 4.315 QT
145.006 4.807 145.787 4.807 QT
146.521 4.807 147.076 4.417 QT
147.631 4.026 148.014 3.37 QT
148.396 2.714 148.576 1.987 QT
148.756 1.261 148.756 0.589 QT
148.756 -0.255 148.451 -1.232 QT
148.146 -2.208 147.529 -2.88 QT
146.912 -3.552 146.021 -3.552 QT
145.178 -3.552 144.459 -3.114 QT
143.74 -2.677 143.334 -1.943 QT
143.334 3.073 L
cp}def
f738686689
f
GR
GS
[0.75 0 0 0.75 340.60233 421.06314] CT
N
/f1726916179{157.31 5.354 M
156.044 5.354 154.966 4.714 QT
153.888 4.073 153.263 2.995 QT
152.638 1.917 152.638 0.651 QT
152.638 -0.318 152.982 -1.208 QT
153.325 -2.099 153.966 -2.802 QT
154.607 -3.505 155.458 -3.896 QT
156.31 -4.286 157.31 -4.286 QT
158.607 -4.286 159.669 -3.607 QT
160.732 -2.927 161.341 -1.786 QT
161.95 -0.646 161.95 0.651 QT
161.95 1.917 161.325 2.995 QT
160.7 4.073 159.63 4.714 QT
158.56 5.354 157.31 5.354 QT
cp
157.31 4.745 M
158.997 4.745 159.56 3.526 QT
160.122 2.307 160.122 0.417 QT
160.122 -0.646 160.005 -1.333 QT
159.888 -2.021 159.513 -2.599 QT
159.278 -2.943 158.911 -3.2 QT
158.544 -3.458 158.146 -3.599 QT
157.747 -3.739 157.31 -3.739 QT
156.653 -3.739 156.067 -3.443 QT
155.482 -3.146 155.091 -2.599 QT
154.7 -1.989 154.591 -1.279 QT
154.482 -0.568 154.482 0.417 QT
154.482 1.589 154.685 2.526 QT
154.888 3.464 155.513 4.104 QT
156.138 4.745 157.31 4.745 QT
cp}def
f1726916179
f
GR
GS
[0.75 0 0 0.75 340.60233 421.06314] CT
N
/f1106224896{163.367 5.12 M
163.367 4.386 L
164.086 4.386 164.547 4.268 QT
165.008 4.151 165.008 3.714 QT
165.008 -7.302 L
165.008 -7.864 164.844 -8.122 QT
164.68 -8.38 164.359 -8.435 QT
164.039 -8.489 163.367 -8.489 QT
163.367 -9.224 L
166.492 -9.458 L
166.492 3.714 L
166.492 4.151 166.953 4.268 QT
167.414 4.386 168.117 4.386 QT
168.117 5.12 L
163.367 5.12 L
cp}def
f1106224896
f
GR
GS
[0.75 0 0 0.75 340.60233 421.06314] CT
N
/f1983913002{169.496 3.057 M
169.496 1.807 170.48 1.026 QT
171.465 0.245 172.84 -0.083 QT
174.215 -0.411 175.465 -0.411 QT
175.465 -1.271 L
175.465 -1.88 175.199 -2.443 QT
174.934 -3.005 174.426 -3.372 QT
173.918 -3.739 173.324 -3.739 QT
171.918 -3.739 171.199 -3.114 QT
171.59 -3.114 171.855 -2.81 QT
172.121 -2.505 172.121 -2.114 QT
172.121 -1.693 171.824 -1.396 QT
171.527 -1.099 171.121 -1.099 QT
170.699 -1.099 170.402 -1.396 QT
170.105 -1.693 170.105 -2.114 QT
170.105 -3.224 171.105 -3.755 QT
172.105 -4.286 173.324 -4.286 QT
174.168 -4.286 175.027 -3.927 QT
175.887 -3.568 176.441 -2.888 QT
176.996 -2.208 176.996 -1.302 QT
176.996 3.417 L
176.996 3.823 177.168 4.167 QT
177.34 4.511 177.699 4.511 QT
178.059 4.511 178.223 4.167 QT
178.387 3.823 178.387 3.417 QT
178.387 2.073 L
179.012 2.073 L
179.012 3.417 L
179.012 3.886 178.762 4.315 QT
178.512 4.745 178.098 4.995 QT
177.684 5.245 177.199 5.245 QT
176.59 5.245 176.145 4.768 QT
175.699 4.292 175.652 3.636 QT
175.262 4.417 174.504 4.886 QT
173.746 5.354 172.871 5.354 QT
172.074 5.354 171.301 5.12 QT
170.527 4.886 170.012 4.378 QT
169.496 3.87 169.496 3.057 QT
cp
171.199 3.057 M
171.199 3.792 171.738 4.3 QT
172.277 4.807 173.027 4.807 QT
173.699 4.807 174.254 4.464 QT
174.809 4.12 175.137 3.542 QT
175.465 2.964 175.465 2.307 QT
175.465 0.12 L
174.512 0.12 173.512 0.432 QT
172.512 0.745 171.855 1.417 QT
171.199 2.089 171.199 3.057 QT
cp}def
f1983913002
f
GR
GS
[0.75 0 0 0.75 340.60233 421.06314] CT
N
/f-649935880{181.46 2.604 M
181.46 -3.193 L
179.725 -3.193 L
179.725 -3.739 L
181.1 -3.739 181.741 -5.021 QT
182.382 -6.302 182.382 -7.802 QT
182.991 -7.802 L
182.991 -3.927 L
185.96 -3.927 L
185.96 -3.193 L
182.991 -3.193 L
182.991 2.557 L
182.991 3.432 183.28 4.089 QT
183.569 4.745 184.335 4.745 QT
185.053 4.745 185.374 4.05 QT
185.694 3.354 185.694 2.557 QT
185.694 1.323 L
186.288 1.323 L
186.288 2.604 L
186.288 3.261 186.046 3.901 QT
185.803 4.542 185.335 4.948 QT
184.866 5.354 184.194 5.354 QT
182.928 5.354 182.194 4.604 QT
181.46 3.854 181.46 2.604 QT
cp}def
f-649935880
f
GR
GS
[0.75 0 0 0.75 340.60233 421.06314] CT
N
/f-1809647325{188.256 5.12 M
188.256 4.386 L
188.975 4.386 189.436 4.268 QT
189.897 4.151 189.897 3.714 QT
189.897 -2.021 L
189.897 -2.833 189.584 -3.013 QT
189.272 -3.193 188.35 -3.193 QT
188.35 -3.927 L
191.381 -4.161 L
191.381 3.714 L
191.381 4.151 191.779 4.268 QT
192.178 4.386 192.85 4.386 QT
192.85 5.12 L
188.256 5.12 L
cp
189.147 -7.771 M
189.147 -8.224 189.498 -8.575 QT
189.85 -8.927 190.303 -8.927 QT
190.6 -8.927 190.873 -8.771 QT
191.147 -8.614 191.303 -8.341 QT
191.459 -8.068 191.459 -7.771 QT
191.459 -7.318 191.108 -6.966 QT
190.756 -6.614 190.303 -6.614 QT
189.85 -6.614 189.498 -6.966 QT
189.147 -7.318 189.147 -7.771 QT
cp}def
f-1809647325
f
GR
GS
[0.75 0 0 0.75 340.60233 421.06314] CT
N
/f310725453{198.791 5.354 M
197.526 5.354 196.448 4.714 QT
195.369 4.073 194.744 2.995 QT
194.119 1.917 194.119 0.651 QT
194.119 -0.318 194.463 -1.208 QT
194.807 -2.099 195.448 -2.802 QT
196.088 -3.505 196.94 -3.896 QT
197.791 -4.286 198.791 -4.286 QT
200.088 -4.286 201.151 -3.607 QT
202.213 -2.927 202.823 -1.786 QT
203.432 -0.646 203.432 0.651 QT
203.432 1.917 202.807 2.995 QT
202.182 4.073 201.112 4.714 QT
200.041 5.354 198.791 5.354 QT
cp
198.791 4.745 M
200.479 4.745 201.041 3.526 QT
201.604 2.307 201.604 0.417 QT
201.604 -0.646 201.487 -1.333 QT
201.369 -2.021 200.994 -2.599 QT
200.76 -2.943 200.393 -3.2 QT
200.026 -3.458 199.627 -3.599 QT
199.229 -3.739 198.791 -3.739 QT
198.135 -3.739 197.549 -3.443 QT
196.963 -3.146 196.573 -2.599 QT
196.182 -1.989 196.073 -1.279 QT
195.963 -0.568 195.963 0.417 QT
195.963 1.589 196.166 2.526 QT
196.369 3.464 196.994 4.104 QT
197.619 4.745 198.791 4.745 QT
cp}def
f310725453
f
GR
GS
[0.75 0 0 0.75 340.60233 421.06314] CT
N
/f-1142892651{204.833 5.12 M
204.833 4.386 L
205.552 4.386 206.013 4.268 QT
206.474 4.151 206.474 3.714 QT
206.474 -2.021 L
206.474 -2.583 206.302 -2.833 QT
206.13 -3.083 205.817 -3.138 QT
205.505 -3.193 204.833 -3.193 QT
204.833 -3.927 L
207.88 -4.161 L
207.88 -2.114 L
208.302 -3.005 209.13 -3.583 QT
209.958 -4.161 210.927 -4.161 QT
212.38 -4.161 213.114 -3.466 QT
213.849 -2.771 213.849 -1.333 QT
213.849 3.714 L
213.849 4.151 214.31 4.268 QT
214.77 4.386 215.489 4.386 QT
215.489 5.12 L
210.677 5.12 L
210.677 4.386 L
211.395 4.386 211.856 4.268 QT
212.317 4.151 212.317 3.714 QT
212.317 -1.271 L
212.317 -2.286 212.02 -2.95 QT
211.724 -3.614 210.802 -3.614 QT
209.583 -3.614 208.794 -2.638 QT
208.005 -1.661 208.005 -0.427 QT
208.005 3.714 L
208.005 4.151 208.474 4.268 QT
208.942 4.386 209.645 4.386 QT
209.645 5.12 L
204.833 5.12 L
cp}def
f-1142892651
f
GR
GS
[0.75 0 0 0.75 0 0.5] CT
1 0 0 RC
[10 6] 0 setdash
2 LJ
1.333 LW
N
411.175 560.751 M
451.139 560.751 L
S
GR
GS
[0.75 0 0 0.75 323.36771 421.06314] CT
1 0 0 RC
N
f335342531
f
GR
GS
[0.75 0 0 0.75 323.36771 421.06314] CT
1 0 0 RC
10.0 ML
1.333 LW
N
4.389 -0.5 M
4.389 -3.2 2.2 -5.389 -0.5 -5.389 C
-3.2 -5.389 -5.389 -3.2 -5.389 -0.5 C
-5.389 2.2 -3.2 4.389 -0.5 4.389 C
2.2 4.389 4.389 2.2 4.389 -0.5 C
S
GR
GS
[0.75 0 0 0.75 0 0.5] CT
0.149 GC
10.0 ML
0.667 LW
N
225 576 M
225 546 L
674 546 L
674 576 L
cp
S
GR
%%Trailer
%%Pages: 1
%%EOF
