%!PS-Adobe-3.0 EPSF-3.0
%%Creator: (MATLAB, The Mathworks, Inc. Version 9.5.0.944444 \(R2018b\). Operating System: Windows 10)
%%Title: (C:/Users/Alex/Documents/PhD Docs/01. GIT/my_phd_thesis/Chapter8/Figures/capsloc_res/pieCharts_examples_f01.eps)
%%CreationDate: 2019-11-04T14:34:16
%%Pages: (atend)
%%BoundingBox: 0 0 527 462
%%LanguageLevel: 3
%%EndComments
%%BeginProlog
%%BeginResource: procset (Apache XML Graphics Std ProcSet) 1.2 0
%%Version: 1.2 0
%%Copyright: (Copyright 2001-2003,2010 The Apache Software Foundation. License terms: http://www.apache.org/licenses/LICENSE-2.0)
/bd{bind def}bind def
/ld{load def}bd
/GR/grestore ld
/GS/gsave ld
/RM/rmoveto ld
/C/curveto ld
/t/show ld
/L/lineto ld
/ML/setmiterlimit ld
/CT/concat ld
/f/fill ld
/N/newpath ld
/S/stroke ld
/CC/setcmykcolor ld
/A/ashow ld
/cp/closepath ld
/RC/setrgbcolor ld
/LJ/setlinejoin ld
/GC/setgray ld
/LW/setlinewidth ld
/M/moveto ld
/re {4 2 roll M
1 index 0 rlineto
0 exch rlineto
neg 0 rlineto
cp } bd
/_ctm matrix def
/_tm matrix def
/BT { _ctm currentmatrix pop matrix _tm copy pop 0 0 moveto } bd
/ET { _ctm setmatrix } bd
/iTm { _ctm setmatrix _tm concat } bd
/Tm { _tm astore pop iTm 0 0 moveto } bd
/ux 0.0 def
/uy 0.0 def
/F {
  /Tp exch def
  /Tf exch def
  Tf findfont Tp scalefont setfont
  /cf Tf def  /cs Tp def
} bd
/ULS {currentpoint /uy exch def /ux exch def} bd
/ULE {
  /Tcx currentpoint pop def
  gsave
  newpath
  cf findfont cs scalefont dup
  /FontMatrix get 0 get /Ts exch def /FontInfo get dup
  /UnderlinePosition get Ts mul /To exch def
  /UnderlineThickness get Ts mul /Tt exch def
  ux uy To add moveto  Tcx uy To add lineto
  Tt setlinewidth stroke
  grestore
} bd
/OLE {
  /Tcx currentpoint pop def
  gsave
  newpath
  cf findfont cs scalefont dup
  /FontMatrix get 0 get /Ts exch def /FontInfo get dup
  /UnderlinePosition get Ts mul /To exch def
  /UnderlineThickness get Ts mul /Tt exch def
  ux uy To add cs add moveto Tcx uy To add cs add lineto
  Tt setlinewidth stroke
  grestore
} bd
/SOE {
  /Tcx currentpoint pop def
  gsave
  newpath
  cf findfont cs scalefont dup
  /FontMatrix get 0 get /Ts exch def /FontInfo get dup
  /UnderlinePosition get Ts mul /To exch def
  /UnderlineThickness get Ts mul /Tt exch def
  ux uy To add cs 10 mul 26 idiv add moveto Tcx uy To add cs 10 mul 26 idiv add lineto
  Tt setlinewidth stroke
  grestore
} bd
/QT {
/Y22 exch store
/X22 exch store
/Y21 exch store
/X21 exch store
currentpoint
/Y21 load 2 mul add 3 div exch
/X21 load 2 mul add 3 div exch
/X21 load 2 mul /X22 load add 3 div
/Y21 load 2 mul /Y22 load add 3 div
/X22 load /Y22 load curveto
} bd
/SSPD {
dup length /d exch dict def
{
/v exch def
/k exch def
currentpagedevice k known {
/cpdv currentpagedevice k get def
v cpdv ne {
/upd false def
/nullv v type /nulltype eq def
/nullcpdv cpdv type /nulltype eq def
nullv nullcpdv or
{
/upd true def
} {
/sametype v type cpdv type eq def
sametype {
v type /arraytype eq {
/vlen v length def
/cpdvlen cpdv length def
vlen cpdvlen eq {
0 1 vlen 1 sub {
/i exch def
/obj v i get def
/cpdobj cpdv i get def
obj cpdobj ne {
/upd true def
exit
} if
} for
} {
/upd true def
} ifelse
} {
v type /dicttype eq {
v {
/dv exch def
/dk exch def
/cpddv cpdv dk get def
dv cpddv ne {
/upd true def
exit
} if
} forall
} {
/upd true def
} ifelse
} ifelse
} if
} ifelse
upd true eq {
d k v put
} if
} if
} if
} forall
d length 0 gt {
d setpagedevice
} if
} bd
/RE { % /NewFontName [NewEncodingArray] /FontName RE -
  findfont dup length dict begin
  {
    1 index /FID ne
    {def} {pop pop} ifelse
  } forall
  /Encoding exch def
  /FontName 1 index def
  currentdict definefont pop
  end
} bind def
%%EndResource
%%BeginResource: procset (Apache XML Graphics EPS ProcSet) 1.0 0
%%Version: 1.0 0
%%Copyright: (Copyright 2002-2003 The Apache Software Foundation. License terms: http://www.apache.org/licenses/LICENSE-2.0)
/BeginEPSF { %def
/b4_Inc_state save def         % Save state for cleanup
/dict_count countdictstack def % Count objects on dict stack
/op_count count 1 sub def      % Count objects on operand stack
userdict begin                 % Push userdict on dict stack
/showpage { } def              % Redefine showpage, { } = null proc
0 setgray 0 setlinecap         % Prepare graphics state
1 setlinewidth 0 setlinejoin
10 setmiterlimit [ ] 0 setdash newpath
/languagelevel where           % If level not equal to 1 then
{pop languagelevel             % set strokeadjust and
1 ne                           % overprint to their defaults.
{false setstrokeadjust false setoverprint
} if
} if
} bd
/EndEPSF { %def
count op_count sub {pop} repeat            % Clean up stacks
countdictstack dict_count sub {end} repeat
b4_Inc_state restore
} bd
%%EndResource
%FOPBeginFontDict
%%IncludeResource: font Courier-Oblique
%%IncludeResource: font Courier-BoldOblique
%%IncludeResource: font Courier-Bold
%%IncludeResource: font ZapfDingbats
%%IncludeResource: font Symbol
%%IncludeResource: font Helvetica
%%IncludeResource: font Helvetica-Oblique
%%IncludeResource: font Helvetica-Bold
%%IncludeResource: font Helvetica-BoldOblique
%%IncludeResource: font Times-Roman
%%IncludeResource: font Times-Italic
%%IncludeResource: font Times-Bold
%%IncludeResource: font Times-BoldItalic
%%IncludeResource: font Courier
%FOPEndFontDict
%%BeginResource: encoding WinAnsiEncoding
/WinAnsiEncoding [
/.notdef /.notdef /.notdef /.notdef /.notdef
/.notdef /.notdef /.notdef /.notdef /.notdef
/.notdef /.notdef /.notdef /.notdef /.notdef
/.notdef /.notdef /.notdef /.notdef /.notdef
/.notdef /.notdef /.notdef /.notdef /.notdef
/.notdef /.notdef /.notdef /.notdef /.notdef
/.notdef /.notdef /space /exclam /quotedbl
/numbersign /dollar /percent /ampersand /quotesingle
/parenleft /parenright /asterisk /plus /comma
/hyphen /period /slash /zero /one
/two /three /four /five /six
/seven /eight /nine /colon /semicolon
/less /equal /greater /question /at
/A /B /C /D /E
/F /G /H /I /J
/K /L /M /N /O
/P /Q /R /S /T
/U /V /W /X /Y
/Z /bracketleft /backslash /bracketright /asciicircum
/underscore /quoteleft /a /b /c
/d /e /f /g /h
/i /j /k /l /m
/n /o /p /q /r
/s /t /u /v /w
/x /y /z /braceleft /bar
/braceright /asciitilde /bullet /Euro /bullet
/quotesinglbase /florin /quotedblbase /ellipsis /dagger
/daggerdbl /circumflex /perthousand /Scaron /guilsinglleft
/OE /bullet /Zcaron /bullet /bullet
/quoteleft /quoteright /quotedblleft /quotedblright /bullet
/endash /emdash /asciitilde /trademark /scaron
/guilsinglright /oe /bullet /zcaron /Ydieresis
/space /exclamdown /cent /sterling /currency
/yen /brokenbar /section /dieresis /copyright
/ordfeminine /guillemotleft /logicalnot /sfthyphen /registered
/macron /degree /plusminus /twosuperior /threesuperior
/acute /mu /paragraph /middot /cedilla
/onesuperior /ordmasculine /guillemotright /onequarter /onehalf
/threequarters /questiondown /Agrave /Aacute /Acircumflex
/Atilde /Adieresis /Aring /AE /Ccedilla
/Egrave /Eacute /Ecircumflex /Edieresis /Igrave
/Iacute /Icircumflex /Idieresis /Eth /Ntilde
/Ograve /Oacute /Ocircumflex /Otilde /Odieresis
/multiply /Oslash /Ugrave /Uacute /Ucircumflex
/Udieresis /Yacute /Thorn /germandbls /agrave
/aacute /acircumflex /atilde /adieresis /aring
/ae /ccedilla /egrave /eacute /ecircumflex
/edieresis /igrave /iacute /icircumflex /idieresis
/eth /ntilde /ograve /oacute /ocircumflex
/otilde /odieresis /divide /oslash /ugrave
/uacute /ucircumflex /udieresis /yacute /thorn
/ydieresis
] def
%%EndResource
%FOPBeginFontReencode
/Courier-Oblique findfont
dup length dict begin
  {1 index /FID ne {def} {pop pop} ifelse} forall
  /Encoding WinAnsiEncoding def
  currentdict
end
/Courier-Oblique exch definefont pop
/Courier-BoldOblique findfont
dup length dict begin
  {1 index /FID ne {def} {pop pop} ifelse} forall
  /Encoding WinAnsiEncoding def
  currentdict
end
/Courier-BoldOblique exch definefont pop
/Courier-Bold findfont
dup length dict begin
  {1 index /FID ne {def} {pop pop} ifelse} forall
  /Encoding WinAnsiEncoding def
  currentdict
end
/Courier-Bold exch definefont pop
/Helvetica findfont
dup length dict begin
  {1 index /FID ne {def} {pop pop} ifelse} forall
  /Encoding WinAnsiEncoding def
  currentdict
end
/Helvetica exch definefont pop
/Helvetica-Oblique findfont
dup length dict begin
  {1 index /FID ne {def} {pop pop} ifelse} forall
  /Encoding WinAnsiEncoding def
  currentdict
end
/Helvetica-Oblique exch definefont pop
/Helvetica-Bold findfont
dup length dict begin
  {1 index /FID ne {def} {pop pop} ifelse} forall
  /Encoding WinAnsiEncoding def
  currentdict
end
/Helvetica-Bold exch definefont pop
/Helvetica-BoldOblique findfont
dup length dict begin
  {1 index /FID ne {def} {pop pop} ifelse} forall
  /Encoding WinAnsiEncoding def
  currentdict
end
/Helvetica-BoldOblique exch definefont pop
/Times-Roman findfont
dup length dict begin
  {1 index /FID ne {def} {pop pop} ifelse} forall
  /Encoding WinAnsiEncoding def
  currentdict
end
/Times-Roman exch definefont pop
/Times-Italic findfont
dup length dict begin
  {1 index /FID ne {def} {pop pop} ifelse} forall
  /Encoding WinAnsiEncoding def
  currentdict
end
/Times-Italic exch definefont pop
/Times-Bold findfont
dup length dict begin
  {1 index /FID ne {def} {pop pop} ifelse} forall
  /Encoding WinAnsiEncoding def
  currentdict
end
/Times-Bold exch definefont pop
/Times-BoldItalic findfont
dup length dict begin
  {1 index /FID ne {def} {pop pop} ifelse} forall
  /Encoding WinAnsiEncoding def
  currentdict
end
/Times-BoldItalic exch definefont pop
/Courier findfont
dup length dict begin
  {1 index /FID ne {def} {pop pop} ifelse} forall
  /Encoding WinAnsiEncoding def
  currentdict
end
/Courier exch definefont pop
%FOPEndFontReencode
%%EndProlog
%%Page: 1 1
%%PageBoundingBox: 0 0 527 462
%%BeginPageSetup
[1 0 0 -1 0 462] CT
%%EndPageSetup
GS
[0.75 0 0 0.75 0 0] CT
1 GC
N
0 0 703 616 re
f
GR
GS
[0.75 0 0 0.75 0 0] CT
1 GC
N
0 0 703 616 re
f
GR
GS
[0.75 0 0 0.75 389.62537 36.14999] CT
/Helvetica-Bold 17.6 F
GS
[1 0 0 1 0 0] CT
-88.5 -4 moveto 
1 -1 scale
(EN Profitability SM01) t 
GR
GR
GS
[0.75 0 0 0.75 0 0] CT
0.302 0.745 0.933 RC
N
448.9 88.223 M
444.561 92.493 L
440.495 97.024 L
515.371 160.121 L
515.371 62.205 L
509.286 62.394 L
503.225 62.961 L
497.211 63.904 L
491.267 65.218 L
485.416 66.899 L
479.68 68.941 L
474.083 71.335 L
468.646 74.073 L
463.389 77.143 L
458.332 80.533 L
453.497 84.232 L
cp
f
GR
GS
[0.75 0 0 0.75 0 0] CT
0.302 0.745 0.933 RC
2 setlinecap
10.0 ML
0.667 LW
N
515.371 160.121 M
515.371 62.205 L
509.286 62.394 L
503.225 62.961 L
497.211 63.904 L
491.267 65.218 L
485.416 66.899 L
479.68 68.941 L
474.083 71.335 L
468.646 74.073 L
463.389 77.143 L
458.332 80.533 L
453.497 84.232 L
448.9 88.223 L
444.561 92.493 L
440.495 97.024 L
515.371 160.121 L
515.371 160.121 L
S
GR
GS
[0.75 0 0 0.75 0 0] CT
0 0.749 0.749 RC
N
466.108 251.079 M
471.36 254.266 L
476.802 257.117 L
482.412 259.621 L
488.168 261.768 L
494.047 263.551 L
500.027 264.961 L
506.083 265.993 L
512.192 266.644 L
518.33 266.91 L
524.472 266.79 L
530.595 266.286 L
519.5 169 L
444.624 105.903 L
440.814 110.723 L
437.315 115.772 L
434.138 121.03 L
431.298 126.478 L
428.805 132.093 L
426.669 137.853 L
424.899 143.736 L
423.501 149.718 L
422.48 155.776 L
421.842 161.886 L
421.588 168.025 L
421.72 174.167 L
422.236 180.288 L
423.136 186.366 L
424.414 192.375 L
426.067 198.292 L
428.088 204.093 L
430.469 209.757 L
433.2 215.26 L
436.271 220.581 L
439.669 225.698 L
443.382 230.593 L
447.394 235.245 L
451.691 239.637 L
456.254 243.75 L
461.066 247.569 L
cp
f
GR
GS
[0.75 0 0 0.75 0 0] CT
0 0.749 0.749 RC
2 setlinecap
10.0 ML
0.667 LW
N
519.5 169 M
444.624 105.903 L
440.814 110.723 L
437.315 115.772 L
434.138 121.03 L
431.298 126.478 L
428.805 132.093 L
426.669 137.853 L
424.899 143.736 L
423.501 149.718 L
422.48 155.776 L
421.842 161.886 L
421.588 168.025 L
421.72 174.167 L
422.236 180.288 L
423.136 186.366 L
424.414 192.375 L
426.067 198.292 L
428.088 204.093 L
430.469 209.757 L
433.2 215.26 L
436.271 220.581 L
439.669 225.698 L
443.382 230.593 L
447.394 235.245 L
451.691 239.637 L
456.254 243.75 L
461.066 247.569 L
466.108 251.079 L
471.36 254.266 L
476.802 257.117 L
482.412 259.621 L
488.168 261.768 L
494.047 263.551 L
500.027 264.961 L
506.083 265.993 L
512.192 266.644 L
518.33 266.91 L
524.472 266.79 L
530.595 266.286 L
519.5 169 L
519.5 169 L
S
GR
GS
[0.75 0 0 0.75 0 0] CT
0 0.447 0.741 RC
N
542.503 264.176 M
548.337 262.574 L
554.061 260.614 L
559.653 258.305 L
565.092 255.655 L
570.356 252.674 L
575.427 249.373 L
580.284 245.766 L
584.908 241.866 L
589.284 237.687 L
593.392 233.246 L
597.219 228.56 L
600.749 223.647 L
603.969 218.525 L
606.866 213.214 L
609.43 207.734 L
611.65 202.106 L
613.519 196.352 L
615.029 190.493 L
616.174 184.553 L
616.95 178.553 L
617.354 172.516 L
617.384 166.466 L
617.041 160.426 L
616.325 154.419 L
615.24 148.467 L
613.789 142.593 L
611.978 136.821 L
609.814 131.171 L
607.306 125.666 L
604.462 120.326 L
601.294 115.172 L
597.813 110.223 L
594.034 105.499 L
589.97 101.017 L
585.637 96.795 L
581.051 92.848 L
576.231 89.192 L
571.194 85.841 L
565.96 82.807 L
560.548 80.103 L
554.979 77.737 L
549.276 75.72 L
543.458 74.06 L
537.549 72.761 L
531.571 71.83 L
525.547 71.27 L
519.5 71.083 L
519.5 169 L
530.595 266.286 L
536.582 265.415 L
cp
f
GR
GS
[0.75 0 0 0.75 0 0] CT
0 0.447 0.741 RC
2 setlinecap
10.0 ML
0.667 LW
N
519.5 169 M
530.595 266.286 L
536.582 265.415 L
542.503 264.176 L
548.337 262.574 L
554.061 260.614 L
559.653 258.305 L
565.092 255.655 L
570.356 252.674 L
575.427 249.373 L
580.284 245.766 L
584.908 241.866 L
589.284 237.687 L
593.392 233.246 L
597.219 228.56 L
600.749 223.647 L
603.969 218.525 L
606.866 213.214 L
609.43 207.734 L
611.65 202.106 L
613.519 196.352 L
615.029 190.493 L
616.174 184.553 L
616.95 178.553 L
617.354 172.516 L
617.384 166.466 L
617.041 160.426 L
616.325 154.419 L
615.24 148.467 L
613.789 142.593 L
611.978 136.821 L
609.814 131.171 L
607.306 125.666 L
604.462 120.326 L
601.294 115.172 L
597.813 110.223 L
594.034 105.499 L
589.97 101.017 L
585.637 96.795 L
581.051 92.848 L
576.231 89.192 L
571.194 85.841 L
565.96 82.807 L
560.548 80.103 L
554.979 77.737 L
549.276 75.72 L
543.458 74.06 L
537.549 72.761 L
531.571 71.83 L
525.547 71.27 L
519.5 71.083 L
519.5 169 L
519.5 169 L
S
GR
GS
[0.75 0 0 0.75 379.06954 80.76232] CT
1 GC
/Helvetica-Bold 18.667 F
GS
[1 0 0 1 0 0] CT
-38 -5 moveto 
1 -1 scale
(14%) t 
GR
GR
GS
[0.75 0 0 0.75 372.30004 135.6501] CT
1 GC
/Helvetica-Bold 18.667 F
GS
[1 0 0 1 0 0] CT
-38 19 moveto 
1 -1 scale
(38%) t 
GR
GR
GS
[0.75 0 0 0.75 413.07797 119.50567] CT
1 GC
/Helvetica-Bold 18.667 F
GS
[1 0 0 1 0 0] CT
0 7 moveto 
1 -1 scale
( 48%) t 
GR
GR
GS
[0.75 0 0 0.75 151.87515 36.14999] CT
/Helvetica-Bold 17.6 F
GS
[1 0 0 1 0 0] CT
-95 -4 moveto 
1 -1 scale
(ENU Profitability SM01) t 
GR
GR
GS
[0.75 0 0 0.75 0 0] CT
0.302 0.745 0.933 RC
N
166.269 67.673 M
160.876 69.868 L
200.476 159.42 L
200.476 61.503 L
194.656 61.676 L
188.856 62.195 L
183.097 63.058 L
177.399 64.261 L
171.784 65.801 L
cp
f
GR
GS
[0.75 0 0 0.75 0 0] CT
0.302 0.745 0.933 RC
2 setlinecap
10.0 ML
0.667 LW
N
200.476 159.42 M
200.476 61.503 L
194.656 61.676 L
188.856 62.195 L
183.097 63.058 L
177.399 64.261 L
171.784 65.801 L
166.269 67.673 L
160.876 69.868 L
200.476 159.42 L
200.476 159.42 L
S
GR
GS
[0.75 0 0 0.75 0 0] CT
0 0.749 0.749 RC
N
124.861 228.664 M
128.733 233.39 L
132.892 237.865 L
137.322 242.072 L
142.005 245.994 L
146.925 249.617 L
152.06 252.926 L
157.392 255.908 L
162.9 258.552 L
202.5 169 L
162.9 79.448 L
157.392 82.092 L
152.06 85.074 L
146.925 88.383 L
142.005 92.006 L
137.322 95.928 L
132.892 100.135 L
128.733 104.61 L
124.861 109.336 L
121.291 114.294 L
118.038 119.464 L
115.113 124.828 L
112.528 130.364 L
110.294 136.05 L
108.419 141.864 L
106.909 147.784 L
105.772 153.786 L
105.012 159.848 L
104.631 165.945 L
104.631 172.055 L
105.012 178.152 L
105.772 184.214 L
106.909 190.216 L
108.419 196.136 L
110.294 201.95 L
112.528 207.636 L
115.113 213.172 L
118.038 218.536 L
121.291 223.706 L
cp
f
GR
GS
[0.75 0 0 0.75 0 0] CT
0 0.749 0.749 RC
2 setlinecap
10.0 ML
0.667 LW
N
202.5 169 M
162.9 79.448 L
157.392 82.092 L
152.06 85.074 L
146.925 88.383 L
142.005 92.006 L
137.322 95.928 L
132.892 100.135 L
128.733 104.61 L
124.861 109.336 L
121.291 114.294 L
118.038 119.464 L
115.113 124.828 L
112.528 130.364 L
110.294 136.05 L
108.419 141.864 L
106.909 147.784 L
105.772 153.786 L
105.012 159.848 L
104.631 165.945 L
104.631 172.055 L
105.012 178.152 L
105.772 184.214 L
106.909 190.216 L
108.419 196.136 L
110.294 201.95 L
112.528 207.636 L
115.113 213.172 L
118.038 218.536 L
121.291 223.706 L
124.861 228.664 L
128.733 233.39 L
132.892 237.865 L
137.322 242.072 L
142.005 245.994 L
146.925 249.617 L
152.06 252.926 L
157.392 255.908 L
162.9 258.552 L
202.5 169 L
202.5 169 L
S
GR
GS
[0.75 0 0 0.75 0 0] CT
0 0.447 0.741 RC
N
174.358 262.786 M
180.263 264.358 L
186.255 265.56 L
192.31 266.385 L
198.405 266.831 L
204.516 266.896 L
210.618 266.58 L
216.689 265.883 L
222.705 264.809 L
228.643 263.362 L
234.478 261.548 L
240.189 259.373 L
245.753 256.846 L
251.148 253.977 L
256.354 250.776 L
261.351 247.258 L
266.118 243.434 L
270.637 239.321 L
274.891 234.934 L
278.863 230.289 L
282.537 225.407 L
285.9 220.304 L
288.938 215.002 L
291.639 209.52 L
293.993 203.881 L
295.991 198.105 L
297.624 192.217 L
298.887 186.238 L
299.775 180.192 L
300.284 174.102 L
300.411 167.992 L
300.158 161.886 L
299.524 155.808 L
298.512 149.782 L
297.126 143.83 L
295.372 137.976 L
293.256 132.243 L
290.786 126.654 L
287.973 121.229 L
284.826 115.99 L
281.359 110.958 L
277.585 106.152 L
273.518 101.59 L
269.175 97.292 L
264.572 93.272 L
259.727 89.547 L
254.66 86.132 L
249.389 83.04 L
243.935 80.283 L
238.321 77.871 L
232.566 75.814 L
226.695 74.12 L
220.729 72.795 L
214.692 71.845 L
208.608 71.274 L
202.5 71.083 L
202.5 169 L
162.9 258.552 L
168.563 260.847 L
cp
f
GR
GS
[0.75 0 0 0.75 0 0] CT
0 0.447 0.741 RC
2 setlinecap
10.0 ML
0.667 LW
N
202.5 169 M
162.9 258.552 L
168.563 260.847 L
174.358 262.786 L
180.263 264.358 L
186.255 265.56 L
192.31 266.385 L
198.405 266.831 L
204.516 266.896 L
210.618 266.58 L
216.689 265.883 L
222.705 264.809 L
228.643 263.362 L
234.478 261.548 L
240.189 259.373 L
245.753 256.846 L
251.148 253.977 L
256.354 250.776 L
261.351 247.258 L
266.118 243.434 L
270.637 239.321 L
274.891 234.934 L
278.863 230.289 L
282.537 225.407 L
285.9 220.304 L
288.938 215.002 L
291.639 209.52 L
293.993 203.881 L
295.991 198.105 L
297.624 192.217 L
298.887 186.238 L
299.775 180.192 L
300.284 174.102 L
300.411 167.992 L
300.158 161.886 L
299.524 155.808 L
298.512 149.782 L
297.126 143.83 L
295.372 137.976 L
293.256 132.243 L
290.786 126.654 L
287.973 121.229 L
284.826 115.99 L
281.359 110.958 L
277.585 106.152 L
273.518 101.59 L
269.175 97.292 L
264.572 93.272 L
259.727 89.547 L
254.66 86.132 L
249.389 83.04 L
243.935 80.283 L
238.321 77.871 L
232.566 75.814 L
226.695 74.12 L
220.729 72.795 L
214.692 71.845 L
208.608 71.274 L
202.5 71.083 L
202.5 169 L
202.5 169 L
S
GR
GS
[0.75 0 0 0.75 138.31722 72.45222] CT
1 GC
/Helvetica-Bold 18.667 F
GS
[1 0 0 1 0 0] CT
-13.5 -5 moveto 
1 -1 scale
(7%) t 
GR
GR
GS
[0.75 0 0 0.75 130.95224 124.08963] CT
1 GC
/Helvetica-Bold 18.667 F
GS
[1 0 0 1 0 0] CT
-38 7 moveto 
1 -1 scale
(37%) t 
GR
GR
GS
[0.75 0 0 0.75 175.04419 130.14377] CT
1 GC
/Helvetica-Bold 18.667 F
GS
[1 0 0 1 0 0] CT
0 7 moveto 
1 -1 scale
(57%) t 
GR
GR
GS
[0.75 0 0 0.75 387.37537 228.89999] CT
/Helvetica-Bold 17.6 F
GS
[1 0 0 1 0 0] CT
-88.5 -4 moveto 
1 -1 scale
(EN Profitability SM02) t 
GR
GR
GS
[0.75 0 0 0.75 0 0] CT
0.302 0.745 0.933 RC
N
422.987 474.858 M
426.288 479.97 L
429.9 484.866 L
433.809 489.529 L
438 493.94 L
442.457 498.082 L
447.163 501.939 L
452.099 505.497 L
457.247 508.741 L
462.586 511.659 L
468.096 514.24 L
473.756 516.474 L
506.853 424.32 L
506.853 326.404 L
500.772 326.593 L
494.714 327.159 L
488.702 328.101 L
482.761 329.414 L
476.913 331.093 L
471.18 333.133 L
465.585 335.525 L
460.15 338.259 L
454.895 341.326 L
449.84 344.714 L
445.006 348.409 L
440.411 352.397 L
436.072 356.662 L
432.006 361.189 L
428.229 365.96 L
424.756 370.956 L
421.6 376.158 L
418.774 381.546 L
416.287 387.1 L
414.15 392.797 L
412.371 398.615 L
410.957 404.533 L
409.913 410.528 L
409.244 416.575 L
408.951 422.653 L
409.036 428.737 L
409.5 434.804 L
410.339 440.83 L
411.551 446.793 L
413.13 452.669 L
415.072 458.436 L
417.368 464.07 L
420.01 469.552 L
cp
f
GR
GS
[0.75 0 0 0.75 0 0] CT
0.302 0.745 0.933 RC
2 setlinecap
10.0 ML
0.667 LW
N
506.853 424.32 M
506.853 326.404 L
500.772 326.593 L
494.714 327.159 L
488.702 328.101 L
482.761 329.414 L
476.913 331.093 L
471.18 333.133 L
465.585 335.525 L
460.15 338.259 L
454.895 341.326 L
449.84 344.714 L
445.006 348.409 L
440.411 352.397 L
436.072 356.662 L
432.006 361.189 L
428.229 365.96 L
424.756 370.956 L
421.6 376.158 L
418.774 381.546 L
416.287 387.1 L
414.15 392.797 L
412.371 398.615 L
410.957 404.533 L
409.913 410.528 L
409.244 416.575 L
408.951 422.653 L
409.036 428.737 L
409.5 434.804 L
410.339 440.83 L
411.551 446.793 L
413.13 452.669 L
415.072 458.436 L
417.368 464.07 L
420.01 469.552 L
422.987 474.858 L
426.288 479.97 L
429.9 484.866 L
433.809 489.529 L
438 493.94 L
442.457 498.082 L
447.163 501.939 L
452.099 505.497 L
457.247 508.741 L
462.586 511.659 L
468.096 514.24 L
473.756 516.474 L
506.853 424.32 L
506.853 424.32 L
S
GR
GS
[0.75 0 0 0.75 0 0] CT
0 0.749 0.749 RC
N
507.085 523.463 M
513.155 523.859 L
519.237 523.878 L
525.309 523.52 L
531.347 522.785 L
537.327 521.676 L
543.227 520.198 L
549.024 518.357 L
554.696 516.16 L
560.22 513.614 L
565.575 510.731 L
570.741 507.52 L
575.698 503.995 L
580.427 500.169 L
584.908 496.057 L
589.126 491.675 L
593.063 487.039 L
596.705 482.167 L
600.038 477.079 L
603.048 471.794 L
605.724 466.332 L
608.056 460.714 L
610.035 454.963 L
611.653 449.1 L
612.904 443.147 L
613.782 437.129 L
614.285 431.067 L
614.411 424.986 L
614.16 418.909 L
613.531 412.859 L
612.528 406.86 L
611.154 400.935 L
609.415 395.106 L
607.318 389.397 L
516.5 426 L
483.403 518.153 L
489.188 520.03 L
495.079 521.545 L
501.052 522.69 L
cp
f
GR
GS
[0.75 0 0 0.75 0 0] CT
0 0.749 0.749 RC
2 setlinecap
10.0 ML
0.667 LW
N
516.5 426 M
483.403 518.153 L
489.188 520.03 L
495.079 521.545 L
501.052 522.69 L
507.085 523.463 L
513.155 523.859 L
519.237 523.878 L
525.309 523.52 L
531.347 522.785 L
537.327 521.676 L
543.227 520.198 L
549.024 518.357 L
554.696 516.16 L
560.22 513.614 L
565.575 510.731 L
570.741 507.52 L
575.698 503.995 L
580.427 500.169 L
584.908 496.057 L
589.126 491.675 L
593.063 487.039 L
596.705 482.167 L
600.038 477.079 L
603.048 471.794 L
605.724 466.332 L
608.056 460.714 L
610.035 454.963 L
611.653 449.1 L
612.904 443.147 L
613.782 437.129 L
614.285 431.067 L
614.411 424.986 L
614.16 418.909 L
613.531 412.859 L
612.528 406.86 L
611.154 400.935 L
609.415 395.106 L
607.318 389.397 L
516.5 426 L
516.5 426 L
S
GR
GS
[0.75 0 0 0.75 0 0] CT
0 0.447 0.741 RC
N
516.5 328.083 M
516.5 426 L
607.318 389.397 L
604.854 383.795 L
602.045 378.358 L
598.902 373.108 L
595.437 368.063 L
591.663 363.245 L
587.596 358.673 L
583.252 354.363 L
578.646 350.333 L
573.798 346.598 L
568.726 343.174 L
563.45 340.074 L
557.991 337.308 L
552.369 334.89 L
546.608 332.827 L
540.728 331.128 L
534.755 329.8 L
528.71 328.848 L
522.617 328.275 L
cp
f
GR
GS
[0.75 0 0 0.75 0 0] CT
0 0.447 0.741 RC
2 setlinecap
10.0 ML
0.667 LW
N
516.5 426 M
607.318 389.397 L
604.854 383.795 L
602.045 378.358 L
598.902 373.108 L
595.437 368.063 L
591.663 363.245 L
587.596 358.673 L
583.252 354.363 L
578.646 350.333 L
573.798 346.598 L
568.726 343.174 L
563.45 340.074 L
557.991 337.308 L
552.369 334.89 L
546.608 332.827 L
540.728 331.128 L
534.755 329.8 L
528.71 328.848 L
522.617 328.275 L
516.5 328.083 L
516.5 426 L
516.5 426 L
S
GR
GS
[0.75 0 0 0.75 359.74983 312.36314] CT
1 GC
/Helvetica-Bold 18.667 F
GS
[1 0 0 1 0 0] CT
-38 7 moveto 
1 -1 scale
(45%) t 
GR
GR
GS
[0.75 0 0 0.75 403.01358 338.27106] CT
1 GC
/Helvetica-Bold 18.667 F
GS
[1 0 0 1 0 0] CT
0 19 moveto 
1 -1 scale
( 37%) t 
GR
GR
GS
[0.75 0 0 0.75 399.32108 288.46365] CT
1 GC
/Helvetica-Bold 18.667 F
GS
[1 0 0 1 0 0] CT
0 -5 moveto 
1 -1 scale
( 19%) t 
GR
GR
GS
[0.75 0 0 0.75 155.62515 228.89999] CT
/Helvetica-Bold 17.6 F
GS
[1 0 0 1 0 0] CT
-95 -4 moveto 
1 -1 scale
(ENU Profitability SM02) t 
GR
GR
GS
[0.75 0 0 0.75 0 0] CT
0.302 0.745 0.933 RC
N
120.84 483.614 M
124.721 488.285 L
128.884 492.706 L
133.313 496.861 L
137.991 500.733 L
142.9 504.308 L
148.021 507.572 L
198.058 423.405 L
198.058 325.489 L
191.989 325.677 L
185.942 326.241 L
179.942 327.179 L
174.012 328.487 L
168.174 330.16 L
162.452 332.192 L
156.866 334.575 L
151.439 337.299 L
146.191 340.355 L
141.142 343.73 L
136.313 347.411 L
131.72 351.385 L
127.384 355.636 L
123.318 360.147 L
119.541 364.902 L
116.065 369.882 L
112.905 375.067 L
110.072 380.439 L
107.578 385.976 L
105.432 391.656 L
103.642 397.459 L
102.215 403.362 L
101.157 409.342 L
100.471 415.376 L
100.161 421.44 L
100.228 427.513 L
100.671 433.569 L
101.488 439.587 L
102.677 445.542 L
104.232 451.412 L
106.149 457.174 L
108.419 462.807 L
111.034 468.288 L
113.984 473.596 L
117.257 478.711 L
cp
f
GR
GS
[0.75 0 0 0.75 0 0] CT
0.302 0.745 0.933 RC
2 setlinecap
10.0 ML
0.667 LW
N
198.058 423.405 M
198.058 325.489 L
191.989 325.677 L
185.942 326.241 L
179.942 327.179 L
174.012 328.487 L
168.174 330.16 L
162.452 332.192 L
156.866 334.575 L
151.439 337.299 L
146.191 340.355 L
141.142 343.73 L
136.313 347.411 L
131.72 351.385 L
127.384 355.636 L
123.318 360.147 L
119.541 364.902 L
116.065 369.882 L
112.905 375.067 L
110.072 380.439 L
107.578 385.976 L
105.432 391.656 L
103.642 397.459 L
102.215 403.362 L
101.157 409.342 L
100.471 415.376 L
100.161 421.44 L
100.228 427.513 L
100.671 433.569 L
101.488 439.587 L
102.677 445.542 L
104.232 451.412 L
106.149 457.174 L
108.419 462.807 L
111.034 468.288 L
113.984 473.596 L
117.257 478.711 L
120.84 483.614 L
124.721 488.285 L
128.884 492.706 L
133.313 496.861 L
137.991 500.733 L
142.9 504.308 L
148.021 507.572 L
198.058 423.405 L
198.058 423.405 L
S
GR
GS
[0.75 0 0 0.75 0 0] CT
0 0.749 0.749 RC
N
173.926 517.981 M
179.702 519.888 L
185.584 521.433 L
191.552 522.609 L
197.581 523.413 L
203.648 523.841 L
209.73 523.891 L
215.804 523.564 L
221.845 522.86 L
227.832 521.783 L
233.739 520.335 L
239.546 518.524 L
245.229 516.356 L
250.766 513.839 L
256.136 510.984 L
261.319 507.8 L
266.294 504.301 L
271.042 500.499 L
275.545 496.41 L
279.785 492.05 L
283.746 487.434 L
287.414 482.582 L
290.772 477.511 L
293.81 472.241 L
296.514 466.793 L
298.875 461.188 L
300.884 455.447 L
302.532 449.592 L
303.813 443.646 L
304.723 437.632 L
305.258 431.573 L
305.415 425.493 L
305.195 419.415 L
304.598 413.362 L
303.626 407.358 L
207.5 426 L
157.463 510.166 L
162.785 513.111 L
168.28 515.719 L
cp
f
GR
GS
[0.75 0 0 0.75 0 0] CT
0 0.749 0.749 RC
2 setlinecap
10.0 ML
0.667 LW
N
207.5 426 M
157.463 510.166 L
162.785 513.111 L
168.28 515.719 L
173.926 517.981 L
179.702 519.888 L
185.584 521.433 L
191.552 522.609 L
197.581 523.413 L
203.648 523.841 L
209.73 523.891 L
215.804 523.564 L
221.845 522.86 L
227.832 521.783 L
233.739 520.335 L
239.546 518.524 L
245.229 516.356 L
250.766 513.839 L
256.136 510.984 L
261.319 507.8 L
266.294 504.301 L
271.042 500.499 L
275.545 496.41 L
279.785 492.05 L
283.746 487.434 L
287.414 482.582 L
290.772 477.511 L
293.81 472.241 L
296.514 466.793 L
298.875 461.188 L
300.884 455.447 L
302.532 449.592 L
303.813 443.646 L
304.723 437.632 L
305.258 431.573 L
305.415 425.493 L
305.195 419.415 L
304.598 413.362 L
303.626 407.358 L
207.5 426 L
207.5 426 L
S
GR
GS
[0.75 0 0 0.75 0 0] CT
0 0.447 0.741 RC
N
207.5 328.083 M
207.5 426 L
303.626 407.358 L
302.269 401.372 L
300.54 395.483 L
298.445 389.714 L
295.993 384.087 L
293.193 378.625 L
290.057 373.349 L
286.596 368.281 L
282.824 363.439 L
278.757 358.842 L
274.409 354.51 L
269.799 350.458 L
264.944 346.704 L
259.863 343.26 L
254.576 340.142 L
249.104 337.362 L
243.469 334.929 L
237.693 332.855 L
231.798 331.146 L
225.808 329.81 L
219.745 328.852 L
213.635 328.276 L
cp
f
GR
GS
[0.75 0 0 0.75 0 0] CT
0 0.447 0.741 RC
2 setlinecap
10.0 ML
0.667 LW
N
207.5 426 M
303.626 407.358 L
302.269 401.372 L
300.54 395.483 L
298.445 389.714 L
295.993 384.087 L
293.193 378.625 L
290.057 373.349 L
286.596 368.281 L
282.824 363.439 L
278.757 358.842 L
274.409 354.51 L
269.799 350.458 L
264.944 346.704 L
259.863 343.26 L
254.576 340.142 L
249.104 337.362 L
243.469 334.929 L
237.693 332.855 L
231.798 331.146 L
225.808 329.81 L
219.745 328.852 L
213.635 328.276 L
207.5 328.083 L
207.5 426 L
207.5 426 L
S
GR
GS
[0.75 0 0 0.75 128.51336 305.45982] CT
1 GC
/Helvetica-Bold 18.667 F
GS
[1 0 0 1 0 0] CT
-38 7 moveto 
1 -1 scale
(41%) t 
GR
GR
GS
[0.75 0 0 0.75 171.50562 343.67242] CT
1 GC
/Helvetica-Bold 18.667 F
GS
[1 0 0 1 0 0] CT
0 19 moveto 
1 -1 scale
(7%) t 
GR
GR
GS
[0.75 0 0 0.75 171.77146 291.09796] CT
1 GC
/Helvetica-Bold 18.667 F
GS
[1 0 0 1 0 0] CT
0 -5 moveto 
1 -1 scale
( 22%) t 
GR
GR
GS
[0.75 0 0 0.75 0 0] CT
1 GC
N
574 585 M
574 555 L
127 555 L
127 585 L
cp
f
GR
GS
[0.75 0 0 0.75 130.5 427.5] CT
/Helvetica 18.667 F
GS
[1 0 0 1 0 0] CT
0 7 moveto 
1 -1 scale
(Profitability) t 
GR
GR
GS
[0.75 0 0 0.75 0 0] CT
0.302 0.745 0.933 RC
N
171 579.643 M
171 560.357 L
131 560.357 L
131 579.643 L
cp
f
GR
GS
[0.75 0 0 0.75 0 0] CT
0.302 0.745 0.933 RC
10.0 ML
0.667 LW
N
131 579.643 M
131 560.357 L
171 560.357 L
171 579.643 L
cp
S
GR
GS
[0.75 0 0 0.75 237.75 427.5] CT
/Helvetica 18.667 F
GS
[1 0 0 1 0 0] CT
0 7 moveto 
1 -1 scale
(Hysteresis) t 
GR
GR
GS
[0.75 0 0 0.75 0 0] CT
0 0.749 0.749 RC
N
314 579.643 M
314 560.357 L
274 560.357 L
274 579.643 L
cp
f
GR
GS
[0.75 0 0 0.75 0 0] CT
0 0.749 0.749 RC
10.0 ML
0.667 LW
N
274 579.643 M
274 560.357 L
314 560.357 L
314 579.643 L
cp
S
GR
GS
[0.75 0 0 0.75 342 427.5] CT
/Helvetica 18.667 F
GS
[1 0 0 1 0 0] CT
0 7 moveto 
1 -1 scale
(Unprofitability) t 
GR
GR
GS
[0.75 0 0 0.75 0 0] CT
0 0.447 0.741 RC
N
453 579.643 M
453 560.357 L
413 560.357 L
413 579.643 L
cp
f
GR
GS
[0.75 0 0 0.75 0 0] CT
0 0.447 0.741 RC
10.0 ML
0.667 LW
N
413 579.643 M
413 560.357 L
453 560.357 L
453 579.643 L
cp
S
GR
GS
[0.75 0 0 0.75 0 0] CT
1 GC
10.0 ML
0.667 LW
N
127 585 M
127 555 L
574 555 L
574 585 L
cp
S
GR
%%Trailer
%%Pages: 1
%%EOF
