%YAML 1.1
%TAG !u! tag:unity3d.com,2011:
--- !u!114 &11400000
MonoBehaviour:
  m_ObjectHideFlags: 0
  m_CorrespondingSourceObject: {fileID: 0}
  m_PrefabInstance: {fileID: 0}
  m_PrefabAsset: {fileID: 0}
  m_GameObject: {fileID: 0}
  m_Enabled: 1
  m_EditorHideFlags: 0
  m_Script: {fileID: 11500000, guid: b89178be076940378e1f436b3b2098e1, type: 3}
  m_Name: EndSequence
  m_EditorClassIdentifier: 
  characterMovementPossible: 0
  characterIsWaving: 0
  startWonTimer: 0
  startLostTimer: 0
  showStartSequenceViews: 0
  showInGameHud: 0
  showEndGameViewsAndAnimations: 1
  waitForFirstTap: 0
  activateParticleEffectId: WonConfetti
