%YAML 1.1
%TAG !u! tag:unity3d.com,2011:
--- !u!114 &11400000
MonoBehaviour:
  m_ObjectHideFlags: 0
  m_CorrespondingSourceObject: {fileID: 0}
  m_PrefabInstance: {fileID: 0}
  m_PrefabAsset: {fileID: 0}
  m_GameObject: {fileID: 0}
  m_Enabled: 1
  m_EditorHideFlags: 0
  m_Script: {fileID: 11500000, guid: 04516b4956544a2493ccbb25fc8eda95, type: 3}
  m_Name: MainCameraVariable
  m_EditorClassIdentifier: 
  developerDescription: 
  initial: {fileID: 0}
  current: {fileID: 0}
