%YAML 1.1
%TAG !u! tag:unity3d.com,2011:
--- !u!114 &11400000
MonoBehaviour:
  m_ObjectHideFlags: 0
  m_CorrespondingSourceObject: {fileID: 0}
  m_PrefabInstance: {fileID: 0}
  m_PrefabAsset: {fileID: 0}
  m_GameObject: {fileID: 0}
  m_Enabled: 1
  m_EditorHideFlags: 0
  m_Script: {fileID: 11500000, guid: 1775f4241bfb49c28c56c57d14479ebd, type: 3}
  m_Name: Finish X 20
  m_EditorClassIdentifier: 
  material: {fileID: 2100000, guid: e66441e03cb7e4d5a9d61a1b64604146, type: 2}
  textPreFix: X
  factor: 20
  len: 12
