%YAML 1.1
%TAG !u! tag:unity3d.com,2011:
--- !u!114 &11400000
MonoBehaviour:
  m_ObjectHideFlags: 0
  m_CorrespondingSourceObject: {fileID: 0}
  m_PrefabInstance: {fileID: 0}
  m_PrefabAsset: {fileID: 0}
  m_GameObject: {fileID: 0}
  m_Enabled: 1
  m_EditorHideFlags: 0
  m_Script: {fileID: 11500000, guid: 2ee8c8e1c6a84de7b33eec02c29fa82c, type: 3}
  m_Name: LevelNumberVariable
  m_EditorClassIdentifier: 
  developerDescription: contains the number of the current level
  initial: 0
  current: 0
