%YAML 1.1
%TAG !u! tag:unity3d.com,2011:
--- !u!114 &11400000
MonoBehaviour:
  m_ObjectHideFlags: 0
  m_CorrespondingSourceObject: {fileID: 0}
  m_PrefabInstance: {fileID: 0}
  m_PrefabAsset: {fileID: 0}
  m_GameObject: {fileID: 0}
  m_Enabled: 1
  m_EditorHideFlags: 0
  m_Script: {fileID: 11500000, guid: 6c20bdc44c334581b76a6bb63a61935c, type: 3}
  m_Name: FinishPlatformsFirstPositionVariable
  m_EditorClassIdentifier: 
  developerDescription: Stores the position of the first finish platform
  initial: {x: 0, y: 0, z: 0}
  current: {x: 0, y: -127.5, z: 249}
