%YAML 1.1
%TAG !u! tag:unity3d.com,2011:
--- !u!114 &11400000
MonoBehaviour:
  m_ObjectHideFlags: 0
  m_CorrespondingSourceObject: {fileID: 0}
  m_PrefabInstance: {fileID: 0}
  m_PrefabAsset: {fileID: 0}
  m_GameObject: {fileID: 0}
  m_Enabled: 1
  m_EditorHideFlags: 0
  m_Script: {fileID: 11500000, guid: c85f93b2542d45c7ae6baad350d6a932, type: 3}
  m_Name: Player State Alive
  m_EditorClassIdentifier: 
  text: Alive
  color: {r: 0, g: 1, b: 0, a: 1}
  blockSlot: 1
  isAlive: 1
