%YAML 1.1
%TAG !u! tag:unity3d.com,2011:
--- !u!114 &11400000
MonoBehaviour:
  m_ObjectHideFlags: 0
  m_CorrespondingSourceObject: {fileID: 0}
  m_PrefabInstance: {fileID: 0}
  m_PrefabAsset: {fileID: 0}
  m_GameObject: {fileID: 0}
  m_Enabled: 1
  m_EditorHideFlags: 0
  m_Script: {fileID: 11500000, guid: 83e065c675194691bf6870fb63bed4e2, type: 3}
  m_Name: PlayerDataContainer 4
  m_EditorClassIdentifier: 
  playerColor: {r: 1, g: 0, b: 0.99906826, a: 1}
  slot: 3
  initialPlayerState: {fileID: 11400000, guid: 829360b3cfdca44608dab9375e6d658f, type: 2}
  playerState: {fileID: 11400000, guid: 829360b3cfdca44608dab9375e6d658f, type: 2}
  playerName: 
  playerId: -1
  spawnPoint: {x: 0, y: 0, z: 0}
