%YAML 1.1
%TAG !u! tag:unity3d.com,2011:
--- !u!114 &11400000
MonoBehaviour:
  m_ObjectHideFlags: 0
  m_CorrespondingSourceObject: {fileID: 0}
  m_PrefabInstance: {fileID: 0}
  m_PrefabAsset: {fileID: 0}
  m_GameObject: {fileID: 0}
  m_Enabled: 1
  m_EditorHideFlags: 0
  m_Script: {fileID: 11500000, guid: a9081f5a5f2941d0816607e3f5a339e8, type: 3}
  m_Name: Game Running
  m_EditorClassIdentifier: 
  id: 2
  evaluateAmountOfPlayersForGameState: 1
  playCountdown: 0
  showCountdownHud: 0
  joinRoomAllowed: 0
  playerControlsAllowed: 1
