Division,WeightClassKg,Place,Name,Team,BodyweightKg,Best3SquatKg,Best3BenchKg,Best3DeadliftKg,TotalKg,Equipment,Event,Sex,BirthDate
Girls,44.23,1,Joselyn Silva,Longview Pine Tree,42.96,83.91,38.56,77.11,199.58,Unlimited,SBD,F,
Girls,44.23,2,Rylan Bizzell,Garrison,43.09,74.84,38.56,79.38,192.78,Unlimited,SBD,F,
Girls,44.23,3,Tenley Rogers,Elkhart,37.19,38.56,27.22,49.9,115.67,Unlimited,SBD,F,
Girls,47.85,1,Yamille Castillo,Longview Pine Tree,47.81,106.59,54.43,90.72,251.74,Unlimited,SBD,F,
Girls,47.85,2,Milly Orzechowski,Elkhart,47.17,83.91,45.36,97.52,226.8,Unlimited,SBD,F,
Girls,47.85,3,Nakona Muller,Bullard,46.72,79.38,38.56,83.91,201.85,Unlimited,SBD,F,
Girls,47.85,4,Martha Brannigan,Longview Pine Tree,46.81,86.18,40.82,65.77,192.78,Unlimited,SBD,F,
Girls,47.85,5,Alexa Stewart,Harleton,46.27,40.82,24.95,52.16,117.93,Unlimited,SBD,F,
Girls,47.85,DQ,Courtney Hanna,Bullard,46.72,61.23,,,,Unlimited,SBD,F,
Girls,47.85,DQ,Kyndle Carrington,Joaquin,45.9,72.57,,,,Unlimited,SBD,F,
Girls,51.94,1,Jaela Gipson,Longview Pine Tree,51.53,147.42,61.23,124.74,333.39,Unlimited,SBD,F,
Girls,51.94,2,Mayson Smith,Harleton,48.72,115.67,83.91,127.01,326.59,Unlimited,SBD,F,
Girls,51.94,3,Ryleigh Glenn,Elkhart,51.89,124.74,81.65,113.4,319.78,Unlimited,SBD,F,
Girls,51.94,4,Kayla Ready,Harleton,50.89,124.74,72.57,120.2,317.51,Unlimited,SBD,F,
Girls,51.94,5,Alexis Huffman,Garrison,50.8,111.13,70.31,124.74,306.17,Unlimited,SBD,F,
Girls,51.94,6,Lainey Childress,Harleton,50.8,104.33,68.04,111.13,283.5,Unlimited,SBD,F,
Girls,51.94,7,Mackenzie Robinson,Longview Pine Tree,51.53,108.86,56.7,106.59,272.16,Unlimited,SBD,F,
Girls,51.94,8,Ava Meek,Newton,48.08,92.99,45.36,90.72,229.06,Unlimited,SBD,F,
Girls,51.94,9,Mackenzie Musselwhite,Henderson,51.57,83.91,43.09,99.79,226.8,Unlimited,SBD,F,
Girls,51.94,10,Zion James,Joaquin,48.35,83.91,43.09,95.25,222.26,Unlimited,SBD,F,
Girls,56.02,1,Guinevere Young,Elkhart,52.16,115.67,65.77,108.86,290.3,Unlimited,SBD,F,
Girls,56.02,2,Dakota Williams,Newton,53.98,102.06,61.23,117.93,281.23,Unlimited,SBD,F,
Girls,56.02,3,Wren Goode,Henderson,52.62,104.33,56.7,106.59,267.62,Unlimited,SBD,F,
Girls,56.02,4,Kambryn Rodrigues,Garrison,54.88,95.25,49.9,102.06,247.21,Unlimited,SBD,F,
Girls,56.02,5,Hannah Cranford,Longview Pine Tree,54.43,99.79,47.63,74.84,222.26,Unlimited,SBD,F,
Girls,56.02,6,Leslie Blackburn,Harleton,52.62,81.65,47.63,83.91,213.19,Unlimited,SBD,F,
Girls,56.02,7,Erin Worden,Bullard,53.07,72.57,45.36,95.25,213.19,Unlimited,SBD,F,
Girls,56.02,8,Makenzie Ansley,Elysian Fields,52.62,79.38,36.29,95.25,210.92,Unlimited,SBD,F,
Girls,56.02,9,Jenna Neal,Elkhart,53.07,81.65,43.09,86.18,210.92,Unlimited,SBD,F,
Girls,56.02,10,Maleighia Washington,Elysian Fields,55.79,81.65,38.56,81.65,201.85,Unlimited,SBD,F,
Girls,60.1,1,Jakhia David,Newton,58.97,131.54,79.38,136.08,347,Unlimited,SBD,F,
Girls,60.1,2,Anna Moreland,Tyler Legacy,59.65,124.74,88.45,131.54,344.73,Unlimited,SBD,F,
Girls,60.1,3,Chyanne Cannon,Elkhart,59.42,115.67,79.38,111.13,306.17,Unlimited,SBD,F,
Girls,60.1,4,Sarah Traxler,Garrison,57.15,104.33,61.23,124.74,290.3,Unlimited,SBD,F,
Girls,60.1,5,Marley Howard,Newton,59.87,104.33,58.97,117.93,281.23,Unlimited,SBD,F,
Girls,60.1,6,Janiyah Anderson,Elysian Fields,57.61,106.59,40.82,129.27,276.69,Unlimited,SBD,F,
Girls,60.1,7,Mackenzie Malone,Longview Pine Tree,59.87,113.4,52.16,111.13,276.69,Unlimited,SBD,F,
Girls,60.1,8,Lexi Easterling,Groveton,56.7,117.93,54.43,102.06,274.42,Unlimited,SBD,F,
Girls,60.1,9,Taylor Airington,Harleton,57.61,99.79,70.31,102.06,272.16,Unlimited,SBD,F,
Girls,60.1,10,Kenley Burt,Henderson,58.51,104.33,54.43,111.13,269.89,Unlimited,SBD,F,
Girls,60.1,11,Hollie Herndon,Center,59.42,97.52,56.7,115.67,269.89,Unlimited,SBD,F,
Girls,60.1,12,Taylor Wilburn,Center,59.87,90.72,56.7,115.67,263.08,Unlimited,SBD,F,
Girls,60.1,13,Kaydence Boyd,Bullard,59.42,102.06,54.43,92.99,249.48,Unlimited,SBD,F,
Girls,60.1,14,Maci Jacks,Newton,59.42,97.52,45.36,90.72,233.6,Unlimited,SBD,F,
Girls,60.1,15,Breanna Gray,Garrison,57.15,79.38,38.56,97.52,215.46,Unlimited,SBD,F,
Girls,60.1,16,Hydie Collins,Gladewater,58.51,79.38,40.82,83.91,204.12,Unlimited,SBD,F,
Girls,60.1,17,Akasha Garcia,Nacogdoches,58.06,38.56,29.48,52.16,120.2,Unlimited,SBD,F,
Girls,60.1,DQ,Cass Hogue,Joaquin,56.7,90.72,52.16,,,Unlimited,SBD,F,
Girls,67.36,1,Nolyn Norris,Henderson,65.32,188.24,99.79,165.56,453.59,Unlimited,SBD,F,
Girls,67.36,2,Jayden Rodrigues,Garrison,66.68,158.76,90.72,117.93,367.41,Unlimited,SBD,F,
Girls,67.36,3,Devyn Gray,Longview Pine Tree,63.96,151.95,77.11,131.54,360.61,Unlimited,SBD,F,
Girls,67.36,4,Emma Barton,Joaquin,65.77,133.81,65.77,120.2,319.78,Unlimited,SBD,F,
Girls,67.36,5,Carleigh McClenan,Henderson,63.5,129.27,54.43,117.93,301.64,Unlimited,SBD,F,
Girls,67.36,6,Leah Selph,Newton,65.32,117.93,63.5,117.93,299.37,Unlimited,SBD,F,
Girls,67.36,7,Brenli Padgett,Henderson,64.41,108.86,68.04,120.2,297.1,Unlimited,SBD,F,
Girls,67.36,8,Kaileigh Lopez,Groveton,63.5,111.13,63.5,108.86,283.5,Unlimited,SBD,F,
Girls,67.36,9,Alexandra Sanchez,Longview Pine Tree,66.68,108.86,65.77,108.86,283.5,Unlimited,SBD,F,
Girls,67.36,10,Kaitlyn Watson,Harleton,64.86,106.59,70.31,104.33,281.23,Unlimited,SBD,F,
Girls,67.36,11,Madelyn Dearman,Elkhart,65.77,115.67,52.16,113.4,281.23,Unlimited,SBD,F,
Girls,67.36,12,Alani Robinson,Elysian Fields,66.68,108.86,45.36,113.4,267.62,Unlimited,SBD,F,
Girls,67.36,13,Olivia Crowder,Nacogdoches,61.23,90.72,54.43,106.59,251.74,Unlimited,SBD,F,
Girls,67.36,14,Mallory Roberts,Garrison,66.68,97.52,43.09,102.06,242.67,Unlimited,SBD,F,
Girls,67.36,15,Aryah Dunn,Newton,66.22,90.72,43.09,81.65,215.46,Unlimited,SBD,F,
Girls,67.36,16,Alicia Boyero,Newton,66.59,83.91,43.09,83.91,210.92,Unlimited,SBD,F,
Girls,67.36,17,Hannah Page,Groveton,62.14,70.31,34.02,81.65,185.97,Unlimited,SBD,F,
Girls,67.36,DQ,Janaysa Harris,Marshall,65.32,113.4,,,,Unlimited,SBD,F,
Girls,67.36,DQ,Jiya Mistry,Marshall,66.68,,,,,Unlimited,SBD,F,
Girls,67.36,DQ,Abi Briggs,Joaquin,61.69,70.31,,,,Unlimited,SBD,F,
Girls,67.36,DQ,Kianna Ballard,Mount Enterprise,65.59,56.7,,,,Unlimited,SBD,F,
Girls,75.07,1,Ciara Allbritton,Garrison,69.4,192.78,88.45,165.56,446.79,Unlimited,SBD,F,
Girls,75.07,2,Angie Pham,Marshall,73.48,140.61,81.65,142.88,365.14,Unlimited,SBD,F,
Girls,75.07,3,MacKynzie Cranford,Garrison,68.49,138.35,88.45,136.08,362.87,Unlimited,SBD,F,
Girls,75.07,4,Cayla Thomas,Henderson,68.04,145.15,79.38,127.01,351.53,Unlimited,SBD,F,
Girls,75.07,5,Hannah Foster,Elkhart,74.84,140.61,81.65,129.27,351.53,Unlimited,SBD,F,
Girls,75.07,6,Jocelyn Cordova,Longview Pine Tree,71.21,140.61,65.77,124.74,331.12,Unlimited,SBD,F,
Girls,75.07,7,Molly Pitts,Nacogdoches,69.4,131.54,70.31,124.74,326.59,Unlimited,SBD,F,
Girls,75.07,8,Olivia Lemmert,Tyler Legacy,74.39,113.4,90.72,120.2,324.32,Unlimited,SBD,F,
Girls,75.07,9,Lauren Bryant,Bullard,70.76,108.86,81.65,117.93,308.44,Unlimited,SBD,F,
Girls,75.07,10,Hailey Hall,Groveton,68.95,136.08,56.7,111.13,303.91,Unlimited,SBD,F,
Girls,75.07,11,Creola Handy,Newton,69.85,120.2,65.77,97.52,283.5,Unlimited,SBD,F,
Girls,75.07,12,Anna Lewis,Joaquin,72.57,92.99,54.43,111.13,258.55,Unlimited,SBD,F,
Girls,75.07,13,Kaci Henley,Groveton,74.84,97.52,56.7,86.18,240.4,Unlimited,SBD,F,
Girls,75.07,14,Jasmine Perez,Bullard,70.76,79.38,34.02,92.99,206.38,Unlimited,SBD,F,
Girls,75.07,15,Ki-Lynn Barlow,Newton,73.44,70.31,36.29,77.11,183.7,Unlimited,SBD,F,
Girls,75.07,DQ,MayCynn Meshell,Groveton,73.03,88.45,,,,Unlimited,SBD,F,
Girls,75.07,DQ,Kirsten Bradley,Marshall,68.49,,,,,Unlimited,SBD,F,
Girls,82.33,1,Ahjia James,Marshall,81.65,181.44,99.79,172.37,453.59,Unlimited,SBD,F,
Girls,82.33,2,Addi Boren,Elkhart,82.1,188.24,111.13,151.95,451.32,Unlimited,SBD,F,
Girls,82.33,3,Olivia Lummus,Longview Pine Tree,81.65,151.95,90.72,131.54,374.21,Unlimited,SBD,F,
Girls,82.33,4,Aleah Lyons,Harleton,82.1,149.69,90.72,131.54,371.95,Unlimited,SBD,F,
Girls,82.33,5,Wendy Esquivel,Marshall,78.47,145.15,79.38,145.15,369.68,Unlimited,SBD,F,
Girls,82.33,6,Laura Whelchel,Tyler Legacy,81.19,120.2,79.38,142.88,342.46,Unlimited,SBD,F,
Girls,82.33,7,Angel Winters,Newton,81.19,113.4,83.91,120.2,317.51,Unlimited,SBD,F,
Girls,82.33,8,Paislie Voelker,Groveton,80.29,120.2,63.5,122.47,306.17,Unlimited,SBD,F,
Girls,82.33,9,Bailey Loden,Elkhart,81.65,102.06,77.11,115.67,294.84,Unlimited,SBD,F,
Girls,82.33,10,Payton Duecker,Bullard,77.56,115.67,65.77,111.13,292.57,Unlimited,SBD,F,
Girls,82.33,11,Anna Weaver,Bullard,77.56,129.27,43.09,113.4,285.76,Unlimited,SBD,F,
Girls,82.33,12,Aaliyah Roseman,Newton,76.2,90.72,38.56,102.06,231.33,Unlimited,SBD,F,
Girls,82.33,13,Saydie Whiteland,Bullard,75.3,113.4,70.31,124.74,308.44,Unlimited,SBD,F,
Girls,82.33,14,Alasia Elam,Crockett,80.29,61.23,29.48,77.11,167.83,Unlimited,SBD,F,
Girls,82.33,DQ,Sophia Hernandez,Henderson,76.2,92.99,,,,Unlimited,SBD,F,
Girls,82.33,DQ,Bailey Barts,Mount Enterprise,77.11,74.84,,,,Unlimited,SBD,F,
Girls,82.33,DQ,Kodie Johnson,Mount Enterprise,80.74,83.91,,,,Unlimited,SBD,F,
Girls,90.04,1,Amelia Gamez,Harleton,88,176.9,106.59,145.15,428.64,Unlimited,SBD,F,
Girls,90.04,2,Aalyah Ayers,Bullard,88.45,158.76,74.84,142.88,376.48,Unlimited,SBD,F,
Girls,90.04,3,Destiny Tinner,Center,85.73,142.88,70.31,145.15,358.34,Unlimited,SBD,F,
Girls,90.04,4,Emory Benkowski,Tyler Legacy,87.54,120.2,52.16,127.01,299.37,Unlimited,SBD,F,
Girls,90.04,5,Summer Cooper,Groveton,86.64,124.74,63.5,106.59,294.84,Unlimited,SBD,F,
Girls,90.04,6,Briana Walker,Tyler Legacy,87.09,115.67,65.77,113.4,294.84,Unlimited,SBD,F,
Girls,90.04,7,Kim Chavez,Groveton,85.28,108.86,70.31,111.13,290.3,Unlimited,SBD,F,
Girls,90.04,8,Courtney Claude,Nacogdoches,88.45,108.86,63.5,117.93,290.3,Unlimited,SBD,F,
Girls,90.04,9,Mackenzi Deloe,Harleton,83.01,97.52,70.31,115.67,283.5,Unlimited,SBD,F,
Girls,90.04,10,Marissa Hare,Henderson,88.45,104.33,54.43,113.4,272.16,Unlimited,SBD,F,
Girls,90.04,11,Abbi Stringer,Center,89.81,111.13,45.36,95.25,251.74,Unlimited,SBD,F,
Girls,90.04,12,Lyriq Sampson,Crockett,87.54,72.57,88.45,79.38,240.4,Unlimited,SBD,F,
Girls,90.04,DQ,Riley Mullins,Joaquin,87.09,,,,,Unlimited,SBD,F,
Girls,100.02,1,Aelena Kellum,Henderson,98.43,199.58,117.93,170.1,487.61,Unlimited,SBD,F,
Girls,100.02,2,Lexi Luby,Harleton,98.88,192.78,127.01,149.69,469.47,Unlimited,SBD,F,
Girls,100.02,3,Samantha Agan,Elkhart,91.17,156.49,127.01,136.08,419.57,Unlimited,SBD,F,
Girls,100.02,4,Elisabeth Fowler,Newton,93.44,158.76,92.99,142.88,394.63,Unlimited,SBD,F,
Girls,100.02,5,Logan Johnson #5,Henderson,97.52,142.88,86.18,145.15,374.21,Unlimited,SBD,F,
Girls,100.02,6,Kalea Phillips,Tyler Legacy,91.17,133.81,72.57,122.47,328.85,Unlimited,SBD,F,
Girls,100.02,7,Sydney Welch,Harleton,97.16,127.01,72.57,120.2,319.78,Unlimited,SBD,F,
Girls,100.02,8,Chassidy Hicks,Crockett,94.8,108.86,63.5,124.74,297.1,Unlimited,SBD,F,
Girls,100.02,9,Shyann Sanders,Elkhart,96.62,120.2,52.16,106.59,278.96,Unlimited,SBD,F,
Girls,100.02,10,Anai Valencia,Crockett,97.52,74.84,36.29,86.18,197.31,Unlimited,SBD,F,
Girls,100.02,DQ,Kylee Johnson,Mount Enterprise,94.8,52.16,,,,Unlimited,SBD,F,
Girls,100.02,DQ,Halle Bonner,Joaquin,100.02,,,,,Unlimited,SBD,F,
Girls,110,1,Janiyah Taylor,Longview Pine Tree,107.95,158.76,90.72,140.61,390.09,Unlimited,SBD,F,
Girls,110,2,Danica Perkins,Newton,109.86,142.88,99.79,129.27,371.95,Unlimited,SBD,F,
Girls,110,3,Janiya Teal,Nacogdoches,106.14,117.93,74.84,120.2,312.98,Unlimited,SBD,F,
Girls,110,4,Remington Parnell,Joaquin,101.6,104.33,58.97,102.06,265.35,Unlimited,SBD,F,
Girls,110,DQ,Mercedes Wilson,Groveton,100.24,,,,,Unlimited,SBD,F,
Girls,110,DQ,Paytin Lummus,Mount Enterprise,109.32,,,,,Unlimited,SBD,F,
Girls,110+,1,Kellsy Blue-Johnson,Marshall,117.48,197.31,97.52,190.51,485.34,Unlimited,SBD,F,
Girls,110+,2,Madison Wright,Marshall,132.81,222.26,88.45,165.56,476.27,Unlimited,SBD,F,
Girls,110+,3,Tatum Wallace,Elkhart,117.48,165.56,111.13,158.76,435.45,Unlimited,SBD,F,
Girls,110+,4,Jamesha Skinner,Nacogdoches,113.85,181.44,97.52,151.95,430.91,Unlimited,SBD,F,
Girls,110+,5,Carina Sanchez,Longview Pine Tree,118.12,165.56,90.72,129.27,385.55,Unlimited,SBD,F,
Girls,110+,6,Leilah Pilgrim,Groveton,132.9,165.56,88.45,129.27,383.29,Unlimited,SBD,F,
Girls,110+,7,Allyee Cline,Elysian Fields,129.27,149.69,92.99,136.08,378.75,Unlimited,SBD,F,
Girls,110+,8,Mackenzee Johns,Newton,114.85,127.01,83.91,117.93,328.85,Unlimited,SBD,F,
Girls,110+,9,Alivia Panero,Joaquin,123.38,88.45,54.43,117.93,260.82,Unlimited,SBD,F,
Girls,110+,10,Jaicey Rich,Elysian Fields,116.57,74.84,45.36,90.72,210.92,Unlimited,SBD,F,
Girls,110+,DQ,Kendall Lummus,Mount Enterprise,141.52,56.7,,,,Unlimited,SBD,F,
Girls,,NS,Addison Levendikis,Elysian Fields,,,,,,Unlimited,SBD,F,
Girls,,NS,Rebecca Allen,Crockett,,,,,,Unlimited,SBD,F,
Girls,,NS,Andrea Villanueva,Crockett,,,,,,Unlimited,SBD,F,
Girls,,NS,Jalynn Brown,Joaquin,,,,,,Unlimited,SBD,F,
Girls,,NS,Gracie Allbritton,Tyler Legacy,,,,,,Unlimited,SBD,F,
Girls,,NS,Nohea Snowden,Groveton,,,,,,Unlimited,SBD,F,
Girls,,NS,Kaelyn Stripling,Bullard,,,,,,Unlimited,SBD,F,
Girls,,NS,Kylea Lenox,Crockett,,,,,,Unlimited,SBD,F,
