Division,WeightClassKg,Place,Name,Team,BodyweightKg,Best3SquatKg,Best3BenchKg,Best3DeadliftKg,TotalKg,Equipment,Event,Sex
Boys,51.71,1,Noah Clasen,Frisco Wakeland,47.85,68.04,34.02,77.11,179.17,Single-ply,SBD,M
Boys,55.79,1,Zach Arenas,Irving MacArthur,55.75,102.06,70.31,133.81,306.17,Single-ply,SBD,M
Boys,55.79,2,Connor Gressett,Frisco Wakeland,54.98,117.93,52.16,117.93,288.03,Single-ply,SBD,M
Boys,59.87,1,AC King,Mesquite Poteet,59.87,129.27,74.84,140.61,344.73,Single-ply,SBD,M
Boys,59.87,2,Sebastian Reyes,Inspired Vision,57.38,136.08,61.23,124.74,322.05,Single-ply,SBD,M
Boys,59.87,3,Sam Hamidi,Frisco Lebanon Trail,58.88,136.08,61.23,117.93,315.25,Single-ply,SBD,M
Boys,67.13,1,Langdon Bautista,Quitman,66.68,188.24,127.01,190.51,505.76,Single-ply,SBD,M
Boys,67.13,2,Jordan Hogg,Frisco Lebanon Trail,65.59,190.51,99.79,185.97,476.27,Single-ply,SBD,M
Boys,67.13,3,Princeton Parker,Frisco Lebanon Trail,62.19,179.17,83.91,181.44,444.52,Single-ply,SBD,M
Boys,67.13,4,Jeremiah Anukem,Mesquite Poteet,66.86,172.37,86.18,172.37,430.91,Single-ply,SBD,M
Boys,67.13,5,Hugo Ramirez,Quitman,64.91,158.76,81.65,156.49,396.89,Single-ply,SBD,M
Boys,67.13,6,Dylan Brown,Mesquite Poteet,66.45,138.35,88.45,158.76,385.55,Single-ply,SBD,M
Boys,67.13,7,Coby Overbeck,Frisco Wakeland,66.5,142.88,83.91,158.76,385.55,Single-ply,SBD,M
Boys,67.13,8,Bryan Morris,Quitman,63.14,142.88,70.31,154.22,367.41,Single-ply,SBD,M
Boys,67.13,9,Joe Edwards,North Mesquite,67.13,140.61,79.38,145.15,365.14,Single-ply,SBD,M
Boys,67.13,10,Guillermo Medellin,Mesquite Horn,67.13,140.61,77.11,124.74,342.46,Single-ply,SBD,M
Boys,67.13,11,Joseph Vargas,Mesquite Horn,62.46,113.4,68.04,106.59,288.03,Single-ply,SBD,M
Boys,67.13,DQ,Bryan Gonzalez,Inspired Vision,65.95,129.27,,,,Single-ply,SBD,M
Boys,74.84,1,Charlie Burkhart,Frisco Wakeland,73.48,190.51,117.93,170.1,478.54,Single-ply,SBD,M
Boys,74.84,2,Chris Rublacado,North Mesquite,73.89,156.49,88.45,151.95,396.89,Single-ply,SBD,M
Boys,74.84,3,Ali Noorani,Frisco Wakeland,74.03,136.08,90.72,158.76,385.55,Single-ply,SBD,M
Boys,74.84,4,Tre Howard,Irving MacArthur,71.99,145.15,70.31,156.49,371.95,Single-ply,SBD,M
Boys,74.84,5,Jayden Lee,McKinney North,74.84,142.88,81.65,136.08,360.61,Single-ply,SBD,M
Boys,74.84,6,Seth Dorsey,Mesquite Horn,73.21,117.93,86.18,138.35,342.46,Single-ply,SBD,M
Boys,74.84,7,Silvano Castillo,Quitman,67.49,129.27,63.5,131.54,324.32,Single-ply,SBD,M
Boys,82.1,1,Jose Domiguez,Inspired Vision,81.19,183.7,113.4,183.7,480.81,Single-ply,SBD,M
Boys,82.1,2,Jaden Paige,Frisco Wakeland,81.1,188.24,90.72,181.44,460.4,Single-ply,SBD,M
Boys,82.1,3,Christian Davis #3,Mesquite Poteet,80.47,161.03,88.45,174.63,424.11,Single-ply,SBD,M
Boys,82.1,4,Seyi Adetimehin,McKinney North,76.34,133.81,86.18,154.22,374.21,Single-ply,SBD,M
Boys,82.1,5,Trevor Gilbert #2,Quitman,80.38,142.88,70.31,156.49,369.68,Single-ply,SBD,M
Boys,82.1,6,Jonan Sanchez,Irving MacArthur,74.98,124.74,79.38,136.08,340.19,Single-ply,SBD,M
Boys,82.1,7,Luke Murphy,Quitman,80.06,117.93,77.11,136.08,331.12,Single-ply,SBD,M
Boys,82.1,8,Nick Jones,Mesquite Horn,79.38,122.47,70.31,136.08,328.85,Single-ply,SBD,M
Boys,,NS,Colton Doggett,Frisco Wakeland,,,,,,Single-ply,SBD,M
Boys,89.81,1,Blake Holloway,Mesquite Poteet,87.77,185.97,115.67,197.31,498.95,Single-ply,SBD,M
Boys,89.81,2,Stephen Kirk,Mesquite Poteet,83.78,183.7,120.2,192.78,496.68,Single-ply,SBD,M
Boys,89.81,3,Robbie Wilkins,Frisco Wakeland,85.68,181.44,111.13,181.44,474,Single-ply,SBD,M
Boys,89.81,4,Aiden Reiter,Frisco Lebanon Trail,89.81,167.83,86.18,181.44,435.45,Single-ply,SBD,M
Boys,89.81,5,Trevyan Smith,Lancaster,85.37,161.03,97.52,174.63,433.18,Single-ply,SBD,M
Boys,89.81,6,Roman Knautz,Frisco Lebanon Trail,83.19,156.49,83.91,176.9,417.3,Single-ply,SBD,M
Boys,89.81,7,Dyllan Frettoloso,Irving MacArthur,85.05,142.88,88.45,156.49,387.82,Single-ply,SBD,M
Boys,89.81,8,Hussein Albedredha,Irving MacArthur,89.81,133.81,83.91,136.08,353.8,Single-ply,SBD,M
Boys,89.81,DQ,Abdul Olawuwo,Irving MacArthur,83.87,124.74,,,,Single-ply,SBD,M
Boys,99.79,1,Erick Varela,Inspired Vision,98.88,244.94,136.08,204.12,585.13,Single-ply,SBD,M
Boys,99.79,2,Jayllen Estelle,Lancaster,95.21,206.38,145.15,204.12,555.65,Single-ply,SBD,M
Boys,99.79,3,Desmond Fraizer,Lancaster,99.06,204.12,147.42,204.12,555.65,Single-ply,SBD,M
Boys,99.79,4,Victor Ortega,North Mesquite,97.98,188.24,129.27,179.17,496.68,Single-ply,SBD,M
Boys,99.79,5,Chase Dogan,Frisco Lebanon Trail,96.84,170.1,111.13,199.58,480.81,Single-ply,SBD,M
Boys,99.79,6,Justin Rodriguez,McKinney North,93.21,165.56,113.4,165.56,444.52,Single-ply,SBD,M
Boys,99.79,DQ,Jose Villa,North Mesquite,96.84,115.67,,,,Single-ply,SBD,M
Boys,109.77,1,Josh Hamil,Frisco Wakeland,106.41,188.24,122.47,201.85,512.56,Single-ply,SBD,M
Boys,109.77,2,Kaleb Washington,Lancaster,101.29,181.44,136.08,192.78,510.29,Single-ply,SBD,M
Boys,109.77,3,Jay'den Walker,McKinney North,109.77,142.88,83.91,179.17,405.97,Single-ply,SBD,M
Boys,109.77,4,Billy Chancellor,Lancaster,105.6,124.74,120.2,147.42,392.36,Single-ply,SBD,M
Boys,109.77,5,Corey Savell,Quitman,101.47,77.11,68.04,108.86,254.01,Single-ply,SBD,M
Boys,124.74,1,Dayven Monroe,Lancaster,119.66,226.8,156.49,242.67,625.96,Single-ply,SBD,M
Boys,124.74,2,Willie Henderson,Mesquite Poteet,114.44,226.8,122.47,242.67,591.94,Single-ply,SBD,M
Boys,124.74,3,Cameron Coker,McKinney North,121.29,208.65,149.69,204.12,562.45,Single-ply,SBD,M
Boys,124.74,4,Justin Blalock,Quitman,110.86,215.46,111.13,192.78,519.36,Single-ply,SBD,M
Boys,124.74,5,Matthew Martinez #7,Mesquite Poteet,121.7,172.37,111.13,172.37,455.86,Single-ply,SBD,M
Boys,124.74,6,Terrance Hobbs,North Mesquite,117.03,151.95,77.11,145.15,374.21,Single-ply,SBD,M
Boys,124.74,DQ,Alexis Varela,Inspired Vision,120.25,183.7,,,,Single-ply,SBD,M
Boys,124.74+,1,Willie Armstrong,Lancaster,125.24,208.65,167.83,190.51,566.99,Single-ply,SBD,M
Boys,124.74+,2,David Rodriguez,Mesquite Poteet,127.87,204.12,140.61,197.31,542.04,Single-ply,SBD,M
Boys,124.74+,3,Donovan Valdez,Lancaster,128.68,167.83,122.47,229.06,519.36,Single-ply,SBD,M
Boys,124.74+,4,Cody Anderson,Mesquite Poteet,133.4,192.78,124.74,192.78,510.29,Single-ply,SBD,M
Boys,124.74+,5,Issac Allen,Mesquite Horn,132,181.44,120.2,195.04,496.68,Single-ply,SBD,M
Boys,124.74+,6,Austin Markiewicz,McKinney North,124.83,188.24,115.67,188.24,492.15,Single-ply,SBD,M
Boys,124.74+,7,Patrick Mitchell,Lancaster,160.16,158.76,113.4,204.12,476.27,Single-ply,SBD,M
Boys,124.74+,8,Tristan Cox,North Mesquite,130.45,170.1,111.13,188.24,469.47,Single-ply,SBD,M
Boys,124.74+,9,Brandon Nelson,McKinney North,142.88,165.56,90.72,188.24,444.52,Single-ply,SBD,M
Boys,124.74+,10,Lee Shaw,Mesquite Poteet,155.36,156.49,104.33,174.63,435.45,Single-ply,SBD,M
Boys,124.74+,DQ,Kameron Choice,North Mesquite,134.4,149.69,,,,Single-ply,SBD,M
