﻿WeightClassKg,Name,Division,Sex,Best3BenchKg,TotalKg,Event,Equipment,Place
132,Bush,Open,M,260,260,B,Raw,1
148,Leshore,Open,M,300,300,B,Raw,1
148,Toomer,Open,M,280,280,B,Raw,2
148,Johnson,Open,M,260,260,B,Raw,3
165,Vaughen,Open,M,290,290,B,Raw,1
165,Garza,Open,M,265,265,B,Raw,2
165,Meade,Open,M,260,260,B,Raw,3
165,Musson,Open,M,260,260,B,Raw,4
181,Williams,Open,M,365,365,B,Raw,1
181,Robbins,Open,M,355,355,B,Raw,2
181,Nickles,Open,M,,,B,Raw,DQ
198,Cotton,Open,M,325,325,B,Raw,1
198,Jones,Open,M,320,320,B,Raw,2
198,Dotson,Open,M,220,220,B,Raw,3
220,Doney,Open,M,350,350,B,Raw,1
220,Haag,Open,M,335,335,B,Raw,2
220,Prokop,Open,M,335,335,B,Raw,3
242,Bill Caton,Open,M,380,380,B,Raw,1
242,Wilburn,Open,M,315,315,B,Raw,2
242,Cline,Open,M,275,275,B,Raw,3
275,Burda,Open,M,315,315,B,Raw,1
