\relax 
\providecommand\hyper@newdestlabel[2]{}
\providecommand*\new@tpo@label[2]{}
\catcode `"\active 
\AC@reset@newl@bel
\providecommand\HyperFirstAtBeginDocument{\AtBeginDocument}
\HyperFirstAtBeginDocument{\ifx\hyper@anchor\@undefined
\global\let\oldcontentsline\contentsline
\gdef\contentsline#1#2#3#4{\oldcontentsline{#1}{#2}{#3}}
\global\let\oldnewlabel\newlabel
\gdef\newlabel#1#2{\newlabelxx{#1}#2}
\gdef\newlabelxx#1#2#3#4#5#6{\oldnewlabel{#1}{{#2}{#3}}}
\AtEndDocument{\ifx\hyper@anchor\@undefined
\let\contentsline\oldcontentsline
\let\newlabel\oldnewlabel
\fi}
\fi}
\global\let\hyper@last\relax 
\gdef\HyperFirstAtBeginDocument#1{#1}
\providecommand\HyField@AuxAddToFields[1]{}
\providecommand\HyField@AuxAddToCoFields[2]{}
\select@language{ngerman}
\@writefile{toc}{\select@language{ngerman}}
\@writefile{lof}{\select@language{ngerman}}
\@writefile{lot}{\select@language{ngerman}}
\@writefile{toc}{\contentsline {section}{\nonumberline Abbildungsverzeichnis}{II}{section*.5}}
\@writefile{toc}{\contentsline {section}{\nonumberline Tabellenverzeichnis}{II}{section*.7}}
\@writefile{toc}{\contentsline {section}{Abk\IeC {\"u}rzungsverzeichnis}{III}{section*.8}}
\newacro{AI}[\AC@hyperlink{AI}{AI}]{Adminstration Intelligence AG}
\newacro{API}[\AC@hyperlink{API}{API}]{Application Programming Interface}
\newacro{CI}[\AC@hyperlink{CI}{CI}]{Continous Integration}
\newacro{CLI}[\AC@hyperlink{CLI}{CLI}]{Command Line Interface}
\newacro{CNI}[\AC@hyperlink{CNI}{CNI}]{Container Network Interface}
\newacro{CPU}[\AC@hyperlink{CPU}{CPU}]{Central Processing Unit, Prozessor}
\newacro{DNS}[\AC@hyperlink{DNS}{DNS}]{Domain Name System}
\newacro{GB}[\AC@hyperlink{GB}{GB}]{Gigabyte}
\newacro{IP}[\AC@hyperlink{IP}{IP}]{Internet Protokoll}
\newacro{NFS}[\AC@hyperlink{NFS}{NFS}]{Network File System}
\newacro{RAM}[\AC@hyperlink{RAM}{RAM}]{Random-Access Memory, Arbeitsspeicher}
\newacro{TLS}[\AC@hyperlink{TLS}{TLS}]{Transport Layer Security}
\newacro{URL}[\AC@hyperlink{URL}{URL}]{Uniform Resource Locator}
\newacro{VM}[\AC@hyperlink{VM}{VM}]{Virtuelle Maschine}
\@writefile{toc}{\contentsline {section}{\numberline {1}Einf\IeC {\"u}hrung}{1}{section.9}}
\newlabel{sec:Einfuehrung}{{1}{1}{Einführung}{section.9}{}}
\AC@undonewlabel{acro:AI}
\newlabel{acro:AI}{{1}{1}{Einführung}{section*.10}{}}
\acronymused{AI}
\newlabel{1@xvr}{{}{1}{Einführung}{section.9}{}}
\newlabel{1@vr}{{}{1}{Einführung}{section.9}{}}
\@writefile{toc}{\contentsline {subsection}{\numberline {1.1}Projektumfeld}{1}{subsection.13}}
\newlabel{sec:Projektumfeld}{{1.1}{1}{Projektumfeld}{subsection.13}{}}
\acronymused{AI}
\acronymused{AI}
\acronymused{AI}
\acronymused{AI}
\acronymused{AI}
\@writefile{toc}{\contentsline {subsection}{\numberline {1.2}Projektziel}{1}{subsection.14}}
\newlabel{sec:Projektziel}{{1.2}{1}{Projektziel}{subsection.14}{}}
\AC@undonewlabel{acro:CI}
\newlabel{acro:CI}{{1.2}{2}{Projektziel}{section*.16}{}}
\acronymused{CI}
\acronymused{AI}
\@writefile{toc}{\contentsline {subsection}{\numberline {1.3}Projektbegr\IeC {\"u}ndung}{2}{subsection.18}}
\newlabel{sec:Projektbegruendung}{{1.3}{2}{Projektbegründung}{subsection.18}{}}
\acronymused{CI}
\@writefile{toc}{\contentsline {subsection}{\numberline {1.4}Projektabgrenzung}{3}{subsection.20}}
\newlabel{sec:Projektabgrenzung}{{1.4}{3}{Projektabgrenzung}{subsection.20}{}}
\@writefile{toc}{\contentsline {section}{\numberline {2}Ist-Analyse}{3}{section.21}}
\newlabel{sec:Ist-Analyse}{{2}{3}{Ist-Analyse}{section.21}{}}
\acronymused{AI}
\acronymused{CI}
\@writefile{toc}{\contentsline {section}{\numberline {3}Anforderungen}{4}{section.28}}
\newlabel{sec:Anforderungen}{{3}{4}{Anforderungen}{section.28}{}}
\newlabel{2@xvr}{{}{4}{Anforderungen}{section.28}{}}
\newlabel{2@vr}{{}{4}{Anforderungen}{section.28}{}}
\@writefile{lof}{\contentsline {figure}{\numberline {1}{\ignorespaces \IeC {\"U}bersicht der Gitlab-CI}}{5}{figure.32}}
\newlabel{fig:cicd_pipeline_infograph}{{1}{5}{Übersicht der Gitlab-CI}{figure.32}{}}
\@writefile{toc}{\contentsline {section}{\numberline {4}Nutzwertanalyse}{5}{section.33}}
\newlabel{sec:Nutzwertanalyse}{{4}{5}{Nutzwertanalyse}{section.33}{}}
\@writefile{toc}{\contentsline {subsection}{\numberline {4.1}Nutzen}{5}{subsection.34}}
\newlabel{sec:Nutzen}{{4.1}{5}{Nutzen}{subsection.34}{}}
\newlabel{3@xvr}{{}{6}{Nutzen}{subsection.34}{}}
\newlabel{3@vr}{{}{6}{Nutzen}{subsection.34}{}}
\@writefile{lot}{\contentsline {table}{\numberline {1}{\ignorespaces Nutzwertanalyse}}{6}{table.37}}
\newlabel{tab:Nutzwertanalyse}{{1}{6}{Nutzwertanalyse}{table.37}{}}
\newlabel{4@xvr}{{}{6}{Nutzen}{table.37}{}}
\newlabel{4@vr}{{}{6}{Nutzen}{table.37}{}}
\@writefile{toc}{\contentsline {subsection}{\numberline {4.2}Kosten}{7}{subsection.38}}
\newlabel{sec:Kosten}{{4.2}{7}{Kosten}{subsection.38}{}}
\@writefile{lot}{\contentsline {table}{\numberline {2}{\ignorespaces Projektkosten}}{7}{table.40}}
\newlabel{tab:Projektkosten}{{2}{7}{Projektkosten}{table.40}{}}
\@writefile{toc}{\contentsline {section}{\numberline {5}Konzept}{7}{section.41}}
\newlabel{sec:Konzept}{{5}{7}{Konzept}{section.41}{}}
\acronymused{AI}
\@writefile{lof}{\contentsline {figure}{\numberline {2}{\ignorespaces Gannt Diagramm: Zeitplan}}{8}{figure.47}}
\newlabel{fig:Gantt}{{2}{8}{Gannt Diagramm: Zeitplan}{figure.47}{}}
\newlabel{5@xvr}{{}{8}{Konzept}{figure.47}{}}
\newlabel{5@vr}{{}{8}{Konzept}{figure.47}{}}
\@writefile{toc}{\contentsline {section}{\numberline {6}Implementierung}{9}{section.48}}
\newlabel{sec:Implementierung}{{6}{9}{Implementierung}{section.48}{}}
\AC@undonewlabel{acro:CLI}
\newlabel{acro:CLI}{{6}{9}{Implementierung}{section*.51}{}}
\acronymused{CLI}
\AC@undonewlabel{acro:CNI}
\newlabel{acro:CNI}{{6}{9}{Implementierung}{section*.53}{}}
\acronymused{CNI}
\newlabel{6@xvr}{{}{10}{Implementierung}{section.48}{}}
\newlabel{6@vr}{{}{10}{Implementierung}{section.48}{}}
\@writefile{toc}{\contentsline {section}{\numberline {7}Integration}{10}{section.63}}
\newlabel{sec:Integration}{{7}{10}{Integration}{section.63}{}}
\AC@undonewlabel{acro:API}
\newlabel{acro:API}{{7}{10}{Integration}{section*.65}{}}
\acronymused{API}
\AC@undonewlabel{acro:TLS}
\newlabel{acro:TLS}{{7}{10}{Integration}{section*.66}{}}
\acronymused{TLS}
\newlabel{7@xvr}{{}{10}{Integration}{section.63}{}}
\newlabel{7@vr}{{}{10}{Integration}{section.63}{}}
\newlabel{8@xvr}{{}{10}{Integration}{section.63}{}}
\newlabel{8@vr}{{}{10}{Integration}{section.63}{}}
\AC@undonewlabel{acro:NFS}
\newlabel{acro:NFS}{{7}{11}{Integration}{section*.69}{}}
\acronymused{NFS}
\newlabel{9@xvr}{{}{11}{Integration}{section.63}{}}
\newlabel{9@vr}{{}{11}{Integration}{section.63}{}}
\newlabel{10@xvr}{{}{11}{Integration}{section.63}{}}
\newlabel{10@vr}{{}{11}{Integration}{section.63}{}}
\newlabel{11@xvr}{{}{11}{Integration}{section.63}{}}
\newlabel{11@vr}{{}{11}{Integration}{section.63}{}}
\newlabel{12@xvr}{{}{12}{Integration}{section.63}{}}
\newlabel{12@vr}{{}{12}{Integration}{section.63}{}}
\newlabel{13@xvr}{{}{12}{Integration}{section.63}{}}
\newlabel{13@vr}{{}{12}{Integration}{section.63}{}}
\@writefile{toc}{\contentsline {section}{\numberline {8}Tests}{12}{section.79}}
\newlabel{sec:Tests}{{8}{12}{Tests}{section.79}{}}
\acronymused{TLS}
\newlabel{14@xvr}{{}{13}{Tests}{section.79}{}}
\newlabel{14@vr}{{}{13}{Tests}{section.79}{}}
\AC@undonewlabel{acro:URL}
\newlabel{acro:URL}{{8}{13}{Tests}{section*.82}{}}
\acronymused{URL}
\AC@undonewlabel{acro:DNS}
\newlabel{acro:DNS}{{8}{13}{Tests}{section*.83}{}}
\acronymused{DNS}
\newlabel{15@xvr}{{}{13}{Tests}{section.79}{}}
\newlabel{15@vr}{{}{13}{Tests}{section.79}{}}
\@writefile{toc}{\contentsline {section}{\numberline {9}Auswertung}{13}{section.85}}
\newlabel{sec:Auswertung}{{9}{13}{Auswertung}{section.85}{}}
\@writefile{toc}{\contentsline {subsection}{\numberline {9.1}Soll-Ist-Abgleich}{14}{subsection.86}}
\newlabel{sec:Projektabgrenzung}{{9.1}{14}{Soll-Ist-Abgleich}{subsection.86}{}}
\newlabel{16@xvr}{{}{14}{Soll-Ist-Abgleich}{subsection.86}{}}
\newlabel{16@vr}{{}{14}{Soll-Ist-Abgleich}{subsection.86}{}}
\@writefile{toc}{\contentsline {section}{\numberline {10}\IeC {\"U}bergabe}{14}{section.87}}
\newlabel{sec:\IeC {\"U}bergabe}{{10}{14}{Übergabe}{section.87}{}}
\acronymused{CI}
\@writefile{toc}{\contentsline {section}{\numberline {11}Fazit}{14}{section.88}}
\newlabel{sec:Fazit}{{11}{14}{Fazit}{section.88}{}}
\@writefile{toc}{\contentsline {section}{\numberline {A}Glossar}{i}{appendix.89}}
\newlabel{app:Glossar}{{A}{i}{Glossar}{appendix.89}{}}
\@writefile{toc}{\contentsline {section}{\numberline {B}Anhang}{iii}{appendix.90}}
\@writefile{toc}{\contentsline {subsection}{\numberline {B.1}Abweichungen vom Zeitplan}{iii}{subsection.91}}
\newlabel{app:Abweichungen vom Zeitplan}{{B.1}{iii}{Abweichungen vom Zeitplan}{subsection.91}{}}
\@writefile{lof}{\contentsline {figure}{\numberline {3}{\ignorespaces Abweichung vom Zeitplan}}{iii}{figure.93}}
\@writefile{toc}{\contentsline {subsection}{\numberline {B.2}Betriebshandbuch}{iii}{subsection.94}}
\newlabel{app:Betriebshandbuch}{{B.2}{iii}{Betriebshandbuch}{subsection.94}{}}
\@writefile{toc}{\contentsline {subsubsection}{\numberline {B.2.1}Runner}{iii}{subsubsection.95}}
\newlabel{app:Runner}{{B.2.1}{iii}{Runner}{subsubsection.95}{}}
\@writefile{lof}{\contentsline {figure}{\numberline {4}{\ignorespaces Runner Token}}{iv}{figure.97}}
\newlabel{fig:runner_token}{{4}{iv}{Runner Token}{figure.97}{}}
\@writefile{lof}{\contentsline {figure}{\numberline {5}{\ignorespaces Runner registriert}}{iv}{figure.99}}
\newlabel{fig:runner_registriert}{{5}{iv}{Runner registriert}{figure.99}{}}
\@writefile{toc}{\contentsline {subsubsection}{\numberline {B.2.2}Kubernetes-Integration}{v}{subsubsection.100}}
\newlabel{app:Kubernetes-Integration}{{B.2.2}{v}{Kubernetes-Integration}{subsubsection.100}{}}
\@writefile{lof}{\contentsline {figure}{\numberline {6}{\ignorespaces Kubernetes-Cluster hinzuf\IeC {\"u}gen}}{v}{figure.102}}
\newlabel{fig:add_cluster}{{6}{v}{Kubernetes-Cluster hinzufügen}{figure.102}{}}
\@writefile{toc}{\contentsline {subsection}{\numberline {B.3}deployment.yml}{vi}{subsection.103}}
\newlabel{app:deployment.yml}{{B.3}{vi}{deployment.yml}{subsection.103}{}}
\@writefile{toc}{\contentsline {subsection}{\numberline {B.4}Dockerfile}{vi}{subsection.104}}
\newlabel{app:Dockerfile}{{B.4}{vi}{Dockerfile}{subsection.104}{}}
\@writefile{toc}{\contentsline {subsection}{\numberline {B.5}Gitlab-ci Pipeline-Schema}{vii}{subsection.105}}
\newlabel{app:gitlab-ci.pdf}{{B.5}{vii}{Gitlab-ci Pipeline-Schema}{subsection.105}{}}
\@writefile{lof}{\contentsline {figure}{\numberline {7}{\ignorespaces Gitlab-CI Pipeline-Schema}}{vii}{figure.107}}
\newlabel{fig:gitlab-ci Pipeline-Schema}{{7}{vii}{Gitlab-CI Pipeline-Schema}{figure.107}{}}
\@writefile{toc}{\contentsline {subsection}{\numberline {B.6}gitlab-ci.yml}{viii}{subsection.108}}
\newlabel{app:gitlab-ci.yml}{{B.6}{viii}{gitlab-ci.yml}{subsection.108}{}}
\@writefile{toc}{\contentsline {subsection}{\numberline {B.7}Kosten Cloud-Anbieter}{viii}{subsection.109}}
\newlabel{app:Kosten Cloud-Anbieter}{{B.7}{viii}{Kosten Cloud-Anbieter}{subsection.109}{}}
\@writefile{lof}{\contentsline {figure}{\numberline {8}{\ignorespaces Kosten AWS}}{viii}{figure.111}}
\newlabel{fig:Kosten AWS}{{8}{viii}{Kosten AWS}{figure.111}{}}
\@writefile{lof}{\contentsline {figure}{\numberline {9}{\ignorespaces Kosten Azure}}{ix}{figure.113}}
\newlabel{fig:Kosten Azure}{{9}{ix}{Kosten Azure}{figure.113}{}}
\@writefile{lof}{\contentsline {figure}{\numberline {10}{\ignorespaces Kosten Google-Cloud}}{x}{figure.115}}
\newlabel{fig:Kosten Google-Cloud}{{10}{x}{Kosten Google-Cloud}{figure.115}{}}
\@writefile{toc}{\contentsline {subsection}{\numberline {B.8}Legende Nutzwertanalyse}{xi}{subsection.116}}
\newlabel{app:Legende Nutzwertanalyse}{{B.8}{xi}{Legende Nutzwertanalyse}{subsection.116}{}}
\@writefile{lot}{\contentsline {table}{\numberline {3}{\ignorespaces Nutzwertanalyse Legende}}{xi}{table.118}}
\newlabel{tab:Nutzwertanalyse Legende}{{3}{xi}{Nutzwertanalyse Legende}{table.118}{}}
\@writefile{toc}{\contentsline {subsection}{\numberline {B.9}MySQL-Deployment}{xi}{subsection.119}}
\newlabel{app:mysql-deployment.yml}{{B.9}{xi}{MySQL-Deployment}{subsection.119}{}}
\@writefile{toc}{\contentsline {subsection}{\numberline {B.10}Service f\IeC {\"u}r Anwendung}{xi}{subsection.120}}
\newlabel{app:service.yml}{{B.10}{xi}{Service für Anwendung}{subsection.120}{}}
\@writefile{toc}{\contentsline {subsection}{\numberline {B.11}\IeC {\"U}bersicht Kubernetes Cluster}{xii}{subsection.121}}
\newlabel{app:Schema}{{B.11}{xii}{Übersicht Kubernetes Cluster}{subsection.121}{}}
\@writefile{lof}{\contentsline {figure}{\numberline {11}{\ignorespaces \IeC {\"U}bersicht Kubernetes Cluster}}{xii}{figure.123}}
\newlabel{fig:\IeC {\"U}bersicht Kubernetes Cluster}{{11}{xii}{Übersicht Kubernetes Cluster}{figure.123}{}}
\@writefile{toc}{\contentsline {subsection}{\numberline {B.12}Workflow}{xiii}{subsection.124}}
\newlabel{app:Workflow}{{B.12}{xiii}{Workflow}{subsection.124}{}}
\@writefile{lof}{\contentsline {figure}{\numberline {12}{\ignorespaces Workflow Gitlab-CI}}{xiii}{figure.126}}
\newlabel{fig:Workflow Gitlab-CI}{{12}{xiii}{Workflow Gitlab-CI}{figure.126}{}}
\gdef\minted@oldcachelist{,
  default-pyg-prefix.pygstyle,
  default.pygstyle,
  47529C2A875E01A004AAF654ABE72546D2CACB6D047502BDD750F050373E57FF.pygtex,
  7CB8C8C3F0312A88EADF9DFB0F20DCB7D2CACB6D047502BDD750F050373E57FF.pygtex,
  33233A0662FDCC8ACED2CC56C879C8C0D2CACB6D047502BDD750F050373E57FF.pygtex,
  58A76BAD47496D4A3E27037136E17DE6D2CACB6D047502BDD750F050373E57FF.pygtex,
  D2CC8A9F9E4F20D049AB3A2C33505D66D2CACB6D047502BDD750F050373E57FF.pygtex}
\global\csname @altsecnumformattrue\endcsname
