{
    "name": "PoA_foreign",
    "engine": {
        "authorityRound": {
            "params": {
                "gasLimitBoundDivisor": "0x400",
                "stepDuration": "5",
                "validators" : {
                    "list": [
                        "0xf3ee321df87781864f46f6464e764c2827fca73b"
                    ]
                }
            }
        }
    },
    "params": {
        "gasLimitBoundDivisor": "0x400",
        "maximumExtraDataSize": "0x20",
        "minGasLimit": "0x1388",
        "networkID" : "0xb00c"
    },
    "genesis": {
        "seal": {
            "authorityRound": {
                "step": "0x0",
                "signature": "0x0000000000000000000000000000000000000000000000000000000000000000000000000000000000000000000000000000000000000000000000000000000000"
            }
        },
        "difficulty": "0x20000",
        "gasLimit": "0x5B8D80"
    },
    "accounts": {
        "0x0000000000000000000000000000000000000001": { "balance": "1", "builtin": { "name": "ecrecover", "pricing": { "linear": { "base": 3000, "word": 0 } } } },
        "0x0000000000000000000000000000000000000002": { "balance": "1", "builtin": { "name": "sha256", "pricing": { "linear": { "base": 60, "word": 12 } } } },
        "0x0000000000000000000000000000000000000003": { "balance": "1", "builtin": { "name": "ripemd160", "pricing": { "linear": { "base": 600, "word": 120 } } } },
        "0x0000000000000000000000000000000000000004": { "balance": "1", "builtin": { "name": "identity", "pricing": { "linear": { "base": 15, "word": 3 } } } },
        "0xf3ee321df87781864f46f6464e764c2827fca73b": { "balance": "10000000000000000000000" },
        "0x37a30534da3d53aa1867adde26e114a3161b2b12": { "balance": "100000000000000000000000" },
        "0x554E8f65d58621cBAa1806C96898Ea1b1D9C4EC1": { "balance": "100000000000000000000000" }
    }
}
