<?xml version="1.0" standalone="no"?>
<!DOCTYPE svg PUBLIC "-//W3C//DTD SVG 20010904//EN"
 "http://www.w3.org/TR/2001/REC-SVG-20010904/DTD/svg10.dtd">
<svg version="1.0" xmlns="http://www.w3.org/2000/svg"
 width="275.000000pt" height="155.000000pt" viewBox="0 0 275.000000 155.000000"
 preserveAspectRatio="xMidYMid meet">
<metadata>
Created by potrace 1.15, written by Peter Selinger 2001-2017
</metadata>
<g transform="translate(0.000000,155.000000) scale(0.100000,-0.100000)"
fill="#000000" stroke="none">
<path d="M160 1380 c-14 -14 -20 -33 -20 -65 0 -32 6 -51 20 -65 14 -14 33
-20 65 -20 61 0 85 24 85 85 0 61 -24 85 -85 85 -32 0 -51 -6 -65 -20z"/>
<path d="M820 1371 c0 -26 4 -30 39 -36 70 -12 78 -30 83 -196 l5 -146 -31 35
c-46 53 -97 72 -191 72 -170 0 -253 -89 -278 -295 -20 -171 16 -336 89 -409
48 -48 99 -66 188 -66 97 0 152 23 195 82 l29 40 7 -56 7 -56 124 0 124 0 0
29 c0 26 -4 30 -40 36 -22 4 -50 15 -62 25 l-23 18 -3 476 -3 476 -129 0 -130
0 0 -29z m25 -390 c72 -41 100 -133 93 -307 -4 -94 -8 -120 -29 -160 -30 -58
-79 -86 -148 -86 -126 0 -178 97 -169 318 4 95 8 119 31 165 14 30 37 60 49
68 52 32 118 33 173 2z"/>
<path d="M1414 1392 c-37 -24 -44 -96 -13 -136 17 -21 29 -26 65 -26 60 0 84
25 84 85 0 60 -25 85 -82 85 -24 0 -48 -4 -54 -8z"/>
<path d="M1710 1370 c0 -17 5 -30 13 -30 6 0 29 -5 50 -11 66 -18 67 -26 67
-459 0 -433 -1 -441 -67 -459 -21 -6 -44 -11 -50 -11 -8 0 -13 -13 -13 -30 l0
-30 119 0 120 0 7 45 c3 25 9 45 13 45 4 0 20 -14 37 -31 50 -53 93 -69 186
-69 173 1 254 85 280 292 21 171 -12 330 -85 407 -50 52 -100 71 -191 71 -96
0 -154 -24 -194 -79 l-27 -37 3 208 3 208 -135 0 -136 0 0 -30z m531 -386 c63
-32 94 -138 87 -301 -5 -94 -9 -121 -31 -165 -32 -65 -71 -90 -138 -90 -130 0
-186 102 -177 327 6 162 43 228 138 245 41 8 85 2 121 -16z"/>
<path d="M40 1060 c0 -27 4 -30 40 -36 26 -4 48 -16 60 -32 19 -23 20 -41 20
-277 0 -236 -1 -254 -20 -277 -13 -18 -34 -28 -65 -32 -42 -7 -45 -9 -45 -37
l0 -29 200 0 200 0 0 29 c0 26 -4 30 -40 36 -22 4 -50 15 -62 25 -23 18 -23
20 -26 339 l-3 321 -129 0 -130 0 0 -30z"/>
<path d="M1390 776 c0 -297 -1 -315 -20 -338 -13 -18 -34 -28 -65 -32 -42 -7
-45 -9 -45 -37 l0 -29 205 0 205 0 0 29 c0 27 -3 30 -49 36 -86 12 -86 10 -89
299 -3 290 -2 293 71 315 42 13 47 18 47 43 l0 28 -130 0 -130 0 0 -314z"/>
<path d="M2594 492 c-37 -24 -44 -96 -13 -136 17 -21 29 -26 65 -26 60 0 84
25 84 85 0 60 -25 85 -82 85 -24 0 -48 -4 -54 -8z"/>
</g>
</svg>
