{
  "heroes": [
    {
      "id": 1,
      "name": "Black Widow",
      "email": "givemeyourheritage@black.com",
      "phone": "+123 123 123 123",
      "image": "black-widow"
    },
    {
      "id": 2,
      "name": "Thor, Thunder God",
      "email": "mr_thunder@valhalia.com",
      "phone": "+124 124 124 124",
      "image": "black-widow"
    },
    {
      "id": 3,
      "name": "Bruce Banner (Hulk)",
      "email": "smash@avengers.com",
      "phone": "+125 125 125 125",
      "image": "black-widow"
    }
  ]
}