major minor  #blocks  name

   7        0     296024 loop0
   7        1      89024 loop1
   7        2     301080 loop2
   7        3      88964 loop3
   7        4     301288 loop4
   7        5      90004 loop5
   8        0  488386584 sda
   8        1     102400 sda1
   8        2  207910843 sda2
   8        3          1 sda3
   8        4  130252800 sda4
   8        5  150117376 sda5
  11        0    1048575 sr0
