{
  "name": "nx-plugins-tester",
  "$schema": "../../../node_modules/nx/schemas/project-schema.json",
  "sourceRoot": "libs/nx-plugins/tester/src",
  "projectType": "library",
  "targets": {},
  "tags": []
}
