﻿username,password,userError,passwordError,generalError
user1,pass123,Username not valid, Password not valid, Username or password not valid
user123,pass1,Username not valid, Password not valid, Username or password not valid
gigel,parolalugigel,Username not valid, Password not valid, Username or password not valid