%YAML 1.1
%TAG !u! tag:unity3d.com,2011:
--- !u!1045 &1
EditorBuildSettings:
  m_ObjectHideFlags: 0
  serializedVersion: 2
  m_Scenes:
  - enabled: 1
    path: Assets/Scenes/Menu.unity
    guid: b5cd9f875ce3e4248983e565f105ad60
  - enabled: 1
    path: Assets/Scenes/Game.unity
    guid: 99aeeb2fb94b68145b3120f249573cab
  m_configObjects: {}
