%YAML 1.1
%TAG !u! tag:unity3d.com,2011:
--- !u!1 &3740499539615894541
GameObject:
  m_ObjectHideFlags: 0
  m_CorrespondingSourceObject: {fileID: 0}
  m_PrefabInstance: {fileID: 0}
  m_PrefabAsset: {fileID: 0}
  serializedVersion: 6
  m_Component:
  - component: {fileID: 3740499539615894529}
  - component: {fileID: 3740499539615894535}
  - component: {fileID: 2533890053834813354}
  - component: {fileID: 2857672101104578849}
  - component: {fileID: 6581839706901450235}
  - component: {fileID: 2510227165166058607}
  - component: {fileID: 990453732301714508}
  - component: {fileID: -4976958264848841207}
  - component: {fileID: 4960533557394763231}
  - component: {fileID: 4716803467840972345}
  m_Layer: 18
  m_Name: FavorPickUp
  m_TagString: Untagged
  m_Icon: {fileID: 0}
  m_NavMeshLayer: 0
  m_StaticEditorFlags: 0
  m_IsActive: 0
--- !u!4 &3740499539615894529
Transform:
  m_ObjectHideFlags: 0
  m_CorrespondingSourceObject: {fileID: 0}
  m_PrefabInstance: {fileID: 0}
  m_PrefabAsset: {fileID: 0}
  m_GameObject: {fileID: 3740499539615894541}
  m_LocalRotation: {x: 0, y: 0, z: 0, w: 1}
  m_LocalPosition: {x: 0, y: 0, z: 0}
  m_LocalScale: {x: 1, y: 1, z: 1}
  m_Children:
  - {fileID: 6762729842546535632}
  - {fileID: 8000632702824235454}
  - {fileID: 3230536666243154029}
  - {fileID: 8476773939897630729}
  m_Father: {fileID: 0}
  m_RootOrder: 0
  m_LocalEulerAnglesHint: {x: 0, y: 0, z: 0}
--- !u!54 &3740499539615894535
Rigidbody:
  m_ObjectHideFlags: 0
  m_CorrespondingSourceObject: {fileID: 0}
  m_PrefabInstance: {fileID: 0}
  m_PrefabAsset: {fileID: 0}
  m_GameObject: {fileID: 3740499539615894541}
  serializedVersion: 2
  m_Mass: 1
  m_Drag: 0
  m_AngularDrag: 0.05
  m_UseGravity: 0
  m_IsKinematic: 0
  m_Interpolate: 0
  m_Constraints: 0
  m_CollisionDetection: 0
--- !u!114 &2533890053834813354
MonoBehaviour:
  m_ObjectHideFlags: 0
  m_CorrespondingSourceObject: {fileID: 0}
  m_PrefabInstance: {fileID: 0}
  m_PrefabAsset: {fileID: 0}
  m_GameObject: {fileID: 3740499539615894541}
  m_Enabled: 1
  m_EditorHideFlags: 0
  m_Script: {fileID: 11500000, guid: aa584fbee541324448dd18d8409c7a41, type: 3}
  m_Name: 
  m_EditorClassIdentifier: 
  ObservedComponentsFoldoutOpen: 0
  Group: 0
  prefixField: -1
  Synchronization: 0
  OwnershipTransfer: 1
  ObservedComponents:
  - {fileID: 0}
  viewIdField: 0
  InstantiationId: 0
  isRuntimeInstantiated: 0
--- !u!114 &2857672101104578849
MonoBehaviour:
  m_ObjectHideFlags: 0
  m_CorrespondingSourceObject: {fileID: 0}
  m_PrefabInstance: {fileID: 0}
  m_PrefabAsset: {fileID: 0}
  m_GameObject: {fileID: 3740499539615894541}
  m_Enabled: 1
  m_EditorHideFlags: 0
  m_Script: {fileID: 11500000, guid: 692b9ac0d7b9b0841bed6cebb551bf15, type: 3}
  m_Name: 
  m_EditorClassIdentifier: 
  synchronizePosition: 1
  synchronizeRotation: 0
  synchronizeScale: 0
  movementSpeed: 4
--- !u!114 &6581839706901450235
MonoBehaviour:
  m_ObjectHideFlags: 0
  m_CorrespondingSourceObject: {fileID: 0}
  m_PrefabInstance: {fileID: 0}
  m_PrefabAsset: {fileID: 0}
  m_GameObject: {fileID: 3740499539615894541}
  m_Enabled: 1
  m_EditorHideFlags: 0
  m_Script: {fileID: 11500000, guid: cdbadcad383a9884497e132b85c97fce, type: 3}
  m_Name: 
  m_EditorClassIdentifier: 
  _isVisible: 0
  model: {fileID: 7176796541531596450}
--- !u!114 &2510227165166058607
MonoBehaviour:
  m_ObjectHideFlags: 0
  m_CorrespondingSourceObject: {fileID: 0}
  m_PrefabInstance: {fileID: 0}
  m_PrefabAsset: {fileID: 0}
  m_GameObject: {fileID: 3740499539615894541}
  m_Enabled: 1
  m_EditorHideFlags: 0
  m_Script: {fileID: 11500000, guid: 4a987161f023e254b9df50ff812667c0, type: 3}
  m_Name: 
  m_EditorClassIdentifier: 
  manager: {fileID: 0}
--- !u!65 &990453732301714508
BoxCollider:
  m_ObjectHideFlags: 0
  m_CorrespondingSourceObject: {fileID: 0}
  m_PrefabInstance: {fileID: 0}
  m_PrefabAsset: {fileID: 0}
  m_GameObject: {fileID: 3740499539615894541}
  m_Material: {fileID: 0}
  m_IsTrigger: 1
  m_Enabled: 1
  serializedVersion: 2
  m_Size: {x: 3, y: 10, z: 3}
  m_Center: {x: 0, y: 0, z: 0}
--- !u!114 &-4976958264848841207
MonoBehaviour:
  m_ObjectHideFlags: 0
  m_CorrespondingSourceObject: {fileID: 0}
  m_PrefabInstance: {fileID: 0}
  m_PrefabAsset: {fileID: 0}
  m_GameObject: {fileID: 3740499539615894541}
  m_Enabled: 1
  m_EditorHideFlags: 0
  m_Script: {fileID: 11500000, guid: 901523b1a896920418d47347f409d317, type: 3}
  m_Name: 
  m_EditorClassIdentifier: 
  unitLayer:
    serializedVersion: 2
    m_Bits: 512
  OnInteract:
    m_PersistentCalls:
      m_Calls:
      - m_Target: {fileID: 7959994925729049372, guid: 2bd661172dbc1104ea53aba4563fd590,
          type: 3}
        m_TargetAssemblyTypeName: GodFavourUIHandler, Assembly-CSharp
        m_MethodName: AddGodFavor
        m_Mode: 4
        m_Arguments:
          m_ObjectArgument: {fileID: 0}
          m_ObjectArgumentAssemblyTypeName: UnityEngine.Object, UnityEngine
          m_IntArgument: 0
          m_FloatArgument: 1
          m_StringArgument: 
          m_BoolArgument: 0
        m_CallState: 2
      - m_Target: {fileID: 4960533557394763231}
        m_TargetAssemblyTypeName: GameStudio.HunterGatherer.Audio.PlayAudio, Assembly-CSharp
        m_MethodName: Play
        m_Mode: 1
        m_Arguments:
          m_ObjectArgument: {fileID: 0}
          m_ObjectArgumentAssemblyTypeName: UnityEngine.Object, UnityEngine
          m_IntArgument: 0
          m_FloatArgument: 0
          m_StringArgument: 
          m_BoolArgument: 0
        m_CallState: 2
      - m_Target: {fileID: 4716803467840972345}
        m_TargetAssemblyTypeName: GodFavorUIParticle, Assembly-CSharp
        m_MethodName: Play
        m_Mode: 1
        m_Arguments:
          m_ObjectArgument: {fileID: 0}
          m_ObjectArgumentAssemblyTypeName: UnityEngine.Object, UnityEngine
          m_IntArgument: 0
          m_FloatArgument: 0
          m_StringArgument: 
          m_BoolArgument: 0
        m_CallState: 2
--- !u!114 &4960533557394763231
MonoBehaviour:
  m_ObjectHideFlags: 0
  m_CorrespondingSourceObject: {fileID: 0}
  m_PrefabInstance: {fileID: 0}
  m_PrefabAsset: {fileID: 0}
  m_GameObject: {fileID: 3740499539615894541}
  m_Enabled: 1
  m_EditorHideFlags: 0
  m_Script: {fileID: 11500000, guid: 9bd93e44355b7b0418ef224019e26726, type: 3}
  m_Name: 
  m_EditorClassIdentifier: 
  eventReference:
    Guid:
      Data1: -1319995233
      Data2: 1151537456
      Data3: 975723189
      Data4: -1648732122
    Path: event:/Events/PickUps
  allowFadeOut: 1
  shouldPlayCertainTime: 0
  playDuration: 3
  parameterAmount: 0
  audioParametersValue: []
--- !u!114 &4716803467840972345
MonoBehaviour:
  m_ObjectHideFlags: 0
  m_CorrespondingSourceObject: {fileID: 0}
  m_PrefabInstance: {fileID: 0}
  m_PrefabAsset: {fileID: 0}
  m_GameObject: {fileID: 3740499539615894541}
  m_Enabled: 1
  m_EditorHideFlags: 0
  m_Script: {fileID: 11500000, guid: dca3a6eda51be1e488877083a64ec5f4, type: 3}
  m_Name: 
  m_EditorClassIdentifier: 
  particlePrefab: {fileID: 8346418157235804130, guid: 0fdde52b5f382bb4a91cb613dc29645e,
    type: 3}
  speed: 10
  minDistanceFromTarget: 0.1
--- !u!1001 &2070427142617052460
PrefabInstance:
  m_ObjectHideFlags: 0
  serializedVersion: 2
  m_Modification:
    m_TransformParent: {fileID: 3740499539615894529}
    m_Modifications:
    - target: {fileID: 351203702040782399, guid: 07f553aa34679704daa2b2f4b748b324,
        type: 3}
      propertyPath: m_Name
      value: FloodInteract
      objectReference: {fileID: 0}
    - target: {fileID: 3489877940219966785, guid: 07f553aa34679704daa2b2f4b748b324,
        type: 3}
      propertyPath: m_RootOrder
      value: 2
      objectReference: {fileID: 0}
    - target: {fileID: 3489877940219966785, guid: 07f553aa34679704daa2b2f4b748b324,
        type: 3}
      propertyPath: m_LocalPosition.x
      value: 0
      objectReference: {fileID: 0}
    - target: {fileID: 3489877940219966785, guid: 07f553aa34679704daa2b2f4b748b324,
        type: 3}
      propertyPath: m_LocalPosition.y
      value: 0
      objectReference: {fileID: 0}
    - target: {fileID: 3489877940219966785, guid: 07f553aa34679704daa2b2f4b748b324,
        type: 3}
      propertyPath: m_LocalPosition.z
      value: 0
      objectReference: {fileID: 0}
    - target: {fileID: 3489877940219966785, guid: 07f553aa34679704daa2b2f4b748b324,
        type: 3}
      propertyPath: m_LocalRotation.w
      value: 1
      objectReference: {fileID: 0}
    - target: {fileID: 3489877940219966785, guid: 07f553aa34679704daa2b2f4b748b324,
        type: 3}
      propertyPath: m_LocalRotation.x
      value: 0
      objectReference: {fileID: 0}
    - target: {fileID: 3489877940219966785, guid: 07f553aa34679704daa2b2f4b748b324,
        type: 3}
      propertyPath: m_LocalRotation.y
      value: 0
      objectReference: {fileID: 0}
    - target: {fileID: 3489877940219966785, guid: 07f553aa34679704daa2b2f4b748b324,
        type: 3}
      propertyPath: m_LocalRotation.z
      value: 0
      objectReference: {fileID: 0}
    - target: {fileID: 3489877940219966785, guid: 07f553aa34679704daa2b2f4b748b324,
        type: 3}
      propertyPath: m_LocalEulerAnglesHint.x
      value: 0
      objectReference: {fileID: 0}
    - target: {fileID: 3489877940219966785, guid: 07f553aa34679704daa2b2f4b748b324,
        type: 3}
      propertyPath: m_LocalEulerAnglesHint.y
      value: 0
      objectReference: {fileID: 0}
    - target: {fileID: 3489877940219966785, guid: 07f553aa34679704daa2b2f4b748b324,
        type: 3}
      propertyPath: m_LocalEulerAnglesHint.z
      value: 0
      objectReference: {fileID: 0}
    m_RemovedComponents: []
  m_SourcePrefab: {fileID: 100100000, guid: 07f553aa34679704daa2b2f4b748b324, type: 3}
--- !u!4 &3230536666243154029 stripped
Transform:
  m_CorrespondingSourceObject: {fileID: 3489877940219966785, guid: 07f553aa34679704daa2b2f4b748b324,
    type: 3}
  m_PrefabInstance: {fileID: 2070427142617052460}
  m_PrefabAsset: {fileID: 0}
--- !u!1001 &3510948062764176880
PrefabInstance:
  m_ObjectHideFlags: 0
  serializedVersion: 2
  m_Modification:
    m_TransformParent: {fileID: 3740499539615894529}
    m_Modifications:
    - target: {fileID: -7864775313939547140, guid: 12f8cf25c21ba464db3df6b8bb7803aa,
        type: 3}
      propertyPath: m_Enabled
      value: 1
      objectReference: {fileID: 0}
    - target: {fileID: -7864775313939547140, guid: 12f8cf25c21ba464db3df6b8bb7803aa,
        type: 3}
      propertyPath: fogOfWarMask
      value: 
      objectReference: {fileID: 0}
    - target: {fileID: -7864775313939547140, guid: 12f8cf25c21ba464db3df6b8bb7803aa,
        type: 3}
      propertyPath: OnSetVisible.m_PersistentCalls.m_Calls.Array.size
      value: 1
      objectReference: {fileID: 0}
    - target: {fileID: -7864775313939547140, guid: 12f8cf25c21ba464db3df6b8bb7803aa,
        type: 3}
      propertyPath: OnSetInvisible.m_PersistentCalls.m_Calls.Array.size
      value: 1
      objectReference: {fileID: 0}
    - target: {fileID: -7864775313939547140, guid: 12f8cf25c21ba464db3df6b8bb7803aa,
        type: 3}
      propertyPath: OnSetVisible.m_PersistentCalls.m_Calls.Array.data[0].m_Mode
      value: 6
      objectReference: {fileID: 0}
    - target: {fileID: -7864775313939547140, guid: 12f8cf25c21ba464db3df6b8bb7803aa,
        type: 3}
      propertyPath: OnSetInvisible.m_PersistentCalls.m_Calls.Array.data[0].m_Mode
      value: 6
      objectReference: {fileID: 0}
    - target: {fileID: -7864775313939547140, guid: 12f8cf25c21ba464db3df6b8bb7803aa,
        type: 3}
      propertyPath: OnSetVisible.m_PersistentCalls.m_Calls.Array.data[0].m_Target
      value: 
      objectReference: {fileID: 8476773939897630730}
    - target: {fileID: -7864775313939547140, guid: 12f8cf25c21ba464db3df6b8bb7803aa,
        type: 3}
      propertyPath: OnSetInvisible.m_PersistentCalls.m_Calls.Array.data[0].m_Target
      value: 
      objectReference: {fileID: 8476773939897630730}
    - target: {fileID: -7864775313939547140, guid: 12f8cf25c21ba464db3df6b8bb7803aa,
        type: 3}
      propertyPath: OnSetVisible.m_PersistentCalls.m_Calls.Array.data[0].m_CallState
      value: 2
      objectReference: {fileID: 0}
    - target: {fileID: -7864775313939547140, guid: 12f8cf25c21ba464db3df6b8bb7803aa,
        type: 3}
      propertyPath: OnSetVisible.m_PersistentCalls.m_Calls.Array.data[0].m_MethodName
      value: SetActive
      objectReference: {fileID: 0}
    - target: {fileID: -7864775313939547140, guid: 12f8cf25c21ba464db3df6b8bb7803aa,
        type: 3}
      propertyPath: OnSetInvisible.m_PersistentCalls.m_Calls.Array.data[0].m_CallState
      value: 2
      objectReference: {fileID: 0}
    - target: {fileID: -7864775313939547140, guid: 12f8cf25c21ba464db3df6b8bb7803aa,
        type: 3}
      propertyPath: OnSetInvisible.m_PersistentCalls.m_Calls.Array.data[0].m_MethodName
      value: SetActive
      objectReference: {fileID: 0}
    - target: {fileID: -7864775313939547140, guid: 12f8cf25c21ba464db3df6b8bb7803aa,
        type: 3}
      propertyPath: OnSetVisible.m_PersistentCalls.m_Calls.Array.data[0].m_Arguments.m_BoolArgument
      value: 1
      objectReference: {fileID: 0}
    - target: {fileID: -7864775313939547140, guid: 12f8cf25c21ba464db3df6b8bb7803aa,
        type: 3}
      propertyPath: OnSetVisible.m_PersistentCalls.m_Calls.Array.data[0].m_Arguments.m_ObjectArgumentAssemblyTypeName
      value: UnityEngine.Object, UnityEngine
      objectReference: {fileID: 0}
    - target: {fileID: -7864775313939547140, guid: 12f8cf25c21ba464db3df6b8bb7803aa,
        type: 3}
      propertyPath: OnSetInvisible.m_PersistentCalls.m_Calls.Array.data[0].m_Arguments.m_ObjectArgumentAssemblyTypeName
      value: UnityEngine.Object, UnityEngine
      objectReference: {fileID: 0}
    - target: {fileID: 1421024887301543098, guid: 12f8cf25c21ba464db3df6b8bb7803aa,
        type: 3}
      propertyPath: m_Name
      value: FogOfWarObject
      objectReference: {fileID: 0}
    - target: {fileID: 1421024887301543098, guid: 12f8cf25c21ba464db3df6b8bb7803aa,
        type: 3}
      propertyPath: m_IsActive
      value: 1
      objectReference: {fileID: 0}
    - target: {fileID: 7882265128489253152, guid: 12f8cf25c21ba464db3df6b8bb7803aa,
        type: 3}
      propertyPath: m_RootOrder
      value: 0
      objectReference: {fileID: 0}
    - target: {fileID: 7882265128489253152, guid: 12f8cf25c21ba464db3df6b8bb7803aa,
        type: 3}
      propertyPath: m_LocalPosition.x
      value: 0
      objectReference: {fileID: 0}
    - target: {fileID: 7882265128489253152, guid: 12f8cf25c21ba464db3df6b8bb7803aa,
        type: 3}
      propertyPath: m_LocalPosition.y
      value: 0
      objectReference: {fileID: 0}
    - target: {fileID: 7882265128489253152, guid: 12f8cf25c21ba464db3df6b8bb7803aa,
        type: 3}
      propertyPath: m_LocalPosition.z
      value: 0
      objectReference: {fileID: 0}
    - target: {fileID: 7882265128489253152, guid: 12f8cf25c21ba464db3df6b8bb7803aa,
        type: 3}
      propertyPath: m_LocalRotation.w
      value: 1
      objectReference: {fileID: 0}
    - target: {fileID: 7882265128489253152, guid: 12f8cf25c21ba464db3df6b8bb7803aa,
        type: 3}
      propertyPath: m_LocalRotation.x
      value: 0
      objectReference: {fileID: 0}
    - target: {fileID: 7882265128489253152, guid: 12f8cf25c21ba464db3df6b8bb7803aa,
        type: 3}
      propertyPath: m_LocalRotation.y
      value: 0
      objectReference: {fileID: 0}
    - target: {fileID: 7882265128489253152, guid: 12f8cf25c21ba464db3df6b8bb7803aa,
        type: 3}
      propertyPath: m_LocalRotation.z
      value: 0
      objectReference: {fileID: 0}
    - target: {fileID: 7882265128489253152, guid: 12f8cf25c21ba464db3df6b8bb7803aa,
        type: 3}
      propertyPath: m_LocalEulerAnglesHint.x
      value: 0
      objectReference: {fileID: 0}
    - target: {fileID: 7882265128489253152, guid: 12f8cf25c21ba464db3df6b8bb7803aa,
        type: 3}
      propertyPath: m_LocalEulerAnglesHint.y
      value: 0
      objectReference: {fileID: 0}
    - target: {fileID: 7882265128489253152, guid: 12f8cf25c21ba464db3df6b8bb7803aa,
        type: 3}
      propertyPath: m_LocalEulerAnglesHint.z
      value: 0
      objectReference: {fileID: 0}
    m_RemovedComponents: []
  m_SourcePrefab: {fileID: 100100000, guid: 12f8cf25c21ba464db3df6b8bb7803aa, type: 3}
--- !u!4 &6762729842546535632 stripped
Transform:
  m_CorrespondingSourceObject: {fileID: 7882265128489253152, guid: 12f8cf25c21ba464db3df6b8bb7803aa,
    type: 3}
  m_PrefabInstance: {fileID: 3510948062764176880}
  m_PrefabAsset: {fileID: 0}
--- !u!1001 &4593067705846629500
PrefabInstance:
  m_ObjectHideFlags: 0
  serializedVersion: 2
  m_Modification:
    m_TransformParent: {fileID: 3740499539615894529}
    m_Modifications:
    - target: {fileID: 1248963881110755808, guid: f5a9668b81587f9419da65d96cfccb7a,
        type: 3}
      propertyPath: m_Name
      value: FogOfWarMask
      objectReference: {fileID: 0}
    - target: {fileID: 1248963881110755808, guid: f5a9668b81587f9419da65d96cfccb7a,
        type: 3}
      propertyPath: m_IsActive
      value: 0
      objectReference: {fileID: 0}
    - target: {fileID: 5259210289070665333, guid: f5a9668b81587f9419da65d96cfccb7a,
        type: 3}
      propertyPath: networkedMovingObject
      value: 
      objectReference: {fileID: 2857672101104578849}
    - target: {fileID: 5817014317139674562, guid: f5a9668b81587f9419da65d96cfccb7a,
        type: 3}
      propertyPath: m_RootOrder
      value: 1
      objectReference: {fileID: 0}
    - target: {fileID: 5817014317139674562, guid: f5a9668b81587f9419da65d96cfccb7a,
        type: 3}
      propertyPath: m_LocalScale.x
      value: 0
      objectReference: {fileID: 0}
    - target: {fileID: 5817014317139674562, guid: f5a9668b81587f9419da65d96cfccb7a,
        type: 3}
      propertyPath: m_LocalScale.y
      value: 0
      objectReference: {fileID: 0}
    - target: {fileID: 5817014317139674562, guid: f5a9668b81587f9419da65d96cfccb7a,
        type: 3}
      propertyPath: m_LocalScale.z
      value: 0
      objectReference: {fileID: 0}
    - target: {fileID: 5817014317139674562, guid: f5a9668b81587f9419da65d96cfccb7a,
        type: 3}
      propertyPath: m_LocalPosition.x
      value: 0
      objectReference: {fileID: 0}
    - target: {fileID: 5817014317139674562, guid: f5a9668b81587f9419da65d96cfccb7a,
        type: 3}
      propertyPath: m_LocalPosition.y
      value: 0
      objectReference: {fileID: 0}
    - target: {fileID: 5817014317139674562, guid: f5a9668b81587f9419da65d96cfccb7a,
        type: 3}
      propertyPath: m_LocalPosition.z
      value: 0
      objectReference: {fileID: 0}
    - target: {fileID: 5817014317139674562, guid: f5a9668b81587f9419da65d96cfccb7a,
        type: 3}
      propertyPath: m_LocalRotation.w
      value: 1
      objectReference: {fileID: 0}
    - target: {fileID: 5817014317139674562, guid: f5a9668b81587f9419da65d96cfccb7a,
        type: 3}
      propertyPath: m_LocalRotation.x
      value: -0
      objectReference: {fileID: 0}
    - target: {fileID: 5817014317139674562, guid: f5a9668b81587f9419da65d96cfccb7a,
        type: 3}
      propertyPath: m_LocalRotation.y
      value: -0
      objectReference: {fileID: 0}
    - target: {fileID: 5817014317139674562, guid: f5a9668b81587f9419da65d96cfccb7a,
        type: 3}
      propertyPath: m_LocalRotation.z
      value: -0
      objectReference: {fileID: 0}
    - target: {fileID: 5817014317139674562, guid: f5a9668b81587f9419da65d96cfccb7a,
        type: 3}
      propertyPath: m_LocalEulerAnglesHint.x
      value: 0
      objectReference: {fileID: 0}
    - target: {fileID: 5817014317139674562, guid: f5a9668b81587f9419da65d96cfccb7a,
        type: 3}
      propertyPath: m_LocalEulerAnglesHint.y
      value: 0
      objectReference: {fileID: 0}
    - target: {fileID: 5817014317139674562, guid: f5a9668b81587f9419da65d96cfccb7a,
        type: 3}
      propertyPath: m_LocalEulerAnglesHint.z
      value: 0
      objectReference: {fileID: 0}
    m_RemovedComponents: []
  m_SourcePrefab: {fileID: 100100000, guid: f5a9668b81587f9419da65d96cfccb7a, type: 3}
--- !u!4 &8000632702824235454 stripped
Transform:
  m_CorrespondingSourceObject: {fileID: 5817014317139674562, guid: f5a9668b81587f9419da65d96cfccb7a,
    type: 3}
  m_PrefabInstance: {fileID: 4593067705846629500}
  m_PrefabAsset: {fileID: 0}
--- !u!1001 &7176796542700162633
PrefabInstance:
  m_ObjectHideFlags: 0
  serializedVersion: 2
  m_Modification:
    m_TransformParent: {fileID: 3740499539615894529}
    m_Modifications:
    - target: {fileID: 1272654057, guid: de8df468a03b1c84f884fc37269e2eca, type: 3}
      propertyPath: m_LocalPosition.y
      value: 0
      objectReference: {fileID: 0}
    - target: {fileID: 1272654057, guid: de8df468a03b1c84f884fc37269e2eca, type: 3}
      propertyPath: m_LocalPosition.z
      value: 0
      objectReference: {fileID: 0}
    - target: {fileID: 1601758175027162333, guid: de8df468a03b1c84f884fc37269e2eca,
        type: 3}
      propertyPath: m_LocalPosition.y
      value: 0
      objectReference: {fileID: 0}
    - target: {fileID: 1601758175027162333, guid: de8df468a03b1c84f884fc37269e2eca,
        type: 3}
      propertyPath: m_LocalPosition.z
      value: 0
      objectReference: {fileID: 0}
    - target: {fileID: 1601758175051517504, guid: de8df468a03b1c84f884fc37269e2eca,
        type: 3}
      propertyPath: m_RootOrder
      value: 3
      objectReference: {fileID: 0}
    - target: {fileID: 1601758175051517504, guid: de8df468a03b1c84f884fc37269e2eca,
        type: 3}
      propertyPath: m_LocalPosition.x
      value: 0
      objectReference: {fileID: 0}
    - target: {fileID: 1601758175051517504, guid: de8df468a03b1c84f884fc37269e2eca,
        type: 3}
      propertyPath: m_LocalPosition.y
      value: 3
      objectReference: {fileID: 0}
    - target: {fileID: 1601758175051517504, guid: de8df468a03b1c84f884fc37269e2eca,
        type: 3}
      propertyPath: m_LocalPosition.z
      value: 0
      objectReference: {fileID: 0}
    - target: {fileID: 1601758175051517504, guid: de8df468a03b1c84f884fc37269e2eca,
        type: 3}
      propertyPath: m_LocalRotation.w
      value: 1
      objectReference: {fileID: 0}
    - target: {fileID: 1601758175051517504, guid: de8df468a03b1c84f884fc37269e2eca,
        type: 3}
      propertyPath: m_LocalRotation.x
      value: 0
      objectReference: {fileID: 0}
    - target: {fileID: 1601758175051517504, guid: de8df468a03b1c84f884fc37269e2eca,
        type: 3}
      propertyPath: m_LocalRotation.y
      value: 0
      objectReference: {fileID: 0}
    - target: {fileID: 1601758175051517504, guid: de8df468a03b1c84f884fc37269e2eca,
        type: 3}
      propertyPath: m_LocalRotation.z
      value: 0
      objectReference: {fileID: 0}
    - target: {fileID: 1601758175051517504, guid: de8df468a03b1c84f884fc37269e2eca,
        type: 3}
      propertyPath: m_LocalEulerAnglesHint.x
      value: 0
      objectReference: {fileID: 0}
    - target: {fileID: 1601758175051517504, guid: de8df468a03b1c84f884fc37269e2eca,
        type: 3}
      propertyPath: m_LocalEulerAnglesHint.y
      value: 0
      objectReference: {fileID: 0}
    - target: {fileID: 1601758175051517504, guid: de8df468a03b1c84f884fc37269e2eca,
        type: 3}
      propertyPath: m_LocalEulerAnglesHint.z
      value: 0
      objectReference: {fileID: 0}
    - target: {fileID: 1601758175051517507, guid: de8df468a03b1c84f884fc37269e2eca,
        type: 3}
      propertyPath: m_Name
      value: GodFavorPickup
      objectReference: {fileID: 0}
    - target: {fileID: 6926356717838877282, guid: de8df468a03b1c84f884fc37269e2eca,
        type: 3}
      propertyPath: m_Intensity
      value: 10
      objectReference: {fileID: 0}
    m_RemovedComponents: []
  m_SourcePrefab: {fileID: 100100000, guid: de8df468a03b1c84f884fc37269e2eca, type: 3}
--- !u!1 &8476773939897630730 stripped
GameObject:
  m_CorrespondingSourceObject: {fileID: 1601758175051517507, guid: de8df468a03b1c84f884fc37269e2eca,
    type: 3}
  m_PrefabInstance: {fileID: 7176796542700162633}
  m_PrefabAsset: {fileID: 0}
--- !u!4 &8476773939897630729 stripped
Transform:
  m_CorrespondingSourceObject: {fileID: 1601758175051517504, guid: de8df468a03b1c84f884fc37269e2eca,
    type: 3}
  m_PrefabInstance: {fileID: 7176796542700162633}
  m_PrefabAsset: {fileID: 0}
--- !u!23 &7176796541531596450 stripped
MeshRenderer:
  m_CorrespondingSourceObject: {fileID: 1272654059, guid: de8df468a03b1c84f884fc37269e2eca,
    type: 3}
  m_PrefabInstance: {fileID: 7176796542700162633}
  m_PrefabAsset: {fileID: 0}
