%YAML 1.1
%TAG !u! tag:unity3d.com,2011:
--- !u!1 &276477235025018500
GameObject:
  m_ObjectHideFlags: 0
  m_CorrespondingSourceObject: {fileID: 0}
  m_PrefabInstance: {fileID: 0}
  m_PrefabAsset: {fileID: 0}
  serializedVersion: 6
  m_Component:
  - component: {fileID: 276477235025018502}
  - component: {fileID: 276477235025018503}
  - component: {fileID: 2027476103}
  - component: {fileID: 2027476104}
  - component: {fileID: 2027476105}
  - component: {fileID: 6871979337474252208}
  m_Layer: 0
  m_Name: SceneManager
  m_TagString: Untagged
  m_Icon: {fileID: 0}
  m_NavMeshLayer: 0
  m_StaticEditorFlags: 0
  m_IsActive: 1
--- !u!4 &276477235025018502
Transform:
  m_ObjectHideFlags: 0
  m_CorrespondingSourceObject: {fileID: 0}
  m_PrefabInstance: {fileID: 0}
  m_PrefabAsset: {fileID: 0}
  m_GameObject: {fileID: 276477235025018500}
  m_LocalRotation: {x: 0, y: 0, z: 0, w: 1}
  m_LocalPosition: {x: 0.085132435, y: 4.623726, z: -5.6048098}
  m_LocalScale: {x: 1, y: 1, z: 1}
  m_Children: []
  m_Father: {fileID: 0}
  m_RootOrder: 0
  m_LocalEulerAnglesHint: {x: 0, y: 0, z: 0}
--- !u!114 &276477235025018503
MonoBehaviour:
  m_ObjectHideFlags: 0
  m_CorrespondingSourceObject: {fileID: 0}
  m_PrefabInstance: {fileID: 0}
  m_PrefabAsset: {fileID: 0}
  m_GameObject: {fileID: 276477235025018500}
  m_Enabled: 1
  m_EditorHideFlags: 0
  m_Script: {fileID: 11500000, guid: 8a164dc41eeb47f43b71bf7d0e92b5b2, type: 3}
  m_Name: 
  m_EditorClassIdentifier: 
  mainMenuSceneName: Menu
  gameSceneNames:
  - Game
  - Arena
--- !u!114 &2027476103
MonoBehaviour:
  m_ObjectHideFlags: 0
  m_CorrespondingSourceObject: {fileID: 0}
  m_PrefabInstance: {fileID: 0}
  m_PrefabAsset: {fileID: 0}
  m_GameObject: {fileID: 276477235025018500}
  m_Enabled: 1
  m_EditorHideFlags: 0
  m_Script: {fileID: 11500000, guid: 9bd93e44355b7b0418ef224019e26726, type: 3}
  m_Name: 
  m_EditorClassIdentifier: 
  audioEvent: 
  eventReference:
    Guid:
      Data1: -262595700
      Data2: 1330263154
      Data3: 94557093
      Data4: -2016547177
    Path: event:/VolumeSFXTest
  allowFadeOut: 0
  shouldPlayCertainTime: 0
  playDuration: 3
  parameterAmount: 0
  audioParametersValue: []
--- !u!114 &2027476104
MonoBehaviour:
  m_ObjectHideFlags: 0
  m_CorrespondingSourceObject: {fileID: 0}
  m_PrefabInstance: {fileID: 0}
  m_PrefabAsset: {fileID: 0}
  m_GameObject: {fileID: 276477235025018500}
  m_Enabled: 1
  m_EditorHideFlags: 0
  m_Script: {fileID: 11500000, guid: 791e835fbe3e49645802f33cc421fdfe, type: 3}
  m_Name: 
  m_EditorClassIdentifier: 
  sfxTestAudio: {fileID: 0}
  masterSlider: {fileID: 0}
  sfxSlider: {fileID: 0}
  musicSlider: {fileID: 0}
--- !u!114 &2027476105
MonoBehaviour:
  m_ObjectHideFlags: 0
  m_CorrespondingSourceObject: {fileID: 0}
  m_PrefabInstance: {fileID: 0}
  m_PrefabAsset: {fileID: 0}
  m_GameObject: {fileID: 276477235025018500}
  m_Enabled: 1
  m_EditorHideFlags: 0
  m_Script: {fileID: 11500000, guid: c216ecb9c447aae4eae7bf347e7deb8d, type: 3}
  m_Name: 
  m_EditorClassIdentifier: 
  VsyncToggle: {fileID: 0}
  defaultVsyncOption: 1
--- !u!114 &6871979337474252208
MonoBehaviour:
  m_ObjectHideFlags: 0
  m_CorrespondingSourceObject: {fileID: 0}
  m_PrefabInstance: {fileID: 0}
  m_PrefabAsset: {fileID: 0}
  m_GameObject: {fileID: 276477235025018500}
  m_Enabled: 1
  m_EditorHideFlags: 0
  m_Script: {fileID: 11500000, guid: c1796295e06fd6d4bb75b5bce2b02a1d, type: 3}
  m_Name: 
  m_EditorClassIdentifier: 
  FrameRateDropDown: {fileID: 0}
  DefaultTargetFPS: 60
