{'name': 'postgres', 'version': 15}
{'name': 'postgres-server', 'version': 15}

dict

nom - Alex
numero - ['0625252525', '00000000']
La liste contient 0625252525
La liste contient 00000000
nouvelle_entree - test

nom
Alex

numero
['0625252525', '00000000']

nouvelle_entree
test


Alex
['0625252525', '00000000']
test
