<!-- Generated by IcoMoon.io -->
<svg version="1.1" xmlns="http://www.w3.org/2000/svg" width="8" height="14" viewBox="0 0 8 14">
<title>icon-caret-up</title>
<path d="M8 9.5c0 0.273-0.227 0.5-0.5 0.5h-7c-0.273 0-0.5-0.227-0.5-0.5 0-0.133 0.055-0.258 0.148-0.352l3.5-3.5c0.094-0.094 0.219-0.148 0.352-0.148s0.258 0.055 0.352 0.148l3.5 3.5c0.094 0.094 0.148 0.219 0.148 0.352z"></path>
</svg>
