{
	"process_id" : 30306,
	"version" : "2020.1.16f1",
	"app_path" : "/Applications/Unity/Hub/Editor/2020.1.16f1/Unity.app",
	"app_contents_path" : "/Applications/Unity/Hub/Editor/2020.1.16f1/Unity.app/Contents"
}