<?xml version="1.0" encoding="utf-8"?>
<!-- Generator: Adobe Illustrator 25.2.0, SVG Export Plug-In . SVG Version: 6.00 Build 0)  -->
<svg version="1.1" id="Слой_1" xmlns="http://www.w3.org/2000/svg" xmlns:xlink="http://www.w3.org/1999/xlink" x="0px" y="0px"
	 viewBox="0 0 20 16" style="enable-background:new 0 0 20 16;" xml:space="preserve">
<style type="text/css">
	.st0{fill:#FFFFFF;}
</style>
<g id="Слой_2_1_">
	<g id="Слой_1-2">
		<path class="st0" d="M18.1,0H1.9c-0.5,0-1,0.2-1.4,0.6C0.2,1,0,1.5,0,2v12c0,0.5,0.2,1,0.5,1.4C0.9,15.8,1.4,16,1.9,16h16.2
			c1.1,0,1.9-0.9,1.9-2V2c0-0.5-0.2-1-0.5-1.4C19.1,0.2,18.6,0,18.1,0z M18.1,1.3h0.2L10,9.1L1.6,1.4c0.1,0,0.2,0,0.2,0L18.1,1.3z
			 M18.1,14.7H1.9c-0.2,0-0.3-0.1-0.5-0.2c-0.1-0.1-0.1-0.1-0.1-0.2c0-0.1,0-0.2,0-0.2V2.8l8.3,7.7c0.1,0.1,0.3,0.2,0.4,0.2
			c0.1,0,0.3-0.1,0.4-0.2l8.3-7.7V14c0,0.1,0,0.2,0,0.2c0,0.1-0.1,0.2-0.1,0.2c-0.1,0.1-0.1,0.1-0.2,0.2L18.1,14.7L18.1,14.7z"/>
	</g>
</g>
</svg>
