<svg
    xmlns="http://www.w3.org/2000/svg"
    class="growth-tab-icon"
    width="22"
    height="12"
    viewBox="0 0 22 12"
>
    <path
        id="icons8-loading_bar"
        d="M3.213,6A2.23,2.23,0,0,0,1,8.213v7.574A2.23,2.23,0,0,0,3.213,18H20.787A2.228,2.228,0,0,0,23,15.789V8.213A2.228,2.228,0,0,0,20.789,6Zm0,2H14v8H3.213A.2.2,0,0,1,3,15.787V8.213A.2.2,0,0,1,3.213,8ZM16,8h4.789A.2.2,0,0,1,21,8.213v7.576a.2.2,0,0,1-.213.211H16Z"
        transform="translate(-1 -6)" 
    />
</svg>