<svg xmlns="http://www.w3.org/2000/svg" width="140.737" height="40.102" viewBox="0 0 140.737 40.102">
  <g id="Сгруппировать_20" data-name="Сгруппировать 20" transform="translate(-395.249 -176.872)">
    <g id="Компонент_5_2" data-name="Компонент 5 – 2" transform="translate(395.25 176.872)">
      <g id="iconfinder_basket_1370043" transform="matrix(0.966, -0.259, 0.259, 0.966, 0, 8.807)">
        <path id="Контур_69" data-name="Контур 69" d="M33.129,6.62A3.561,3.561,0,0,0,30.5,5.345l-13.083.008a.851.851,0,0,0,0,1.7l13.083-.008a2,2,0,0,1,1.359.6,1.524,1.524,0,0,1,.339,1.447l-.767,4.258-9.345.006a.851.851,0,0,0,0,1.7l9.09-.006L30.4,19.138a1.283,1.283,0,0,1-1.275,1.023l-16.312.01a1.352,1.352,0,0,1-1.274-1.021L8.24.676A.826.826,0,0,0,7.391,0L.85,0a.851.851,0,0,0,0,1.7l5.862,0L9.928,19.577a2.92,2.92,0,0,0,2.122,2.383,3.862,3.862,0,0,0-.766,2.214,3.823,3.823,0,1,0,7.646,0,3.727,3.727,0,0,0-.678-2.128l5.182,0a3.735,3.735,0,0,0-.681,2.129,3.823,3.823,0,1,0,6.968-2.218,3.133,3.133,0,0,0,2.3-2.385L33.892,9.515A3.614,3.614,0,0,0,33.129,6.62Zm-15.9,17.465a2.124,2.124,0,1,1-2.123-2.127A2.109,2.109,0,0,1,17.231,24.085Zm9.429,2.123a2.129,2.129,0,1,1,2.125-2.13A2.1,2.1,0,0,1,26.66,26.207Z" transform="translate(0 0)" fill="#fff"/>
      </g>
      <g id="fire" transform="matrix(-0.438, -0.899, 0.899, -0.438, 4.447, 40.102)">
        <g id="Сгруппировать_17" data-name="Сгруппировать 17" transform="translate(0 0)">
          <path id="Контур_52" data-name="Контур 52" d="M5.968,13.629a4.52,4.52,0,0,0,2.57-6.191C7.734,5.58,5.486,2.367,6.549.2a.136.136,0,0,0-.166-.19c-.926.326-3.4,1.487-2.627,4.41A4.753,4.753,0,0,0,2.414,3.319a.136.136,0,0,0-.187.136C2.362,5.221,1.1,6.166.378,7.658a3.9,3.9,0,0,0,.3,3.808,4.678,4.678,0,0,0,2.972,2.216l.827-.09.643.2a4.57,4.57,0,0,0,.763-.135l.084-.023Z" fill="#fff"/>
          <path id="Контур_53" data-name="Контур 53" d="M4.074,7.433C3.27,5.576,1.022,2.362,2.085.2A.136.136,0,0,0,1.919.01,4.951,4.951,0,0,0,0,1.207l.012,12.38.643.2a4.571,4.571,0,0,0,.763-.135l.084-.023a4.52,4.52,0,0,0,2.57-6.191Z" transform="translate(4.464 0.004)" fill="#fff"/>
        </g>
        <g id="Сгруппировать_18" data-name="Сгруппировать 18" transform="translate(2.231 6.585)">
          <path id="Контур_54" data-name="Контур 54" d="M4.064,3.823a.974.974,0,0,1-.684.459c.853-2.489-.3-3.778-.9-4.25a.136.136,0,0,0-.219.129C2.5,1.674.191,3.18.021,4.67A2.324,2.324,0,0,0,1.42,7.1a4.581,4.581,0,0,0,1.506.1A2.491,2.491,0,0,0,4.31,3.845.136.136,0,0,0,4.064,3.823Z" transform="translate(0 0)" fill="#2d77f4" opacity="0.4"/>
        </g>
      </g>
    </g>
    <path id="Контур_144" data-name="Контур 144" d="M22.439-100.332A6.391,6.391,0,0,1,20.4-96.078a6.667,6.667,0,0,1-4.552,1.5,6.121,6.121,0,0,1-4.933-2.207,8.88,8.88,0,0,1-1.855-5.906v-1.67a9.9,9.9,0,0,1,.865-4.259,6.461,6.461,0,0,1,2.452-2.822,6.827,6.827,0,0,1,3.675-.984,6.277,6.277,0,0,1,4.438,1.545,6.468,6.468,0,0,1,1.945,4.277h-2.3a4.969,4.969,0,0,0-1.295-3.007,3.924,3.924,0,0,0-2.786-.931,4.1,4.1,0,0,0-3.442,1.623,7.444,7.444,0,0,0-1.247,4.617v1.682a7.652,7.652,0,0,0,1.181,4.5,3.818,3.818,0,0,0,3.3,1.67,4.408,4.408,0,0,0,2.929-.865,4.8,4.8,0,0,0,1.354-3.013Zm12.718.978H27.88L26.245-94.82H23.883l6.634-17.371h2L39.166-94.82h-2.35Zm-6.586-1.885h5.906l-2.959-8.125Zm19.3-.608H43.8v7.027h-2.3v-17.371h5.751a6.807,6.807,0,0,1,4.516,1.336,4.808,4.808,0,0,1,1.581,3.889,4.677,4.677,0,0,1-.877,2.828,5.235,5.235,0,0,1-2.44,1.8l4.08,7.373v.143H51.646ZM43.8-103.72h3.52a3.974,3.974,0,0,0,2.714-.883,2.983,2.983,0,0,0,1.008-2.362,3.141,3.141,0,0,0-.96-2.47,4.072,4.072,0,0,0-2.774-.871H43.8Zm23.8-6.586H62.014V-94.82H59.735v-15.486H54.163v-1.885H67.6ZM72.633-94.82H70.342v-17.371h2.291Zm3.9-.859a1.012,1.012,0,0,1,.268-.71.962.962,0,0,1,.746-.292.981.981,0,0,1,.752.292,1,1,0,0,1,.274.71.918.918,0,0,1-.274.686,1.029,1.029,0,0,1-.752.268,1.008,1.008,0,0,1-.746-.268A.929.929,0,0,1,76.534-95.679Zm8.089.859H83.156v-17.371h1.468Zm17.55-7.743a10.037,10.037,0,0,1-.829,4.212,6.328,6.328,0,0,1-2.368,2.792,6.484,6.484,0,0,1-3.555.978,6.171,6.171,0,0,1-4.916-2.177,8.705,8.705,0,0,1-1.873-5.876v-1.79a9.975,9.975,0,0,1,.841-4.206,6.425,6.425,0,0,1,2.38-2.816,6.433,6.433,0,0,1,3.543-.984,6.492,6.492,0,0,1,3.538.966,6.349,6.349,0,0,1,2.368,2.732,9.833,9.833,0,0,1,.871,4.092Zm-1.468-1.885a7.678,7.678,0,0,0-1.42-4.916,4.708,4.708,0,0,0-3.889-1.778,4.7,4.7,0,0,0-3.86,1.784,7.739,7.739,0,0,0-1.438,4.981v1.814a7.677,7.677,0,0,0,1.432,4.9,4.7,4.7,0,0,0,3.889,1.808,4.66,4.66,0,0,0,3.889-1.784,7.882,7.882,0,0,0,1.4-4.969Z" transform="translate(433.812 300.198)" fill="#fff"/>
  </g>
</svg>
