<?xml version="1.0" encoding="UTF-8"?>
<svg width="161px" height="66px" viewBox="0 0 161 66" version="1.1" xmlns="http://www.w3.org/2000/svg" xmlns:xlink="http://www.w3.org/1999/xlink">
    <!-- Generator: Sketch 52.2 (67145) - http://www.bohemiancoding.com/sketch -->
    <title>Group 3</title>
    <desc>Created with Sketch.</desc>
    <g id="LP---Pricing" stroke="none" stroke-width="1" fill="none" fill-rule="evenodd">
        <g id="1440px-original" transform="translate(-641.000000, -322.000000)">
            <g id="Group-23" transform="translate(247.000000, 242.000000)">
                <g id="Group-3" transform="translate(474.500000, 113.000000) rotate(-270.000000) translate(-474.500000, -113.000000) translate(442.000000, 33.000000)">
                    <rect id="Rectangle-7" fill="#D8D9DD" x="32" y="0" width="1" height="160"></rect>
                    <circle id="Oval-Copy-2" stroke="#D8D9DD" fill="#FFFFFF" cx="32.5" cy="80.5" r="32"></circle>
                    <path d="M36.0766072,75.0255357 L36.0766072,70 L46.4400005,79.6454597 L36.0766072,89.2909193 L36.0766072,84.3586735 L21,84.3586735 L21,75.0255357 L36.0766072,75.0255357 Z" id="Combined-Shape" fill="#007AFA"></path>
                </g>
            </g>
        </g>
    </g>
</svg>