<svg width="297" height="173" viewBox="0 0 297 173" fill="none" xmlns="http://www.w3.org/2000/svg">
<path d="M251.821 171.305C251.821 171.305 296.255 151.554 295.224 111.708C294.192 71.8611 252.075 53.3458 223.487 77.9019C194.899 102.458 176.4 81.8718 161.586 61.081C146.772 40.2901 113.737 14.056 70.3838 26.2031C24.9753 38.9068 11.0047 84.8759 15.5169 115.546C18.7434 137.582 30.5603 156.261 46.6355 170.618C47.1596 171.084 47.6919 171.543 48.2733 172.001L251.821 171.305Z" fill="#EAEDFB"/>
<path d="M168.299 158.287H131.078V167.298H168.299V158.287Z" fill="#2A67DE"/>
<path d="M175.33 172H124.045C123.733 172 123.424 171.939 123.136 171.821C122.848 171.703 122.586 171.529 122.366 171.31C122.145 171.091 121.971 170.832 121.852 170.546C121.733 170.26 121.673 169.954 121.674 169.646C121.674 169.023 121.924 168.426 122.368 167.986C122.813 167.546 123.416 167.299 124.045 167.299H175.33C175.959 167.299 176.562 167.546 177.007 167.986C177.451 168.426 177.701 169.023 177.701 169.646C177.702 169.954 177.642 170.26 177.523 170.546C177.404 170.832 177.23 171.091 177.009 171.31C176.789 171.529 176.527 171.703 176.239 171.821C175.951 171.939 175.642 172 175.33 172Z" fill="#4786FF"/>
<path d="M233.337 53.5607C233.337 52.1367 232.772 50.771 231.765 49.764C230.758 48.7571 229.392 48.1914 227.968 48.1914H71.4001C70.6954 48.1914 69.9976 48.3303 69.3466 48.6003C68.6957 48.8702 68.1043 49.2658 67.6064 49.7645C67.1085 50.2632 66.7137 50.8552 66.4448 51.5066C66.1759 52.1579 66.038 52.856 66.0391 53.5607V144.182H233.337V53.5607Z" fill="#4786FF"/>
<path d="M225.892 56.0273H73.4824V137.13H225.892V56.0273Z" fill="#EAEDFB"/>
<path d="M71.4001 159.07H227.968C229.392 159.07 230.758 158.509 231.765 157.509C232.772 156.51 233.337 155.154 233.337 153.741V144.182H66.0391V153.741C66.038 154.441 66.1759 155.133 66.4448 155.78C66.7137 156.426 67.1085 157.014 67.6064 157.509C68.1043 158.004 68.6957 158.396 69.3466 158.664C69.9976 158.932 70.6954 159.07 71.4001 159.07Z" fill="white"/>
<path d="M153.018 151.627C153.018 152.247 152.823 152.853 152.457 153.368C152.091 153.883 151.571 154.285 150.962 154.522C150.354 154.76 149.684 154.822 149.038 154.701C148.392 154.58 147.799 154.281 147.333 153.843C146.867 153.405 146.55 152.846 146.421 152.238C146.293 151.63 146.359 151 146.611 150.427C146.863 149.854 147.29 149.365 147.838 149.02C148.385 148.676 149.029 148.492 149.688 148.492C150.571 148.492 151.418 148.822 152.043 149.41C152.667 149.998 153.018 150.795 153.018 151.627Z" fill="#404DC4"/>
<g opacity="0.57">
<path opacity="0.57" d="M115.751 55.9844L80.8789 137.197H93.2234L128.472 55.9844H115.751Z" fill="white"/>
<path opacity="0.57" d="M204.7 55.9844L169.836 137.197H182.172L217.421 55.9844H204.7Z" fill="white"/>
<path opacity="0.57" d="M144.206 55.9844L109.342 137.197H145.859L181.108 55.9844H144.206Z" fill="white"/>
</g>
<path d="M149.099 72.875H84.0605V118.716H149.099V72.875Z" fill="white"/>
<path d="M149.099 72.875H84.0605V118.716H149.099V72.875Z" stroke="#A2C9F8" stroke-width="3.01" stroke-linecap="round" stroke-linejoin="round"/>
<path d="M156.545 76.4004H215.707" stroke="white" stroke-width="2.81" stroke-miterlimit="10"/>
<path d="M156.545 90.1133H192.982" stroke="white" stroke-width="2.81" stroke-miterlimit="10"/>
<path d="M156.545 83.4531H166.732" stroke="white" stroke-width="2.81" stroke-miterlimit="10"/>
<path d="M156.545 99.125H215.707" stroke="white" stroke-width="2.81" stroke-miterlimit="10"/>
<path d="M156.545 113.23H215.707" stroke="white" stroke-width="2.81" stroke-miterlimit="10"/>
<path d="M156.545 106.178H191.415" stroke="white" stroke-width="2.81" stroke-miterlimit="10"/>
<path d="M129.355 98.1646C130.759 90.4243 125.622 83.0116 117.882 81.6077C110.142 80.2039 102.729 85.3405 101.325 93.0808C99.9212 100.821 105.058 108.234 112.798 109.638C120.538 111.041 127.951 105.905 129.355 98.1646Z" fill="#F04365"/>
<path d="M107.961 95.5996H122.066" stroke="white" stroke-width="4.21" stroke-linecap="round" stroke-linejoin="round"/>
<path d="M243.133 123.05L246.227 168.082L251.129 168.074L252.144 123.025L243.133 123.05Z" fill="#1B1754"/>
<path d="M242.348 171.999H250.967V167.689H246.343C245.288 167.689 244.275 168.144 243.529 168.952C242.783 169.76 242.364 170.856 242.364 171.999H242.348Z" fill="#243051"/>
<path d="M252.928 171.999H261.939L261.572 167.689H256.935C255.876 167.689 254.861 168.144 254.113 168.952C253.364 169.76 252.944 170.856 252.944 171.999H252.928Z" fill="#243051"/>
<path d="M258.492 123.025L261.547 167.935L256.851 168.082L249.01 123.025H258.492Z" fill="#2A2B7B"/>
<path d="M250.184 99.635L262.694 110.931C263.194 111.387 263.84 111.646 264.514 111.662C265.188 111.677 265.844 111.446 266.364 111.013C266.661 110.772 266.907 110.473 267.087 110.134C267.267 109.795 267.377 109.423 267.411 109.039C267.446 108.656 267.403 108.269 267.285 107.903C267.168 107.537 266.979 107.199 266.729 106.908C266.729 106.908 260.689 98.6992 257.295 95.9902L250.184 99.635Z" fill="#F04365"/>
<path d="M269.775 127.14C269.775 127.721 269.591 128.289 269.246 128.772C268.902 129.255 268.412 129.632 267.84 129.854C267.267 130.077 266.637 130.135 266.029 130.022C265.421 129.908 264.862 129.628 264.424 129.217C263.986 128.807 263.687 128.283 263.566 127.713C263.445 127.143 263.507 126.552 263.744 126.015C263.982 125.478 264.383 125.019 264.899 124.696C265.414 124.374 266.02 124.201 266.64 124.201C267.052 124.201 267.459 124.277 267.84 124.425C268.22 124.573 268.566 124.789 268.857 125.062C269.148 125.335 269.379 125.659 269.536 126.015C269.694 126.372 269.775 126.754 269.775 127.14Z" fill="#F89A6E"/>
<path d="M262.739 109.728L264.349 124.592H268.6L267.634 109.26C267.609 108.917 267.513 108.583 267.353 108.28C267.193 107.976 266.971 107.709 266.703 107.496C266.434 107.283 266.124 107.128 265.792 107.041C265.46 106.954 265.114 106.938 264.776 106.992C264.152 107.102 263.594 107.446 263.215 107.954C262.836 108.463 262.666 109.098 262.739 109.728Z" fill="#F04365"/>
<path d="M249.005 94.1205C249.005 94.1205 242.784 94.3161 242.422 100.478C242.059 106.641 243.146 123.024 243.146 123.024H258.616L259.002 103.005C259.973 97.6581 257.233 94.2591 251.687 94.039C250.792 94.0163 249.896 94.0435 249.005 94.1205Z" fill="#F04365"/>
<path d="M258.803 107.549L256.061 105.002L258.702 112.446L258.803 107.549Z" fill="#DB3E5D"/>
<path d="M228.244 88.5381C228.246 89.1583 228.075 89.7652 227.753 90.2817C227.431 90.7983 226.972 91.2013 226.436 91.4399C225.899 91.6784 225.308 91.7417 224.737 91.6217C224.167 91.5017 223.642 91.2039 223.231 90.7658C222.819 90.3278 222.538 89.7694 222.424 89.1611C222.31 88.5529 222.368 87.9222 222.59 87.349C222.812 86.7758 223.189 86.2857 223.672 85.941C224.156 85.5962 224.724 85.4121 225.306 85.4121C225.691 85.411 226.073 85.491 226.43 85.6476C226.786 85.8042 227.11 86.0343 227.383 86.3247C227.656 86.6151 227.873 86.9601 228.02 87.3399C228.168 87.7197 228.244 88.1268 228.244 88.5381Z" fill="#F89A6E"/>
<path d="M234.388 105.164L227.999 90.1133L223.934 91.4437L229.716 106.711C229.813 107.044 229.974 107.352 230.19 107.618C230.405 107.884 230.671 108.102 230.97 108.257C231.269 108.413 231.595 108.504 231.929 108.524C232.262 108.544 232.597 108.493 232.911 108.374C233.507 108.141 233.994 107.677 234.27 107.078C234.545 106.48 234.588 105.794 234.388 105.164Z" fill="#F04365"/>
<path d="M246.659 94.6191C241.141 96.9976 235.87 99.7127 230.921 103.115C230.316 103.445 229.851 103.98 229.607 104.622C229.363 105.265 229.358 105.973 229.591 106.619C229.72 106.981 229.921 107.313 230.181 107.596C230.442 107.879 230.756 108.107 231.106 108.267C231.456 108.427 231.835 108.515 232.22 108.527C232.605 108.538 232.988 108.473 233.347 108.334L245.969 102.211L246.659 94.6191Z" fill="#F04365"/>
<path d="M242.349 104.023V100.301L239.803 105.198L242.349 104.023Z" fill="#DB3E5D"/>
<path d="M247.051 90.4086L247.243 94.5753C247.264 95.019 247.41 95.4471 247.662 95.808C247.915 96.1689 248.264 96.4472 248.668 96.6095C249.026 96.7559 249.414 96.8057 249.796 96.7541C250.178 96.7026 250.541 96.5515 250.849 96.3152C251.158 96.0789 251.402 95.7655 251.559 95.4048C251.715 95.0442 251.778 94.6484 251.743 94.2555L251.494 90.1133L247.051 90.4086Z" fill="#F89A6E"/>
<path d="M247.136 93.6161C247.136 93.6161 251.133 94.1426 251.701 90.3253C252.27 86.508 247.899 88.0876 247.899 88.0876L247.051 91.222L247.136 93.6161Z" fill="#E88057"/>
<path d="M244.518 80.5526C243.622 81.5468 243.032 82.7922 242.824 84.1313C242.616 85.4704 242.798 86.843 243.347 88.0756C243.897 89.3081 244.789 90.3453 245.911 91.0558C247.033 91.7664 248.335 92.1185 249.651 92.0675C250.968 92.0166 252.24 91.5648 253.307 90.7695C254.374 89.9742 255.188 88.871 255.646 87.5994C256.104 86.3279 256.185 84.945 255.88 83.6259C255.574 82.3067 254.896 81.1104 253.93 80.1883C252.635 78.952 250.916 78.2959 249.151 78.3642C247.386 78.4326 245.719 79.2197 244.518 80.5526Z" fill="#F89A6E"/>
<path d="M251.384 87.2713C251.384 87.2713 248.707 92.1174 252.473 93.4435C256.238 94.7697 256.5 84.5 256.5 84.5L253.226 76.3267L245.5 76.3262L243.5 79.5C243.5 79.5 243.689 82.417 252.014 85.5686L251.384 87.2713Z" fill="#243051"/>
<path d="M249.354 83.4648L250.524 87.4105L253.52 85.6669L249.354 83.4648Z" fill="#243051"/>
<path d="M250.65 85.9773C250.414 86.2336 250.259 86.5543 250.205 86.8987C250.151 87.2432 250.2 87.596 250.346 87.9126C250.492 88.2293 250.728 88.4956 251.025 88.6779C251.322 88.8602 251.666 88.9504 252.014 88.937C252.362 88.9237 252.699 88.8074 252.981 88.6028C253.263 88.3983 253.478 88.1147 253.6 87.7878C253.721 87.4609 253.743 87.1053 253.662 86.7661C253.582 86.4268 253.403 86.119 253.148 85.8815C252.803 85.5637 252.347 85.3955 251.879 85.4134C251.411 85.4314 250.969 85.6341 250.65 85.9773Z" fill="#F89A6E"/>
<path d="M242.354 83.0042C242.354 83.0042 242.02 78.0657 246.077 75.5089C246.875 75.0017 247.766 74.6658 248.695 74.5216C249.624 74.3774 250.572 74.428 251.481 74.6703C252.39 74.9126 253.242 75.3416 253.983 75.931C254.725 76.5204 255.342 77.2581 255.796 78.099C256.668 79.7646 257.165 81.4302 256.611 84.6282L242.354 83.0042Z" fill="#FDD63B"/>
<path d="M256.53 85.4117H256.449L240.23 83.6755C240.138 83.6653 240.05 83.6372 239.969 83.5928C239.888 83.5484 239.817 83.4885 239.759 83.4166C239.702 83.3447 239.659 83.2622 239.633 83.1737C239.608 83.0853 239.6 82.9927 239.61 82.9011C239.62 82.8096 239.648 82.721 239.693 82.6403C239.737 82.5597 239.797 82.4885 239.869 82.431C239.941 82.3735 240.024 82.3307 240.112 82.305C240.201 82.2794 240.294 82.2715 240.385 82.2816L256.612 84.0179C256.703 84.028 256.792 84.0561 256.873 84.1005C256.954 84.1449 257.025 84.2048 257.083 84.2767C257.14 84.3486 257.183 84.4312 257.209 84.5196C257.234 84.6081 257.242 84.7007 257.232 84.7922C257.21 84.963 257.127 85.12 256.998 85.234C256.869 85.348 256.703 85.4111 256.53 85.4117Z" fill="#F2A62F"/>
<path d="M252.266 25.6354C253.869 18.823 249.645 12.001 242.833 10.3982C236.02 8.79529 229.198 13.0185 227.596 19.8309C225.993 26.6434 230.216 33.4654 237.028 35.0683C243.841 36.6711 250.663 32.4479 252.266 25.6354Z" fill="#4786FF"/>
<path d="M241.957 28.0516C241.924 28.5194 241.703 28.9578 241.34 29.2781C240.976 29.5984 240.496 29.7767 239.998 29.7767C239.5 29.7767 239.02 29.5984 238.657 29.2781C238.293 28.9578 238.072 28.5194 238.039 28.0516C238.072 27.5839 238.293 27.1454 238.657 26.8251C239.02 26.5048 239.5 26.3266 239.998 26.3266C240.496 26.3266 240.976 26.5048 241.34 26.8251C241.703 27.1454 241.924 27.5839 241.957 28.0516ZM241.724 15.6719L241.637 24.7634H238.342C238.342 21.3205 238.273 19.131 238.273 15.6719H241.724Z" fill="white"/>
<path d="M158.895 0L159.945 2.73477C160.264 3.5673 160.755 4.32337 161.386 4.95391C162.016 5.58446 162.772 6.07541 163.605 6.3949L166.34 7.44419L163.605 8.49348C162.772 8.81207 162.015 9.3027 161.385 9.93336C160.754 10.564 160.263 11.3206 159.945 12.1536L158.895 14.8884L157.846 12.1536C157.527 11.3206 157.037 10.564 156.406 9.93336C155.776 9.3027 155.019 8.81207 154.186 8.49348L151.451 7.44419L154.186 6.3949C155.018 6.07541 155.775 5.58446 156.405 4.95391C157.036 4.32337 157.527 3.5673 157.846 2.73477L158.895 0Z" fill="#EAEDFB"/>
<path d="M188.085 23.5078L188.771 25.2924C188.98 25.8445 189.304 26.346 189.721 26.7636C190.139 27.1812 190.64 27.5054 191.191 27.7149L192.982 28.4013L191.191 29.0957C190.64 29.3052 190.139 29.6294 189.721 30.047C189.304 30.4646 188.98 30.9661 188.771 31.5182L188.085 33.3028L187.399 31.5182C187.19 30.9661 186.866 30.4646 186.449 30.047C186.031 29.6294 185.53 29.3052 184.979 29.0957L183.188 28.4013L184.979 27.7149C185.53 27.5054 186.031 27.1812 186.449 26.7636C186.866 26.346 187.19 25.8445 187.399 25.2924L188.085 23.5078Z" fill="#EAEDFB"/>
<path d="M11.9867 39.1797L12.5384 40.616C12.7058 41.0514 12.9621 41.4472 13.2911 41.7783C13.6202 42.1094 14.0146 42.3685 14.4495 42.5391L15.8887 43.0897L14.4495 43.6563C14.0124 43.8263 13.6155 44.085 13.2838 44.4161C12.9521 44.7471 12.6929 45.1432 12.5224 45.5793L11.9707 47.0157L11.419 45.5793C11.2486 45.1432 10.9894 44.7471 10.6577 44.4161C10.326 44.085 9.92903 43.8263 9.49199 43.6563L8.05273 43.1057L9.49199 42.5551C9.92978 42.3863 10.3274 42.128 10.6592 41.7968C10.9911 41.4656 11.2499 41.0689 11.419 40.632L11.9867 39.1797Z" fill="#EAEDFB"/>
<path d="M280.545 46.625L281.132 48.0643C281.31 48.5021 281.581 48.8996 281.929 49.2315C282.277 49.5633 282.694 49.8221 283.154 49.9913L284.663 50.543L283.154 51.0947C282.694 51.2625 282.276 51.5209 281.928 51.8529C281.579 52.1849 281.308 52.5832 281.132 53.0217L280.545 54.461L279.967 53.0217C279.791 52.5832 279.52 52.1849 279.171 51.8529C278.823 51.5209 278.405 51.2625 277.945 51.0947L276.436 50.543L277.945 49.9913C278.404 49.8221 278.821 49.5633 279.17 49.2315C279.518 48.8996 279.789 48.5021 279.967 48.0643L280.545 46.625Z" fill="#EAEDFB"/>
<path d="M75.834 16.244L78.8276 19.2746C79.1476 19.6001 79.5556 19.8262 80.0021 19.9255C80.4487 20.0248 80.9145 19.9929 81.3432 19.8339C81.7219 19.6942 82.0583 19.4604 82.3204 19.1546C82.5825 18.8488 82.7616 18.4813 82.8406 18.087C82.9197 17.6928 82.896 17.285 82.7718 16.9025C82.6477 16.5199 82.4272 16.1754 82.1315 15.9018L79.0959 12.9297L75.834 16.244Z" fill="#F89A6E"/>
<path d="M78.1088 18.4145C78.1088 18.4145 79.9033 14.6893 79.1951 13.1021C77.6501 9.65229 75.0508 13.9119 75.0508 13.9119L76.4752 16.7625L78.1088 18.4145Z" fill="#E88057"/>
<path d="M67.216 10.8514C67.1916 12.1688 67.57 13.4636 68.3033 14.5721C69.0365 15.6805 70.0918 16.5528 71.3355 17.0785C72.5792 17.6043 73.9554 17.7599 75.2902 17.5256C76.6249 17.2914 77.8582 16.6779 78.8339 15.7627C79.8097 14.8475 80.4841 13.6717 80.7718 12.3841C81.0595 11.0965 80.9476 9.75489 80.4503 8.52905C79.953 7.30321 79.0926 6.24819 77.978 5.49746C76.8633 4.74673 75.5445 4.33401 74.1884 4.31152C72.3712 4.28138 70.6161 4.95329 69.3087 6.17959C68.0013 7.4059 67.2486 9.08627 67.216 10.8514Z" fill="#F89A6E"/>
<path d="M76.9413 11.1592C76.9413 11.1592 78.1855 16.5538 81.8528 15.0312C85.5202 13.5086 79 5.00098 79 5.00098L71.0392 1.76172L66 6.00098L67 10.001C67 10.001 66.8644 11.1674 75.1649 7.95849L76.9413 11.1592Z" fill="#243051"/>
<path d="M73 9.38957L76.0698 12L77 8L73 9.38957Z" fill="#243051"/>
<path d="M77.5035 12.3629C77.5035 12.3629 83.3121 28.584 90.5199 21.182C96.9386 14.6135 87.2658 10.6207 84.6055 9.92054C82.5961 9.38706 81.8314 8.67853 79.2932 6.26953L74.2656 7.0114L77.5035 12.3629Z" fill="#243051"/>
<path d="M75.4419 10.5343C75.4332 10.922 75.5398 11.3036 75.7482 11.6307C75.9565 11.9577 76.2573 12.2156 76.6123 12.3716C76.9673 12.5276 77.3606 12.5748 77.7425 12.507C78.1243 12.4393 78.4775 12.2598 78.7572 11.9912C79.0369 11.7226 79.2307 11.3771 79.3138 10.9983C79.397 10.6195 79.3659 10.2246 79.2244 9.86352C79.0829 9.50245 78.8375 9.19148 78.5192 8.97002C78.2008 8.74855 77.8239 8.62655 77.4362 8.61947C76.9181 8.61 76.4174 8.80619 76.0436 9.16507C75.6698 9.52395 75.4535 10.0163 75.4419 10.5343Z" fill="#F89A6E"/>
<path d="M66.5527 11.754C66.5527 11.754 63.8915 7.70703 66.1935 3.58724C66.6443 2.76708 67.2589 2.04654 67.9998 1.46954C68.7406 0.892537 69.5922 0.471162 70.5026 0.231097C71.4131 -0.00896806 72.3633 -0.0626981 73.2953 0.0731861C74.2274 0.20907 75.1217 0.531724 75.9239 1.02147C77.4831 2.00893 78.6994 3.15017 79.7524 6.1611L66.5527 11.754Z" fill="#FDD63B"/>
<path d="M80.1637 6.82953H80.09L65.0605 13.2653C64.975 13.3011 64.8833 13.3198 64.7906 13.3204C64.6979 13.3209 64.6059 13.3033 64.52 13.2686C64.4341 13.2338 64.3559 13.1826 64.29 13.1178C64.224 13.053 64.1715 12.976 64.1355 12.891C64.0995 12.8061 64.0807 12.7149 64.0801 12.6227C64.0795 12.5306 64.0972 12.4392 64.1322 12.3538C64.1671 12.2684 64.2187 12.1907 64.2839 12.1252C64.349 12.0596 64.4266 12.0074 64.512 11.9716L79.5415 5.54401C79.6263 5.50656 79.7177 5.48632 79.8105 5.48451C79.9032 5.4827 79.9954 5.49933 80.0816 5.53345C80.1678 5.56756 80.2462 5.61846 80.3123 5.68315C80.3785 5.74784 80.4309 5.82502 80.4665 5.91014C80.5449 6.07267 80.5571 6.25897 80.5007 6.43024C80.4443 6.60152 80.3235 6.74454 80.1637 6.82953Z" fill="#F2A62F"/>
<path d="M66.2536 49.8289L51.414 65.0392L47.625 63.36L60.4687 45.1481C60.7581 44.6658 61.1623 44.2625 61.6452 43.9739C62.1281 43.6854 62.6748 43.5205 63.2367 43.494C63.7986 43.4675 64.3585 43.5802 64.8664 43.8221C65.3743 44.064 65.8145 44.4275 66.1481 44.8804C66.5721 45.6327 66.8036 46.4781 66.822 47.3414C66.8404 48.2047 66.6451 49.0592 66.2536 49.8289Z" fill="#1B1754"/>
<path d="M41.7564 63.2691L49.459 68.5641L51.543 64.9851L47.5834 62.2641C47.1339 61.9518 46.6256 61.7299 46.0881 61.6114C45.5506 61.4928 44.9944 61.4799 44.4518 61.5734C43.9092 61.6668 43.3908 61.8648 42.9267 62.1559C42.4626 62.447 42.062 62.8253 41.748 63.2691H41.7564Z" fill="#243051"/>
<path d="M76.8555 40.748L61.7285 43.4463L64.8504 49.3676H85.1342C85.1342 49.3676 91.2389 49.2282 88.4031 42.5113L76.8555 40.748Z" fill="#2A2B7B"/>
<path d="M67.1595 45.0503L74.2657 68.9687L70.2327 71.3072L58.9967 48.2011C58.7333 47.7 58.595 47.1407 58.5938 46.5724C58.5926 46.0041 58.7286 45.4442 58.9898 44.9419C59.251 44.4396 59.6295 44.0102 60.092 43.6915C60.5545 43.3727 61.0869 43.1744 61.6423 43.1139C63.0942 42.9744 66.5304 43.7457 67.1595 45.0503Z" fill="#2A2B7B"/>
<path d="M68.4709 76.793L75.834 72.7801L74.2403 68.957L70.1444 71.1947C69.6776 71.4462 69.2635 71.7909 68.9261 72.209C68.5886 72.6272 68.3343 73.1104 68.178 73.6309C68.0217 74.1514 67.9664 74.6987 68.0153 75.2415C68.0642 75.7842 68.2163 76.3115 68.4629 76.793H68.4709Z" fill="#243051"/>
<path d="M75.7714 22.5202C75.7714 22.5202 76.3867 19.835 77.1766 19.0056C77.742 18.4144 79.7625 16.5422 80.8684 16.1316C81.0318 16.0741 81.206 16.0532 81.3785 16.0702C81.5511 16.0872 81.7176 16.1419 81.8662 16.2301C85.074 18.2784 87.4653 21.3595 88.6345 24.9508C90.3557 30.0666 90.7216 44.6586 90.7216 44.6586C85.8241 47.8036 76.6528 40.5528 76.6528 40.5528C76.8856 31.4708 74.6156 31.011 75.7714 22.5202Z" fill="#F04365"/>
<path d="M75.0508 40.8081L82.1229 41.1233C82.5695 41.168 83.0206 41.1205 83.4478 40.9837C83.8751 40.847 84.2692 40.6241 84.6055 40.3289C84.9417 40.0337 85.2129 39.6727 85.4019 39.2684C85.5909 38.8642 85.6937 38.4255 85.7038 37.98L86.0212 25.8594L75.0508 40.8081Z" fill="#DB3E5D"/>
<path d="M68.3895 39.2558L64.1767 37.6773C64.008 37.6139 63.8266 37.5973 63.65 37.6288C63.4734 37.6604 63.3076 37.7391 63.1685 37.8574L61.2916 39.4531C61.1658 39.5607 61.0687 39.7005 61.0097 39.8589C60.9507 40.0173 60.9318 40.189 60.9549 40.3574C60.978 40.5257 61.0422 40.6849 61.1415 40.8196C61.2407 40.9542 61.3714 41.0598 61.5211 41.1259C61.6841 41.2004 61.864 41.2246 62.0397 41.1957C62.2153 41.1668 62.3795 41.0861 62.5128 40.9629L63.4144 40.1051C63.4144 40.1051 66.4962 41.9495 67.9551 41.4434L68.3895 39.2558Z" fill="#F97D7D"/>
<path d="M79.2882 20.373L78.5434 34.3313L67.2148 37.2756L67.6782 41.5302L81.5225 40.0788C82.5059 40.0145 83.4245 39.5646 84.0794 38.8265C84.4257 38.4129 84.6391 37.9041 84.6918 37.3668L86.413 22.886L79.2882 20.373Z" fill="#F04365"/>
<path d="M60.4293 44.651L76.272 41.7924C76.5043 41.7473 76.7103 41.6104 76.8459 41.4109C76.9816 41.2114 77.0362 40.9651 76.998 40.7247C76.9562 40.4842 76.8238 40.2705 76.6297 40.1304C76.4356 39.9902 76.1955 39.9348 75.962 39.9764L60.1193 42.835C60.0033 42.8552 59.8924 42.8991 59.7929 42.9639C59.6934 43.0287 59.6075 43.1132 59.5399 43.2125C59.4724 43.3119 59.4246 43.424 59.3995 43.5425C59.3743 43.661 59.3722 43.7834 59.3933 43.9027C59.4351 44.1432 59.5675 44.3568 59.7616 44.497C59.9557 44.6372 60.1958 44.6926 60.4293 44.651Z" fill="#243051"/>
<path d="M60.6158 43.8808C60.566 43.8821 60.5166 43.8723 60.4712 43.8521C60.4258 43.8319 60.3856 43.8017 60.3537 43.764L50.4681 32.706C50.4362 32.6749 50.4108 32.6379 50.3934 32.597C50.3761 32.5562 50.3672 32.5124 50.3672 32.4681C50.3672 32.4238 50.3761 32.38 50.3934 32.3392C50.4108 32.2983 50.4362 32.2613 50.4681 32.2303C50.499 32.1977 50.5363 32.1717 50.5777 32.1539C50.6192 32.1361 50.6639 32.127 50.7091 32.127C50.7543 32.127 50.799 32.1361 50.8405 32.1539C50.8819 32.1717 50.9193 32.1977 50.9501 32.2303L60.8441 43.2883C60.8764 43.3201 60.9019 43.3578 60.9193 43.3993C60.9368 43.4408 60.9458 43.4854 60.9458 43.5303C60.9458 43.5753 60.9368 43.6198 60.9193 43.6613C60.9019 43.7028 60.8764 43.7406 60.8441 43.7723C60.8152 43.8044 60.7802 43.8305 60.741 43.8491C60.7018 43.8677 60.6593 43.8785 60.6158 43.8808Z" fill="#243051"/>
<path d="M79 15.5C79 15.5 83.5816 27.1448 89.8421 21.6523C96.1025 16.1598 83.011 13 83.011 13L79 15.5Z" fill="#243051"/>
<path d="M202.777 170.041L210.716 149.226C210.802 149.009 210.951 148.823 211.142 148.693C211.333 148.562 211.558 148.492 211.789 148.492C212.019 148.492 212.244 148.562 212.436 148.693C212.627 148.823 212.775 149.009 212.861 149.226L220.8 170.041H202.777Z" fill="#F2A62F"/>
<path d="M214.529 153.586H209.044L207.408 157.896H216.169L214.529 153.586Z" fill="#FAFAFA"/>
<path d="M217.548 161.422H206.017L204.539 165.34H219.007L217.548 161.422Z" fill="#FAFAFA"/>
<path d="M222.096 172H201.478C201.096 172 200.73 171.835 200.459 171.542C200.189 171.25 200.035 170.852 200.033 170.437C200.033 170.02 200.185 169.62 200.456 169.326C200.727 169.031 201.095 168.865 201.478 168.865H222.096C222.479 168.865 222.847 169.031 223.118 169.326C223.389 169.62 223.541 170.02 223.541 170.437C223.539 170.852 223.386 171.25 223.115 171.542C222.844 171.835 222.478 172 222.096 172Z" fill="#EB9924"/>
<path d="M49.975 146.141H43.3145V163.772H49.975V146.141Z" fill="#8BBDF8"/>
<path d="M83.2786 146.141H77.0098V163.772H83.2786V146.141Z" fill="#8BBDF8"/>
<path d="M86.7893 162.988H39.8017C38.2792 162.988 37.0449 164.222 37.0449 165.744V169.244C37.0449 170.766 38.2792 172 39.8017 172H86.7893C88.3118 172 89.5461 170.766 89.5461 169.244V165.744C89.5461 164.222 88.3118 162.988 86.7893 162.988Z" fill="#4786FF"/>
<path d="M85.7481 131.252H41.2346C38.9207 131.252 37.0449 133.174 37.0449 135.545V143.414C37.0449 145.785 38.9207 147.708 41.2346 147.708H85.7481C88.0621 147.708 89.9379 145.785 89.9379 143.414V135.545C89.9379 133.174 88.0621 131.252 85.7481 131.252Z" fill="#F2A62F"/>
<path d="M43.9892 147.708H40.9642L40.454 147.645C39.7412 147.559 39.0781 147.236 38.5703 146.728L52.4358 131.252H58.7911L43.9892 147.708Z" fill="white"/>
<path d="M74.7459 147.708H68.3906L83.1979 131.252H85.8257H85.9291C86.5053 131.252 87.0735 131.386 87.5888 131.644L88.1765 132.036L74.7459 147.708Z" fill="white"/>
<path d="M59.0703 147.708H52.7188L67.5244 131.252H73.8759L59.0703 147.708Z" fill="white"/>
<path d="M1 172H296.025" stroke="#102236" stroke-width="0.65" stroke-linecap="round" stroke-linejoin="round"/>
</svg>
