<svg width="15" height="8" viewBox="0 0 15 8" fill="none" xmlns="http://www.w3.org/2000/svg">
<path d="M1 1L7.01558 7L13.0312 1" stroke="#5793FF" stroke-width="2" stroke-linecap="round" stroke-linejoin="round"/>
</svg>
