<svg xmlns="http://www.w3.org/2000/svg" viewBox="0 0 40 50">
  <defs>
    <style>
      .cls-1 {
        fill: #fff;
        fill-rule: evenodd;
      }
    </style>
  </defs>
  <path id="Path_2" data-name="Path 2" class="cls-1" d="M37.5,35A2.5,2.5,0,0,1,35,32.5V20c0-8.882-5.918-13.81-12.5-14.8V2.5a2.5,2.5,0,0,0-5,0v2.7C10.919,6.185,5,11.113,5,20V32.5A2.5,2.5,0,0,1,2.5,35a2.5,2.5,0,1,0,0,5h10v2.5a7.5,7.5,0,0,0,15,0V40h10a2.5,2.5,0,1,0,0-5Zm-15,7.5a2.5,2.5,0,0,1-5,0V40h5ZM30,35H10V20c0-6.666,5-10,10-10h0c5,0,10,3.333,10,10Z" transform="translate(0 0.004)"/>
</svg>
