<svg xmlns="http://www.w3.org/2000/svg" xmlns:xlink="http://www.w3.org/1999/xlink" width="57.758" height="58.971" viewBox="0 0 57.758 58.971">
  <defs>
    <linearGradient id="linear-gradient" x1="-6.992" y1="-9.508" x2="-6.541" y2="-8.251" gradientUnits="objectBoundingBox">
      <stop offset="0" stop-color="#aa4200"/>
      <stop offset="0.092" stop-color="#a33f00"/>
      <stop offset="0.226" stop-color="#8f3700"/>
      <stop offset="0.384" stop-color="#702b00"/>
      <stop offset="0.562" stop-color="#441a00"/>
      <stop offset="0.753" stop-color="#0d0500"/>
      <stop offset="0.796"/>
    </linearGradient>
    <radialGradient id="radial-gradient" cx="0.368" cy="0.044" r="1.412" gradientTransform="translate(0.164) scale(0.673 1)" gradientUnits="objectBoundingBox">
      <stop offset="0" stop-color="#ef2e28"/>
      <stop offset="0.197" stop-color="#e82d28"/>
      <stop offset="0.481" stop-color="#d52b28"/>
      <stop offset="0.796" stop-color="#b82828"/>
    </radialGradient>
    <radialGradient id="radial-gradient-2" cx="0.002" cy="-0.101" r="1.165" gradientTransform="translate(-0.918) scale(2.835 1)" gradientUnits="objectBoundingBox">
      <stop offset="0" stop-color="#e5ba17"/>
      <stop offset="0.21" stop-color="#e5b317"/>
      <stop offset="0.512" stop-color="#e5a017"/>
      <stop offset="0.796" stop-color="#e58817"/>
    </radialGradient>
    <linearGradient id="linear-gradient-2" x1="0.523" y1="-0.349" x2="0.491" y2="0.877" gradientUnits="objectBoundingBox">
      <stop offset="0" stop-color="#e5a517"/>
      <stop offset="0.076" stop-color="#dea016"/>
      <stop offset="0.185" stop-color="#ca9214"/>
      <stop offset="0.315" stop-color="#ab7b11"/>
      <stop offset="0.461" stop-color="#7f5b0c"/>
      <stop offset="0.619" stop-color="#473307"/>
      <stop offset="0.787" stop-color="#040200"/>
      <stop offset="0.796"/>
    </linearGradient>
    <radialGradient id="radial-gradient-3" cx="0.729" cy="-0.188" r="1.244" gradientTransform="matrix(-0.289, 0.912, -0.641, -0.411, -5.107, -2.289)" xlink:href="#radial-gradient-2"/>
    <radialGradient id="radial-gradient-4" cx="0.803" cy="0.314" r="0.977" gradientTransform="matrix(-0.289, 0.912, -0.64, -0.411, -7.164, -3.448)" xlink:href="#radial-gradient-2"/>
    <radialGradient id="radial-gradient-5" cx="0.939" cy="0.522" r="3.787" gradientTransform="matrix(-0.085, 0.912, -0.189, -0.411, -2.479, -11.765)" xlink:href="#radial-gradient"/>
    <radialGradient id="radial-gradient-6" cx="0.646" cy="0.679" r="0.835" gradientTransform="matrix(-0.293, 0.912, -0.649, -0.411, -4.383, -4.979)" xlink:href="#radial-gradient-2"/>
    <radialGradient id="radial-gradient-7" cx="1.008" cy="0.543" r="1.374" gradientTransform="matrix(-0.285, 0.912, -0.631, -0.411, -7.195, -5.925)" xlink:href="#radial-gradient-2"/>
  </defs>
  <g id="closed" transform="translate(-593.103 -629.331)">
    <path id="Path_3316" data-name="Path 3316" d="M969.793,754.292a.639.639,0,0,0,.639-.638l0-10.69a.638.638,0,0,0-.638-.638l-12.381-.006-.005,11.967Z" transform="translate(-319.575 -101.295)" fill="url(#linear-gradient)" style="mix-blend-mode: screen;isolation: isolate"/>
    <g id="Group_432" data-name="Group 432" transform="translate(596.762 652.631)">
      <path id="Path_3319" data-name="Path 3319" d="M671.993,882.2l-47.2-.022a1.893,1.893,0,0,1-1.892-1.894l.015-30.769a1.631,1.631,0,0,1,1.632-1.63l47.727.022a1.631,1.631,0,0,1,1.63,1.632l-.015,30.768A1.893,1.893,0,0,1,671.993,882.2Z" transform="translate(-622.898 -846.53)" fill="url(#radial-gradient)"/>
      <path id="Path_3320" data-name="Path 3320" d="M791.492,872.617l-12.487-.013.037-34.668a.827.827,0,0,1,.828-.827l10.833.012a.827.827,0,0,1,.826.828Z" transform="translate(-759.837 -837.076)" fill="url(#radial-gradient-2)"/>
      <path id="Path_3321" data-name="Path 3321" d="M791.477,846.911l-12.487-.072.053-9.174a.827.827,0,0,1,.832-.823l10.832.062a.827.827,0,0,1,.822.832Z" transform="translate(-759.824 -836.843)" fill="url(#linear-gradient-2)" style="mix-blend-mode: screen;isolation: isolate"/>
    </g>
    <path id="Path_3313" data-name="Path 3313" d="M659.557,629.933c-6.539-3.407-13.243-3.477-14.974-.155s2.167,8.777,8.706,12.184,13.243,3.477,14.974.155S666.1,633.34,659.557,629.933Zm4.557,11.992c-.881,1.127-4.288,1.1-7.609-.069s-5.3-3.025-4.417-4.152,4.288-1.1,7.609.069S665,640.8,664.114,641.925Z" transform="translate(-44.798 2)" fill="url(#radial-gradient-3)"/>
    <path id="Path_3314" data-name="Path 3314" d="M813.336,642.223c1.728,3.323,8.432,3.26,14.974-.142s10.445-8.853,8.717-12.176-8.432-3.26-14.974.141S811.608,638.9,813.336,642.223Zm8.57-4.336c3.322-1.163,6.729-1.19,7.609-.062s-1.1,2.985-4.421,4.148-6.729,1.19-7.609.062S818.584,639.05,821.906,637.887Z" transform="translate(-192.832 1.892)" fill="url(#radial-gradient-4)"/>
    <path id="Path_3315" data-name="Path 3315" d="M593.935,754.125l56.282.026a.638.638,0,0,0,.639-.638l0-10.69a.638.638,0,0,0-.638-.638l-56.283-.026a.832.832,0,0,0-.833.832l0,10.3A.832.832,0,0,0,593.935,754.125Z" transform="translate(0 -98.728)" fill="url(#radial-gradient-5)"/>
    <path id="Path_3317" data-name="Path 3317" d="M657.458,732.006c-10.409-.927-21.133,4.436-24.691,13.992,1.557-1.366,4.523-2.131,6.447-2.887.735,1.914,1.688,4.778,2.136,6.36,2.581-6.837,8.818-15.849,16.107-16.434Z" transform="translate(-34.793 -89.732)" fill="url(#radial-gradient-6)"/>
    <path id="Path_3318" data-name="Path 3318" d="M816.9,732.093v.925c7.6.027,14.156,9.416,16.815,16.48.45-1.582,1.405-4.445,2.142-6.358,1.923.758,4.889,1.526,6.445,2.893C838.67,736.252,827.532,730.855,816.9,732.093Z" transform="translate(-196.317 -89.745)" fill="url(#radial-gradient-7)"/>
  </g>
</svg>
