<svg xmlns="http://www.w3.org/2000/svg" viewBox="0 0 21 20.997">
  <defs>
    <style>
      .cls-1 {
        fill: #fff;
        fill-rule: evenodd;
      }
    </style>
  </defs>
  <path id="Messenger" class="cls-1" d="M10.4-.007C4.566-.007.008,4.344.008,9.711c0,3.054.9,5.778,4.1,7.56V20.99l3.433-1.967a10.8,10.8,0,0,0,2.949.406c5.835,0,10.521-4.351,10.521-9.719S16.236-.007,10.4-.007Zm1.113,13.033L8.781,10.233,3.519,13.095l5.77-6.022L12.02,9.865,17.282,7Z" transform="translate(-0.008 0.007)"/>
</svg>
