<svg
    xmlns="http://www.w3.org/2000/svg"
    class="growth-tab-icon"
    width="20"
    height="18"
    viewBox="0 0 20 18"
>
    <path
        id="icons8-invoice"
        d="M4,3A2,2,0,0,0,2,5V19a2,2,0,0,0,2,2H20a2,2,0,0,0,2-2V5a2,2,0,0,0-2-2ZM4,5H20l0,14H4ZM6,7V9h7V7Zm9,0V9h3V7ZM6,11v2h7V11Zm9,0v2h3V11Zm-2,4v2h5V15Z"
        transform="translate(-2 -3)" 
    />
</svg>