<?xml version="1.0" encoding="utf-8"?>
<!-- Generator: Adobe Illustrator 25.2.0, SVG Export Plug-In . SVG Version: 6.00 Build 0)  -->
<svg version="1.1" id="Слой_1" xmlns="http://www.w3.org/2000/svg" xmlns:xlink="http://www.w3.org/1999/xlink" x="0px" y="0px"
	 viewBox="0 0 90.7 90.7" style="enable-background:new 0 0 90.7 90.7;" xml:space="preserve">
<style type="text/css">
	.st0{fill:#DFEAFF;}
	.st1{fill:#4786FF;}
	.st2{fill:#7AA8FF;}
</style>
<path class="st0" d="M71.9,87.9H18.8c-8.8,0-15.9-7.1-15.9-15.9V18.8C2.9,10,10,2.9,18.8,2.9h53.1c8.8,0,15.9,7.1,15.9,15.9v53.1
	C87.9,80.7,80.7,87.9,71.9,87.9z"/>
<path class="st1" d="M63.5,33H27.2c-1.7,0-3.1,1.4-3.1,3.1v6.2c0,1.7,1.4,3.1,3.1,3.1h0.4H29h1.3H44h2.7h13.7h1.3h1.3h0.4
	c1.7,0,3.1-1.4,3.1-3.1v-6.2C66.6,34.4,65.2,33,63.5,33L63.5,33z"/>
<path class="st2" d="M29,48.1h-1.3v13.7c0,2.7,2.2,4.9,4.9,4.9H44v-1.3V64V48.1H30.3L29,48.1L29,48.1z"/>
<path class="st2" d="M60.4,48.1H46.7V64v1.3v1.3h11.5c2.7,0,4.9-2.2,4.9-4.9V48.1h-1.3H60.4z"/>
<path class="st1" d="M53.7,25.8c-1.8-1.8-4.9-1.8-6.6,0c-0.6,0.6-1.2,2-1.7,3.4c-0.5-1.4-1.1-2.8-1.7-3.4c-1.8-1.8-4.9-1.8-6.6,0
	c-0.9,0.9-1.4,2.1-1.4,3.3c0,1.3,0.5,2.4,1.4,3.3c1.5,1.5,6.6,2.7,8.1,3c0.1,0,0.2,0,0.3,0c0.1,0,0.2,0,0.3,0c1.5-0.3,6.6-1.6,8.1-3
	c0.9-0.9,1.4-2.1,1.4-3.3C55.1,27.9,54.6,26.7,53.7,25.8z M38.9,30.5c-0.4-0.4-0.6-0.9-0.6-1.4c0-0.5,0.2-1.1,0.6-1.4
	c0.4-0.4,0.9-0.6,1.4-0.6c0.5,0,1.1,0.2,1.4,0.6c0.5,0.5,1.2,2.5,1.8,4.7C41.4,31.7,39.3,31,38.9,30.5z M51.8,30.5
	c-0.5,0.5-2.5,1.2-4.7,1.8c0.6-2.2,1.3-4.2,1.8-4.7c0.4-0.4,0.9-0.6,1.4-0.6s1.1,0.2,1.4,0.6c0.4,0.4,0.6,0.9,0.6,1.4
	C52.4,29.7,52.2,30.2,51.8,30.5z"/>
</svg>
