<?xml version="1.0" standalone="no"?>
<!DOCTYPE svg PUBLIC "-//W3C//DTD SVG 1.1//EN" "http://www.w3.org/Graphics/SVG/1.1/DTD/svg11.dtd" >
<svg xmlns="http://www.w3.org/2000/svg">
<metadata>Generated by IcoMoon</metadata>
<defs>
<font id="icomoon" horiz-adv-x="1024">
<font-face units-per-em="1024" ascent="960" descent="-64" />
<missing-glyph horiz-adv-x="1024" />
<glyph unicode="&#x20;" horiz-adv-x="512" d="" />
<glyph unicode="&#xe900;" glyph-name="icons8-imac" horiz-adv-x="1103" d="M91.884 960c-50.819-0.334-91.886-41.608-91.886-92.473 0-0.222 0.001-0.444 0.002-0.666v0.034-651.618c0.602-45.826 37.892-82.744 83.804-82.744 2.846 0 5.658 0.142 8.431 0.419l-0.35-0.028h356.116l-22.961-103.818h-57.462c-25.71 0-46.553-20.842-46.553-46.553s20.842-46.553 46.553-46.553v0h367.577c25.71 0 46.553 20.842 46.553 46.553s-20.842 46.553-46.553 46.553v0h-57.423l-22.961 103.818h356.116c2.423-0.249 5.235-0.39 8.081-0.39 45.912 0 83.202 36.918 83.803 82.687l0.001 0.057v651.618c0.001 0.188 0.002 0.41 0.002 0.632 0 50.866-41.068 92.139-91.855 92.473h-0.032zM91.884 841.846h919.001v-512h-919.001zM551.385 261.829c0.176 0.002 0.383 0.004 0.591 0.004 25.71 0 46.553-20.842 46.553-46.553s-20.842-46.553-46.553-46.553c-25.709 0-46.55 20.84-46.553 46.549v0c-0.001 0.082-0.001 0.179-0.001 0.277 0 25.448 20.54 46.098 45.946 46.276h0.017z" />
</font></defs></svg>