<svg width="42" height="42" viewBox="0 0 42 42" fill="none" xmlns="http://www.w3.org/2000/svg">
<path d="M15.75 22.75H26.25H15.75ZM21 17.5V28V17.5ZM29.75 36.75H12.25C11.3217 36.75 10.4315 36.3813 9.77513 35.7249C9.11875 35.0685 8.75 34.1783 8.75 33.25V8.75C8.75 7.82174 9.11875 6.9315 9.77513 6.27513C10.4315 5.61875 11.3217 5.25 12.25 5.25H22.0255C22.4896 5.2501 22.9346 5.43454 23.2628 5.76275L32.7373 15.2372C33.0655 15.5654 33.2499 16.0104 33.25 16.4745V33.25C33.25 34.1783 32.8813 35.0685 32.2249 35.7249C31.5685 36.3813 30.6783 36.75 29.75 36.75Z" stroke="#4786FF" stroke-width="2" stroke-linecap="round" stroke-linejoin="round"/>
</svg>
