<svg width="10" xmlns="http://www.w3.org/2000/svg" viewBox="0 0 10 6">
  <defs>
    <style>
      .cls-1 {
        fill: none;
        stroke: #4786ff;
        stroke-linecap: round;
        stroke-linejoin: round;
        stroke-width: 2px;
      }
    </style>
  </defs>
  <path id="chevron-down" class="cls-1" d="M6,9l4,4,4-4" transform="translate(-5 -8)"/>
</svg>
