  <svg
    xmlns="http://www.w3.org/2000/svg"
    class="growth-tab-icon"
    width="18"
    height="18"
    viewBox="0 0 18 18"
>
    <path
        id="icons8-web_design"
        d="M5,3A2.015,2.015,0,0,0,3,5V19a2.015,2.015,0,0,0,2,2H19a2.015,2.015,0,0,0,2-2V5a2.015,2.015,0,0,0-2-2ZM5,5H19V9H5ZM7,6A1,1,0,1,0,8,7,1,1,0,0,0,7,6Zm3,0a1,1,0,1,0,1,1A1,1,0,0,0,10,6Zm3,0V8h4V6ZM5,11H8v8H5Zm5,0h9v8H10Zm2,1v2h5V12Zm0,3v2h5V15Z"
        transform="translate(-3 -3)" 
    />
</svg>