<svg width="40" xmlns="http://www.w3.org/2000/svg" viewBox="0 0 18 18">
  <defs>
    <style>
      .sms-icon {
      fill: none;
      stroke: #ffffff;
      stroke-linecap: round;
      stroke-linejoin: round;
      stroke-width: 2px;
      }
    </style>
  </defs>
  <path id="message-square" class="sms-icon" d="M19,13.667a1.778,1.778,0,0,1-1.778,1.778H6.556L3,19V4.778A1.778,1.778,0,0,1,4.778,3H17.222A1.778,1.778,0,0,1,19,4.778Z" transform="translate(-2 -2)"></path>
</svg>