<svg xmlns="http://www.w3.org/2000/svg" width="11.414" height="9.121" viewBox="0 0 11.414 9.121">
  <path id="icons8-checked_checkbox" d="M16.293,8.293,10,14.586,7.707,12.293,6.293,13.707,10,17.414l7.707-7.707Z" transform="translate(-6.293 -8.293)" fill="#4786ff"/>
</svg>
