<svg width="180" height="80" viewBox="0 0 180 80" fill="none" xmlns="http://www.w3.org/2000/svg">
<path d="M168.182 79.5H11.9979C11.4444 79.5 10.8923 79.4707 10.3446 79.3906C8.08871 79.0606 1.88972 77.944 0.667044 75.5C0.375089 74.9164 0.19672 74.4274 0.0987936 74.0183C-0.252948 72.5489 1.28577 71.5567 2.5029 70.6614C6.76462 67.5266 17.0867 59.7657 18.667 57C20.667 53.5 21.3837 53.1901 22.667 50.5C24.3422 46.9885 24.7533 46.5 25.667 41C26.492 36.0349 27.8649 6.62106 28.1241 0.946999C28.1485 0.41263 28.5884 0 29.1234 0H149.696C150.237 0 150.68 0.41718 150.697 0.957725C150.877 6.5257 151.868 34.6995 153.667 41C155.666 48 155.389 46.9684 157.167 50.5C158.507 53.1623 158.166 53 161.167 57C163.886 60.6243 176.045 69.9956 178.305 71.7238C178.546 71.9083 178.805 72.0794 178.982 72.326C179.321 72.797 179.685 73.8029 178.667 75.5C177.584 77.306 173.369 78.5902 171.112 79.1639C170.155 79.4073 169.17 79.5 168.182 79.5Z" fill="white"/>
</svg>
