<svg width="48" height="48" viewBox="0 0 48 48" fill="none" xmlns="http://www.w3.org/2000/svg">
<path d="M1.89999 10.5C16.6 5.10001 31.3 15.9 46 10.5C46 14.8 46 19.2 46 23.5C31.3 28.9 16.6 18.1 1.89999 23.5C1.89999 19.2 1.89999 14.9 1.89999 10.5Z" fill="#50AA41"/>
<path d="M1.89999 23.6C16.6 18.2 31.3 29 46 23.6C46 28.3 46 33 46 37.6C31.3 43 16.6 32.2 1.89999 37.6C1.89999 32.9 1.89999 28.2 1.89999 23.6Z" fill="#50AA41"/>
<path d="M1.89999 19.9C16.6 14.5 31.3 25.3 46 19.9C46 23 46 26.1 46 29.3C31.3 34.7 16.6 23.9 1.89999 29.3C1.89999 26.1 1.89999 23 1.89999 19.9Z" fill="#F7D046"/>
<path d="M1.89999 10.5C6.79999 13 11.7 17.4 16.6 22.3C11.7 26.4 6.79999 31 1.89999 37.5C1.89999 28.6 1.89999 19.6 1.89999 10.5Z" fill="#C4111B"/>
<path d="M21.725 27.7334C22.425 27.4 23.125 27.0667 24 26.5667C24.7 27.2334 25.4 27.9 26.1 28.4C25.75 27.5667 25.575 26.7334 25.225 25.7334C25.925 25.4 26.625 24.9 27.5 24.5667C26.625 24.4 25.75 24.2334 24.875 24.0667C24.525 23.2334 24.35 22.4 24 21.4C23.65 22.2334 23.475 22.9 23.125 23.7334C22.25 23.5667 21.375 23.4 20.5 23.2334C21.2 23.9 21.9 24.5667 22.6 25.0667C22.25 26.2334 22.075 26.9 21.725 27.7334Z" fill="black"/>
<path d="M30.725 28.7334C31.425 28.4 32.125 28.0667 33 27.5667C33.7 28.2334 34.4 28.9 35.1 29.4C34.75 28.5667 34.575 27.7334 34.225 26.7334C34.925 26.4 35.625 25.9 36.5 25.5667C35.625 25.4 34.75 25.2334 33.875 25.0667C33.525 24.2334 33.35 23.4 33 22.4C32.65 23.2334 32.475 23.9 32.125 24.7334C31.25 24.5667 30.375 24.4 29.5 24.2334C30.2 24.9 30.9 25.5667 31.6 26.0667C31.25 27.2334 31.075 27.9 30.725 28.7334Z" fill="black"/>
<path opacity="0.3" d="M1.89999 10.5C1.89999 13.6 1.89999 34.8 1.89999 37.6C16.6 32.2 31.3 43 46 37.6C46 34.8 46 13.7 46 10.5C31.4 16 16.6 5.10001 1.89999 10.5Z" fill="url(#paint0_linear)"/>
<path opacity="0.65" d="M1.89999 10.5C1.89999 13.6 1.89999 34.8 1.89999 37.6C16.6 32.2 31.3 43 46 37.6C46 34.8 46 13.7 46 10.5C31.4 16 16.6 5.10001 1.89999 10.5Z" fill="url(#paint1_linear)"/>
<defs>
<linearGradient id="paint0_linear" x1="1.94799" y1="24.068" x2="46.051" y2="24.068" gradientUnits="userSpaceOnUse">
<stop stop-color="white" stop-opacity="0"/>
<stop offset="0.002" stop-color="white" stop-opacity="0.01"/>
<stop offset="0.229" stop-color="white" stop-opacity="0.7"/>
<stop offset="0.43" stop-color="white" stop-opacity="0"/>
<stop offset="0.587" stop-color="white" stop-opacity="0"/>
<stop offset="0.77" stop-color="white" stop-opacity="0.6"/>
<stop offset="0.976" stop-color="white" stop-opacity="0.052"/>
<stop offset="0.996" stop-color="white" stop-opacity="0"/>
</linearGradient>
<linearGradient id="paint1_linear" x1="1.94799" y1="24.068" x2="46.051" y2="24.068" gradientUnits="userSpaceOnUse">
<stop offset="0.004" stop-opacity="0.83"/>
<stop offset="0.084" stop-color="#000511" stop-opacity="0.468"/>
<stop offset="0.188" stop-color="#000B24" stop-opacity="0"/>
<stop offset="0.359" stop-color="#000B24" stop-opacity="0.018"/>
<stop offset="0.396" stop-color="#000718" stop-opacity="0.13"/>
<stop offset="0.469" stop-color="#000206" stop-opacity="0.35"/>
<stop offset="0.522" stop-opacity="0.51"/>
<stop offset="0.597" stop-color="#00030B" stop-opacity="0.318"/>
<stop offset="0.715" stop-color="#000B24" stop-opacity="0.018"/>
<stop offset="0.839" stop-color="#000B24" stop-opacity="0.018"/>
<stop offset="0.953" stop-color="#00030B" stop-opacity="0.502"/>
<stop offset="1" stop-opacity="0.7"/>
</linearGradient>
</defs>
</svg>
