<svg width="48" height="48" viewBox="0 0 48 48" fill="none" xmlns="http://www.w3.org/2000/svg">
<path d="M2 11.5C16.667 6.50002 31.333 16.5 46 11.5C46 19.833 46 28.167 46 36.5C31.333 41.5 16.667 31.5 2 36.5C2 28.167 2 19.833 2 11.5Z" fill="#009543"/>
<path d="M2 36.5C11.778 24.833 21.556 19.833 31.333 12.611C36.222 13.167 41.111 13.167 46 11.5C46 19.833 46 28.167 46 36.5C31.333 41.5 16.667 31.5 2 36.5Z" fill="#FBDE4A"/>
<path d="M46 11.5C46 19.833 46 28.167 46 36.5C36.222 39.833 26.444 36.5 16.667 35.389C26.444 28.167 36.222 23.167 46 11.5Z" fill="#DC241F"/>
<path opacity="0.5" d="M2 11.5C16.667 6.50002 31.333 16.5 46 11.5C46 19.833 46 28.167 46 36.5C31.333 41.5 16.667 31.5 2 36.5C2 28.167 2 19.833 2 11.5Z" fill="url(#paint0_linear)"/>
<path opacity="0.65" d="M2 11.5C16.667 6.50002 31.333 16.5 46 11.5C46 19.833 46 28.167 46 36.5C31.333 41.5 16.667 31.5 2 36.5C2 28.167 2 19.833 2 11.5Z" fill="url(#paint1_linear)"/>
<defs>
<linearGradient id="paint0_linear" x1="2" y1="24" x2="46" y2="24" gradientUnits="userSpaceOnUse">
<stop offset="0.073" stop-color="white" stop-opacity="0"/>
<stop offset="0.225" stop-color="white" stop-opacity="0.5"/>
<stop offset="0.408" stop-color="white" stop-opacity="0"/>
<stop offset="0.62" stop-color="white" stop-opacity="0"/>
<stop offset="0.801" stop-color="white" stop-opacity="0.3"/>
<stop offset="0.987" stop-color="white" stop-opacity="0"/>
</linearGradient>
<linearGradient id="paint1_linear" x1="2" y1="24" x2="46" y2="24" gradientUnits="userSpaceOnUse">
<stop offset="0.004" stop-opacity="0.9"/>
<stop offset="0.024" stop-color="#000206" stop-opacity="0.796"/>
<stop offset="0.12" stop-color="#00091C" stop-opacity="0.311"/>
<stop offset="0.181" stop-color="#000B24" stop-opacity="0"/>
<stop offset="0.296" stop-color="#000B24" stop-opacity="0.018"/>
<stop offset="0.316" stop-color="#00081A" stop-opacity="0.013"/>
<stop offset="0.376" stop-color="#000001" stop-opacity="0"/>
<stop offset="0.55" stop-opacity="0.35"/>
<stop offset="0.612" stop-color="#000309" stop-opacity="0.228"/>
<stop offset="0.714" stop-color="#000B23" stop-opacity="0.026"/>
<stop offset="0.719" stop-color="#000B24" stop-opacity="0.018"/>
<stop offset="0.83" stop-color="#000B24" stop-opacity="0.018"/>
<stop offset="0.885" stop-color="#000A1F" stop-opacity="0.302"/>
<stop offset="0.947" stop-color="#000511" stop-opacity="0.627"/>
<stop offset="1" stop-opacity="0.9"/>
</linearGradient>
</defs>
</svg>
