<svg xmlns="http://www.w3.org/2000/svg" width="16" height="15.998" viewBox="0 0 16 15.998">
  <path id="Messenger" d="M7.926-.007A7.629,7.629,0,0,0,.008,7.4a5.972,5.972,0,0,0,3.121,5.76v2.834l2.615-1.5a8.227,8.227,0,0,0,2.247.31c4.446,0,8.016-3.315,8.016-7.4S12.372-.007,7.926-.007Zm.848,9.93L6.692,7.795,2.683,9.975l4.4-4.588L9.16,7.515l4.009-2.181Z" transform="translate(-0.008 0.007)" fill="#fff" fill-rule="evenodd"/>
</svg>
