<svg xmlns="http://www.w3.org/2000/svg" width="18" height="18" viewBox="0 0 18 18">
  <path id="icons8-graph" d="M3,3V19a2.015,2.015,0,0,0,2,2H21V19H5V3ZM19.32,6.314l-4.332,4.291L11.994,7.742,6.3,13.283,7.7,14.717l4.309-4.2,3.006,2.873,5.717-5.66Z" transform="translate(-3 -3)" fill="#fff"/>
</svg>
