739344 942405
885171 844576
747360 827494
854738 976611
902091 763560
940415 900138
766439 754520
768546 888397
791719 839892
993039 941768
755756 776836
878690 887025
955469 910280
858704 888482
787212 920634
805251 992578
921585 790083
755555 852621
798561 957696
876912 841947
748000 723629
921475 794616
765299 717219
901231 799161
881314 945272
968742 938684
921204 951112
976309 935341
826802 816938
825653 777987
772671 948066
818230 851414
876664 947087
725230 796619
880747 730733
895595 742188
709109 824229
736470 927078
935207 750188
974463 930060
997797 979704
732805 727237
957217 981042
859339 783694
892726 977037
881349 994368
891691 952322
851424 923151
730936 770221
885632 826928
7145 2816
7952 6743
6629 6295
564 5940
4175 2941
4489 8085
1864 6359
1691 5261
2155 4541
3879 4906
6133 9274
4783 4727
3197 3215
4985 8849
8742 5592
8612 3702
6430 7163
711 4899
7788 5276
4586 5041
5748 4668
3647 3979
9330 3216
3634 7835
8742 5174
483 6468
8835 8887
2973 3388
2167 4104
3535 1218
463 4093
83 5959
7208 7135
3374 4537
178 4070
6271 3013
1935 8989
5346 9326
8581 51
5447 7516
9768 8674
2371 4020
6930 4878
6913 3300
1305 7776
7326 5385
9150 7886
4260 6783
3368 9681
4148 8209
996852 415301
842706 358703
785906 367956
872690 74740
830244 309651
901811 106550
770211 348153
715639 303126
860952 55736
936770 146938
797425 49350
852102 251693
871181 126041
978910 394431
841067 199165
855367 31837
760272 487049
912808 104808
746562 454362
784399 410092
894808 324250
969841 393278
966097 283965
789503 333770
945450 140555
859315 325730
829508 455875
778454 10667
810446 253717
996381 186989
878399 132178
729380 241420
779740 228986
964163 185466
734250 93829
865948 126057
947731 4799
861753 192779
870061 154243
865120 451329
852585 472674
804964 145112
754355 247895
864830 254020
773741 57231
936930 349546
984428 448983
708728 466126
706951 230897
759133 281273
734136 104990
809276 247829
757769 32816
955645 283672
736665 444755
748473 392335
849774 22117
768277 208451
996793 165456
792709 211469
877429 418400
775564 270222
730617 296323
856431 453318
984250 422421
946020 191067
877661 50108
826960 325217
795278 132809
777207 306770
778345 333883
924490 351619
784554 102355
735050 114536
718696 459235
842301 53273
796050 496485
779695 199554
760675 179825
834010 340033
801136 387702
911632 473072
953722 31685
811402 320933
878725 110751
779698 403047
870219 15201
772243 272952
988527 143637
857233 370808
971710 5013
741678 56412
983946 354593
949035 246926
894926 8750
946862 268975
780855 480969
957798 28738
701627 198274
889888 70221
625543 899648
125703 724598
64679 442594
134291 286623
80271 248340
163340 411271
826376 246054
211946 580021
980884 218375
854992 805610
689547 872988
236057 676884
169043 950442
325162 718003
80994 379569
549103 968653
157524 255459
871369 367004
17071 853770
33215 969229
989352 93373
776559 4568
124216 355121
74955 864874
619411 670411
893412 795243
151197 793908
371211 212272
478542 343108
747172 208392
794277 509970
551793 540285
213180 890175
461632 96456
789810 595563
27565 568573
87468 498659
975118 400694
134615 641999
700780 966473
934332 524110
781578 192338
377871 949006
586051 906590
516168 575239
348591 4617
197733 92128
913952 405632
658704 75433
798001 975836
