
3 State Instance Information
("state_abbrev", "total_pop", "white_pop", "hispanic_pop", "asian_pop", "black_pop", "male_pop", "female_pop", "non_white_percentage")
MS,2976149,1726970,90143,31154,1130608,1434957,1541192,41.97%
MO,6137428,5022939,264334,127154,703058,3008169,3129259,18.16%
MT,1068778,940423,40328,8927,N/A,537170,531608,12.01%


3 District Instance Information
("state_abbrev", "district_num", "total_pop", "white_pop", "hispanic_pop", "asian_pop", "black_pop", "male_pop", "female_pop", "non_white_percentage")

CA,3,755811,519095,228566,85141,47499,377848,377963,31.32%
CA,21,729460,518642,549049,23102,21050,382173,347287,28.90%
CA,48,718359,446054,154254,140629,9755,352383,365976,37.91%


3 Politician Instance Information (3 Rep and 1 Senator)
['cid', 'firstlast', 'lastname', 'party', 'office', 'gender', 'first_elected', 'exit_code', 'comments', 'phone', 'fax', 'website', 'webform', 'congress_office', 'bioguide_id', 'votesmart_id', 'feccandid', 'twitter_id', 'youtube_url', 'facebook_id', 'birthdate’, plus a lot more information]

N00030856,John Garamendi,Garamendi,D,CA03,M,2009,0,,202-225-1880,202-225-5914,http://garamendi.house.gov,https://garamendi.house.gov/contact-me/email-me,2438 Rayburn House Office Building,G000559,29664.0,H0CA10149,RepGaramendi,https://youtube.com/garamendiCA10,repgaramendi,1945-01-24,2009,2022,527046.91,175632.21,1462536.98,0.0,Center for Responsive Politics,https://www.opensecrets.org/members-of-congress/summary?cid=N00030856&cycle=2022,12/31/2021,"[{'@attributes': {'org_name': 'Seafarers International Union', 'total': '18000', 'pacs': '18000', 'indivs': '0'}}, {'@attributes': {'org_name': 'Raytheon Technologies', 'total': '13000', 'pacs': '13000', 'indivs': '0'}}, {'@attributes': {'org_name': 'Air Line Pilots Assn', 'total': '12000', 'pacs': '12000', 'indivs': '0'}}, {'@attributes': {'org_name': 'Marine Engineers Beneficial Assn', 'total': '11500', 'pacs': '11500', 'indivs': '0'}}, {'@attributes': {'org_name': 'McCormack Sheep & Grain', 'total': '10400', 'pacs': '0', 'indivs': '10400'}}, {'@attributes': {'org_name': 'American Waterways Operators', 'total': '10000', 'pacs': '10000', 'indivs': '0'}}, {'@attributes': {'org_name': 'California Rice Industry Assn', 'total': '10000', 'pacs': '10000', 'indivs': '0'}}, {'@attributes': {'org_name': 'Carpenters & Joiners Union', 'total': '10000', 'pacs': '10000', 'indivs': '0'}}, {'@attributes': {'org_name': 'Farm Credit Council', 'total': '10000', 'pacs': '10000', 'indivs': '0'}}, {'@attributes': {'org_name': 'Grupe Co', 'total': '10000', 'pacs': '0', 'indivs': '10000'}}]"

N00033367,David Valadao,Valadao,R,CA21,M,2012,0,,202-225-4695,202-226-3196,http://valadao.house.gov,http://valadao.house.gov/contact/,1728 Longworth House Office Building,V000129,120200.0,H2CA20094,RepDavidValadao,https://youtube.com/congressmanvaladao,CongressmanDavidValadao,1977-04-14,2012,2022,1585163.65,402807.82,1338185.45,0.0,Center for Responsive Politics,https://www.opensecrets.org/members-of-congress/summary?
cid=N00033367&cycle=2022,12/31/2021,"[{'@attributes': {'org_name': 'Kern Oil & Refining Co', 'total': '26400', 'pacs': '0', 'indivs': '26400'}}, {'@attributes': {'org_name': 'Garlic Co', 'total': '19500', 'pacs': '0', 'indivs': '19500'}}, {'@attributes': {'org_name': 'Pioneer Nursery', 'total': '17050', 'pacs': '0', 'indivs': '17050'}}, {'@attributes': {'org_name': 'Valov & Sons Farming', 'total': '16850', 'pacs': '0', 'indivs': '16850'}}, {'@attributes': {'org_name': 'Allied Potato', 'total': '16800', 'pacs': '0', 'indivs': '16800'}}, {'@attributes': {'org_name': 'Sunny Brooks Farms', 'total': '16800', 'pacs': '0', 'indivs': '16800'}}, {'@attributes': {'org_name': 'Spencer Enterprises', 'total': '16200', 'pacs': '0', 'indivs': '16200'}}, {'@attributes': {'org_name': 'Dias Law Firm', 'total': '14000', 'pacs': '0', 'indivs': '14000'}}, {'@attributes': {'org_name': ""Land O'Lakes"", 'total': '13402', 'pacs': '10000', 'indivs': '3402'}}, {'@attributes': {'org_name': 'Casaca Vineyards', 'total': '13400', 'pacs': '0', 'indivs': '13400'}}]"

N00037015,Salud Carbajal,Carbajal,D,CA24,M,2016,0,,202-225-3601,,https://carbajal.house.gov,,212 Cannon House Office Building,C001112,,,RepCarbajal,,repsaludcarbajal,1964-11-18,2016,2022,1294313.37,471147.21,2223870.84,0.0,Center for Responsive Politics,https://www.opensecrets.org/members-of-congress/summary?cid=N00037015&cycle=2022,12/31/2021,"[{'@attributes': {'org_name': 'University of California', 'total': '13365', 'pacs': '0', 'indivs': '13365'}}, {'@attributes': {'org_name': 'AJ Diani Construction', 'total': '11200', 'pacs': '0', 'indivs': '11200'}}, {'@attributes': {'org_name': 'Becker Construction', 'total': '11200', 'pacs': '0', 'indivs': '11200'}}, {'@attributes': {'org_name': 'Esri', 'total': '11200', 'pacs': '0', 'indivs': '11200'}}, {'@attributes': {'org_name': 'Patagonia Works', 'total': '11200', 'pacs': '0', 'indivs': '11200'}}, {'@attributes': {'org_name': 'Cate School', 'total': '11000', 'pacs': '0', 'indivs': '11000'}}, {'@attributes': {'org_name': 'Raytheon Technologies', 'total': '11000', 'pacs': '11000', 'indivs': '0'}}, {'@attributes': {'org_name': 'Shangri-La Group', 'total': '11000', 'pacs': '0', 'indivs': '11000'}}, {'@attributes': {'org_name': 'Advanced Scientific Concepts', 'total': '10800', 'pacs': '0', 'indivs': '10800'}}, {'@attributes': {'org_name': 'Proctor Lane Investments', 'total': '10800', 'pacs': '0', 'indivs': '10800'}}]"

N00036915,Kamala Harris,Harris,D,CAS1,F,2016,12,Resigned to become Vice-President,202-224-3553,,https://www.harris.senate.gov,https://www.harris.senate.gov/content/contact-senator,112 Hart Senate Office Building,H001075,,,SenKamalaHarris,,SenatorKamalaHarris,1964-10-20,2016,2022,7929554.13,8858439.49,0.0,0.0,Center for Responsive Politics,https://www.opensecrets.org/members-of-congress/summary?cid=N00036915&cycle=2022,12/31/2020,"[{'@attributes': {'org_name': 'Plumbers/Pipefitters Union', 'total': '16000', 'pacs': '16000', 'indivs': '0'}}, {'@attributes': {'org_name': 'Seafarers International Union', 'total': '14500', 'pacs': '14500', 'indivs': '0'}}, {'@attributes': {'org_name': 'United Food & Commercial Workers Union', 'total': '12205', 'pacs': '0', 'indivs': '12205'}}, {'@attributes': {'org_name': 'Bad Robot Productions', 'total': '10655', 'pacs': '0', 'indivs': '10655'}}, {'@attributes': {'org_name': 'Service Employees International Union', 'total': '10011', 'pacs': '10000', 'indivs': '11'}}, {'@attributes': {'org_name': 'Carpenters & Joiners Union', 'total': '10000', 'pacs': '10000', 'indivs': '0'}}, {'@attributes': {'org_name': 'End Citizens United & Let America Vote', 'total': '10000', 'pacs': '10000', 'indivs': '0'}}, {'@attributes': {'org_name': 'Sheet Metal, Air, Rail & Transportation Union', 'total': '10000', 'pacs': '10000', 'indivs': '0'}}, {'@attributes': {'org_name': 'Tom Steyer 2020', 'total': '8390', 'pacs': '8390', 'indivs': '0'}}, {'@attributes': {'org_name': 'Walt Disney Co', 'total': '8056', 'pacs': '0', 'indivs': '8056'}}]"

