,name,state,district,party,age,years_in_office,phone_number,total_cash,twitter_id
0,Liz Cheney,WY,01,R,55,6,202-225-2311,7178657.09,RepLizCheney
1,Bryan Steil,WI,01,R,40,4,202-225-3031,1536849.52,RepBryanSteil
2,Mark Pocan,WI,02,D,57,10,202-225-2906,520822.75,RepMarkPocan
3,Ron Kind,WI,03,D,58,26,202-225-5506,585950.59,RepRonKind
4,Gwen Moore,WI,04,D,70,18,202-225-4572,525252.83,RepGwenMoore
5,Scott Fitzgerald,WI,05,R,2010,2,202225-5101,469448.03,@RepFitzgerald
6,Glenn S Grothman,WI,06,R,66,8,202-225-2476,684935.26,RepGrothman
7,Tom Tiffany,WI,07,R,N/A,2,,413949.31,
8,Mike Gallagher,WI,08,R,38,6,202-225-5665,2053745.07,RepGallagher
9,David McKinley,WV,01,R,74,12,202-225-4172,1484203.76,RepMcKinley
10,Alex Mooney,WV,02,R,50,8,202-225-2711,3115341.77,RepAlexMooney
11,Carol Miller,WV,03,R,71,4,202-225-3452,424066.43,
12,Suzan DelBene,WA,01,D,60,10,202-225-6311,1073129.37,RepDelBene
13,Rick Larsen,WA,02,D,56,22,202-225-2605,591367.37,RepRickLarsen
14,Jaime Herrera Beutler,WA,03,R,43,12,202-225-3536,2227127.32,HerreraBeutler
15,Dan Newhouse,WA,04,R,66,8,202-225-5816,964797.13,RepNewhouse
16,Cathy McMorris Rodgers,WA,05,R,52,18,202-225-2006,2757660.75,CathyMcMorris
17,Derek Kilmer,WA,06,D,48,10,202-225-5916,1130159.53,RepDerekKilmer
18,Pramila Jayapal,WA,07,D,56,6,202-225-3106,1611848.45,RepJayapal
19,Kim Schrier,WA,08,D,53,4,202-225-7761,2983602.52,RepKimSchrier
20,Adam Smith,WA,09,D,56,26,202-225-8901,630896.0,RepAdamSmith
21,Marilyn Strickland,WA,10,D,2012,2,202225-9740,881072.37,@RepStricklandWA
22,Rob Wittman,VA,01,R,63,15,202-225-4261,740736.95,RobWittman
23,Elaine Luria,VA,02,D,46,4,202-225-4215,2838375.96,RepElaineLuria
24,Bobby Scott,VA,03,D,74,30,202-225-8351,276681.25,BobbyScott
25,Donald McEachin,VA,04,D,60,6,202-225-6365,448113.18,RepMcEachin
26,Bob Good,VA,05,R,2012,2,202225-4711,503576.04,@RepBobGood
27,Ben Cline,VA,06,R,50,4,202-225-5431,337202.95,RepBenCline
28,Abigail Spanberger,VA,07,D,42,4,202-225-2815,2994414.92,RepSpanberger
29,Don Beyer,VA,08,D,71,8,202-225-4376,923255.38,repdonbeyer
30,Morgan Griffith,VA,09,R,63,12,202-225-3861,278012.41,RepMGriffith
31,Jennifer Wexton,VA,10,D,53,4,202-225-5136,1107331.19,RepWexton
32,Gerry Connolly,VA,11,D,71,14,202-225-1492,1069962.0,GerryConnolly
33,Peter Welch,VT,01,D,74,16,202-225-4115,2674809.67,PeterWelch
34,Blake Moore,UT,01,R,2015,2,202225-0453,602359.96,@RepBlakeMoore
35,Chris Stewart,UT,02,R,61,10,202-225-9730,529389.36,RepChrisStewart
36,John Curtis,UT,03,R,61,5,202-225-7751,898302.4,RepJohnCurtis
37,Burgess Owens,UT,04,R,2014,2,202225-3011,1758023.36,@RepBurgessOwens
38,Louie Gohmert,TX,01,R,68,18,202-225-3035,206591.78,RepLouieGohmert
39,Dan Crenshaw,TX,02,R,37,4,202-225-6565,10582149.83,RepDanCrenshaw
40,Van Taylor,TX,03,R,49,4,202-225-4201,1936793.66,RepVanTaylor
41,Patrick Fallon,TX,04,R,2009,2,202225-6673,555582.97,@RepPatFallon
42,Lance Gooden,TX,05,R,39,4,202-225-3484,465667.72,
43,Ron Wright,TX,06,R,68,4,202-225-2002,11763.54,RepRonWright
44,Jake Ellzey,TX,06,R,N/A,1,,3968283.16,
45,Lizzie Fletcher,TX,07,D,47,4,202-225-2571,2437964.74,RepFletcher
46,Kevin Brady,TX,08,R,66,26,202-225-4901,272318.18,RepKevinBrady
47,Al Green,TX,09,D,74,18,202-225-7508,208925.37,RepAlGreen
48,Michael McCaul,TX,10,R,60,18,202-225-2401,1478255.24,RepMcCaul
49,August Pfluger,TX,11,R,N/A,2,202225-3605,1441068.73,@RepPfluger
50,Kay Granger,TX,12,R,79,26,202-225-5071,1020496.43,RepKayGranger
51,Ronny Jackson,TX,13,R,2016,2,202225-3706,2598749.91,@RepRonnyJackson
52,Randy Weber,TX,14,R,68,10,202-225-2831,422543.24,TXRandy14
53,Vicente Gonzalez,TX,15,D,54,6,202-225-2531,1476238.32,RepGonzalez
54,Veronica Escobar,TX,16,D,52,4,202-225-4831,578498.2,RepEscobar
55,Pete Sessions,TX,17,R,66,26,202-225-2231,427198.14,PeteSessions
56,Sheila Jackson Lee,TX,18,D,72,28,202-225-3816,412764.24,JacksonLeeTX18
57,Jodey Arrington,TX,19,R,49,6,202-225-4005,988972.75,RepArrington
58,Joaquin Castro,TX,20,D,47,10,202-225-3236,428972.01,JoaquinCastrotx
59,Chip Roy,TX,21,R,49,4,202-225-4236,1299455.82,
60,Troy Nehls,TX,22,R,2017,2,202225-5951,685579.01,@RepTroyNehls
61,Tony Gonzales,TX,23,R,2011,2,202225-4511,2508180.37,@RepTonyGonzales
62,Beth Van Duyne,TX,24,R,2010,2,202225-6605,2217385.9,@RepBethVanDuyne
63,Roger Williams,TX,25,R,72,10,202-225-9896,1092181.14,RepRWilliams
64,Michael Burgess,TX,26,R,71,20,202-225-7772,629213.53,MichaelCBurgess
65,Michael Cloud,TX,27,R,46,4,202-225-7742,567235.1,RepCloudTX
66,Henry Cuellar,TX,28,D,66,18,202-225-1640,1938857.21,RepCuellar
67,Sylvia Garcia,TX,29,D,71,4,202-225-1688,404815.79,RepSylviaGarcia
68,Eddie Bernice Johnson,TX,30,D,86,30,202-225-8885,15000.0,RepEBJ
69,John Carter,TX,31,R,80,20,202-225-3864,800045.8,JudgeCarter
70,Colin Allred,TX,32,D,38,4,202-225-2231,2250764.67,RepColinAllred
71,Marc Veasey,TX,33,D,51,10,202-225-9897,939895.3,RepVeasey
72,Filemon Vela,TX,34,D,59,10,202-225-9901,10626.0,RepFilemonVela
73,Lloyd Doggett,TX,35,D,75,28,202-225-4865,,RepLloydDoggett
74,Brian Babin,TX,36,R,73,8,202-225-1555,459516.79,RepBrianBabin
75,Diana Harshbarger,TN,01,R,N/A,2,202225-6356,530527.17,@RepHarshbarger
76,Tim Burchett,TN,02,R,57,4,202-225-5435,641405.15,RepTimBurchett
77,Chuck Fleischmann,TN,03,R,59,12,202-225-3271,528508.78,RepChuck
78,Scott Desjarlais,TN,04,R,58,12,202-225-6831,66038.84,DesJarlaisTN04
79,Jim Cooper,TN,05,D,67,20,202-225-4311,1289878.32,RepJimCooper
80,John Rose,TN,06,R,57,4,202-225-4231,815326.0,
81,Mark Green,TN,07,R,57,4,202-225-2811,871766.47,RepMarkGreen
82,David Kustoff,TN,08,R,55,6,202-225-4714,880310.01,repdavidkustoff
83,Steve Cohen,TN,09,D,72,16,202-225-3265,247594.76,RepCohen
84,Dusty Johnson,SD,01,R,45,4,202-225-2801,1201014.34,RepJohnson
85,Nancy Mace,SC,01,R,2009,2,202225-3176,2900210.2,@RepNancyMace
86,Joe Wilson,SC,02,R,74,21,202-225-2452,483641.52,RepJoeWilson
87,Jeff Duncan,SC,03,R,56,12,202-225-5301,732871.18,RepJeffDuncan
88,William Timmons,SC,04,R,37,4,202-225-6030,434007.9,RepTimmons
89,Ralph Norman,SC,05,R,68,5,,-137756.13,RepRaphNorman
90,James E Clyburn,SC,06,D,81,30,202-225-3315,1753665.01,Clyburn
91,Tom Rice,SC,07,R,64,10,202-225-9895,1275417.4,RepTomRice
92,David Cicilline,RI,01,D,60,12,202-225-4911,1301402.94,RepCicilline
93,Jim Langevin,RI,02,D,57,22,202-225-2735,426880.83,JimLangevin
94,Brian Fitzpatrick,PA,01,R,48,6,202-225-4276,2502327.37,repbrianfitz
95,Brendan Boyle,PA,02,D,45,8,202-225-6111,966234.04,RepBrendanBoyle
96,Dwight Evans,PA,03,D,67,6,202-225-4001,504064.33,RepDwightEvans
97,Madeleine Dean,PA,04,D,62,4,202-225-4731,654432.8,
98,Mary Gay Scanlon,PA,05,D,62,4,202-225-2011,593098.8,
99,Chrissy Houlahan,PA,06,D,54,4,202-225-4315,1976495.3,RepHoulahan
100,Susan Wild,PA,07,D,64,4,202-225-6411,2116958.81,RepSusanWild
101,Matt Cartwright,PA,08,D,60,10,202-225-5546,1905262.61,RepCartwright
102,Dan Meuser,PA,09,R,58,4,202-225-6511,469022.83,RepMeuser
103,Scott Perry,PA,10,R,59,10,202-225-5836,1219764.2,RepScottPerry
104,Lloyd Smucker,PA,11,R,58,6,202-225-2411,657006.72,RepSmucker
105,Fred Keller,PA,12,R,N/A,3,,552976.13,
106,John Joyce,PA,13,R,65,4,202-225-2431,677145.19,
107,Guy Reschenthaler,PA,14,R,38,4,202-225-2065,782629.37,
108,Glenn Thompson,PA,15,R,62,14,202-225-5121,1240397.69,CongressmanGT
109,Mike Kelly,PA,16,R,73,12,202-225-5406,452292.92,MikeKellyPA
110,Conor Lamb,PA,17,D,37,4,202-225-2301,3946022.7,RepConorLamb
111,Mike Doyle,PA,18,D,68,28,202-225-2135,167350.1,USRepMikeDoyle
112,Suzanne Bonamici,OR,01,D,67,10,202-225-0855,444952.83,RepBonamici
113,Cliff Bentz,OR,02,R,2020,2,202225-6730,491293.82,@RepBentz
114,Earl Blumenauer,OR,03,D,73,26,202-225-4811,686311.52,BlumenauerMedia
115,Peter DeFazio,OR,04,D,74,36,202-225-6416,1384050.68,RepPeterDeFazio
116,Kurt Schrader,OR,05,D,70,14,202-225-5711,1406874.39,RepSchrader
117,Kevin Hern,OK,01,R,60,4,202-225-2211,558730.38,repkevinhern
118,Markwayne Mullin,OK,02,R,44,10,202-225-2701,744975.38,RepMullin
119,Frank D Lucas,OK,03,R,62,28,202-225-5565,290056.77,RepFrankLucas
120,Tom Cole,OK,04,R,72,20,202-225-6165,884145.87,TomColeOK04
121,Stephanie Bice,OK,05,R,2010,2,202225-2132,1339442.18,@RepBice
122,Steve Chabot,OH,01,R,69,12,202-225-2216,779709.71,RepSteveChabot
123,Brad Wenstrup,OH,02,R,63,10,202-225-3164,1017805.44,RepBradWenstrup
124,Joyce Beatty,OH,03,D,71,10,202-225-4324,984326.52,RepBeatty
125,Jim Jordan,OH,04,R,58,16,202-225-2676,6726529.45,Jim_Jordan
126,Bob Latta,OH,05,R,65,15,202-225-6405,665794.82,BobLatta
127,Bill Johnson,OH,06,R,67,12,202-225-5705,821297.38,RepBillJohnson
128,Bob Gibbs,OH,07,R,67,12,202-225-6265,222476.96,RepBobGibbs
129,Warren Davidson,OH,08,R,52,6,202-225-6205,431530.9,WarrenDavidson
130,Marcy Kaptur,OH,09,D,75,40,202-225-4146,470452.7,RepMarcyKaptur
131,Michael R Turner,OH,10,R,62,20,202-225-6465,615056.99,RepMikeTurner
132,Marcia Fudge,OH,11,D,69,14,202-225-7032,1674.01,RepMarciaFudge
133,Shontel Brown,OH,11,D,N/A,1,,3090429.81,
134,Troy Balderson,OH,12,R,60,4,202-225-5355,880596.23,RepBalderson
135,Tim Ryan,OH,13,D,48,20,202-225-5261,8472959.49,RepTimRyan
136,David P Joyce,OH,14,R,64,10,202-225-5731,1085867.99,RepDaveJoyce
137,Steve Stivers,OH,15,R,56,12,202-225-2015,389505.95,RepSteveStivers
138,Mike Carey,OH,15,R,N/A,1,,1351354.88,
139,Anthony Gonzalez,OH,16,R,37,4,202-225-3876,789897.25,
140,Kelly Armstrong,ND,01,R,45,4,202-225-2611,746494.53,RepArmstrongND
141,G K Butterfield,NC,01,D,74,18,202-225-3101,217583.72,GKButterfield
142,Deborah Ross,NC,02,D,2015,2,202225-3032,930353.03,@RepDeborahRoss
143,Greg Murphy,NC,03,R,N/A,3,,862988.38,
144,David Price,NC,04,D,81,36,202-225-1784,204991.71,RepDavidEPrice
145,Virginia Foxx,NC,05,R,78,18,202-225-2071,946689.37,VirginiaFoxx
146,Kathy Manning,NC,06,D,2009,2,202225-3065,1094994.22,@RepKManning
147,David Rouzer,NC,07,R,50,8,202-225-2731,506699.79,RepDavidRouzer
148,Richard Hudson,NC,08,R,50,10,202-225-3715,1548237.32,RepRichHudson
149,Dan Bishop,NC,09,R,N/A,3,,1044013.0,
150,Patrick McHenry,NC,10,R,46,18,202-225-2576,1463545.67,PatrickMcHenry
151,Madison Cawthorn,NC,11,R,2014,2,202225-6401,2791003.8,@RepCawthorn
152,Alma Adams,NC,12,D,75,8,202-225-1510,376150.99,RepAdams
153,Ted Budd,NC,13,R,50,6,202-225-4531,3046681.58,RepTedBudd
154,Kelly Armstrong,ND,01,R,45,4,202-225-2611,746494.53,RepArmstrongND
155,G K Butterfield,NC,01,D,74,18,202-225-3101,217583.72,GKButterfield
156,Deborah Ross,NC,02,D,2015,2,202225-3032,930353.03,@RepDeborahRoss
157,Greg Murphy,NC,03,R,N/A,3,,862988.38,
158,David Price,NC,04,D,81,36,202-225-1784,204991.71,RepDavidEPrice
159,Virginia Foxx,NC,05,R,78,18,202-225-2071,946689.37,VirginiaFoxx
160,Kathy Manning,NC,06,D,2009,2,202225-3065,1094994.22,@RepKManning
161,David Rouzer,NC,07,R,50,8,202-225-2731,506699.79,RepDavidRouzer
162,Richard Hudson,NC,08,R,50,10,202-225-3715,1548237.32,RepRichHudson
163,Dan Bishop,NC,09,R,N/A,3,,1044013.0,
164,Patrick McHenry,NC,10,R,46,18,202-225-2576,1463545.67,PatrickMcHenry
165,Madison Cawthorn,NC,11,R,2014,2,202225-6401,2791003.8,@RepCawthorn
166,Alma Adams,NC,12,D,75,8,202-225-1510,376150.99,RepAdams
167,Ted Budd,NC,13,R,50,6,202-225-4531,3046681.58,RepTedBudd
168,Lee Zeldin,NY,01,R,42,8,202-225-3826,704677.02,RepLeeZeldin
169,Andrew Garbarino,NY,02,R,2012,2,202225-7896,1544491.55,@RepGarbarino
170,Tom Suozzi,NY,03,D,59,6,202-225-3335,1916373.89,RepTomSuozzi
171,Kathleen Rice,NY,04,D,57,8,202-225-5516,512884.34,RepKathleenRice
172,Gregory W Meeks,NY,05,D,68,24,202-225-3461,1431509.15,GregoryMeeks
173,Grace Meng,NY,06,D,46,10,202-225-2601,773071.44,RepGraceMeng
174,Nydia Velazquez,NY,07,D,68,30,202-225-2361,244909.26,NydiaVelazquez
175,Hakeem Jeffries,NY,08,D,51,10,202-225-5936,3002639.73,RepJeffries
176,Yvette D Clarke,NY,09,D,57,16,202-225-6231,331925.23,RepYvetteClarke
177,Jerrold Nadler,NY,10,D,74,30,202-225-5635,758232.14,RepJerryNadler
178,Nicole Malliotakis,NY,11,R,2010,2,202225-3371,2283639.48,@RepMalliotakis
179,Carolyn B Maloney,NY,12,D,76,30,202-225-7944,1820462.54,RepMaloney
180,Adriano Espaillat,NY,13,D,67,6,202-225-4365,753640.56,RepEspaillat
181,Alexandria Ocasio-Cortez,NY,14,D,32,4,202-225-3965,7765371.53,
182,Ritchie Torres,NY,15,D,2018,2,202225-4361,2540896.21,@RepRitchie
183,Jamaal Bowman,NY,16,D,2018,2,202225-2464,821543.91,@RepBowman
184,Mondaire Jones,NY,17,D,2016,2,202225-6506,2240925.9,@RepJones
185,Sean Patrick Maloney,NY,18,D,55,10,202-225-5441,2105890.05,RepSeanMaloney
186,Antonio Delgado,NY,19,D,45,4,202-225-5614,3154911.06,repdelgado
187,Paul Tonko,NY,20,D,72,14,202-225-5076,783104.28,RepPaulTonko
188,Elise Stefanik,NY,21,R,37,8,202-225-4611,4575447.81,RepStefanik
189,Claudia Tenney,NY,22,R,61,2,202-225-3665,2050144.72,RepTenney
190,Tom Reed,NY,23,R,50,12,202-225-3161,450853.0,RepTomReed
191,John Katko,NY,24,R,59,8,202-225-3701,1788783.85,RepJohnKatko
192,Joseph D Morelle,NY,25,D,64,4,202-225-3615,594247.69,repjoemorelle
193,Brian M Higgins,NY,26,D,62,18,202-225-3306,896947.26,RepBrianHiggins
194,Chris Jacobs,NY,27,R,N/A,2,,551092.22,
195,Debra Haaland,NM,01,D,61,4,202-225-6316,1678.47,RepDebHaaland
196,Melanie Stansbury,NM,01,D,N/A,1,,2378056.89,
197,Yvette Herrell,NM,02,R,2018,2,202225-2365,1619902.26,@RepHerrell
198,Teresa Leger Fernandez,NM,03,D,2015,2,202225-6190,821745.37,@RepTeresaLF
199,Don Norcross,NJ,01,D,63,8,202-225-6501,1001846.4,DonaldNorcross
200,Jeff Van Drew,NJ,02,R,69,4,202-225-6572,1841041.58,
201,Andy Kim,NJ,03,D,39,4,202-225-4765,3325597.69,
202,Chris Smith,NJ,04,R,69,42,202-225-3765,763927.96,RepChrisSmith
203,Josh Gottheimer,NJ,05,D,46,6,202-225-4465,4127737.76,RepJoshG
204,Frank Pallone Jr.,NJ,06,D,70,34,202-225-4671,1282050.76,FrankPallone
205,Tom Malinowski,NJ,07,D,56,4,202-225-5361,3471333.71,
206,Albio Sires,NJ,08,D,71,16,202-225-7919,215140.0,RepSires
207,Bill Pascrell Jr.,NJ,09,D,85,26,202-225-5751,795397.01,BillPascrell
208,Donald M Payne Jr.,NJ,10,D,63,10,202-225-3436,426087.83,RepDonaldPayne
209,Mikie Sherrill,NJ,11,D,50,4,202-225-5034,2862861.52,RepSherrill
210,Bonnie Watson Coleman,NJ,12,D,77,8,202-225-5801,401068.86,RepBonnie
211,Chris Pappas,NH,01,D,41,4,202-225-5456,1571717.49,
212,Ann Kuster,NH,02,D,65,10,202-225-5206,1709224.53,RepAnnieKuster
213,Dina Titus,NV,01,D,71,10,202-225-5965,665242.81,RepDinaTitus
214,Mark Amodei,NV,02,R,63,11,202-225-6155,379022.0,MarkAmodeiNV2
215,Susie Lee,NV,03,D,55,4,202-225-3252,2472515.86,RepSusieLee
216,Steven Horsford,NV,04,D,48,4,202-225-9894,1847671.82,RepHorsford
217,Jeff Fortenberry,NE,01,R,61,18,202-225-4806,567076.33,JeffFortenberry
218,Don Bacon,NE,02,R,58,6,202-225-4155,1791133.04,RepDonBacon
219,Adrian Smith,NE,03,R,51,16,202-225-6435,501933.76,RepAdrianSmith
220,Matt Rosendale,MT,01,R,2014,2,202225-3211,994993.88,@RepRosendale
221,Cori Bush,MO,01,D,2014,2,202225-2406,1193202.98,@RepCori
222,Ann Wagner,MO,02,R,59,10,202-225-1621,2381540.39,RepAnnWagner
223,Blaine Luetkemeyer,MO,03,R,69,14,202-225-2956,877327.34,RepBlainePress
224,Vicky Hartzler,MO,04,R,61,12,202-225-2876,1917605.06,RepHartzler
225,Emanuel Cleaver,MO,05,D,77,18,202-225-4535,502133.56,RepCleaver
226,Sam Graves,MO,06,R,58,22,202-225-7041,883650.36,RepSamGraves
227,Billy Long,MO,07,R,66,12,202-225-6536,1365995.3,USRepLong
228,Jason Smith,MO,08,R,41,9,202-225-4404,1162605.71,RepJasonSmith
229,Trent Kelly,MS,01,R,56,7,202-225-4306,382841.66,reptrentkelly
230,Bennie G Thompson,MS,02,D,74,29,202-225-5876,599638.7,BennieGThompson
231,Michael Guest,MS,03,R,52,4,202-225-5031,250223.12,
232,Steven Palazzo,MS,04,R,52,12,202-225-5772,344577.85,CongPalazzo
233,Jim Hagedorn,MN,01,R,59,4,202-225-2472,933421.66,
234,Angie Craig,MN,02,D,50,4,202-225-2271,2624409.15,RepAngieCraig
235,Dean Phillips,MN,03,D,53,4,202-225-2871,1100525.97,RepDeanPhillips
236,Betty McCollum,MN,04,D,67,22,202-225-6631,807096.22,BettyMcCollum04
237,Ilhan Omar,MN,05,D,40,4,202-225-4755,1618012.61,
238,Tom Emmer,MN,06,R,61,8,202-225-2331,1591554.04,RepTomEmmer
239,Michelle Fischbach,MN,07,R,2010,2,202225-2165,920475.62,@RepFischbach
240,Pete Stauber,MN,08,R,55,4,202-225-6211,1324695.33,RepPeteStauber
241,John Bergman,MI,01,R,75,6,202-225-4735,856831.95,RepJackBergman
242,Bill Huizenga,MI,02,R,53,12,202-225-4401,1148164.29,RepHuizenga
243,Peter Meijer,MI,03,R,N/A,2,202225-3831,1592922.46,@RepMeijer
244,John Moolenaar,MI,04,R,60,8,202-225-3561,1249213.35,RepMoolenaar
245,Dan Kildee,MI,05,D,63,10,202-225-3611,1250008.65,RepDanKildee
246,Fred Upton,MI,06,R,68,36,202-225-3761,1614234.69,RepFredUpton
247,Tim Walberg,MI,07,R,70,12,202-225-6276,718364.08,RepWalberg
248,Elissa Slotkin,MI,08,D,45,4,202-225-4872,3782594.63,RepSlotkin
249,Andy Levin,MI,09,D,61,4,202-225-4961,1271598.16,RepAndyLevin
250,Lisa McClain,MI,10,R,2017,2,202225-2106,451245.09,@RepLisaMcClain
251,Haley Stevens,MI,11,D,38,4,202-225-8171,2528445.12,RepHaleyStevens
252,Debbie Dingell,MI,12,D,68,8,202-225-4071,754759.91,RepDebDingell
253,Rashida Tlaib,MI,13,D,45,4,202-225-5126,1778862.77,RepRashida
254,Brenda Lawrence,MI,14,D,67,8,202-225-5802,371169.84,RepLawrence
255,Richard E Neal,MA,01,D,73,34,202-225-5601,1530760.15,RepRichardNeal
256,James P McGovern,MA,02,D,62,26,202-225-6101,537868.74,RepMcGovern
257,Lori Trahan,MA,03,D,48,4,202-225-3411,1269629.38,RepLoriTrahan
258,Jake Auchincloss,MA,04,D,2020,2,202225-5931,2061699.25,@RepAuchincloss
259,Katherine Clark,MA,05,D,58,9,202-225-2836,1218756.1,RepKClark
260,Seth Moulton,MA,06,D,43,8,202-225-8020,1068983.68,teammoulton
261,Ayanna Pressley,MA,07,D,48,4,202-225-5111,709798.39,RepPressley
262,Stephen F Lynch,MA,08,D,66,21,202-225-8273,361471.41,RepStephenLynch
263,Bill Keating,MA,09,D,69,12,202-225-3111,276188.21,USRepKeating
264,Richard E Neal,MA,01,D,73,34,202-225-5601,1530760.15,RepRichardNeal
265,James P McGovern,MA,02,D,62,26,202-225-6101,537868.74,RepMcGovern
266,Lori Trahan,MA,03,D,48,4,202-225-3411,1269629.38,RepLoriTrahan
267,Jake Auchincloss,MA,04,D,2020,2,202225-5931,2061699.25,@RepAuchincloss
268,Katherine Clark,MA,05,D,58,9,202-225-2836,1218756.1,RepKClark
269,Seth Moulton,MA,06,D,43,8,202-225-8020,1068983.68,teammoulton
270,Ayanna Pressley,MA,07,D,48,4,202-225-5111,709798.39,RepPressley
271,Stephen F Lynch,MA,08,D,66,21,202-225-8273,361471.41,RepStephenLynch
272,Bill Keating,MA,09,D,69,12,202-225-3111,276188.21,USRepKeating
273,Andy Harris,MD,01,R,65,12,202-225-5311,790185.13,RepAndyHarrisMD
274,Dutch Ruppersberger,MD,02,D,76,20,202-225-3061,466929.32,Call_Me_Dutch
275,John Sarbanes,MD,03,D,59,16,202-225-4016,103046.0,RepSarbanes
276,Anthony Brown,MD,04,D,60,6,202-225-8699,534617.32,RepAnthonyBrown
277,Steny H Hoyer,MD,05,D,82,41,202-225-4131,1874841.21,WhipHoyer
278,David Trone,MD,06,D,66,4,202-225-2721,590306.24,RepDavidTrone
279,Kweisi Mfume,MD,07,D,N/A,2,,226403.05,
280,Jamie Raskin,MD,08,D,59,6,202-225-5341,1880195.91,repraskin
281,Chellie Pingree,ME,01,D,66,14,202-225-6116,230257.18,ChelliePingree
282,Jared Golden,ME,02,D,39,4,202-225-6306,2090150.89,RepGolden
283,Steve Scalise,LA,01,R,56,14,202-225-3015,10087913.31,SteveScalise
284,Troy Carter,LA,02,D,N/A,1,,2054434.19,
285,Cedric Richmond,LA,02,D,48,12,202-225-6636,-2500.0,RepRichmond
286,Clay Higgins,LA,03,R,60,6,202-225-2031,352575.18,RepClayHiggins
287,Mike Johnson,LA,04,R,50,6,202-225-2777,584466.05,RepMikeJohnson
288,Julia Letlow,LA,05,R,N/A,1,,1794489.06,
289,Garret Graves,LA,06,R,50,8,202-225-3901,530259.57,RepGarretGraves
290,James Comer,KY,01,R,49,6,202-225-3115,795614.9,KYComer
291,Brett Guthrie,KY,02,R,58,14,202-225-3501,874651.09,RepGuthrie
292,John Yarmuth,KY,03,D,74,16,202-225-5401,186042.99,RepJohnYarmuth
293,Thomas Massie,KY,04,R,51,10,202-225-3465,435326.29,RepThomasMassie
294,Hal Rogers,KY,05,R,84,42,202-225-4601,305642.87,RepHalRogers
295,Andy Barr,KY,06,R,48,10,202-225-4706,2050189.37,RepAndyBarr
296,Tracey Mann,KS,01,R,2009,2,202225-2715,585374.41,@RepMann
297,Jake Laturner,KS,02,R,2019,2,202225-6601,848612.15,@RepLaTurner
298,Sharice Davids,KS,03,D,41,4,202-225-2865,2816455.43,RepDavids
299,Ron Estes,KS,04,R,65,5,,884601.05,RepRonEstes
300,Ashley Hinson,IA,01,R,2015,2,202225-2911,3251509.64,@RepAshleyHinson
301,Mariannette Miller-Meeks,IA,02,R,2012,2,202225-6576,1926327.84,@RepMMM
302,Cindy Axne,IA,03,D,56,4,202-225-5476,2702488.29,RepCindyAxne
303,Randy Feenstra,IA,04,R,2020,2,202225-4426,1348599.99,@RepFeenstra
304,Frank Mrvan Jr,IN,01,D,2017,2,202225-2461,382330.53,@RepMrvan
305,Jackie Walorski,IN,02,R,58,10,202-225-3915,853500.93,RepWalorski
306,Jim Banks,IN,03,R,42,6,202-225-4436,1090729.18,RepJimBanks
307,Jim Baird,IN,04,R,76,4,202-225-5037,108455.5,
308,Victoria Spartz,IN,05,R,2011,2,202225-2276,2170440.88,@RepSpartz
309,Greg Pence,IN,06,R,65,4,202-225-3021,1237468.0,
310,Andre Carson,IN,07,D,47,14,202-225-4011,342419.02,RepAndreCarson
311,Larry Bucshon,IN,08,R,59,12,202-225-4636,646818.5,RepLarryBucshon
312,Trey Hollingsworth,IN,09,R,38,6,202-225-5315,526659.44,reptrey
313,Bobby Rush,IL,01,D,75,30,202-225-4372,215692.72,RepBobbyRush
314,Robin Kelly,IL,02,D,65,9,202-225-0773,830118.2,RepRobinKelly
315,Marie Newman,IL,03,D,2017,2,202225-5701,1013932.45,@RepMarieNewman
316,Jesus Garcia,IL,04,D,65,4,202-225-8203,442095.07,
317,Mike Quigley,IL,05,D,63,13,202-225-4061,464601.0,RepMikeQuigley
318,Sean Casten,IL,06,D,50,4,202-225-4561,1881822.46,
319,Danny K Davis,IL,07,D,80,26,202-225-5006,334074.85,RepDannyDavis
320,Raja Krishnamoorthi,IL,08,D,48,6,202-225-3711,4395159.75,congressmanraja
321,Jan Schakowsky,IL,09,D,77,24,202-225-2111,751520.68,JanSchakowsky
322,Brad Schneider,IL,10,D,60,6,202-225-4835,1759887.84,repschneider
323,Bill Foster,IL,11,D,66,10,202-225-3515,1010541.94,RepBillFoster
324,Mike Bost,IL,12,R,61,8,202-225-5661,690043.29,RepBost
325,Rodney Davis,IL,13,R,52,10,202-225-2371,1788405.47,RodneyDavis
326,Lauren A Underwood,IL,14,D,35,4,202-225-2976,3204833.45,RepUnderwood
327,Mary Miller,IL,15,R,2013,2,202225-5271,771137.23,@RepMaryMiller
328,Adam Kinzinger,IL,16,R,44,12,202-225-3635,2333741.33,RepKinzinger
329,Cheri Bustos,IL,17,D,60,10,202-225-5905,334727.34,RepCheri
330,Darin LaHood,IL,18,R,53,7,202-225-6201,2050964.81,RepLaHood
331,Russ Fulcher,ID,01,R,48,4,202-225-6611,245430.97,RepRussFulcher
332,Mike Simpson,ID,02,R,71,24,202-225-5531,695119.49,CongMikeSimpson
333,Ed Case,HI,01,D,69,4,202-225-2726,604542.11,
334,Kai Kahele,HI,02,D,2018,2,202225-4906,445224.02,@KaheleRep
335,Buddy Carter,GA,01,R,64,8,202-225-5831,760992.73,RepBuddyCarter
336,Sanford Bishop,GA,02,D,75,30,202-225-3631,658023.13,SanfordBishop
337,Drew Ferguson,GA,03,R,54,6,202-225-5901,1688613.18,RepDrewFerguson
338,Hank Johnson,GA,04,D,67,16,202-225-1605,214382.95,RepHankJohnson
339,Nikema Williams,GA,05,D,2014,2,202225-3801,413283.37,@RepNikema
340,Lucy McBath,GA,06,D,61,4,202-225-4501,3052850.09,
341,Carolyn Bourdeaux,GA,07,D,2015,2,202225-4272,2385577.32,@RepBourdeaux
342,Austin Scott,GA,08,R,52,12,202-225-6531,330512.22,AustinScottGA08
343,Andrew Clyde,GA,09,R,2010,2,202225-9893,303379.9,
344,Jody Hice,GA,10,R,61,8,202-225-4101,22245.0,congressmanhice
345,Barry Loudermilk,GA,11,R,58,8,202-225-2931,296926.85,RepLoudermilk
346,Richard W Allen,GA,12,R,70,8,202-225-2823,441599.22,reprickallen
347,David Scott,GA,13,D,76,20,202-225-2939,1048848.3,RepDavidScott
348,Marjorie Taylor Greene,GA,14,R,2016,2,202225-5211,7479740.39,@RepMTG
349,Buddy Carter,GA,01,R,64,8,202-225-5831,760992.73,RepBuddyCarter
350,Sanford Bishop,GA,02,D,75,30,202-225-3631,658023.13,SanfordBishop
351,Drew Ferguson,GA,03,R,54,6,202-225-5901,1688613.18,RepDrewFerguson
352,Hank Johnson,GA,04,D,67,16,202-225-1605,214382.95,RepHankJohnson
353,Nikema Williams,GA,05,D,2014,2,202225-3801,413283.37,@RepNikema
354,Lucy McBath,GA,06,D,61,4,202-225-4501,3052850.09,
355,Carolyn Bourdeaux,GA,07,D,2015,2,202225-4272,2385577.32,@RepBourdeaux
356,Austin Scott,GA,08,R,52,12,202-225-6531,330512.22,AustinScottGA08
357,Andrew Clyde,GA,09,R,2010,2,202225-9893,303379.9,
358,Jody Hice,GA,10,R,61,8,202-225-4101,22245.0,congressmanhice
359,Barry Loudermilk,GA,11,R,58,8,202-225-2931,296926.85,RepLoudermilk
360,Richard W Allen,GA,12,R,70,8,202-225-2823,441599.22,reprickallen
361,David Scott,GA,13,D,76,20,202-225-2939,1048848.3,RepDavidScott
362,Marjorie Taylor Greene,GA,14,R,2016,2,202225-5211,7479740.39,@RepMTG
363,Matt Gaetz,FL,01,R,39,6,202-225-4136,4074009.31,RepMattGaetz
364,Neal Dunn,FL,02,R,69,6,202-225-5235,706304.18,drnealdunnfl2
365,Kat Cammack,FL,03,R,2019,2,202225-5744,1056152.53,@RepKatCammack
366,John Rutherford,FL,04,R,69,6,202-225-2501,317120.59,RepRutherfordFL
367,Al Lawson,FL,05,D,73,6,202-225-0123,237405.0,RepAlLawsonJr
368,Michael Waltz,FL,06,R,48,4,202-225-2706,1360951.3,
369,Stephanie Murphy,FL,07,D,43,6,202-225-4035,1227338.69,RepStephMurphy
370,Bill Posey,FL,08,R,74,14,202-225-3671,468463.32,CongBillPosey
371,Darren Soto,FL,09,D,44,6,202-225-9889,488638.0,RepDarrenSoto
372,Val Demings,FL,10,D,64,6,202-225-2176,20476172.52,RepValDemings
373,Daniel Webster,FL,11,R,72,12,202-225-1002,360153.91,RepWebster
374,Gus Bilirakis,FL,12,R,59,16,202-225-5755,763942.76,RepGusBilirakis
375,Charlie Crist,FL,13,D,65,6,202-225-5961,381761.6,repcharliecrist
376,Kathy Castor,FL,14,D,55,16,202-225-3376,529017.89,USRepKCastor
377,Scott Franklin,FL,15,R,2013,2,202225-1252,406517.6,@RepFranklin
378,Vernon Buchanan,FL,16,R,70,16,202-225-5015,1246144.43,VernBuchanan
379,Greg Steube,FL,17,R,43,4,202-225-5792,622138.34,
380,Brian Mast,FL,18,R,41,6,202-225-3026,3410962.72,repbrianmast
381,Byron Donalds,FL,19,R,2011,2,202225-2536,3251103.87,@RepDonaldsPress
382,Alcee Hastings,FL,20,D,85,30,202-225-1313,0.0,RepHastingsFL
383,Sheila Cherfilus-McCormick,FL,20,D,N/A,0,,4191582.61,
384,Lois J Frankel,FL,21,D,73,10,202-225-9890,576077.21,RepLoisFrankel
385,Ted Deutch,FL,22,D,55,12,202-225-3001,378837.37,RepTedDeutch
386,Debbie Wasserman Schultz,FL,23,D,55,18,202-225-7931,942492.54,RepDWStweets
387,Frederica Wilson,FL,24,D,79,12,202-225-4506,203660.0,RepWilson
388,Mario Diaz-Balart,FL,25,R,60,20,202-225-4211,805895.53,MarioDB
389,Carlos Gimenez,FL,26,R,2020,2,202225-2778,1259988.48,@RepCarlos
390,Maria Salazar,FL,27,R,2011,2,202225-3931,2004538.99,@RepMariaSalazar
391,Lisa Blunt Rochester,DE,01,D,60,6,202-225-4165,1080565.8,RepBRochester
392,John Larson,CT,01,D,73,24,202-225-2265,859250.23,RepJohnLarson
393,Joe Courtney,CT,02,D,68,16,202-225-2076,466685.88,RepJoeCourtney
394,Rosa L DeLauro,CT,03,D,79,32,202-225-3661,1121367.83,RosaDeLauro
395,Jim Himes,CT,04,D,55,14,202-225-5541,549766.7,JAHimes
396,Jahana Hayes,CT,05,D,48,4,202-225-4476,876839.58,
397,Diana DeGette,CO,01,D,64,26,202-225-4431,487476.54,RepDianaDeGette
398,Joseph Neguse,CO,02,D,37,4,202-225-2161,1160706.46,RepJoeNeguse
399,Lauren Boebert,CO,03,R,2009,2,202225-4761,3537134.09,@RepBoebert
400,Ken Buck,CO,04,R,63,8,202-225-4676,696619.7,RepKenBuck
401,Doug Lamborn,CO,05,R,67,16,202-225-4422,226484.0,RepDLamborn
402,Jason Crow,CO,06,D,42,4,202-225-7882,1179601.72,RepJasonCrow
403,Ed Perlmutter,CO,07,D,68,16,202-225-2645,652632.21,RepPerlmutter
404,Doug LaMalfa,CA,01,R,61,10,202-225-3076,425745.29,RepLaMalfa
405,Jared Huffman,CA,02,D,58,10,202-225-5161,379226.01,RepHuffman
406,John Garamendi,CA,03,D,77,13,202-225-1880,527046.91,RepGaramendi
407,Tom McClintock,CA,04,R,65,14,202-225-2511,713424.26,RepMcClintock
408,Mike Thompson,CA,05,D,71,24,202-225-3311,840356.89,RepThompson
409,Doris Matsui,CA,06,D,77,17,202-225-7163,406733.41,DorisMatsui
410,Ami Bera,CA,07,D,57,10,202-225-5716,669253.42,RepBera
411,Jay Obernolte,CA,08,R,2013,2,202-225-5861,429203.46,@JayObernolte
412,Jerry McNerney,CA,09,D,70,16,202-225-1947,575573.56,RepMcNerney
413,Josh Harder,CA,10,D,35,4,202-225-4540,3752740.63,RepJoshHarder
414,Mark Desaulnier,CA,11,D,69,8,202-225-2095,322523.16,RepDeSaulnier
415,Nancy Pelosi,CA,12,D,81,35,202-225-4965,12081188.59,NancyPelosi
416,Barbara Lee,CA,13,D,75,24,202-225-2661,1002132.38,RepBarbaraLee
417,Jackie Speier,CA,14,D,71,14,202-225-3531,272383.78,RepSpeier
418,Eric Swalwell,CA,15,D,41,10,202-225-5065,1912080.34,RepSwalwell
419,Jim Costa,CA,16,D,69,18,202-225-3341,1036209.26,RepJimCosta
420,Ro Khanna,CA,17,D,45,6,202-225-2631,3505590.92,RepRoKhanna
421,Anna Eshoo,CA,18,D,79,30,202-225-8104,1082138.79,RepAnnaEshoo
422,Zoe Lofgren,CA,19,D,74,28,202-225-3072,932889.66,RepZoeLofgren
423,Jimmy Panetta,CA,20,D,52,6,202-225-2861,1105770.3,RepJimmyPanetta
424,David Valadao,CA,21,R,44,10,202-225-4695,1585163.65,RepDavidValadao
425,Devin Nunes,CA,22,R,48,20,202-225-2523,3660720.75,Rep_DevinNunes
426,Kevin McCarthy,CA,23,R,57,16,202-225-2915,12854758.24,GOPLeader
427,Salud Carbajal,CA,24,D,57,6,202-225-3601,1294313.37,RepCarbajal
428,Mike Garcia,CA,25,R,N/A,2,,3096602.1,
429,Julia Brownley,CA,26,D,69,10,202-225-5811,976983.29,JuliaBrownley26
430,Judy Chu,CA,27,D,68,13,202-225-5464,655720.91,RepJudyChu
431,Adam Schiff,CA,28,D,61,22,202-225-4176,9239021.03,RepAdamSchiff
432,Tony Cardenas,CA,29,D,58,10,202-225-6131,650093.6,RepCardenas
433,Brad Sherman,CA,30,D,67,26,202-225-5911,1576574.51,BradSherman
434,Pete Aguilar,CA,31,D,42,8,202-225-3201,1391011.67,reppeteaguilar
435,Grace Napolitano,CA,32,D,85,24,202-225-5256,79324.05,GraceNapolitano
436,Ted Lieu,CA,33,D,52,8,202-225-3976,865866.47,RepTedLieu
437,Jimmy Gomez,CA,34,D,47,5,202-225-6235,772466.62,RepJimmyGomez
438,Norma Torres,CA,35,D,56,8,202-225-6161,321128.38,NormaJTorres
439,Raul Ruiz,CA,36,D,49,10,202-225-5330,1241354.16,CongressmanRuiz
440,Karen Bass,CA,37,D,68,12,202-225-7084,501697.54,RepKarenBass
441,Linda Sanchez,CA,38,D,53,20,202-225-6676,674628.23,RepLindaSanchez
442,Young Kim,CA,39,R,2011,2,202225-4111,3730733.36,@RepYoungKim
443,Lucille Roybal-Allard,CA,40,D,80,30,202-225-1766,174660.98,RepRoybalAllard
444,Mark Takano,CA,41,D,61,10,202-225-2305,616560.34,RepMarkTakano
445,Ken Calvert,CA,42,R,68,30,202-225-1986,1085810.55,KenCalvert
446,Maxine Waters,CA,43,D,83,32,202-225-2201,556500.98,MaxineWaters
447,Nanette Barragan,CA,44,D,45,6,202-225-8220,483138.17,RepBarragan
448,Katie Porter,CA,45,D,48,4,202-225-5611,9987803.56,
449,Lou Correa,CA,46,D,64,6,202-225-2965,592931.69,RepLouCorrea
450,Alan Lowenthal,CA,47,D,80,10,202-225-7924,180582.56,RepLowenthal
451,Michelle Steel,CA,48,R,2015,2,202225-2415,2851899.97,@RepSteel
452,Mike Levin,CA,49,D,43,4,202-225-3906,1902792.18,RepMikeLevin
453,Darrell Issa,CA,50,R,68,22,202-225-3906,720057.82,DarrellIssa
454,Juan Vargas,CA,51,D,60,10,202-225-8045,510295.52,RepJuanVargas
455,Scott Peters,CA,52,D,63,10,202-225-0508,1031178.62,RepScottPeters
456,Sara Jacobs,CA,53,D,2020,2,202225-2040,1258012.36,@RepSaraJacobs
457,Rick Crawford,AR,01,R,56,12,202-225-4076,423391.23,RepRickCrawford
458,French Hill,AR,02,R,65,8,202-225-2506,1446509.45,RepFrenchHill
459,Steve Womack,AR,03,R,65,12,202-225-4301,681267.49,Rep_SteveWomack
460,Bruce Westerman,AR,04,R,54,8,202-225-3772,707294.51,RepWesterman
461,Tom O'Halleran,AZ,01,D,76,6,202-225-3361,1578953.93,repohalleran
462,Ann Kirkpatrick,AZ,02,D,71,4,202-225-3361,0.0,RepKirkpatrick
463,Raul M Grijalva,AZ,03,D,74,20,202-225-2435,297225.19,RepRaulGrijalva
464,Paul Gosar,AZ,04,R,63,12,202-225-2315,341041.79,RepGosar
465,Andy Biggs,AZ,05,R,63,6,202-225-2635,875753.1,RepAndyBiggsAZ
466,David Schweikert,AZ,06,R,60,12,202-225-2190,662039.97,RepDavid
467,Ruben Gallego,AZ,07,D,42,8,202-225-4065,851178.18,RepRubenGallego
468,Debbie Lesko,AZ,08,R,63,4,202-225-4576,638419.85,RepDLesko
469,Greg Stanton,AZ,09,D,51,4,202-225-9888,1017919.96,RepGregStanton
470,Don Young,AK,01,R,88,49,202-225-5765,557662.93,RepDonYoung
471,Jerry Carl,AL,01,R,2015,2,202225-4931,486262.61,@RepJerryCarl
472,Barry Moore,AL,02,R,2013,2,202225-2901,428918.86,@RepBarryMoore
473,Mike D Rogers,AL,03,R,63,20,202-225-3261,899340.82,RepMikeRogersAL
474,Robert B Aderholt,AL,04,R,56,26,202-225-4876,591586.02,Robert_Aderholt
475,Mo Brooks,AL,05,R,67,12,202-225-4801,2139854.31,RepMoBrooks
476,Gary Palmer,AL,06,R,67,8,202-225-4921,653662.2,USRepGaryPalmer
477,Terri Sewell,AL,07,D,57,12,202-225-2665,812533.12,RepTerriSewell
