AK_0	571023
AL_1	6067
AL_2	10143
AL_3	7543
AL_4	8888
AL_5	3678
AL_6	4171
AL_7	10154
AR_1	19280
AR_2	4976
AR_3	5399
AR_4	22336
AS_98	76
AZ_1	55035
AZ_2	7882
AZ_3	15688
AZ_4	33220
AZ_5	293
AZ_6	625
AZ_7	204
AZ_8	540
AZ_9	165
CA_1	28120
CA_10	1820
CA_11	489
CA_12	38
CA_13	96
CA_14	259
CA_15	598
CA_16	2842
CA_17	185
CA_18	695
CA_19	915
CA_2	12952
CA_20	4875
CA_21	6730
CA_22	1165
CA_23	9901
CA_24	6882
CA_25	1690
CA_26	938
CA_27	699
CA_28	218
CA_29	92
CA_3	6184
CA_30	135
CA_31	219
CA_32	124
CA_33	288
CA_34	47
CA_35	168
CA_36	5915
CA_37	55
CA_38	101
CA_39	205
CA_4	12836
CA_40	57
CA_41	316
CA_42	936
CA_43	72
CA_44	79
CA_45	330
CA_46	72
CA_47	216
CA_48	145
CA_49	553
CA_5	1730
CA_50	2789
CA_51	4791
CA_52	267
CA_53	136
CA_6	175
CA_7	548
CA_8	32893
CA_9	1250
CO_1	189
CO_2	7538
CO_3	49729
CO_4	38101
CO_5	7265
CO_6	473
CO_7	339
CT_1	675
CT_2	1988
CT_3	470
CT_4	460
CT_5	1247
DC_98	61
DE_0	1948
FL_1	4017
FL_10	436
FL_11	2408
FL_12	858
FL_13	181
FL_14	276
FL_15	1088
FL_16	1294
FL_17	5574
FL_18	1509
FL_19	747
FL_2	11004
FL_20	2159
FL_21	256
FL_22	163
FL_23	186
FL_24	102
FL_25	3504
FL_26	2184
FL_27	113
FL_3	3565
FL_4	1569
FL_5	3819
FL_6	2173
FL_7	392
FL_8	1751
FL_9	2312
GA_1	8126
GA_10	7098
GA_11	1070
GA_12	8211
GA_13	714
GA_14	3623
GA_2	9630
GA_3	3836
GA_4	497
GA_5	264
GA_6	298
GA_7	392
GA_8	8738
GA_9	5212
GU_98	209
HI_1	209
HI_2	6213
IA_1	12048
IA_2	12260
IA_3	8788
IA_4	22754
ID_1	39420
ID_2	43224
IL_1	258
IL_10	299
IL_11	280
IL_12	5008
IL_13	5793
IL_14	1597
IL_15	14696
IL_16	7916
IL_17	6930
IL_18	10515
IL_2	1080
IL_3	236
IL_4	52
IL_5	95
IL_6	378
IL_7	62
IL_8	205
IL_9	105
IN_1	1156
IN_2	3958
IN_3	4180
IN_4	6351
IN_5	1924
IN_6	6206
IN_7	304
IN_8	7255
IN_9	4487
KS_1	52542
KS_2	14144
KS_3	757
KS_4	14314
KY_1	12084
KY_2	7182
KY_3	319
KY_4	4373
KY_5	11234
KY_6	4297
LA_1	4032
LA_2	1271
LA_3	6984
LA_4	12436
LA_5	14452
LA_6	4033
MA_1	2350
MA_2	1627
MA_3	757
MA_4	668
MA_5	265
MA_6	526
MA_7	62
MA_8	326
MA_9	1216
MD_1	3977
MD_2	348
MD_3	304
MD_4	297
MD_5	1482
MD_6	1952
MD_7	488
MD_8	859
ME_1	3287
ME_2	27557
MI_1	25029
MI_10	4146
MI_11	419
MI_12	402
MI_13	184
MI_14	185
MI_2	3337
MI_3	2630
MI_4	8459
MI_5	2349
MI_6	3547
MI_7	4228
MI_8	1503
MI_9	183
MN_1	11974
MN_2	2437
MN_3	527
MN_4	332
MN_5	135
MN_6	2880
MN_7	33429
MN_8	27908
MO_1	225
MO_2	465
MO_3	6851
MO_4	14406
MO_5	2425
MO_6	18198
MO_7	6271
MO_8	19901
MP_98	182
MS_1	10573
MS_2	15552
MS_3	12754
MS_4	8044
MT_0	145550
NC_1	5871
NC_10	2590
NC_11	6604
NC_12	420
NC_13	1832
NC_2	2697
NC_3	7218
NC_4	732
NC_5	3969
NC_6	3910
NC_7	5946
NC_8	2954
NC_9	3874
ND_0	68994
NE_1	8877
NE_2	506
NE_3	67433
NH_1	2464
NH_2	6488
NJ_1	350
NJ_10	75
NJ_11	506
NJ_12	412
NJ_2	2094
NJ_3	898
NJ_4	691
NJ_5	991
NJ_6	215
NJ_7	969
NJ_8	54
NJ_9	95
NM_1	4600
NM_2	71746
NM_3	44965
NV_1	104
NV_2	55897
NV_3	2848
NV_4	51009
NY_1	649
NY_10	14
NY_11	64
NY_12	14
NY_13	10
NY_14	28
NY_15	14
NY_16	78
NY_17	382
NY_18	1353
NY_19	7937
NY_2	180
NY_20	1231
NY_21	15114
NY_22	5077
NY_23	7371
NY_24	2388
NY_25	510
NY_26	219
NY_27	3972
NY_3	254
NY_4	110
NY_5	51
NY_6	29
NY_7	16
NY_8	28
NY_9	15
OH_1	686
OH_10	1129
OH_11	244
OH_12	2271
OH_13	893
OH_14	1955
OH_15	4738
OH_16	1205
OH_2	3221
OH_3	228
OH_4	4665
OH_5	5626
OH_6	7214
OH_7	3864
OH_8	2449
OH_9	463
OK_1	1632
OK_2	20996
OK_3	34116
OK_4	9777
OK_5	2074
OR_1	3007
OR_2	69451
OR_3	1074
OR_4	17272
OR_5	5190
PA_1	638
PA_10	1080
PA_11	1502
PA_12	9895
PA_13	6020
PA_14	2847
PA_15	9734
PA_16	3311
PA_17	882
PA_18	292
PA_2	62
PA_3	52
PA_4	476
PA_5	211
PA_6	912
PA_7	856
PA_8	2666
PA_9	3294
PR_98	3424
RI_1	268
RI_2	765
SC_1	1549
SC_2	3022
SC_3	5268
SC_4	1299
SC_5	5505
SC_6	8063
SC_7	5354
SD_0	75808
TN_1	4143
TN_2	2321
TN_3	4570
TN_4	5984
TN_5	1248
TN_6	6475
TN_7	9161
TN_8	6846
TN_9	480
TX_1	7869
TX_10	5072
TX_11	27834
TX_12	1441
TX_13	38350
TX_14	2448
TX_15	7804
TX_16	710
TX_17	7650
TX_18	235
TX_19	25835
TX_2	309
TX_20	199
TX_21	5921
TX_22	1033
TX_23	58058
TX_24	263
TX_25	7622
TX_26	908
TX_27	9120
TX_28	9379
TX_29	187
TX_3	480
TX_30	356
TX_31	2154
TX_32	185
TX_33	212
TX_34	8191
TX_35	594
TX_36	7125
TX_4	10131
TX_5	5044
TX_6	2148
TX_7	162
TX_8	6054
TX_9	165
UT_1	19557
UT_2	40195
UT_3	20073
UT_4	2549
VA_1	4211
VA_10	1371
VA_11	185
VA_2	1103
VA_3	625
VA_4	3642
VA_5	10030
VA_6	5928
VA_7	3118
VA_8	149
VA_9	9115
VI_98	134
VT_0	9217
WA_1	6181
WA_10	827
WA_2	1019
WA_3	9117
WA_4	19246
WA_5	15473
WA_6	6902
WA_7	143
WA_8	7359
WA_9	183
WI_1	1727
WI_2	4536
WI_3	11117
WI_4	128
WI_5	1891
WI_6	4919
WI_7	23039
WI_8	6806
WV_1	6276
WV_2	8019
WV_3	9745
WY_0	97088
