%YAML 1.1
%TAG !u! tag:unity3d.com,2011:
--- !u!114 &11400000
MonoBehaviour:
  m_ObjectHideFlags: 0
  m_PrefabParentObject: {fileID: 0}
  m_PrefabInternal: {fileID: 0}
  m_GameObject: {fileID: 0}
  m_Enabled: 1
  m_EditorHideFlags: 0
  m_Script: {fileID: 11500000, guid: 2f38aead2356b564eace637bd77dd5eb, type: 3}
  m_Name: BGMSettingsStreet
  m_EditorClassIdentifier: 
  volumes:
  - 0
  - -80
  - -10
  - -80
  - -5
  - -80
  - -80
  - -80
  - -80
  - -80
