%YAML 1.1
%TAG !u! tag:unity3d.com,2011:
--- !u!114 &11400000
MonoBehaviour:
  m_ObjectHideFlags: 0
  m_PrefabParentObject: {fileID: 0}
  m_PrefabInternal: {fileID: 0}
  m_GameObject: {fileID: 0}
  m_Enabled: 1
  m_EditorHideFlags: 0
  m_Script: {fileID: 11500000, guid: b024d71b769c63f4989bab0814d5b3f0, type: 3}
  m_Name: TestDialogAnswer2
  m_EditorClassIdentifier: 
  text: Awesome thank you!
  answers: []
