<svg width="301" height="237" viewBox="0 0 301 237" fill="none" xmlns="http://www.w3.org/2000/svg">
<path d="M0.74119 184.534C0.207722 184.677 -0.108865 185.225 0.0340718 185.759L2.36336 194.452C2.5063 194.986 3.05463 195.302 3.5881 195.159C4.12157 195.016 4.43816 194.468 4.29522 193.935L2.22474 186.207L9.95216 184.137C10.4856 183.994 10.8022 183.445 10.6593 182.912C10.5163 182.378 9.96801 182.062 9.43454 182.205L0.74119 184.534ZM298.5 0C298.5 97.4298 275.627 173.255 227.271 209.896C179.014 246.461 104.888 244.326 1.50001 184.634L0.499992 186.366C104.112 246.188 179.236 248.803 228.479 211.49C277.623 174.252 300.5 97.5702 300.5 0H298.5Z" fill="#C97B00"/>
</svg>
