<svg width="14" height="9" viewBox="0 0 14 9" fill="none" xmlns="http://www.w3.org/2000/svg">
<path d="M4.18193 0.493977H6.50964L5.01325 8.75181H0.718072L4.18193 0.493977ZM10.9988 0.493977H13.3265L11.8301 8.75181H7.53494L10.9988 0.493977Z" fill="#C97B00"/>
</svg>
