<svg width="152" height="31" viewBox="0 0 152 31" fill="none" xmlns="http://www.w3.org/2000/svg">
<path d="M151.5 1H141.5C137.634 1 134.5 4.13401 134.5 8V17.5C134.5 24.6797 128.68 30.5 121.5 30.5H28.5C21.3203 30.5 15.5 24.6797 15.5 17.5V8C15.5 4.13401 12.366 1 8.5 1H0" stroke="#C97B00"/>
</svg>
