<svg width="101" height="157" viewBox="0 0 101 157" fill="none" xmlns="http://www.w3.org/2000/svg">
<path d="M23.0674 10.885C22.7455 10.4362 22.1207 10.3334 21.6719 10.6553L14.3587 15.9008C13.9099 16.2227 13.807 16.8475 14.1289 17.2963C14.4508 17.7451 15.0756 17.8479 15.5244 17.526L22.025 12.8633L26.6878 19.364C27.0097 19.8127 27.6344 19.9156 28.0832 19.5937C28.532 19.2718 28.6348 18.647 28.3129 18.1983L23.0674 10.885ZM99.7819 139.468C81.1132 143.711 56.3875 146.362 39.1434 130.939C21.9067 115.523 11.7137 81.649 23.2415 11.6303L21.2681 11.3054C9.7259 81.4112 19.739 116.268 37.8101 132.43C55.8737 148.586 81.5573 145.662 100.225 141.418L99.7819 139.468Z" fill="#C97B00"/>
</svg>
