<svg width="110" height="110" viewBox="0 0 110 110" fill="none" xmlns="http://www.w3.org/2000/svg">
<g clip-path="url(#clip0)">
<path d="M29.8024 97.166H25.6667V100.833H42.1667V97.166H33.6311L38.0309 82.4994H42.1667V78.8327H7.33333C5.30843 78.8327 3.66667 77.1909 3.66667 75.166V71.4994H42.1667V67.8327H3.66667V16.4993C3.66667 14.4744 5.30843 12.8327 7.33333 12.8327H84.3333C86.3582 12.8327 88 14.4744 88 16.4993V31.166H91.6667V16.4993C91.6667 12.4495 88.3831 9.16602 84.3333 9.16602H7.33333C3.28353 9.16602 0 12.4495 0 16.4993V75.166C0 79.2158 3.28353 82.4994 7.33333 82.4994H34.2022L29.8024 97.166Z" fill="#A9ADB7"/>
<path d="M80.6654 27.5007V31.1673H84.332V25.6673C84.332 24.6549 83.5111 23.834 82.4987 23.834H9.16536C8.15291 23.834 7.33203 24.6549 7.33203 25.6673V47.6673C7.33203 48.6798 8.15291 49.5007 9.16536 49.5007H42.1654V45.834H10.9987V27.5007H80.6654Z" fill="#A9ADB7"/>
<path d="M31.1654 64.166V54.9993C31.1654 53.9869 30.3445 53.166 29.332 53.166H9.16536C8.15291 53.166 7.33203 53.9869 7.33203 54.9993V64.166H10.9987V56.8327H27.4987V64.166H31.1654Z" fill="#A9ADB7"/>
<path d="M34.832 54.9993V64.166H38.4987V56.8327H42.1654V53.166H36.6654C35.6529 53.166 34.832 53.9869 34.832 54.9993Z" fill="#A9ADB7"/>
<path d="M7.33203 16.5H10.9987V20.1667H7.33203V16.5Z" fill="#A9ADB7"/>
<path d="M14.668 16.5H18.3346V20.1667H14.668V16.5Z" fill="#A9ADB7"/>
<path d="M22 16.5H25.6667V20.1667H22V16.5Z" fill="#A9ADB7"/>
<path d="M97.1654 49.5007V40.334C97.1654 37.2966 94.7027 34.834 91.6654 34.834H51.332C48.2947 34.834 45.832 37.2966 45.832 40.334V95.334C45.832 98.3713 48.2947 100.834 51.332 100.834H76.9987V97.1673H51.332C50.3196 97.1673 49.4987 96.3464 49.4987 95.334V93.5007H76.9987V89.834H49.4987V40.334C49.4987 39.3215 50.3196 38.5007 51.332 38.5007H91.6654C92.6778 38.5007 93.4987 39.3215 93.4987 40.334V49.5007H97.1654Z" fill="#C97B00"/>
<path d="M55 42.166H60.5V45.8327H55V42.166Z" fill="#A9ADB7"/>
<path d="M64.168 42.166H69.668V45.8327H64.168V42.166Z" fill="#A9ADB7"/>
<path d="M73.332 42.166H78.832V45.8327H73.332V42.166Z" fill="#A9ADB7"/>
<path d="M82.5 42.166H88V45.8327H82.5V42.166Z" fill="#A9ADB7"/>
<path d="M56.8346 53.1667H80.668V49.5H55.0013C53.9889 49.5 53.168 50.3209 53.168 51.3333V64.1667C53.168 65.1791 53.9889 66 55.0013 66H77.0013V62.3333H56.8346V53.1667Z" fill="#C97B00"/>
<path d="M77.0013 73.3327V69.666H55.0013C53.9889 69.666 53.168 70.4869 53.168 71.4993V84.3327C53.168 85.3451 53.9889 86.166 55.0013 86.166H77.0013V82.4994H56.8346V73.3327H77.0013Z" fill="#C97B00"/>
<path d="M104.501 53.166H86.168C83.1306 53.166 80.668 55.6287 80.668 58.666V95.3327C80.668 98.37 83.1306 100.833 86.168 100.833H104.501C107.539 100.833 110.001 98.37 110.001 95.3327V58.666C110.001 55.6287 107.539 53.166 104.501 53.166ZM106.335 95.3327C106.335 96.3451 105.514 97.166 104.501 97.166H86.168C85.1555 97.166 84.3346 96.3451 84.3346 95.3327V93.4994H106.335V95.3327ZM106.335 89.8327H84.3346V58.666C84.3346 57.6536 85.1555 56.8327 86.168 56.8327H104.501C105.514 56.8327 106.335 57.6536 106.335 58.666V89.8327Z" fill="#C97B00"/>
<path d="M100.833 60.5H89.8333C88.8209 60.5 88 61.3209 88 62.3333V69.6667C88 70.6791 88.8209 71.5 89.8333 71.5H100.833C101.846 71.5 102.667 70.6791 102.667 69.6667V62.3333C102.667 61.3209 101.846 60.5 100.833 60.5ZM99 67.8333H91.6667V64.1667H99V67.8333Z" fill="#C97B00"/>
<path d="M100.833 75.166H89.8333C88.8209 75.166 88 75.9869 88 76.9994V84.3327C88 85.3451 88.8209 86.166 89.8333 86.166H100.833C101.846 86.166 102.667 85.3451 102.667 84.3327V76.9994C102.667 75.9869 101.846 75.166 100.833 75.166ZM99 82.4994H91.6667V78.8327H99V82.4994Z" fill="#C97B00"/>
</g>
<defs>
<clipPath id="clip0">
<rect width="110" height="110" fill="white"/>
</clipPath>
</defs>
</svg>
