<svg width="110" height="110" viewBox="0 0 110 110" fill="none" xmlns="http://www.w3.org/2000/svg">
<path d="M106.479 32.871H66.6844C64.7432 32.871 63.1639 34.4503 63.1639 36.3915V40.3905H56.7186V18.2617H62.8662C64.8073 18.2617 66.3866 16.6824 66.3866 14.7413V3.52042C66.3866 1.57931 64.8073 0 62.8662 0H16.8407C14.8996 0 13.3203 1.57931 13.3203 3.52042V14.7415C13.3203 16.6824 14.8996 18.2617 16.8407 18.2617H26.4794C27.3695 18.2617 28.0908 17.5402 28.0908 16.6504C28.0908 15.7605 27.3695 15.039 26.4794 15.039H16.8407C16.6766 15.039 16.5429 14.9054 16.5429 14.7413V3.52042C16.5429 3.35628 16.6766 3.22265 16.8407 3.22265H62.8664C63.0305 3.22265 63.1642 3.35628 63.1642 3.52042V14.7415C63.1642 14.9056 63.0305 15.0392 62.8664 15.0392H32.9247C32.0346 15.0392 31.3134 15.7607 31.3134 16.6506C31.3134 17.5405 32.0346 18.2619 32.9247 18.2619H53.496V66.3868H47.0507V62.3877C47.0507 60.4466 45.4714 58.8673 43.5303 58.8673H3.73527C1.79416 58.8671 0.214844 60.4464 0.214844 62.3875V73.6086C0.214844 75.5494 1.79416 77.1288 3.73527 77.1288H43.5305C45.4716 77.1288 47.0509 75.5495 47.0509 73.6083V69.6092H53.4962V91.7381H47.3487C45.4076 91.7381 43.8283 93.3174 43.8283 95.2585V106.48C43.8283 108.421 45.4076 110 47.3487 110H93.3744C95.3155 110 96.8948 108.421 96.8948 106.48V95.2585C96.8948 93.3174 95.3155 91.7381 93.3744 91.7381H82.3387C81.4486 91.7381 80.7274 92.4596 80.7274 93.3494C80.7274 94.2393 81.4486 94.9608 82.3387 94.9608H93.3739C93.5381 94.9608 93.6717 95.0944 93.6717 95.2585V106.48C93.6717 106.644 93.5381 106.777 93.3739 106.777H47.3485C47.1843 106.777 47.0507 106.644 47.0507 106.48V95.2585C47.0507 95.0944 47.1843 94.9608 47.3485 94.9608H75.8934C76.7835 94.9608 77.5047 94.2393 77.5047 93.3494C77.5047 92.4596 76.7835 91.7381 75.8934 91.7381H56.7186V43.6132H63.1639V47.6123C63.1639 49.5534 64.7432 51.1327 66.6844 51.1327H106.48C108.421 51.1327 110 49.5534 110 47.6123V36.3912C110 34.4503 108.42 32.871 106.479 32.871ZM43.8283 73.6083H43.828C43.828 73.7725 43.6944 73.9061 43.5303 73.9061H3.73527C3.57113 73.9061 3.43749 73.7725 3.43749 73.6083V62.3873C3.43749 62.2231 3.57113 62.0895 3.73527 62.0895H43.5305C43.6946 62.0895 43.8283 62.2231 43.8283 62.3873V73.6083ZM106.777 47.6123C106.777 47.7764 106.644 47.9101 106.479 47.9101H66.6844C66.5202 47.9101 66.3866 47.7764 66.3866 47.6123V36.3912C66.3866 36.2271 66.5202 36.0935 66.6844 36.0935H106.48C106.644 36.0935 106.777 36.2271 106.777 36.3912V47.6123Z" fill="#A9ADB7"/>
<path d="M27.2125 4.88199L22.7889 9.35009L22.1031 8.93437C21.3414 8.47332 20.351 8.7163 19.8898 9.47728C19.4287 10.2383 19.6715 11.2291 20.4324 11.6904L22.2049 12.7646C22.4638 12.9214 22.7528 12.9979 23.0396 12.9979C23.4589 12.9979 23.874 12.8346 24.1853 12.5201L29.5027 7.14902C30.1288 6.51674 30.1236 5.49645 29.4911 4.87039C28.859 4.24455 27.8387 4.2495 27.2125 4.88199Z" fill="#C97B00"/>
<path d="M51.0253 10.7422C51.9154 10.7422 52.6367 10.0207 52.6367 9.13086C52.6367 8.24098 51.9154 7.51953 51.0253 7.51953H31.6894C30.7994 7.51953 30.0781 8.24098 30.0781 9.13086C30.0781 10.0207 30.7994 10.7422 31.6894 10.7422H51.0253Z" fill="#C97B00"/>
<path d="M57.4707 10.7422C58.3608 10.7422 59.082 10.0207 59.082 9.13086C59.082 8.24098 58.3608 7.51953 57.4707 7.51953H55.1074C54.2173 7.51953 53.4961 8.24098 53.4961 9.13086C53.4961 10.0207 54.2173 10.7422 55.1074 10.7422H57.4707Z" fill="#C97B00"/>
<path d="M74.4012 37.9622C73.7717 37.3329 72.7516 37.3329 72.1223 37.9622L69.222 40.8626C68.5927 41.4919 68.5927 42.5121 69.222 43.1412L71.8001 45.7193C72.1148 46.0339 72.5273 46.1913 72.9396 46.1913C73.3519 46.1913 73.7644 46.0341 74.0791 45.7193C74.7084 45.09 74.7084 44.0698 74.0791 43.4407L72.6403 42.0019L74.4014 40.2408C75.0302 39.6118 75.0302 38.5913 74.4012 37.9622Z" fill="#C97B00"/>
<path d="M83.8563 37.9622C83.2268 37.3329 82.2067 37.3329 81.5774 37.9622C80.9481 38.5915 80.9481 39.6118 81.5774 40.2408L83.3385 42.0019L81.8997 43.4407C81.2704 44.07 81.2704 45.0903 81.8997 45.7193C82.2144 46.0339 82.6269 46.1913 83.0392 46.1913C83.4515 46.1913 83.864 46.0341 84.1788 45.7193L86.7569 43.1412C87.3862 42.5119 87.3862 41.4916 86.7569 40.8626L83.8563 37.9622Z" fill="#C97B00"/>
<path d="M79.5539 37.7135C78.728 37.3827 77.7898 37.7846 77.4594 38.6111L75.3109 43.9822C74.9805 44.8085 75.3825 45.7463 76.2088 46.0767C76.4049 46.1553 76.6073 46.1925 76.8067 46.1925C77.446 46.1925 78.0513 45.8092 78.3033 45.1793L80.4517 39.8082C80.7821 38.9815 80.3802 38.0439 79.5539 37.7135Z" fill="#C97B00"/>
<path d="M103.232 40.3906H90.127C89.2369 40.3906 88.5156 41.1121 88.5156 42.002C88.5156 42.8918 89.2369 43.6133 90.127 43.6133H103.232C104.122 43.6133 104.844 42.8918 104.844 42.002C104.844 41.1121 104.122 40.3906 103.232 40.3906Z" fill="#C97B00"/>
<path d="M13.6774 64.1789L9.25379 68.647L8.56801 68.2313C7.80639 67.7701 6.81596 68.013 6.35469 68.7742C5.89342 69.5354 6.13641 70.5261 6.89738 70.9873L8.66984 72.0615C8.92873 72.2184 9.21769 72.2949 9.50451 72.2949C9.92388 72.2949 10.339 72.1316 10.6503 71.8171L15.9676 66.446C16.5937 65.8137 16.5885 64.7934 15.956 64.1673C15.324 63.5415 14.3037 63.5462 13.6774 64.1789Z" fill="#C97B00"/>
<path d="M39.6386 66.3867H18.3691C17.479 66.3867 16.7578 67.1082 16.7578 67.998C16.7578 68.8879 17.479 69.6094 18.3691 69.6094H39.6386C40.5287 69.6094 41.25 68.8879 41.25 67.998C41.25 67.1082 40.5287 66.3867 39.6386 66.3867Z" fill="#C97B00"/>
<path d="M49.4141 100.869C49.4141 103.298 51.3898 105.273 53.8184 105.273C56.2469 105.273 58.2226 103.298 58.2226 100.869C58.2226 98.4405 56.2469 96.4648 53.8184 96.4648C51.3898 96.4648 49.4141 98.4405 49.4141 100.869ZM55 100.869C55 101.521 54.47 102.051 53.8184 102.051C53.1667 102.051 52.6367 101.521 52.6367 100.869C52.6367 100.218 53.1667 99.6875 53.8184 99.6875C54.47 99.6875 55 100.218 55 100.869Z" fill="#C97B00"/>
<path d="M59.7266 100.869C59.7266 103.298 61.7023 105.273 64.1308 105.273C66.5594 105.273 68.5351 103.298 68.5351 100.869C68.5351 98.4405 66.5594 96.4648 64.1308 96.4648C61.7023 96.4648 59.7266 98.4405 59.7266 100.869ZM65.3125 100.869C65.3125 101.521 64.7825 102.051 64.1308 102.051C63.4792 102.051 62.9492 101.521 62.9492 100.869C62.9492 100.218 63.4792 99.6875 64.1308 99.6875C64.7825 99.6875 65.3125 100.218 65.3125 100.869Z" fill="#C97B00"/>
<path d="M74.6582 99.2578H71.6504C70.7603 99.2578 70.0391 99.9793 70.0391 100.869C70.0391 101.759 70.7603 102.48 71.6504 102.48H74.6582C75.5483 102.48 76.2695 101.759 76.2695 100.869C76.2695 99.9793 75.5483 99.2578 74.6582 99.2578Z" fill="#C97B00"/>
<path d="M79.1699 102.48H89.6972C90.5873 102.48 91.3086 101.759 91.3086 100.869C91.3086 99.9793 90.5873 99.2578 89.6972 99.2578H79.1699C78.2798 99.2578 77.5586 99.9793 77.5586 100.869C77.5586 101.759 78.2798 102.48 79.1699 102.48Z" fill="#C97B00"/>
<path d="M3.47423 38.0273H11.7796C13.6954 38.0273 15.2539 36.4688 15.2539 34.5533V26.2475C15.2539 24.3317 13.6954 22.7734 11.7796 22.7734H3.47423C1.55847 22.7734 0 24.3319 0 26.2475V34.5531C0 36.4688 1.55847 38.0273 3.47423 38.0273ZM3.22265 26.2475C3.22265 26.1087 3.33544 25.9961 3.47423 25.9961H11.7796C11.9184 25.9961 12.0312 26.1089 12.0312 26.2475V34.5531C12.0312 34.6919 11.9184 34.8044 11.7796 34.8044H3.47423C3.33544 34.8044 3.22265 34.6917 3.22265 34.5531V26.2475Z" fill="#C97B00"/>
<path d="M21.0547 23.5254C21.0547 24.4153 21.7759 25.1367 22.666 25.1367H47.1582C48.0483 25.1367 48.7695 24.4153 48.7695 23.5254C48.7695 22.6355 48.0483 21.9141 47.1582 21.9141H22.666C21.7759 21.9141 21.0547 22.6355 21.0547 23.5254Z" fill="#A9ADB7"/>
<path d="M22.666 32.0117H47.1582C48.0483 32.0117 48.7695 31.2903 48.7695 30.4004C48.7695 29.5105 48.0483 28.7891 47.1582 28.7891H22.666C21.7759 28.7891 21.0547 29.5105 21.0547 30.4004C21.0547 31.2903 21.7759 32.0117 22.666 32.0117Z" fill="#A9ADB7"/>
<path d="M22.666 38.8867H28.4668C29.3569 38.8867 30.0781 38.1653 30.0781 37.2754C30.0781 36.3855 29.3569 35.6641 28.4668 35.6641H22.666C21.7759 35.6641 21.0547 36.3855 21.0547 37.2754C21.0547 38.1653 21.7759 38.8867 22.666 38.8867Z" fill="#A9ADB7"/>
<path d="M47.1582 35.6641H34.0527C33.1626 35.6641 32.4414 36.3855 32.4414 37.2754C32.4414 38.1653 33.1626 38.8867 34.0527 38.8867H47.1582C48.0483 38.8867 48.7695 38.1653 48.7695 37.2754C48.7695 36.3855 48.0483 35.6641 47.1582 35.6641Z" fill="#A9ADB7"/>
<path d="M64.7047 60.3711C62.7889 60.3711 61.2305 61.9296 61.2305 63.8451V72.1507C61.2305 74.0665 62.7889 75.6248 64.7047 75.6248H73.0101C74.9259 75.6248 76.4843 74.0663 76.4843 72.1507V63.8451C76.4843 61.9294 74.9259 60.3711 73.0101 60.3711H64.7047ZM73.2617 63.8451V72.1507C73.2617 72.2895 73.1489 72.4021 73.0101 72.4021H64.7047C64.5659 72.4021 64.4531 72.2893 64.4531 72.1507V63.8451C64.4531 63.7063 64.5659 63.5937 64.7047 63.5937H73.0101C73.1489 63.5937 73.2617 63.7065 73.2617 63.8451Z" fill="#C97B00"/>
<path d="M108.389 59.5117H83.8965C83.0064 59.5117 82.2852 60.2332 82.2852 61.123C82.2852 62.0129 83.0064 62.7344 83.8965 62.7344H108.389C109.279 62.7344 110 62.0129 110 61.123C110 60.2332 109.279 59.5117 108.389 59.5117Z" fill="#A9ADB7"/>
<path d="M108.389 66.3867H83.8965C83.0064 66.3867 82.2852 67.1082 82.2852 67.998C82.2852 68.8879 83.0064 69.6094 83.8965 69.6094H108.389C109.279 69.6094 110 68.8879 110 67.998C110 67.1082 109.279 66.3867 108.389 66.3867Z" fill="#A9ADB7"/>
<path d="M83.8965 73.2617C83.0064 73.2617 82.2852 73.9832 82.2852 74.873C82.2852 75.7629 83.0064 76.4844 83.8965 76.4844H89.6973C90.5873 76.4844 91.3086 75.7629 91.3086 74.873C91.3086 73.9832 90.5873 73.2617 89.6973 73.2617H83.8965Z" fill="#A9ADB7"/>
<path d="M108.389 73.2617H95.2832C94.3931 73.2617 93.6719 73.9832 93.6719 74.873C93.6719 75.7629 94.3931 76.4844 95.2832 76.4844H108.389C109.279 76.4844 110 75.7629 110 74.873C110 73.9832 109.279 73.2617 108.389 73.2617Z" fill="#A9ADB7"/>
</svg>
