<svg width="110" height="110" viewBox="0 0 110 110" fill="none" xmlns="http://www.w3.org/2000/svg">
<path d="M108.167 71.5H89.8333C89.3255 71.5 88.8672 71.7072 88.5353 72.039L77.5408 83.0335C77.2218 83.3507 77.0293 83.7888 77.0128 84.271L69.6667 81.268V72.259L80.1295 61.7962C80.4742 61.4533 80.6667 60.9877 80.6667 60.5V54.9065C84.7807 54.4445 88 50.985 88 46.75C88 43.241 85.7872 40.2563 82.6925 39.0665L83.7962 37.9628C84.1408 37.62 84.3333 37.1543 84.3333 36.6667V23.8333C84.3333 14.7345 76.9322 7.33333 67.8333 7.33333H67.6867C65.0833 2.8435 60.2268 0 55 0H42.1667C41.1528 0 40.3333 0.8195 40.3333 1.83333C40.3333 3.74367 40.7 5.61 41.4113 7.35167C32.6627 7.74767 25.6667 14.9893 25.6667 23.8333V36.6667C25.6667 37.1543 25.8592 37.62 26.2038 37.9628L27.3075 39.0665C24.2128 40.2563 22 43.241 22 46.75C22 50.985 25.2193 54.4445 29.3333 54.9065V60.5C29.3333 60.9877 29.5258 61.4533 29.8705 61.7962L40.3333 72.259V81.268L1.1385 97.3023C0.449167 97.5865 0 98.2557 0 99V108.167C0 109.181 0.8195 110 1.83333 110H78.8333H108.167C109.181 110 110 109.181 110 108.167V73.3333C110 72.3195 109.181 71.5 108.167 71.5ZM84.3333 46.75C84.3333 48.9628 82.7567 50.8163 80.6667 51.2417V42.2583C82.7567 42.6837 84.3333 44.5372 84.3333 46.75ZM29.3333 51.2417C27.2433 50.8163 25.6667 48.9628 25.6667 46.75C25.6667 44.5372 27.2433 42.6837 29.3333 42.2583V51.2417ZM29.3333 35.9077V23.8333C29.3333 16.7585 35.0918 11 42.1667 11H44.4767C45.1605 11 45.7857 10.6205 46.1028 10.0155C46.4182 9.40867 46.3705 8.679 45.9818 8.118C45.0395 6.7705 44.4217 5.258 44.154 3.66667H55C59.213 3.66667 63.1107 6.13433 64.9257 9.955C65.23 10.593 65.8753 11 66.5812 11H67.8333C74.9082 11 80.6667 16.7585 80.6667 23.8333V35.9077L78.8333 37.741L77 35.9077V23.8333C77 23.3182 76.7837 22.8268 76.4042 22.4803C76.0228 22.1338 75.5132 21.9578 74.9998 22.0073L55 23.826L35.0002 22.0073C34.4905 21.9597 33.979 22.132 33.5958 22.4803C33.2163 22.8268 33 23.3182 33 23.8333V35.9077L31.1667 37.741L29.3333 35.9077ZM33 59.741V53.1667V41.0923L36.1295 37.9628C36.4742 37.62 36.6667 37.1543 36.6667 36.6667V25.8408L54.8332 27.4927C54.945 27.5037 55.055 27.5037 55.1668 27.4927L73.3333 25.8408V36.6667C73.3333 37.1543 73.5258 37.62 73.8705 37.9628L77 41.0923V53.1667V59.741L61.5743 75.1667H48.4257L33 59.741ZM66 75.9257V81.5558L55 89.4135L44 81.5558V75.9257L46.3705 78.2962C46.7133 78.6408 47.179 78.8333 47.6667 78.8333H62.3333C62.821 78.8333 63.2867 78.6408 63.6295 78.2962L66 75.9257ZM77 106.333H3.66667V100.23L41.9247 84.5808L53.9348 93.159C54.2538 93.3863 54.626 93.5 55 93.5C55.374 93.5 55.7462 93.3863 56.0652 93.1572L68.0753 84.579L77 88.231V106.333ZM88 77.759V82.5H83.259L88 77.759ZM106.333 106.333H80.6667V86.999V86.1667H89.8333C90.8472 86.1667 91.6667 85.3472 91.6667 84.3333V75.1667H106.333V106.333Z" fill="#A9ADB7"/>
</svg>
