<svg width="46" height="46" viewBox="0 0 46 46" fill="none" xmlns="http://www.w3.org/2000/svg">
<path d="M27.8581 12.1055H18.1442C14.9954 12.1055 12.4336 14.7466 12.4336 17.9929V28.0075C12.4336 31.2538 14.9954 33.8949 18.1442 33.8949H27.8581C31.0069 33.8949 33.5687 31.2538 33.5687 28.0075V17.9929C33.5687 14.7466 31.0069 12.1055 27.8581 12.1055ZM31.8612 28.0075C31.8612 30.2832 30.0655 32.1346 27.8581 32.1346H18.1442C15.9369 32.1346 14.1411 30.2832 14.1411 28.0075V17.9929C14.1411 15.7172 15.9369 13.8658 18.1442 13.8658H27.8581C30.0654 13.8658 31.8612 15.7172 31.8612 17.9929V28.0075Z" fill="#2A2A33"/>
<path d="M27.731 22.2397C27.5808 21.195 27.1185 20.2482 26.3942 19.5014C25.6698 18.7547 24.7514 18.2781 23.7382 18.1232C23.2769 18.0527 22.8091 18.0527 22.3478 18.1232C21.0956 18.3147 19.9906 18.9974 19.2365 20.0456C18.4824 21.0938 18.1693 22.3821 18.355 23.6731C18.5407 24.9641 19.2029 26.1032 20.2197 26.8807C21.0451 27.5119 22.0238 27.8433 23.033 27.8433C23.2669 27.8433 23.5025 27.8256 23.7382 27.7895C24.9904 27.598 26.0953 26.9153 26.8495 25.8671C27.6037 24.8189 27.9168 23.5306 27.731 22.2397ZM23.4877 26.0482C22.6867 26.1708 21.8873 25.9642 21.2369 25.4668C20.5864 24.9695 20.1628 24.2407 20.044 23.4149C19.9252 22.5891 20.1255 21.7649 20.6079 21.0944C21.0904 20.4238 21.7972 19.9871 22.5983 19.8646C22.7458 19.842 22.8944 19.8307 23.043 19.8307C23.1915 19.8307 23.3401 19.842 23.4877 19.8646C24.8182 20.068 25.8447 21.1262 26.042 22.4979C26.2872 24.2027 25.1414 25.7954 23.4877 26.0482Z" fill="#2A2A33"/>
<path d="M28.9458 16.8691C28.7868 16.7053 28.5667 16.6113 28.3421 16.6113C28.1174 16.6113 27.8974 16.7052 27.7384 16.8691C27.5794 17.0331 27.4883 17.2596 27.4883 17.4915C27.4883 17.7235 27.5794 17.95 27.7384 18.114C27.8974 18.2778 28.1174 18.3718 28.3421 18.3718C28.5667 18.3718 28.7868 18.2779 28.9458 18.114C29.1047 17.95 29.1958 17.7231 29.1958 17.4915C29.1958 17.2599 29.1047 17.033 28.9458 16.8691Z" fill="#2A2A33"/>
</svg>
