<svg width="110" height="110" viewBox="0 0 110 110" fill="none" xmlns="http://www.w3.org/2000/svg">
<path fill-rule="evenodd" clip-rule="evenodd" d="M89.375 57.1588V52.7536L90.8566 52.1984C98.1956 49.4467 103.125 42.3328 103.125 34.4953V25.7812H99.6875V34.4953C99.6875 40.9062 95.6536 46.7277 89.65 48.9792L89.375 49.0823V45.5469L93.2714 42.625C95.1362 41.2242 96.25 38.9967 96.25 36.6661C96.25 32.7525 93.2147 29.535 89.375 29.2411V25.7812H85.9375V32.6562H88.8027C91.013 32.6562 92.8125 34.4558 92.8125 36.6661C92.8125 37.9208 92.2127 39.1222 91.2072 39.875L85.9375 43.8281V58.4375C85.9375 60.3333 84.3958 61.875 82.5 61.875C80.6042 61.875 79.0625 60.3333 79.0625 58.4375V49.8438H70.4688C67.6259 49.8438 65.3125 47.5303 65.3125 44.6875V38.4691L63.0438 37.3347C62.3219 36.9737 61.875 36.2502 61.875 35.4458C61.875 35.0848 61.9816 34.7359 62.1792 34.4369L65.3125 29.7395V25.7812H61.875V28.698L59.3192 32.5291C58.7417 33.397 58.4375 34.4059 58.4375 35.4458C58.4375 37.5598 59.6131 39.4608 61.5055 40.4095L61.875 40.5934V44.6875C61.875 49.4261 65.7302 53.2812 70.4688 53.2812H75.625V56.9319L73.6003 57.2017C63.8395 58.5045 55.6445 64.8656 51.9217 73.9062H42.9688V51.5625H53.2812V37.8125H29.2188V42.9688H25.7812V37.8125H15.4688V27.5H25.7812V10.3125H1.71875V27.5H12.0312V37.8125H1.71875V51.5625H25.7812V46.4062H29.2188V51.5625H39.5312V73.9062H32.6562V60.1562H24.0625C19.3239 60.1562 15.4688 64.0114 15.4688 68.75V99.6875C15.4688 104.426 19.3239 108.281 24.0625 108.281H73.9062V101.406H90.0659C100.11 101.406 108.281 93.2336 108.281 83.1892C108.281 71.3213 100.571 60.8025 89.375 57.1588ZM22.3438 13.75H5.15625V24.0625H22.3438V13.75ZM5.15625 48.125H22.3438V41.25H5.15625V48.125ZM49.8438 41.25H32.6562V48.125H49.8438V41.25ZM29.2188 63.5938H24.0625C21.2197 63.5938 18.9062 65.9072 18.9062 68.75C18.9062 71.5928 21.2197 73.9062 24.0625 73.9062H29.2188V63.5938ZM24.0625 104.844H70.4688V101.406C66.6772 101.406 63.5938 98.3228 63.5938 94.5312V91.0938C63.5938 87.3022 66.6772 84.2188 70.4688 84.2188V77.3438H24.0625C22.1203 77.3438 20.3466 76.6717 18.9062 75.5803V99.6875C18.9062 102.53 21.2197 104.844 24.0625 104.844ZM70.4688 97.9688H77.3438V90.0866L75.9206 88.6634C75.2692 88.0137 74.4064 87.6562 73.4886 87.6562H70.4688C68.573 87.6562 67.0312 89.198 67.0312 91.0938V94.5312C67.0312 96.427 68.573 97.9688 70.4688 97.9688ZM80.7812 97.9688H90.0659C98.2145 97.9688 104.844 91.3395 104.844 83.1892C104.844 73.0503 98.4036 64.0389 88.9745 60.6598C88.0447 63.3566 85.5095 65.3125 82.5 65.3125C79.3805 65.3125 76.7697 63.2122 75.9327 60.3608L74.0558 60.61C65.9983 61.6842 59.1662 66.6995 55.6841 73.9062H73.9062V84.26C75.5837 84.3614 77.1513 85.0334 78.3509 86.2331L79.7741 87.6562H87.4483C89.3114 87.6562 91.1367 86.9 92.4567 85.5817C93.7939 84.2445 94.5312 82.4673 94.5312 80.5733V75.625H97.9688V80.5733C97.9688 83.3852 96.8739 86.0269 94.887 88.012C92.8984 89.9989 90.2567 91.0938 87.4483 91.0938H80.7812V97.9688Z" fill="#A9ADB7"/>
<path fill-rule="evenodd" clip-rule="evenodd" d="M103.125 26.0625C105.021 26.0625 106.562 24.5208 106.562 22.625V19.1875C106.562 17.2917 105.021 15.75 103.125 15.75H103.024C102.164 8.02766 95.6038 2 87.6562 2H73.9062C65.9587 2 59.3966 8.02766 58.5389 15.75H58.4375C56.5417 15.75 55 17.2917 55 19.1875V22.625C55 24.5208 56.5417 26.0625 58.4375 26.0625H61.875H65.3125H85.9375H89.375H99.6875H103.125ZM87.6562 5.4375H73.9062C67.858 5.4375 62.8513 9.93031 62.0125 15.75H99.55C98.7112 9.93031 93.7045 5.4375 87.6562 5.4375ZM103.125 19.1875H58.4375V22.625H103.125V19.1875Z" fill="#C97B00"/>
<path d="M8.59375 17.1875H18.9062V20.625H8.59375V17.1875Z" fill="#C97B00"/>
<path d="M84.2188 72.1875H91.0938V75.625H84.2188V72.1875Z" fill="#C97B00"/>
</svg>
