<svg width="663" height="101" viewBox="0 0 663 101" fill="none" xmlns="http://www.w3.org/2000/svg">
<path fill-rule="evenodd" clip-rule="evenodd" d="M0.838672 43.4991C0.855809 49.1913 1.9949 54.8242 4.19079 60.0757C6.38668 65.3271 9.59628 70.0941 13.636 74.1038C17.6757 78.1136 22.4662 81.2874 27.7335 83.4439C33.0008 85.6003 38.6416 86.697 44.3331 86.6712C50.0246 86.6798 55.6619 85.566 60.9227 83.3937C66.1834 81.2214 70.9643 78.0331 74.9918 74.0112C79.0193 69.9893 82.2145 65.2127 84.3945 59.9547C86.5746 54.6967 87.6967 49.0604 87.6967 43.3683C87.6793 31.849 83.0871 20.8084 74.9304 12.6752C66.7736 4.5421 55.7204 -0.0172991 44.2023 4.93268e-05C32.6842 0.0173977 21.6447 4.61007 13.5125 12.7677C5.38023 20.9254 0.821326 31.9798 0.838672 43.4991Z" fill="url(#paint0_linear)"/>
<path fill-rule="evenodd" clip-rule="evenodd" d="M108.43 33.5563L105.16 36.1074C103.447 33.7993 101.203 31.9372 98.6193 30.6782C95.9778 29.4488 93.0956 28.8231 90.1821 28.8467C86.9265 28.8165 83.7214 29.6517 80.8946 31.2669C78.1264 32.8013 75.8291 35.0618 74.2502 37.8051C72.6713 40.5483 71.8705 43.6704 71.9341 46.835C71.8377 49.2668 72.2603 51.6913 73.1738 53.947C74.0873 56.2027 75.4706 58.238 77.2319 59.9174C78.9653 61.5926 81.0144 62.9063 83.2601 63.7822C85.5058 64.6581 87.9032 65.0787 90.3129 65.0196C93.0994 65.1036 95.8691 64.5592 98.4166 63.4269C100.964 62.2945 103.224 60.6032 105.029 58.4784L108.299 60.964C106.27 63.7401 103.6 65.9843 100.516 67.5052C97.2268 68.979 93.6552 69.7158 90.0513 69.6638C86.7349 69.7 83.4543 68.976 80.4612 67.5473C77.4681 66.1186 74.842 64.0232 72.7843 61.4219C69.2442 57.2716 67.358 51.9618 67.4865 46.5079C67.4298 43.6195 67.9831 40.7516 69.1101 38.0915C70.2371 35.4314 71.9126 33.0391 74.027 31.0707C76.1406 28.9486 78.661 27.2753 81.4371 26.1513C84.2131 25.0273 87.1876 24.4756 90.1821 24.5295C93.8416 24.4815 97.4644 25.2643 100.778 26.8189C103.851 28.3285 106.502 30.5758 108.495 33.3601L108.43 33.5563ZM112.747 36.6961H133.088V40.163H125.108V67.7015H121.119V40.163H112.747V36.6961ZM169.388 36.6961V67.7015H165.398V62.3377C163.88 64.2566 161.96 65.8196 159.773 66.9165C157.736 67.9107 155.499 68.4253 153.233 68.421C151.144 68.4558 149.07 68.055 147.145 67.2441C145.219 66.4332 143.483 65.2301 142.048 63.7113C140.534 62.1944 139.341 60.3867 138.543 58.397C137.745 56.4073 137.358 54.2767 137.405 52.1334C137.379 50.0125 137.777 47.9078 138.574 45.9423C139.371 43.9768 140.553 42.19 142.048 40.6863C143.513 39.1702 145.272 37.9701 147.218 37.1602C149.164 36.3502 151.256 35.9474 153.363 35.9766C155.635 35.9903 157.873 36.5275 159.904 37.5465C162.082 38.7209 163.944 40.4039 165.333 42.4524V36.6961H169.388ZM153.429 39.8359C151.268 39.803 149.14 40.369 147.281 41.4712C145.385 42.5031 143.837 44.0737 142.833 45.9846C141.703 47.9784 141.117 50.2341 141.133 52.5259C141.088 54.8211 141.676 57.0843 142.833 59.0671C143.89 60.9732 145.422 62.5731 147.281 63.7113C149.122 64.7988 151.225 65.3641 153.363 65.3466C155.542 65.3557 157.685 64.7917 159.577 63.7113C161.662 62.5812 163.334 60.8173 164.351 58.6746C165.457 56.6763 165.999 54.4156 165.921 52.1334C165.973 50.4779 165.687 48.8291 165.08 47.2882C164.472 45.7473 163.557 44.3466 162.389 43.1719C161.28 42.0047 159.939 41.0818 158.452 40.4623C156.965 39.8428 155.366 39.5404 153.756 39.5743L153.429 39.8359ZM204.576 67.7015H200.455L189.99 45.1343L179.656 67.7015H175.405L189.532 36.6961H190.513L204.837 67.7015H204.576ZM210.658 36.6961H214.583V49.7785L229.037 36.6961H234.466L218.834 50.8251L235.708 67.7015H230.084L215.891 53.3762L214.583 54.4882V67.5706H210.658V36.6961ZM266.056 57.4318L269.392 59.1979C268.425 61.1399 267.144 62.9082 265.599 64.4309C264.162 65.7264 262.499 66.7464 260.693 67.4398C258.716 68.1192 256.636 68.4512 254.545 68.421C252.352 68.5196 250.165 68.1307 248.141 67.2824C246.116 66.4341 244.305 65.1475 242.838 63.5151C240.177 60.5579 238.651 56.7529 238.531 52.7765C238.412 48.8002 239.706 44.9102 242.184 41.7983C243.617 39.914 245.482 38.4017 247.622 37.3886C249.762 36.3755 252.114 35.8912 254.48 35.9766C256.921 35.8994 259.345 36.405 261.551 37.4516C263.758 38.4981 265.683 40.0554 267.168 41.9945C269.454 45.0405 270.61 48.7866 270.439 52.5913H242.445C242.455 55.8649 243.692 59.0158 245.912 61.4219C246.989 62.5287 248.282 63.4018 249.711 63.987C251.14 64.5722 252.674 64.8569 254.218 64.8233C255.778 64.8287 257.327 64.5631 258.796 64.0384C260.121 63.4832 261.355 62.7336 262.459 61.8144C263.799 60.5256 264.944 59.0494 265.86 57.4318H266.056ZM266.056 49.059C265.661 47.2361 264.881 45.5188 263.767 44.0223C262.666 42.7029 261.28 41.6515 259.712 40.9479C258.075 40.0813 256.265 39.5897 254.414 39.5088C251.499 39.4521 248.67 40.5041 246.5 42.4524C244.691 44.2371 243.441 46.5101 242.903 48.9936L266.056 49.059ZM277.829 36.6961H282.081V42.4524C283.486 40.4187 285.344 38.7393 287.509 37.5465C289.638 36.4773 291.995 35.9387 294.377 35.9766C296.475 35.9446 298.557 36.3465 300.493 37.1569C302.429 37.9673 304.177 39.1689 305.626 40.6863C307.143 42.1778 308.342 43.9609 309.151 45.9282C309.961 47.8955 310.364 50.0063 310.336 52.1334C310.367 54.2747 309.973 56.401 309.176 58.3887C308.379 60.3763 307.195 62.1856 305.692 63.7113C304.242 65.2287 302.494 66.4303 300.559 67.2407C298.623 68.0511 296.541 68.4529 294.442 68.421C292.178 68.4053 289.945 67.8917 287.902 66.9165C285.717 65.816 283.798 64.2536 282.277 62.3377V78.7561H278.287V36.6961H277.829ZM293.788 39.8359C292.168 39.8009 290.559 40.1026 289.061 40.7219C287.564 41.3411 286.211 42.2645 285.089 43.4336C283.897 44.631 282.967 46.0637 282.359 47.6404C281.751 49.2171 281.478 50.9032 281.557 52.5913C281.479 54.8735 282.022 57.1342 283.127 59.1325C284.18 61.0125 285.745 62.555 287.64 63.5805C289.532 64.6609 291.675 65.2249 293.854 65.2158C295.972 65.2416 298.056 64.6752 299.871 63.5805C301.763 62.4635 303.321 60.8598 304.384 58.9362C305.541 56.9535 306.129 54.6903 306.084 52.395C306.1 50.1033 305.514 47.8476 304.384 45.8538C303.358 43.9586 301.816 42.3935 299.936 41.3404C298.074 40.2445 295.948 39.6789 293.788 39.7051V39.8359ZM314.783 50.171H330.415V53.7033H314.783V50.171ZM337.348 25.8377H341.599V41.5366L358.408 25.8377H364.033L344.019 44.611L365.799 67.7015H360.567L342.122 48.0778V67.7015H337.871V25.8377H337.348ZM385.813 35.9766C388.054 35.9177 390.281 36.3497 392.337 37.2424C394.393 38.135 396.23 39.4668 397.717 41.1441C400.534 44.2004 402.099 48.2052 402.099 52.3623C402.099 56.5194 400.534 60.5243 397.717 63.5805C396.191 65.1152 394.377 66.3332 392.379 67.1643C390.381 67.9954 388.239 68.4232 386.075 68.4232C383.911 68.4232 381.768 67.9954 379.77 67.1643C377.772 66.3332 375.958 65.1152 374.433 63.5805C371.615 60.5243 370.051 56.5194 370.051 52.3623C370.051 48.2052 371.615 44.2004 374.433 41.1441C375.92 39.4668 377.756 38.135 379.812 37.2424C381.869 36.3497 384.095 35.9177 386.336 35.9766H385.813ZM385.813 39.9013C384.223 39.8736 382.645 40.1795 381.181 40.7991C379.716 41.4188 378.398 42.3385 377.31 43.499C376.106 44.68 375.159 46.0974 374.529 47.6621C373.898 49.2269 373.598 50.9051 373.648 52.5913C373.562 54.8826 374.129 57.151 375.283 59.1325C376.52 60.8727 378.219 62.2321 380.188 63.0572C382.05 64.088 384.143 64.6288 386.271 64.6288C388.399 64.6288 390.492 64.088 392.354 63.0572C394.211 62.0265 395.733 60.4822 396.736 58.6092C397.889 56.6277 398.456 54.3593 398.371 52.068C398.402 50.4192 398.099 48.7812 397.481 47.2524C396.863 45.7237 395.942 44.3357 394.774 43.1719C393.684 42.0147 392.365 41.0971 390.901 40.4777C389.437 39.8583 387.86 39.5506 386.271 39.5743L385.813 39.9013ZM431.597 52.9837H413.479V67.8977H409.49V36.6961H413.479V49.059H431.531V36.6961H435.521V67.7015H431.531V52.5913L431.597 52.9837ZM474.568 43.3682L471.363 45.3305C470.16 43.8044 468.658 42.5403 466.949 41.6159C465.24 40.6914 463.36 40.126 461.424 39.9545C459.489 39.783 457.539 40.0089 455.693 40.6184C453.848 41.228 452.147 42.2082 450.695 43.499C449.492 44.6297 448.539 45.9993 447.897 47.5201C447.255 49.0409 446.938 50.6791 446.967 52.3296C446.929 54.6241 447.517 56.8855 448.667 58.8708C449.793 60.8351 451.447 62.4442 453.442 63.5151C456.462 64.9828 459.9 65.3482 463.161 64.5478C466.422 63.7474 469.3 61.8317 471.298 59.1325L474.502 61.2257C472.981 63.4429 470.907 65.2243 468.485 66.3932C465.811 67.6641 462.877 68.2914 459.917 68.2248C457.681 68.3099 455.451 67.9424 453.36 67.1444C451.27 66.3463 449.362 65.1341 447.752 63.5805C446.219 62.1875 444.991 60.4917 444.147 58.6002C443.303 56.7087 442.86 54.6627 442.846 52.5913C442.837 49.6651 443.628 46.7921 445.136 44.2839C446.602 41.7356 448.755 39.6504 451.349 38.266C454.086 36.8104 457.145 36.068 460.244 36.1074C462.263 36.1046 464.271 36.4135 466.196 37.0232C467.942 37.6107 469.595 38.448 471.101 39.5088C472.448 40.5905 473.599 41.896 474.502 43.3682H474.568ZM513.026 36.827V67.8323H509.036V62.3377C507.534 64.2722 505.61 65.8383 503.411 66.9165C501.377 67.9174 499.138 68.4324 496.871 68.421C494.782 68.4558 492.709 68.055 490.783 67.2441C488.857 66.4332 487.122 65.2301 485.687 63.7113C484.184 62.1856 483 60.3763 482.202 58.3887C481.405 56.401 481.011 54.2747 481.043 52.1334C481.015 50.0063 481.418 47.8955 482.227 45.9282C483.036 43.9609 484.235 42.1778 485.752 40.6863C487.202 39.1689 488.949 37.9673 490.885 37.1569C492.821 36.3465 494.903 35.9446 497.002 35.9766C499.274 35.9903 501.512 36.5275 503.542 37.5465C505.72 38.7209 507.583 40.4039 508.971 42.4524V36.6961L513.026 36.827ZM497.067 39.9667C494.907 39.9406 492.781 40.5061 490.919 41.602C489.039 42.6551 487.497 44.2203 486.472 46.1155C485.375 48.0962 484.812 50.3275 484.836 52.5913C484.792 54.8865 485.38 57.1497 486.537 59.1325C487.599 61.056 489.158 62.6597 491.05 63.7767C492.868 64.862 494.95 65.4276 497.067 65.412C499.357 65.487 501.622 64.9206 503.608 63.7767C505.503 62.7512 507.068 61.2088 508.121 59.3287C509.226 57.3304 509.768 55.0698 509.69 52.7875C509.743 51.132 509.456 49.4833 508.849 47.9423C508.242 46.4014 507.326 45.0007 506.158 43.826C505.036 42.657 503.684 41.7336 502.186 41.1143C500.689 40.495 499.08 40.1934 497.46 40.2284L497.067 39.9667ZM548.279 67.8323H544.093L533.629 45.2651L523.36 67.8323H519.043L533.236 36.827H533.89L548.279 67.8323ZM550.83 36.827H571.171V40.163H562.93V67.7015H558.94V40.163H550.765V36.6961L550.83 36.827ZM580.589 36.827V59.6558L603.35 36.6961V67.7015H599.361V44.938L577.058 67.7015H576.404V36.6961L580.589 36.827ZM634.483 52.5913H616.431V67.5052H612.442V36.6961H616.431V49.059H634.483V36.6961H638.473V67.7015H634.483V52.5913ZM651.292 40.0321V67.5052H647.368V36.6961H663V40.2284L651.292 40.0321Z" fill="#00A3D4"/>
<path fill-rule="evenodd" clip-rule="evenodd" d="M170.303 88.8949V95.4361H168.21V78.756H172.854C174.547 78.646 176.228 79.1066 177.628 80.0643C178.123 80.5343 178.513 81.1036 178.772 81.7349C179.032 82.3662 179.154 83.0452 179.133 83.7274C179.149 84.456 179.006 85.1794 178.712 85.8463C178.418 86.5132 177.981 87.1074 177.432 87.5867C176.12 88.685 174.429 89.2251 172.723 89.0912L170.303 88.8949ZM170.303 80.2605V87.1942H172.331C173.609 87.32 174.89 86.9708 175.928 86.213C176.283 85.8797 176.56 85.4727 176.741 85.0207C176.922 84.5687 177.001 84.0826 176.974 83.5965C177.004 83.1355 176.931 82.6738 176.761 82.2441C176.592 81.8144 176.33 81.4275 175.993 81.1109C174.996 80.4898 173.831 80.1927 172.658 80.2605H170.303ZM185.869 95.567C185.084 95.6062 184.3 95.4677 183.575 95.162C182.85 94.8562 182.204 94.3909 181.684 93.8008C180.662 92.3935 180.113 90.6992 180.113 88.9603C180.113 87.2215 180.662 85.5272 181.684 84.1198C182.226 83.558 182.877 83.1112 183.596 82.8061C184.315 82.5009 185.088 82.3437 185.869 82.3437C186.651 82.3437 187.424 82.5009 188.143 82.8061C188.862 83.1112 189.513 83.558 190.055 84.1198C191.162 85.4823 191.721 87.2078 191.625 88.9603C191.734 90.7145 191.173 92.4446 190.055 93.8008C189.535 94.3909 188.889 94.8562 188.164 95.162C187.439 95.4677 186.655 95.6062 185.869 95.567ZM185.869 83.989C185.339 83.9624 184.81 84.068 184.331 84.2963C183.851 84.5247 183.436 84.8686 183.122 85.2972C182.48 86.411 182.141 87.6743 182.141 88.9603C182.141 90.2463 182.48 91.5097 183.122 92.6234C183.439 93.0445 183.857 93.379 184.337 93.5962C184.817 93.8134 185.344 93.9063 185.869 93.8662C186.404 93.8999 186.938 93.8046 187.427 93.5882C187.917 93.3719 188.347 93.041 188.682 92.6234C189.34 91.5189 189.659 90.2448 189.598 88.9603C189.598 85.6897 188.355 83.989 185.869 83.989ZM203.594 94.4549C202.379 95.0891 201.039 95.4465 199.67 95.5015C198.84 95.5528 198.009 95.4278 197.231 95.1346C196.453 94.8415 195.746 94.3869 195.157 93.8008C194.585 93.1398 194.152 92.3709 193.882 91.5395C193.613 90.7081 193.512 89.8311 193.587 88.9603C193.53 88.0958 193.645 87.2284 193.926 86.4087C194.206 85.589 194.647 84.8332 195.222 84.1852C195.794 83.589 196.487 83.1227 197.254 82.818C198.021 82.5133 198.845 82.3772 199.67 82.4191C201.035 82.4495 202.376 82.7847 203.594 83.4003V85.6243C202.513 84.6944 201.158 84.1431 199.735 84.0544C199.178 84.0338 198.622 84.1409 198.112 84.3676C197.602 84.5944 197.151 84.9347 196.792 85.3627C195.999 86.3881 195.604 87.6661 195.68 88.9603C195.592 90.256 195.988 91.5383 196.792 92.558C197.151 92.9819 197.604 93.3153 198.115 93.5313C198.627 93.7472 199.182 93.8396 199.735 93.8008C201.157 93.7608 202.521 93.2291 203.594 92.2963V94.4549ZM215.04 94.4549C213.825 95.0891 212.485 95.4465 211.116 95.5015C210.297 95.5435 209.478 95.4139 208.712 95.121C207.947 94.8281 207.25 94.3785 206.668 93.8008C206.085 93.145 205.64 92.3784 205.359 91.5468C205.078 90.7152 204.967 89.8356 205.033 88.9603C204.985 88.0913 205.11 87.2213 205.402 86.4014C205.694 85.5814 206.147 84.828 206.734 84.1852C207.302 83.5855 207.995 83.1169 208.763 82.8119C209.531 82.5069 210.356 82.3728 211.181 82.4191C212.524 82.457 213.842 82.7921 215.04 83.4003V85.6243C213.959 84.6944 212.604 84.1431 211.181 84.0544C210.613 84.0286 210.047 84.133 209.525 84.3598C209.004 84.5865 208.541 84.9296 208.173 85.3627C207.432 86.4116 207.064 87.678 207.126 88.9603C207.019 90.2476 207.392 91.5291 208.173 92.558C208.544 92.9831 209.009 93.3165 209.531 93.5321C210.053 93.7476 210.618 93.8396 211.181 93.8008C212.597 93.7306 213.951 93.2027 215.04 92.2963V94.4549ZM228.121 95.2399H226.224V85.6243L219.684 95.2399H217.918V82.6808H219.815V92.2309L226.355 82.6808H228.187V95.2399H228.121ZM242.314 95.2399H240.417V85.6243L233.877 95.2399H232.111V82.6808H234.008V92.2309L240.548 82.6808H242.379V95.2399H242.314ZM241.137 77.7749C241.142 78.2485 241.052 78.7185 240.873 79.1567C240.693 79.595 240.427 79.9926 240.09 80.3259C239.308 80.9863 238.299 81.315 237.278 81.2417C236.236 81.3254 235.202 80.9965 234.4 80.3259C234.063 79.9926 233.797 79.595 233.618 79.1567C233.438 78.7185 233.348 78.2485 233.354 77.7749H235.119C235.119 79.2793 235.904 80.0643 237.278 80.0643C238.651 80.0643 239.305 79.2793 239.371 77.7749H241.137ZM255.133 94.4549C253.945 95.0965 252.624 95.4547 251.275 95.5015C250.445 95.5528 249.614 95.4278 248.836 95.1346C248.058 94.8415 247.351 94.3869 246.762 93.8008C246.19 93.1398 245.756 92.3709 245.487 91.5395C245.217 90.7081 245.117 89.8311 245.192 88.9603C245.135 88.0958 245.25 87.2284 245.53 86.4087C245.811 85.589 246.252 84.8332 246.827 84.1852C247.398 83.589 248.091 83.1227 248.859 82.818C249.626 82.5133 250.45 82.3772 251.275 82.4191C252.62 82.441 253.941 82.777 255.133 83.4003V85.6243C254.053 84.6944 252.698 84.1431 251.275 84.0544C250.716 84.0287 250.159 84.1336 249.648 84.3607C249.137 84.5878 248.687 84.9309 248.331 85.3627C247.538 86.3881 247.143 87.6661 247.219 88.9603C247.147 90.2439 247.516 91.5136 248.266 92.558C248.638 92.9831 249.103 93.3165 249.625 93.5321C250.146 93.7476 250.711 93.8396 251.275 93.8008C252.696 93.7608 254.06 93.2291 255.133 92.2963V94.4549ZM268.214 95.2399H265.729L260.562 89.4182H259.254V95.2399H257.292V82.6808H259.254V88.1754C259.888 88.2086 260.52 88.0732 261.085 87.7829C261.566 87.4817 261.951 87.0509 262.197 86.5401L262.917 84.9048C263.155 84.482 263.441 84.087 263.767 83.7274C264.106 83.3929 264.505 83.1265 264.944 82.9424C265.53 82.8626 266.124 82.8626 266.71 82.9424H267.495V84.6431H266.579C266.09 84.6142 265.606 84.7527 265.206 85.0356C264.79 85.4095 264.475 85.8819 264.29 86.4093C263.972 87.4384 263.269 88.3053 262.328 88.8295L268.28 95.3707L268.214 95.2399ZM280.511 95.2399H278.614V85.6243L272.073 95.2399H270.307V82.6808H272.27V92.2309L278.81 82.6808H280.576V95.2399H280.511ZM294.704 95.2399H292.807V85.6243L286.266 95.2399H284.5V82.6808H286.397V92.2309L292.938 82.6808H294.769V95.2399H294.704ZM293.526 77.7749C293.548 78.2506 293.466 78.7254 293.285 79.1661C293.104 79.6067 292.829 80.0026 292.48 80.3259C291.698 80.9863 290.688 81.315 289.667 81.2417C289.161 81.289 288.65 81.2322 288.166 81.0747C287.683 80.9172 287.236 80.6624 286.855 80.3259C286.497 80.0058 286.212 79.6122 286.02 79.1719C285.828 78.7316 285.734 78.2551 285.743 77.7749H287.509C287.509 79.2793 288.294 80.0643 289.667 80.0643C291.041 80.0643 291.76 79.2793 291.76 77.7749H293.526ZM317.595 98.3797H315.829V95.3707H306.215V98.3797H304.449V93.7354H305.757C306.611 92.1947 307.249 90.544 307.654 88.8295C308.104 86.8778 308.324 84.8799 308.308 82.877H316.091V93.7354H317.595V98.3797ZM314.129 93.7354V84.3161H310.139C310.083 87.5482 309.229 90.7165 307.654 93.5392L314.129 93.7354ZM330.546 95.4361H328.649V85.6243L322.108 95.2399H320.342V82.6808H322.239V92.2309L328.78 82.6808H330.611V95.2399L330.546 95.4361ZM343.627 94.6512C342.438 95.2928 341.117 95.6509 339.768 95.6978C338.938 95.749 338.107 95.624 337.329 95.3309C336.551 95.0377 335.844 94.5832 335.255 93.9971C334.683 93.336 334.249 92.5671 333.98 91.7357C333.71 90.9044 333.61 90.0274 333.685 89.1566C333.628 88.292 333.743 87.4247 334.023 86.6049C334.304 85.7852 334.745 85.0294 335.32 84.3815C335.889 83.7818 336.581 83.3131 337.349 83.0081C338.117 82.7031 338.943 82.5691 339.768 82.6154C341.112 82.6466 342.431 82.9821 343.627 83.5965V85.8205C342.546 84.8906 341.191 84.3393 339.768 84.2507C339.209 84.225 338.652 84.3298 338.141 84.5569C337.631 84.784 337.18 85.1271 336.824 85.5589C336.031 86.5843 335.636 87.8624 335.713 89.1566C335.64 90.4402 336.009 91.7098 336.759 92.7542C337.131 93.1793 337.596 93.5127 338.118 93.7283C338.64 93.9439 339.204 94.0359 339.768 93.9971C341.189 93.957 342.553 93.4253 343.627 92.4926V94.6512ZM355.334 84.5777H350.887V95.4361H348.924V84.3815H344.411V82.6808H355.334V84.3815V84.5777ZM359.324 94.7166V100.015H357.427V82.6808H359.324V84.1198C360.463 83.0498 361.948 82.4233 363.51 82.3537C364.19 82.3435 364.863 82.4919 365.476 82.7871C366.089 83.0823 366.625 83.5162 367.042 84.0544C367.973 85.4672 368.431 87.1394 368.35 88.8295C368.405 90.5674 367.824 92.2655 366.715 93.6046C366.244 94.1899 365.646 94.6594 364.965 94.9769C364.285 95.2944 363.541 95.4516 362.79 95.4361C361.579 95.4097 360.39 95.0959 359.324 94.5204V94.7166ZM359.324 85.886V93.1467C360.28 93.6278 361.328 93.8956 362.398 93.9317C362.946 93.9522 363.492 93.8446 363.991 93.6175C364.491 93.3904 364.931 93.0501 365.276 92.6234C366.006 91.5946 366.375 90.352 366.322 89.0912C366.322 85.9514 365.21 84.3815 362.921 84.3815C361.586 84.4597 360.317 84.9903 359.324 85.886ZM381.627 95.4361H379.665V85.6243L373.124 95.2399H371.358V82.6808H373.32V92.2309L379.861 82.6808H381.692V95.2399L381.627 95.4361ZM395.297 77.8403V79.6064H392.026C391.161 79.6989 390.307 79.8741 389.475 80.1297C388.675 80.4085 388.002 80.9657 387.579 81.6996C387.099 82.5857 386.83 83.5707 386.794 84.5777C387.937 83.6772 389.33 83.1517 390.784 83.0732C391.501 83.0486 392.216 83.1758 392.881 83.4463C393.546 83.7168 394.146 84.1246 394.643 84.6431C395.679 85.8584 396.196 87.4326 396.081 89.0257C396.162 90.7277 395.575 92.394 394.446 93.67C393.936 94.2596 393.303 94.7295 392.591 95.0461C391.878 95.3627 391.105 95.5182 390.326 95.5015C389.49 95.5459 388.658 95.3698 387.911 94.991C387.165 94.6121 386.532 94.0438 386.074 93.3429C385.018 91.4728 384.518 89.3391 384.636 87.1942C384.647 85.9596 384.8 84.7304 385.093 83.5311C385.276 82.5998 385.584 81.6975 386.009 80.8492C386.36 80.2594 386.827 79.7474 387.383 79.3447C387.941 78.9452 388.559 78.6362 389.214 78.429C389.917 78.1937 390.639 78.0186 391.372 77.9057L395.297 77.5786V77.8403ZM386.729 86.1476C386.7 86.6051 386.7 87.0638 386.729 87.5213C386.619 89.1933 386.958 90.8643 387.71 92.3618C387.985 92.8406 388.387 93.2343 388.872 93.4997C389.356 93.7651 389.905 93.8919 390.457 93.8662C390.964 93.892 391.471 93.7989 391.937 93.5945C392.402 93.3901 392.813 93.08 393.138 92.6888C393.846 91.6763 394.191 90.455 394.119 89.222C394.119 86.3438 392.942 84.9048 390.457 84.9048C389.143 84.9667 387.874 85.3974 386.794 86.1476H386.729ZM398.959 95.2399V82.6808H400.856V87.5213H403.734C405.073 87.4055 406.412 87.7517 407.527 88.5024C407.931 88.8585 408.254 89.2963 408.476 89.7869C408.697 90.2775 408.812 90.8096 408.812 91.3479C408.812 91.8861 408.697 92.4182 408.476 92.9088C408.254 93.3994 407.931 93.8373 407.527 94.1933C406.454 94.934 405.167 95.3017 403.865 95.2399H398.959ZM400.856 89.1566V93.6046H402.884C403.914 93.686 404.949 93.506 405.892 93.0813C406.15 92.8818 406.356 92.6231 406.493 92.327C406.629 92.0309 406.693 91.7063 406.677 91.3806C406.708 91.0754 406.665 90.7672 406.551 90.4824C406.437 90.1976 406.256 89.9447 406.023 89.7453C405.087 89.2275 404.01 89.0213 402.949 89.1566H400.856ZM415.965 89.4836H412.891V95.2399H410.928V82.6808H412.891V87.8483H415.638C415.752 86.3553 416.376 84.9469 417.403 83.8582C417.891 83.368 418.472 82.9818 419.113 82.7232C419.754 82.4646 420.441 82.3389 421.132 82.3537C421.907 82.3197 422.68 82.4608 423.393 82.7666C424.107 83.0723 424.742 83.5349 425.252 84.1198C426.228 85.5454 426.75 87.2327 426.75 88.9603C426.75 90.688 426.228 92.3752 425.252 93.8008C424.742 94.3858 424.107 94.8483 423.393 95.1541C422.68 95.4598 421.907 95.601 421.132 95.567C420.397 95.6016 419.664 95.4728 418.986 95.1901C418.307 94.9073 417.7 94.4775 417.207 93.9317C416.162 92.6842 415.583 91.1114 415.572 89.4836H415.965ZM421.524 83.989C421.004 83.9675 420.486 84.0758 420.018 84.3042C419.55 84.5325 419.146 84.8738 418.842 85.2972C418.184 86.4017 417.865 87.6758 417.927 88.9603C417.865 90.2448 418.184 91.5189 418.842 92.6234C419.174 93.0103 419.585 93.3208 420.048 93.5338C420.511 93.7467 421.015 93.8569 421.524 93.8569C422.033 93.8569 422.537 93.7467 423 93.5338C423.463 93.3208 423.874 93.0103 424.206 92.6234C424.864 91.5189 425.183 90.2448 425.121 88.9603C425.121 85.6897 423.944 83.989 421.524 83.989ZM438.987 84.3815H434.474V95.2399H432.512V84.3815H427.999V82.6808H439.053V84.3815H438.987ZM445.528 95.567C444.743 95.6015 443.96 95.4609 443.236 95.1554C442.512 94.85 441.865 94.3873 441.342 93.8008C440.321 92.3935 439.771 90.6992 439.771 88.9603C439.771 87.2215 440.321 85.5272 441.342 84.1198C441.865 83.5334 442.512 83.0707 443.236 82.7652C443.96 82.4598 444.743 82.3192 445.528 82.3537C446.322 82.3186 447.115 82.4586 447.85 82.7638C448.584 83.069 449.243 83.5319 449.779 84.1198C450.862 85.4917 451.398 87.2163 451.283 88.9603C451.411 90.7059 450.873 92.435 449.779 93.8008C449.243 94.3888 448.584 94.8517 447.85 95.1569C447.115 95.4621 446.322 95.6021 445.528 95.567ZM445.528 83.989C444.998 83.9681 444.471 84.0763 443.993 84.3042C443.514 84.5321 443.098 84.8729 442.781 85.2972C442.138 86.411 441.799 87.6743 441.799 88.9603C441.799 90.2463 442.138 91.5097 442.781 92.6234C443.105 93.0358 443.524 93.364 444.002 93.5803C444.481 93.7966 445.004 93.8947 445.528 93.8662C446.062 93.9055 446.599 93.8127 447.089 93.596C447.579 93.3793 448.009 93.0453 448.34 92.6234C449.058 91.542 449.402 90.2557 449.321 88.9603C449.321 85.6897 448.078 83.989 445.528 83.989ZM456.123 94.5204V99.8188H454.161V82.6808H456.123V84.1198C457.246 83.064 458.705 82.4386 460.244 82.3537C460.926 82.3329 461.603 82.4766 462.217 82.7727C462.832 83.0687 463.367 83.5083 463.776 84.0544C464.707 85.4672 465.165 87.1394 465.084 88.8295C465.158 90.559 464.6 92.2563 463.514 93.6046C463.044 94.1899 462.445 94.6594 461.765 94.9769C461.085 95.2944 460.34 95.4516 459.59 95.4361C458.377 95.4201 457.186 95.1055 456.123 94.5204ZM456.123 85.6897V92.9505C457.076 93.4397 458.127 93.708 459.197 93.7354C459.736 93.756 460.272 93.6481 460.761 93.4206C461.25 93.1931 461.678 92.8526 462.01 92.4272C462.77 91.4129 463.141 90.1596 463.056 88.8949C463.056 85.7551 461.944 84.1852 459.721 84.1852C458.38 84.2417 457.105 84.7753 456.123 85.6897ZM488.826 95.2399H486.144L479.604 87.5213H477.903V95.2399H475.679V78.756H477.772V86.2784C478.337 86.3524 478.908 86.3524 479.473 86.2784C479.909 86.1183 480.309 85.8738 480.65 85.5589C480.951 85.265 481.214 84.9355 481.435 84.5777C481.435 84.1852 481.958 83.4657 482.416 82.3537C482.76 81.3041 483.395 80.3739 484.247 79.6718C485.147 79.1802 486.168 78.9534 487.191 79.0177H487.91V80.7838H486.995C486.322 80.7407 485.654 80.925 485.098 81.3071C484.615 81.9392 484.239 82.6464 483.986 83.4003C483.731 84.1411 483.379 84.8449 482.939 85.4935C482.494 86.1006 481.911 86.5937 481.239 86.9326L488.891 95.6978L488.826 95.2399ZM492.685 94.5204V99.8188H490.788V82.6808H492.685V84.1198C493.824 83.0498 495.309 82.4233 496.871 82.3537C497.551 82.3435 498.224 82.4919 498.837 82.7871C499.45 83.0823 499.986 83.5162 500.403 84.0544C501.334 85.4672 501.792 87.1394 501.711 88.8295C501.768 89.6941 501.653 90.5614 501.372 91.3811C501.091 92.2009 500.651 92.9566 500.076 93.6046C499.615 94.1848 499.028 94.6516 498.359 94.9691C497.69 95.2867 496.957 95.4464 496.217 95.4361C494.983 95.4201 493.771 95.106 492.685 94.5204ZM492.685 85.6897V92.9505C493.641 93.4316 494.689 93.6994 495.759 93.7354C496.308 93.7611 496.855 93.6559 497.355 93.4285C497.856 93.201 498.295 92.8578 498.637 92.4272C499.397 91.4129 499.768 90.1596 499.683 88.8949C499.683 85.7551 498.571 84.1852 496.282 84.1852C494.947 84.2635 493.678 84.7941 492.685 85.6897ZM512.306 92.2309V88.6333C510.495 88.5545 508.688 88.8669 507.008 89.549C506.648 89.7329 506.347 90.0144 506.138 90.3613C505.93 90.7083 505.824 91.1068 505.831 91.5114C505.831 93.0159 506.747 93.7354 508.513 93.7354C509.914 93.6912 511.256 93.159 512.306 92.2309ZM512.306 95.2399V93.8008C511.543 94.4202 510.68 94.9067 509.755 95.2399C509.076 95.4438 508.372 95.5538 507.663 95.567C507.153 95.5793 506.646 95.4869 506.174 95.2957C505.701 95.1044 505.273 94.8183 504.915 94.4549C504.553 94.083 504.269 93.6428 504.078 93.16C503.887 92.6772 503.794 92.1613 503.804 91.6422C503.759 91.0007 503.887 90.3589 504.175 89.7837C504.462 89.2085 504.899 88.7209 505.439 88.3716C507.596 87.4115 509.947 86.9637 512.306 87.0634V86.6709C512.328 86.3062 512.268 85.9413 512.133 85.6021C511.997 85.263 511.788 84.9579 511.521 84.7085C510.686 84.2412 509.728 84.0361 508.774 84.1198C507.466 84.1474 506.176 84.4365 504.981 84.9702V82.9424C506.286 82.6119 507.625 82.4362 508.971 82.4191C510.4 82.3141 511.825 82.6818 513.026 83.4657C513.466 83.8676 513.808 84.3662 514.024 84.9223C514.239 85.4784 514.323 86.0769 514.268 86.6709V95.2399H512.306ZM526.957 94.4549C525.745 95.0974 524.403 95.4554 523.033 95.5015C522.214 95.5435 521.395 95.4139 520.629 95.121C519.863 94.8281 519.167 94.3785 518.585 93.8008C518.002 93.145 517.556 92.3784 517.276 91.5468C516.995 90.7152 516.884 89.8356 516.95 88.9603C516.902 88.0913 517.027 87.2213 517.319 86.4014C517.611 85.5814 518.064 84.828 518.651 84.1852C519.219 83.5855 519.912 83.1169 520.68 82.8119C521.448 82.5069 522.273 82.3728 523.098 82.4191C524.442 82.4504 525.761 82.7858 526.957 83.4003V85.6243C525.876 84.6944 524.521 84.1431 523.098 84.0544C522.531 84.0334 521.966 84.14 521.445 84.3664C520.924 84.5929 520.461 84.9333 520.089 85.3627C519.349 86.4116 518.981 87.678 519.043 88.9603C518.971 90.2439 519.34 91.5136 520.089 92.558C520.461 92.9831 520.926 93.3165 521.448 93.5321C521.97 93.7476 522.535 93.8396 523.098 93.8008C524.52 93.7608 525.883 93.2291 526.957 92.2963V94.4549ZM534.217 95.567C533.432 95.6015 532.649 95.4609 531.925 95.1554C531.201 94.85 530.554 94.3873 530.031 93.8008C529.01 92.3935 528.46 90.6992 528.46 88.9603C528.46 87.2215 529.01 85.5272 530.031 84.1198C530.554 83.5334 531.201 83.0707 531.925 82.7652C532.649 82.4598 533.432 82.3192 534.217 82.3537C535.012 82.3186 535.804 82.4586 536.539 82.7638C537.274 83.069 537.932 83.5319 538.468 84.1198C539.525 85.5056 540.057 87.2199 539.973 88.9603C540.069 90.7022 539.535 92.4205 538.468 93.8008C537.932 94.3888 537.274 94.8517 536.539 95.1569C535.804 95.4621 535.012 95.6021 534.217 95.567ZM534.217 83.989C533.687 83.9681 533.161 84.0763 532.682 84.3042C532.204 84.5321 531.788 84.8729 531.47 85.2972C530.827 86.411 530.489 87.6743 530.489 88.9603C530.489 90.2463 530.827 91.5097 531.47 92.6234C531.795 93.0358 532.214 93.364 532.692 93.5803C533.17 93.7966 533.693 93.8947 534.217 93.8662C534.752 93.9055 535.288 93.8127 535.778 93.596C536.269 93.3793 536.698 93.0453 537.029 92.6234C537.747 91.542 538.091 90.2557 538.01 88.9603C538.01 85.6897 536.702 83.989 534.217 83.989ZM551.811 84.3815H547.363V95.2399H545.401V84.3815H540.954V82.6808H551.811V84.3815ZM567.508 95.2399H565.546V82.6808H567.508V95.2399ZM553.904 95.2399V82.6808H555.866V87.5213H558.678C560.018 87.4055 561.357 87.7517 562.472 88.5024C562.874 88.8473 563.189 89.2812 563.393 89.7695C563.598 90.2578 563.685 90.787 563.649 91.3152C563.67 91.8636 563.562 92.4092 563.335 92.9088C563.108 93.4084 562.768 93.8482 562.341 94.1933C561.233 94.9105 559.933 95.2754 558.613 95.2399H553.904ZM555.866 89.1566V93.6046H557.828C558.859 93.686 559.894 93.506 560.837 93.0813C561.095 92.8818 561.301 92.6231 561.437 92.327C561.574 92.0309 561.637 91.7063 561.622 91.3806C561.646 91.0817 561.607 90.7811 561.505 90.4989C561.404 90.2168 561.243 89.9598 561.033 89.7453C560.069 89.2386 558.975 89.0335 557.894 89.1566H555.866Z" fill="#989999"/>
<defs>
<linearGradient id="paint0_linear" x1="0.838672" y1="43.63" x2="88.4815" y2="43.63" gradientUnits="userSpaceOnUse">
<stop stop-color="#0099CB"/>
<stop offset="0.01" stop-color="#00A3D4"/>
<stop offset="0.9" stop-color="white"/>
<stop offset="1" stop-color="white"/>
</linearGradient>
</defs>
</svg>
