<svg width="30" height="37" viewBox="0 0 30 37" fill="none" xmlns="http://www.w3.org/2000/svg">
<path fill-rule="evenodd" clip-rule="evenodd" d="M7.05 27.5H5.25V29.75H7.05C7.725 29.75 8.175 29.3 8.175 28.625C8.175 27.95 7.725 27.5 7.05 27.5ZM18.75 0.5H0.75V36.5H30V11.75L18.75 0.5ZM10.2 28.85C10.2 30.65 8.85 32 7.05 32H5.25V34.25H3V25.25H7.05C8.85 25.25 10.2 26.6 10.2 28.4V28.85ZM19.425 29.975C19.425 32.225 17.625 34.25 15.15 34.25H12V25.25H15.15C17.4 25.25 19.425 27.05 19.425 29.525V29.975ZM27.75 27.5H23.25V29.75H26.625V32H23.25V34.25H21V25.25H27.75V27.5ZM27.75 23H3V2.75H18.75V11.75H27.75V23ZM15.15 27.5H14.25V32H15.15C16.5 32 17.4 31.1 17.4 29.75C17.4 28.4 16.275 27.5 15.15 27.5Z"/>
</svg>
