<svg width="26" height="26" viewBox="0 0 26 26" fill="none" xmlns="http://www.w3.org/2000/svg">
<g clip-path="url(#clip0)">
<path d="M20.366 24.0736C20.1738 24.0736 19.983 24.0168 19.8192 23.9057L13.6326 19.7092L10.3145 22.0968C10.0542 22.2839 9.71882 22.3311 9.41664 22.223C9.11485 22.1147 8.88565 21.8647 8.80384 21.5548L7.13776 15.2408L1.18466 12.9645C0.809892 12.8212 0.561343 12.4626 0.558616 12.0614C0.555889 11.6601 0.799504 11.2982 1.17246 11.1498L23.8083 2.14278C23.911 2.09914 24.0197 2.07395 24.1293 2.0672C24.1685 2.06486 24.2079 2.06486 24.247 2.06707C24.474 2.08057 24.6969 2.17303 24.871 2.34367C24.889 2.36133 24.9061 2.37938 24.9224 2.39821C25.0665 2.56287 25.1457 2.76363 25.1607 2.96816C25.1643 3.01958 25.164 3.07165 25.1595 3.12373C25.1564 3.16087 25.1511 3.19788 25.1435 3.23463L21.3227 23.282C21.2613 23.6041 21.0421 23.8737 20.7392 23.9992C20.6191 24.0491 20.4923 24.0736 20.366 24.0736ZM14.1758 17.724L19.6866 21.4619L22.6596 5.86283L11.922 16.1951L14.1498 17.7064C14.1588 17.712 14.1674 17.718 14.1758 17.724ZM9.58832 16.8927L10.3262 19.6886L11.9159 18.5447L9.83427 17.1326C9.73752 17.0671 9.65467 16.9856 9.58832 16.8927ZM4.21231 12.0366L8.29999 13.5994C8.59282 13.7113 8.81384 13.9575 8.89383 14.2606L9.41223 16.2253C9.43599 15.9987 9.53871 15.7854 9.70558 15.6248L19.937 5.77972L4.21231 12.0366Z" fill="#C97B00"/>
</g>
<defs>
<clipPath id="clip0">
<rect width="24.6047" height="24.6047" fill="white" transform="translate(0.558594 0.767578)"/>
</clipPath>
</defs>
</svg>
