<svg width="88" height="110" viewBox="0 0 88 110" fill="none" xmlns="http://www.w3.org/2000/svg">
    <rect class="title-decor-anim-1" width="44" height="20" transform="matrix(1 8.74228e-08 8.74228e-08 -1 0 110)"
          fill="#C97B00"/>
    <rect class="title-decor-anim-2" width="64" height="20" transform="matrix(1 8.74228e-08 8.74228e-08 -1 0 20)"
          fill="#C97B00"/>
    <rect class="title-decor-anim-3" width="88" height="20" transform="matrix(1 8.74228e-08 8.74228e-08 -1 0 65)"
          fill="#C97B00"/>
</svg>