<svg width="34" height="30" viewBox="0 0 34 30" fill="none" xmlns="http://www.w3.org/2000/svg">
<path d="M7.35639 29.9059C7.34846 29.9059 7.34079 29.9059 7.33286 29.9059L4.16809 29.8859C1.86987 29.8716 0 27.9873 0 25.6849V22.5513C0 21.5696 0.381694 20.6464 1.0745 19.952L19.9182 1.07703C20.6107 0.382599 21.5324 0 22.5134 0H29.292C31.6048 0 33.4864 1.88483 33.4864 4.2015V10.9915C33.4864 11.9731 33.1047 12.8964 32.4119 13.5908L22.7322 23.2866C22.3231 23.6969 21.659 23.6969 21.2494 23.2866C20.8397 22.8763 20.8397 22.2116 21.2494 21.8013L30.9286 12.106C31.2253 11.808 31.3892 11.4121 31.3892 10.9915V4.2015C31.3892 3.04293 30.4484 2.10075 29.2919 2.10075H22.5133C22.093 2.10075 21.6982 2.26434 21.4015 2.5618L2.55776 21.4368C2.26107 21.7347 2.09722 22.1307 2.09722 22.5513V25.6849C2.09722 26.8358 3.03219 27.778 4.18114 27.7851L7.34643 27.8052C7.76089 27.8267 8.17306 27.6395 8.46851 27.3441L22.7087 13.08L20.7372 11.1049L8.34379 23.5191C7.9347 23.9294 7.2706 23.9294 6.86099 23.5191C6.45138 23.1087 6.45138 22.4441 6.86099 22.0338L19.2541 9.61952C20.0718 8.80042 21.4023 8.79944 22.22 9.61952L24.1918 11.5946C24.5878 11.9916 24.8059 12.5188 24.8059 13.0799C24.8059 13.641 24.5878 14.1682 24.1915 14.5652L9.95131 28.8294C9.26748 29.5146 8.32282 29.9059 7.35639 29.9059Z" fill="#C97B00"/>
</svg>
