<svg width="147" height="149" viewBox="0 0 147 149" fill="none" xmlns="http://www.w3.org/2000/svg">
<path d="M131.67 49.1689C131.85 49.053 132.09 49.1051 132.206 49.2853L134.094 52.2217C134.21 52.4019 134.158 52.6419 133.977 52.7578C133.797 52.8736 133.557 52.8215 133.441 52.6413L131.763 50.0312L129.153 51.7097C128.973 51.8256 128.733 51.7734 128.617 51.5932C128.501 51.4131 128.553 51.1731 128.733 51.0572L131.67 49.1689ZM1.01983 86.5215C28.9923 111.936 56.7284 125.148 79.8615 120.822C102.947 116.505 121.67 94.6665 131.5 49.4128L132.258 49.5775C122.407 94.929 103.562 117.18 80.0041 121.585C56.4938 125.981 28.5109 112.547 0.49814 87.0957L1.01983 86.5215Z" fill="#C97B00"/>
</svg>
