<svg width="239" height="127" viewBox="0 0 239 127" fill="none" xmlns="http://www.w3.org/2000/svg">
<path d="M19.2872 32C25.307 32 28.4828 28.208 28.4828 23.468C28.4828 19.4864 25.781 16.2158 22.4156 15.6944C25.4018 15.0782 27.8666 12.4238 27.8666 8.4422C27.8666 4.2236 24.7856 0.384194 18.7658 0.384194H2.1284V32H19.2872ZM17.2964 13.04H8.8592V6.167H17.2964C19.5716 6.167 20.9936 7.6364 20.9936 9.6272C20.9936 11.618 19.5716 13.04 17.2964 13.04ZM17.5334 26.1698H8.8592V18.8228H17.5334C20.1878 18.8228 21.6098 20.5292 21.6098 22.52C21.6098 24.7952 20.093 26.1698 17.5334 26.1698ZM55.9315 32V26.075H40.2895V18.9176H55.5997V12.9926H40.2895V6.30919H55.9315V0.384194H33.5587V32H55.9315ZM90.6761 32L78.4943 0.384194H70.0571L57.8278 32H65.5067L67.4975 26.6438H81.0539L82.9973 32H90.6761ZM79.2053 20.7188H69.3461L74.2757 7.115L79.2053 20.7188ZM106.289 32.5688C115.911 32.5688 120.557 27.2126 120.557 19.3442V0.384194H113.684V19.1546C113.684 23.5628 111.171 26.5964 106.289 26.5964C101.407 26.5964 98.8474 23.5628 98.8474 19.1546V0.384194H92.0218V19.3916C92.0218 27.1652 96.667 32.5688 106.289 32.5688ZM140.863 32V6.30919H150.058V0.384194H124.841V6.30919H134.084V32H140.863ZM169.92 32V19.0598L182.007 0.384194H174.329L166.555 13.0874L158.687 0.384194H151.008L163.19 19.0598V32H169.92ZM14.5946 79C24.5012 79 31.3742 72.7432 31.3742 63.2158C31.3742 53.6884 24.5012 47.3842 14.5946 47.3842H2.1284V79H14.5946ZM14.5946 73.075H8.8592V53.3092H14.5946C21.0884 53.3092 24.5012 57.6226 24.5012 63.2158C24.5012 68.572 20.8514 73.075 14.5946 73.075ZM42.8817 79V47.3842H36.1509V79H42.8817ZM60.3919 79.5688C68.9239 79.5688 73.0477 75.208 73.0477 69.4252C73.0477 57.6226 54.8935 60.988 54.8935 55.9636C54.8935 54.0676 56.5051 52.7878 59.3965 52.7878C62.6197 52.7878 66.0325 53.878 68.5921 56.248L72.3367 51.3184C69.2083 48.427 65.0371 46.9102 60.0127 46.9102C52.5709 46.9102 48.0205 51.271 48.0205 56.5324C48.0205 68.4298 66.2221 64.5904 66.2221 70.1836C66.2221 71.9848 64.4209 73.6912 60.7237 73.6912C56.3629 73.6912 52.9027 71.7478 50.6749 69.4252L47.0251 74.5444C49.9639 77.5306 54.3247 79.5688 60.3919 79.5688ZM92.8898 79.5688C99.8576 79.5688 103.839 75.7294 106.114 71.7952L100.332 68.9986C99.0044 71.6056 96.1604 73.5964 92.8898 73.5964C87.1544 73.5964 82.9832 69.1882 82.9832 63.2158C82.9832 57.2434 87.1544 52.8352 92.8898 52.8352C96.1604 52.8352 99.0044 54.8734 100.332 57.433L106.114 54.589C103.887 50.6548 99.8576 46.8628 92.8898 46.8628C83.4098 46.8628 76.0628 53.4988 76.0628 63.2158C76.0628 72.9328 83.4098 79.5688 92.8898 79.5688ZM125.099 79.5688C134.674 79.5688 141.642 72.7432 141.642 63.2158C141.642 53.6884 134.674 46.8628 125.099 46.8628C115.572 46.8628 108.604 53.6884 108.604 63.2158C108.604 72.7432 115.572 79.5688 125.099 79.5688ZM125.099 73.5964C119.269 73.5964 115.524 69.0934 115.524 63.2158C115.524 57.2908 119.269 52.8352 125.099 52.8352C130.929 52.8352 134.721 57.2908 134.721 63.2158C134.721 69.0934 130.929 73.5964 125.099 73.5964ZM160.633 79.5688C170.255 79.5688 174.9 74.2126 174.9 66.3442V47.3842H168.027V66.1546C168.027 70.5628 165.515 73.5964 160.633 73.5964C155.75 73.5964 153.191 70.5628 153.191 66.1546V47.3842H146.365V66.3916C146.365 74.1652 151.01 79.5688 160.633 79.5688ZM209.426 79V47.3842H202.695V67.2448L188.049 47.3842H181.128V79H187.859V58.381L202.932 79H209.426ZM229.738 79V53.3092H238.933V47.3842H213.716V53.3092H222.959V79H229.738ZM17.4386 126.569C24.4064 126.569 28.388 122.729 30.6632 118.795L24.8804 115.999C23.5532 118.606 20.7092 120.596 17.4386 120.596C11.7032 120.596 7.532 116.188 7.532 110.216C7.532 104.243 11.7032 99.8352 17.4386 99.8352C20.7092 99.8352 23.5532 101.873 24.8804 104.433L30.6632 101.589C28.4354 97.6548 24.4064 93.8628 17.4386 93.8628C7.9586 93.8628 0.6116 100.499 0.6116 110.216C0.6116 119.933 7.9586 126.569 17.4386 126.569ZM57.0424 126V120.075H41.4004V112.918H56.7106V106.993H41.4004V100.309H57.0424V94.3842H34.6696V126H57.0424ZM90.602 126V94.3842H83.8712V114.245L69.2246 94.3842H62.3042V126H69.035V105.381L84.1082 126H90.602ZM110.914 126V100.309H120.109V94.3842H94.8924V100.309H104.135V126H110.914ZM146.797 126V120.075H131.155V112.918H146.465V106.993H131.155V100.309H146.797V94.3842H124.424V126H146.797ZM177.655 126L170.545 113.96C173.957 113.155 177.465 110.168 177.465 104.575C177.465 98.6976 173.436 94.3842 166.847 94.3842H152.059V126H158.789V114.766H163.719L169.928 126H177.655ZM165.852 108.841H158.789V100.309H165.852C168.554 100.309 170.592 101.921 170.592 104.575C170.592 107.23 168.554 108.841 165.852 108.841Z" fill="#2A2A33"/>
</svg>
