<svg width="98" height="98" viewBox="0 0 98 98" fill="none" xmlns="http://www.w3.org/2000/svg">
<path d="M89.1953 50.9141H96.0859C97.1387 50.9141 98 50.0527 98 49C98 47.9473 97.1387 47.0859 96.0859 47.0859H89.1953C88.1426 47.0859 87.2812 47.9473 87.2812 49C87.2812 50.0527 88.1426 50.9141 89.1953 50.9141Z" fill="#A9ADB7"/>
<path d="M1.91406 50.9141H8.80469C9.85742 50.9141 10.7188 50.0527 10.7188 49C10.7188 47.9473 9.85742 47.0859 8.80469 47.0859H1.91406C0.861328 47.0859 0 47.9473 0 49C0 50.0527 0.861328 50.9141 1.91406 50.9141Z" fill="#A9ADB7"/>
<path d="M14.3528 17.0556L19.2337 21.9364C19.9802 22.6829 21.186 22.6829 21.9325 21.9364C22.679 21.1899 22.679 19.9841 21.9325 19.2376L17.0517 14.3567C16.3052 13.6103 15.0993 13.6103 14.3528 14.3567C13.6063 15.1032 13.6063 16.3091 14.3528 17.0556Z" fill="#A9ADB7"/>
<path d="M47.0859 1.91406V8.80469C47.0859 9.85742 47.9473 10.7188 49 10.7188C50.0527 10.7188 50.9141 9.85742 50.9141 8.80469V1.91406C50.9141 0.861328 50.0527 0 49 0C47.9473 0 47.0859 0.861328 47.0859 1.91406Z" fill="#A9ADB7"/>
<path d="M80.9446 14.3567L76.0638 19.2376C75.3173 19.9841 75.3173 21.1899 76.0638 21.9364C76.8103 22.6829 78.0161 22.6829 78.7626 21.9364L83.6435 17.0556C84.3899 16.3091 84.3899 15.1032 83.6435 14.3567C82.897 13.6103 81.6911 13.6103 80.9446 14.3567Z" fill="#A9ADB7"/>
<path d="M49 98C50.0571 98 50.9141 97.143 50.9141 96.0859C50.9141 95.0288 50.0571 94.1719 49 94.1719C47.9429 94.1719 47.0859 95.0288 47.0859 96.0859C47.0859 97.143 47.9429 98 49 98Z" fill="#C97B00"/>
<path d="M21.2461 46.1289V60.4844C21.2461 70.9734 29.6871 77.0027 32.7305 78.8211V96.0859C32.7305 97.1387 33.5918 98 34.6445 98H40.3867C41.4395 98 42.3008 97.1387 42.3008 96.0859C42.3008 95.0332 41.4395 94.1719 40.3867 94.1719H36.5586V77.7109C36.5586 76.9836 36.1566 76.3328 35.5059 76.0074C35.4102 75.95 25.0742 70.6289 25.0742 60.4844V46.1289C25.0742 44.0234 26.7969 42.3008 28.9023 42.3008H49.7656C48.8852 46.6648 45.0188 49.957 40.3867 49.957H34.6445C33.5918 49.957 32.7305 50.8184 32.7305 51.8711C32.7305 52.9238 33.5918 53.7852 34.6445 53.7852C43.0856 53.7852 49.957 60.6566 49.957 69.0977C49.957 70.1504 50.8184 71.0117 51.8711 71.0117C52.9238 71.0117 53.7852 70.1504 53.7852 69.0977C53.7852 63.8148 58.0727 59.5273 63.3555 59.5273C64.4082 59.5273 65.2695 58.666 65.2695 57.6133C65.2695 56.5605 64.4082 55.6992 63.3555 55.6992C58.7426 55.6992 54.6656 58.0344 52.2539 61.5945C50.7418 58.0344 48.177 55.0293 44.9613 52.9812C48.2918 51.7754 51.0098 49.268 52.5027 46.0906C53.8617 47.2965 55.6418 48.043 57.6133 48.043C58.1109 48.043 58.6086 48.043 59.068 48.043C59.9676 48.043 60.8481 48.0238 61.652 47.8707C62.4367 51.2586 65.4801 53.7852 69.1168 53.7852C70.5141 53.7852 71.8156 53.4023 72.9449 52.7516V60.4844C72.9449 70.6098 62.6281 75.95 62.5133 76.0074C61.8625 76.3328 61.4606 77.0027 61.4606 77.7109V94.1719H57.6324C56.5797 94.1719 55.7184 95.0332 55.7184 96.0859C55.7184 97.1387 56.5797 98 57.6324 98H63.3746C64.4274 98 65.2887 97.1387 65.2887 96.0859V78.8211C68.332 76.9836 76.7731 70.9734 76.7731 60.4844C76.7731 56.6754 76.7731 42.4156 76.7731 36.3672C76.7731 32.1371 73.3469 28.7109 69.1168 28.7109C67.7004 28.7109 66.3797 29.0938 65.2313 29.7637C64.8102 25.9355 61.5563 22.9688 57.6324 22.9688C56.216 22.9688 54.8953 23.3516 53.7469 24.0215C53.3258 20.1934 50.0719 17.2266 46.1481 17.2266C42.2242 17.2266 38.9703 20.2125 38.5492 24.0215C37.4199 23.3516 36.0801 22.9688 34.6637 22.9688C30.4336 22.9688 27.0074 26.3949 27.0074 30.625V38.7215C23.6961 39.5637 21.2461 42.5688 21.2461 46.1289ZM69.0977 32.5391C71.2031 32.5391 72.9258 34.2617 72.9258 36.3672V46.1289C72.9258 48.2344 71.2031 49.957 69.0977 49.957C66.9922 49.957 65.2695 48.2344 65.2695 46.1289V36.3672C65.2695 34.2617 66.9922 32.5391 69.0977 32.5391ZM57.6133 26.7969C59.7188 26.7969 61.4414 28.5195 61.4414 30.625V43.2578C61.4414 43.7938 61.3266 43.9469 61.3266 43.9469C61.0395 44.234 59.3742 44.2148 58.3789 44.2148C58.1301 44.2148 57.8621 44.2148 57.6133 44.2148C55.5078 44.2148 53.7852 42.4922 53.7852 40.3867V30.625C53.7852 28.5195 55.5078 26.7969 57.6133 26.7969ZM42.3008 24.8828C42.3008 22.7773 44.0234 21.0547 46.1289 21.0547C48.2344 21.0547 49.957 22.7773 49.957 24.8828V38.4727H42.3008V24.8828ZM34.6445 26.7969C36.75 26.7969 38.4727 28.5195 38.4727 30.625V38.4727H30.8164V30.625C30.8164 28.5195 32.5391 26.7969 34.6445 26.7969Z" fill="#C97B00"/>
</svg>
