<svg width="253" height="32" viewBox="0 0 253 32" fill="none" xmlns="http://www.w3.org/2000/svg">
<path d="M7.17731 0L9.6445 0.758294L2.54196 32L0 31.2417L7.17731 0Z" fill="#C97B00"/>
<path d="M21.0093 0L23.4765 0.758294L16.374 32L13.832 31.2417L21.0093 0Z" fill="#C97B00"/>
<path d="M34.8394 0L37.3066 0.758294L30.2041 32L27.6621 31.2417L34.8394 0Z" fill="#C97B00"/>
<path d="M50 27.6063V9.75111H52.5606V11.8273H52.699C52.9759 11.1352 53.368 10.547 53.8756 10.0625C54.3831 9.57809 55.1328 9.33587 56.1248 9.33587C57.1629 9.33587 57.9357 9.60116 58.4432 10.1317C58.9507 10.6393 59.2621 11.3082 59.3775 12.1387H59.4813C59.8042 11.3313 60.2656 10.6623 60.8654 10.1317C61.4652 9.60116 62.2957 9.33587 63.3568 9.33587C64.8102 9.33587 65.779 9.84338 66.2635 10.8584C66.771 11.8734 67.0248 13.3268 67.0248 15.2184V27.6063H64.4641V15.6683C64.4641 14.1457 64.3026 13.0961 63.9797 12.5194C63.6798 11.9196 63.1146 11.6197 62.2841 11.6197C61.5459 11.6197 60.9461 11.8619 60.4848 12.3463C60.0234 12.8077 59.7927 13.5229 59.7927 14.4917V27.6063H57.2321V15.6683C57.2321 14.1457 57.0706 13.0961 56.7476 12.5194C56.4477 11.9196 55.8941 11.6197 55.0867 11.6197C54.3485 11.6197 53.7371 11.8619 53.2527 12.3463C52.7913 12.8077 52.5606 13.5229 52.5606 14.4917V27.6063H50Z" fill="#2A2A33"/>
<path d="M79.5722 28.0216C78.2803 28.0216 77.1154 27.8024 76.0773 27.3641C75.0622 26.9258 74.1856 26.303 73.4474 25.4956C72.7323 24.6651 72.1786 23.6847 71.7865 22.5543C71.3943 21.4008 71.1982 20.1205 71.1982 18.7133C71.1982 17.2831 71.3943 15.9912 71.7865 14.8378C72.2017 13.6843 72.7669 12.7039 73.482 11.8965C74.1972 11.066 75.0507 10.4316 76.0427 9.99333C77.0577 9.55503 78.1765 9.33587 79.3992 9.33587C80.5988 9.33587 81.683 9.55503 82.6519 9.99333C83.6438 10.4316 84.4858 11.043 85.1779 11.8273C85.87 12.5886 86.4006 13.4998 86.7697 14.561C87.1388 15.6221 87.3233 16.7871 87.3233 18.0559V19.3708H74.1049V20.2013C74.1049 20.9856 74.2318 21.7123 74.4855 22.3813C74.7393 23.0503 75.0969 23.627 75.5582 24.1114C76.0427 24.5959 76.6194 24.9765 77.2884 25.2533C77.9804 25.5071 78.7417 25.634 79.5722 25.634C80.7718 25.634 81.8099 25.3571 82.6865 24.8035C83.5631 24.2498 84.2321 23.4886 84.6935 22.5197L86.7351 23.9038C86.2045 25.1034 85.3163 26.0953 84.0706 26.8797C82.848 27.641 81.3485 28.0216 79.5722 28.0216ZM79.3992 11.6197C78.6379 11.6197 77.9343 11.7581 77.2884 12.0349C76.6425 12.3117 76.0773 12.6924 75.5928 13.1768C75.1315 13.6613 74.7624 14.238 74.4855 14.907C74.2318 15.5529 74.1049 16.268 74.1049 17.0524V17.2946H84.3474V16.914C84.3474 16.1296 84.2206 15.4145 83.9668 14.7686C83.7361 14.1226 83.4016 13.569 82.9633 13.1076C82.5481 12.6232 82.029 12.2541 81.4062 12.0003C80.8064 11.7466 80.1374 11.6197 79.3992 11.6197Z" fill="#2A2A33"/>
<path d="M99.9295 27.6063C98.2726 27.6063 96.9295 26.2632 96.9295 24.6063V12.1041H90.9777V9.75111H95.4069C96.0067 9.75111 96.422 9.63576 96.6526 9.40508C96.9064 9.15132 97.0333 8.72455 97.0333 8.12476V3.45333H99.6977V9.75111H107.829V12.1041H99.6977V24.2533C99.6977 24.8056 100.145 25.2533 100.698 25.2533H107.829V27.6063H99.9295Z" fill="#2A2A33"/>
<path d="M127.505 27.6063C126.421 27.6063 125.648 27.3295 125.187 26.7759C124.725 26.2222 124.437 25.5302 124.322 24.6997H124.149C123.756 25.7378 123.122 26.5567 122.245 27.1565C121.392 27.7332 120.238 28.0216 118.785 28.0216C116.917 28.0216 115.429 27.5371 114.321 26.5683C113.214 25.5994 112.66 24.2729 112.66 22.5889C112.66 20.9279 113.26 19.6476 114.46 18.7479C115.682 17.8482 117.643 17.3984 120.342 17.3984H124.149V15.6336C124.149 14.3187 123.78 13.3383 123.041 12.6924C122.303 12.0234 121.254 11.6889 119.892 11.6889C118.693 11.6889 117.712 11.9311 116.951 12.4156C116.19 12.8769 115.579 13.5113 115.117 14.3187L113.249 12.9346C113.479 12.4732 113.791 12.0234 114.183 11.5851C114.575 11.1468 115.06 10.7661 115.636 10.4432C116.213 10.0971 116.87 9.83185 117.609 9.6473C118.347 9.43968 119.166 9.33587 120.065 9.33587C122.165 9.33587 123.826 9.86645 125.048 10.9276C126.294 11.9888 126.917 13.4652 126.917 15.3568V25.1841H129.408V27.6063H127.505ZM119.27 25.7032C119.985 25.7032 120.631 25.6224 121.207 25.4609C121.807 25.2764 122.326 25.0457 122.765 24.7689C123.203 24.469 123.537 24.123 123.768 23.7308C124.022 23.3156 124.149 22.8772 124.149 22.4159V19.4746H120.342C118.681 19.4746 117.47 19.7053 116.709 20.1667C115.948 20.628 115.567 21.297 115.567 22.1736V22.9003C115.567 23.8231 115.89 24.5267 116.536 25.0111C117.205 25.4725 118.116 25.7032 119.27 25.7032Z" fill="#2A2A33"/>
<path d="M141.714 28.0216C139.845 28.0216 138.23 27.7102 136.869 27.0873C135.531 26.4414 134.389 25.5878 133.443 24.5267L135.312 22.9003C136.166 23.8 137.1 24.4921 138.115 24.9765C139.13 25.4609 140.352 25.7032 141.783 25.7032C143.167 25.7032 144.297 25.4609 145.174 24.9765C146.074 24.469 146.523 23.6847 146.523 22.6235C146.523 22.1621 146.431 21.7815 146.247 21.4816C146.085 21.1586 145.854 20.9049 145.555 20.7203C145.255 20.5358 144.92 20.3974 144.551 20.3051C144.182 20.1897 143.79 20.0975 143.374 20.0283L140.572 19.613C139.949 19.5207 139.268 19.3939 138.53 19.2324C137.815 19.0709 137.157 18.8171 136.558 18.4711C135.958 18.102 135.45 17.6176 135.035 17.0178C134.643 16.418 134.447 15.6336 134.447 14.6648C134.447 13.7651 134.62 12.9923 134.966 12.3463C135.335 11.6774 135.843 11.1237 136.488 10.6854C137.134 10.224 137.896 9.88952 138.772 9.6819C139.649 9.45122 140.606 9.33587 141.644 9.33587C143.259 9.33587 144.655 9.58963 145.831 10.0971C147.031 10.6047 148.057 11.3083 148.911 12.2079L147.112 13.9035C146.904 13.6497 146.639 13.396 146.316 13.1422C146.016 12.8654 145.635 12.6232 145.174 12.4156C144.736 12.1849 144.217 12.0003 143.617 11.8619C143.017 11.7235 142.325 11.6543 141.541 11.6543C140.133 11.6543 139.049 11.8965 138.288 12.381C137.55 12.8654 137.181 13.569 137.181 14.4917C137.181 14.9531 137.261 15.3453 137.423 15.6683C137.607 15.9681 137.85 16.2104 138.149 16.3949C138.449 16.5795 138.784 16.7294 139.153 16.8448C139.545 16.937 139.937 17.0178 140.329 17.087L143.132 17.5022C143.778 17.5945 144.459 17.7214 145.174 17.8829C145.889 18.0443 146.546 18.3096 147.146 18.6787C147.746 19.0248 148.242 19.4977 148.634 20.0975C149.049 20.6972 149.257 21.4816 149.257 22.4505C149.257 24.2268 148.565 25.5994 147.181 26.5683C145.82 27.5371 143.997 28.0216 141.714 28.0216Z" fill="#2A2A33"/>
<path d="M155.264 2H158.033V12.6578H158.171C158.356 12.2195 158.586 11.8042 158.863 11.4121C159.14 10.9968 159.475 10.6393 159.867 10.3394C160.282 10.0395 160.766 9.79724 161.32 9.61269C161.874 9.42814 162.52 9.33587 163.258 9.33587C165.126 9.33587 166.626 9.93566 167.756 11.1352C168.887 12.3117 169.452 13.9842 169.452 16.1527V27.6063H166.684V16.6371C166.684 14.9993 166.326 13.7881 165.611 13.0038C164.896 12.1964 163.846 11.7927 162.462 11.7927C161.908 11.7927 161.366 11.8619 160.836 12.0003C160.305 12.1387 159.832 12.3463 159.417 12.6232C159.002 12.9 158.667 13.2576 158.413 13.6959C158.16 14.1342 158.033 14.6417 158.033 15.2184V27.6063H155.264V2Z" fill="#2A2A33"/>
<path d="M189.75 27.6063C188.666 27.6063 187.893 27.3295 187.432 26.7759C186.971 26.2222 186.682 25.5302 186.567 24.6997H186.394C186.002 25.7378 185.367 26.5567 184.491 27.1565C183.637 27.7332 182.484 28.0216 181.03 28.0216C179.162 28.0216 177.674 27.5371 176.567 26.5683C175.459 25.5994 174.906 24.2729 174.906 22.5889C174.906 20.9279 175.505 19.6476 176.705 18.7479C177.928 17.8482 179.888 17.3984 182.587 17.3984H186.394V15.6336C186.394 14.3187 186.025 13.3383 185.286 12.6924C184.548 12.0234 183.499 11.6889 182.138 11.6889C180.938 11.6889 179.958 11.9311 179.196 12.4156C178.435 12.8769 177.824 13.5113 177.362 14.3187L175.494 12.9346C175.725 12.4732 176.036 12.0234 176.428 11.5851C176.82 11.1468 177.305 10.7661 177.881 10.4432C178.458 10.0971 179.116 9.83185 179.854 9.6473C180.592 9.43968 181.411 9.33587 182.311 9.33587C184.41 9.33587 186.071 9.86645 187.293 10.9276C188.539 11.9888 189.162 13.4652 189.162 15.3568V25.1841H191.653V27.6063H189.75ZM181.515 25.7032C182.23 25.7032 182.876 25.6224 183.453 25.4609C184.052 25.2764 184.571 25.0457 185.01 24.7689C185.448 24.469 185.782 24.123 186.013 23.7308C186.267 23.3156 186.394 22.8772 186.394 22.4159V19.4746H182.587C180.926 19.4746 179.715 19.7053 178.954 20.1667C178.193 20.628 177.812 21.297 177.812 22.1736V22.9003C177.812 23.8231 178.135 24.5267 178.781 25.0111C179.45 25.4725 180.361 25.7032 181.515 25.7032Z" fill="#2A2A33"/>
<path d="M196.035 25.2533H201.26V12.1041H196.035V9.75111H204.028V13.1761C204.028 13.1761 206.114 9.75111 210.222 9.75111H212.713V12.5194C207.873 11.6064 207.172 12.8647 205.373 15.3568C204.245 16.9201 204.028 18.607 204.028 20.1064V25.2533H210.949V27.6063H196.035V25.2533Z" fill="#2A2A33"/>
<path d="M217.752 2H220.52V18.1597H220.659L223.773 15.2184L229.725 9.75111H233.116L225.711 16.741L233.981 27.6063H230.555L223.6 18.3327L220.52 21.1356V27.6063H217.752V2Z" fill="#2A2A33"/>
<path d="M245.455 28.0216C243.587 28.0216 241.972 27.7102 240.611 27.0873C239.273 26.4414 238.131 25.5878 237.185 24.5267L239.054 22.9003C239.907 23.8 240.842 24.4921 241.857 24.9765C242.872 25.4609 244.094 25.7032 245.525 25.7032C246.909 25.7032 248.039 25.4609 248.916 24.9765C249.815 24.469 250.265 23.6847 250.265 22.6235C250.265 22.1621 250.173 21.7815 249.988 21.4816C249.827 21.1586 249.596 20.9049 249.296 20.7203C248.997 20.5358 248.662 20.3974 248.293 20.3051C247.924 20.1897 247.532 20.0975 247.116 20.0283L244.314 19.613C243.691 19.5207 243.01 19.3939 242.272 19.2324C241.557 19.0709 240.899 18.8171 240.3 18.4711C239.7 18.102 239.192 17.6176 238.777 17.0178C238.385 16.418 238.189 15.6336 238.189 14.6648C238.189 13.7651 238.362 12.9923 238.708 12.3463C239.077 11.6774 239.584 11.1237 240.23 10.6854C240.876 10.224 241.638 9.88952 242.514 9.6819C243.391 9.45122 244.348 9.33587 245.386 9.33587C247.001 9.33587 248.397 9.58963 249.573 10.0971C250.773 10.6047 251.799 11.3083 252.653 12.2079L250.854 13.9035C250.646 13.6497 250.381 13.396 250.058 13.1422C249.758 12.8654 249.377 12.6232 248.916 12.4156C248.477 12.1849 247.958 12.0003 247.359 11.8619C246.759 11.7235 246.067 11.6543 245.282 11.6543C243.875 11.6543 242.791 11.8965 242.03 12.381C241.292 12.8654 240.922 13.569 240.922 14.4917C240.922 14.9531 241.003 15.3453 241.165 15.6683C241.349 15.9681 241.591 16.2104 241.891 16.3949C242.191 16.5795 242.526 16.7294 242.895 16.8448C243.287 16.937 243.679 17.0178 244.071 17.087L246.874 17.5022C247.52 17.5945 248.201 17.7214 248.916 17.8829C249.631 18.0443 250.288 18.3096 250.888 18.6787C251.488 19.0248 251.984 19.4977 252.376 20.0975C252.791 20.6972 252.999 21.4816 252.999 22.4505C252.999 24.2268 252.307 25.5994 250.923 26.5683C249.562 27.5371 247.739 28.0216 245.455 28.0216Z" fill="#2A2A33"/>
</svg>
