<svg width="78" height="96" viewBox="0 0 78 96" fill="none" xmlns="http://www.w3.org/2000/svg">
<path d="M70.3399 95.9992H7.63862C3.42124 95.9992 0 92.5622 0 88.3518V15.5517C0 11.3413 3.42124 7.92578 7.63862 7.92578H70.3399C74.5573 7.92578 77.9785 11.3413 77.9785 15.5517V88.3518C78 92.5622 74.5788 95.9992 70.3399 95.9992ZM7.63862 12.0932C5.72359 12.0932 4.15283 13.6398 4.15283 15.5731V88.3733C4.15283 90.2852 5.72359 91.8533 7.63862 91.8533H70.3399C72.2549 91.8533 73.8257 90.2852 73.8257 88.3733V15.5517C73.8257 13.6398 72.2549 12.0717 70.3399 12.0717H7.63862V12.0932Z" fill="#A9ADB7"/>
<path d="M29.8804 83.5635C28.9454 83.5635 28.2442 82.9217 28.2442 82.0466V70.7869H24.2704C24.0561 73.2956 23.8808 75.7847 23.6665 78.2934C23.4328 81.4438 22.2446 83.4662 19.5759 83.4662C18.4461 83.4662 17.2773 83.2523 17.2773 82.066C17.2773 81.0937 17.9786 80.5881 18.6799 80.5881C18.9526 80.5881 19.011 80.6464 19.2642 80.6464C20.0434 80.6464 20.394 79.9269 20.5304 78.4101L21.3096 69.5618C21.407 68.6478 22.0303 68.0449 22.7705 68.0449H30.0558C31.0882 68.0449 31.5362 68.92 31.5362 69.5812V82.0272C31.5167 82.9217 30.7765 83.5635 29.8804 83.5635Z" fill="#C97B00"/>
<path d="M38.2178 77.1644V78.5646C38.2178 79.9259 39.1528 80.801 41.0618 80.801C42.1916 80.801 43.0097 80.4898 44.0031 80.0426C44.1005 79.9842 44.3148 79.887 44.6654 79.887C45.6978 79.887 46.1459 80.6454 46.1459 81.2483C46.1459 83.0568 42.5617 83.5819 40.7696 83.5819C37.049 83.5819 34.9258 81.3455 34.9258 78.409V73.0417C34.9258 70.0664 37.0101 67.8105 40.9254 67.8105C44.5875 67.8105 46.4186 69.8136 46.4186 72.8278C46.4186 75.667 44.7433 77.3783 40.9059 77.3783C40.0683 77.3783 39.1917 77.32 38.2178 77.1644ZM40.8864 70.5136C39.1917 70.5136 38.2178 71.4276 38.2178 72.8667V74.6558C39.2502 74.7725 40.4384 74.8308 40.8864 74.8308C42.6201 74.8308 43.185 74.0141 43.185 72.75C43.185 71.1554 42.3669 70.5136 40.8864 70.5136Z" fill="#C97B00"/>
<path d="M55.6128 82.0447C55.6128 82.9198 54.8921 83.581 53.9765 83.581C53.0415 83.581 52.3403 82.9198 52.3403 82.0447V70.999H49.6521C48.7756 70.999 48.1133 70.3572 48.1133 69.5405C48.1133 68.6848 48.7756 68.0625 49.6521 68.0625H58.3204C59.1775 68.0625 59.8593 68.7042 59.8593 69.5405C59.8593 70.3572 59.158 70.999 58.3204 70.999H55.6128V82.0447Z" fill="#C97B00"/>
<path d="M25.4421 31.8842L19.3646 35.7735C18.6828 36.2208 17.8842 36.7653 17.2024 36.7653C16.3648 36.7653 15.4688 35.968 15.4688 35.0929C15.4688 34.4123 15.7609 33.7705 16.3648 33.3622L26.085 27.1586C26.4745 26.9058 26.8252 26.8086 27.2732 26.8086C28.4614 26.8086 29.3964 27.742 29.3964 28.9283V60.5098C29.3964 61.5405 28.5004 62.474 27.429 62.474C26.3577 62.474 25.4616 61.5405 25.4616 60.5098V31.8842H25.4421Z" fill="#C97B00"/>
<path d="M59.0057 37.6014V52.2838C59.0057 58.0011 55.4994 62.5322 49.0907 62.5322C42.6821 62.5322 39.1758 58.0011 39.1758 52.2838V37.6014C39.1758 31.3979 42.1951 26.3223 49.0907 26.3223C55.9864 26.3029 59.0057 31.3785 59.0057 37.6014ZM43.0716 37.1931V52.2643C43.0716 56.212 45.1949 58.8568 49.0907 58.8568C52.9866 58.8568 55.1098 56.1926 55.1098 52.2643V37.1931C55.1098 32.9537 53.3762 29.9005 49.0907 29.9005C44.8053 29.9005 43.0716 32.9731 43.0716 37.1931Z" fill="#C97B00"/>
<path d="M15.709 19.2473C15.4723 19.2473 15.3002 19.2258 15.2571 19.2258L15.8166 15.4021C15.8166 15.4021 15.7951 15.4021 15.7305 15.4021C15.7736 15.4021 16.1609 15.4021 16.5697 15.0154C17.0646 14.5429 17.9038 13.211 17.9038 9.68807C17.9038 5.58514 16.2685 3.88812 15.3863 3.88812C14.9989 3.88812 14.5471 4.23182 14.1813 4.85478C13.5358 5.92884 13.17 7.64735 13.17 9.68807C13.17 10.7621 12.3093 11.6214 11.2334 11.6214C10.1576 11.6214 9.29688 10.7621 9.29688 9.68807C9.29688 6.85254 9.83481 4.55404 10.8676 2.83553C11.965 1.0311 13.6003 0 15.3863 0C18.5708 0 21.7769 3.3296 21.7769 9.66659C21.7769 13.6192 20.8516 16.4117 19.0442 17.9799C17.7531 19.0754 16.4191 19.2473 15.709 19.2473Z" fill="#A9ADB7"/>
<path d="M61.9903 19.2473C61.7536 19.2473 61.5814 19.2258 61.5384 19.2258L62.0978 15.4021C62.0978 15.4021 62.0763 15.4021 62.0118 15.4021C62.0548 15.4021 62.4421 15.4021 62.851 15.0154C63.3458 14.5429 64.185 13.211 64.185 9.68808C64.185 5.58514 62.5497 3.88812 61.6675 3.88812C61.2802 3.88812 60.8283 4.23182 60.4625 4.85478C59.817 5.92885 59.4512 7.64735 59.4512 9.68808C59.4512 10.7621 58.5905 11.6214 57.5147 11.6214C56.4388 11.6214 55.5781 10.7621 55.5781 9.68808C55.5781 6.85254 56.1161 4.55404 57.1489 2.83554C58.2463 1.03111 59.8816 0.0214844 61.6675 0.0214844C64.8521 0.0214844 68.0581 3.35109 68.0581 9.68808C68.0581 13.6406 67.1329 16.4332 65.3254 18.0013C64.0344 19.0754 62.6788 19.2473 61.9903 19.2473Z" fill="#A9ADB7"/>
<path d="M38.8575 19.2473C38.6208 19.2473 38.4486 19.2258 38.4056 19.2258L38.965 15.4021C38.965 15.4021 38.9435 15.4021 38.879 15.4021C38.922 15.4021 39.3093 15.4021 39.7181 15.0154C40.213 14.5429 41.0522 13.211 41.0522 9.68807C41.0522 5.58514 39.4169 3.88812 38.5347 3.88812C38.1474 3.88812 37.6955 4.23182 37.3297 4.85478C36.6842 5.92884 36.3184 7.64735 36.3184 9.68807C36.3184 10.7621 35.4577 11.6214 34.3819 11.6214C33.306 11.6214 32.4453 10.7621 32.4453 9.68807C32.4453 6.85254 32.9832 4.55404 34.0161 2.83553C35.0919 1.0311 36.7272 0 38.5132 0C41.6977 0 44.9038 3.3296 44.9038 9.66659C44.9038 13.6192 43.9786 16.4117 42.1711 17.9799C40.8801 19.0754 39.546 19.2473 38.8575 19.2473Z" fill="#A9ADB7"/>
</svg>
