<svg width="110" height="110" viewBox="0 0 110 110" fill="none" xmlns="http://www.w3.org/2000/svg">
<path d="M106.563 89.3748H103.125V42.9685C103.122 40.2344 102.035 37.613 100.101 35.6797C98.168 33.7463 95.5467 32.6589 92.8125 32.656H87.1621C86.8719 32.1309 86.4452 31.6939 85.9271 31.3913C85.409 31.0888 84.8187 30.9319 84.2188 30.9373H82.5C82.4977 28.6588 81.5916 26.4742 79.9805 24.8631C78.3693 23.2519 76.1848 22.3458 73.9063 22.3435H67.0313C64.7528 22.3458 62.5682 23.2519 60.9571 24.8631C59.3459 26.4742 58.4398 28.6588 58.4375 30.9373H56.7188C56.116 30.9383 55.5241 31.0976 55.0023 31.3992C54.4805 31.7009 54.047 32.1342 53.7453 32.656H49.2916C50.0151 29.3556 50.0355 25.9397 49.3514 22.6309C48.6674 19.322 47.2942 16.1943 45.3214 13.4513C43.3485 10.7083 40.8201 8.41141 37.9008 6.71024C34.9814 5.00907 31.7366 3.94171 28.3775 3.57762C25.0183 3.21354 21.6201 3.56089 18.4041 4.59707C15.1881 5.63325 12.2263 7.33504 9.71155 9.59166C7.19678 11.8483 5.18538 14.6092 3.80827 17.6946C2.43117 20.7801 1.71922 24.1209 1.71876 27.4998C1.71356 32.8942 3.5305 38.1323 6.87501 42.3648V89.3748H3.43751C2.98167 89.3748 2.5445 89.5558 2.22217 89.8782C1.89984 90.2005 1.71876 90.6377 1.71876 91.0935V97.9685C1.72047 99.7913 2.44534 101.539 3.73429 102.828C5.02323 104.117 6.77092 104.842 8.59376 104.844H101.406C103.229 104.842 104.977 104.117 106.266 102.828C107.555 101.539 108.28 99.7913 108.281 97.9685V91.0935C108.281 90.6377 108.1 90.2005 107.778 89.8782C107.456 89.5558 107.018 89.3748 106.563 89.3748ZM82.5 34.3748H84.1822C84.2098 34.4429 84.2222 34.5162 84.2188 34.5896V39.531H82.5V34.3748ZM82.5 44.6873V42.9685H84.2188C86.0815 42.9685 87.6563 41.4925 87.6563 39.7459V36.0935H92.8125C94.6354 36.0952 96.383 36.8201 97.672 38.109C98.9609 39.398 99.6858 41.1457 99.6875 42.9685V89.3748H96.25V63.5935C96.248 61.8099 95.5536 60.0967 94.3132 58.815C93.0728 57.5333 91.3832 56.7832 89.6006 56.7228L77.3438 53.657V52.5613C78.875 51.8912 80.1779 50.7898 81.0936 49.3916C82.0092 47.9933 82.4979 46.3587 82.5 44.6873ZM87.6563 75.6248V70.4685C87.6563 70.0127 87.4752 69.5755 87.1529 69.2532C86.8305 68.9308 86.3934 68.7498 85.9375 68.7498C85.4817 68.7498 85.0445 68.9308 84.7222 69.2532C84.3998 69.5755 84.2188 70.0127 84.2188 70.4685V89.3748H56.7188V70.4685C56.7188 70.0127 56.5377 69.5755 56.2154 69.2532C55.893 68.9308 55.4559 68.7498 55 68.7498C54.5442 68.7498 54.107 68.9308 53.7847 69.2532C53.4623 69.5755 53.2813 70.0127 53.2813 70.4685V75.6248H48.125V63.5935C48.1262 62.6822 48.4888 61.8085 49.1331 61.1641C49.7775 60.5197 50.6512 60.1572 51.5625 60.156C51.703 60.1561 51.843 60.1388 51.9793 60.1045L64.234 57.0408C65.5037 58.9701 68.3891 60.156 70.4688 60.156C71.7385 60.156 73.3348 59.6791 74.6346 58.9099C75.4557 58.4508 76.1623 57.8118 76.7014 57.0408L88.9582 60.1045C89.0945 60.1388 89.2345 60.1561 89.375 60.156C90.2863 60.1572 91.16 60.5197 91.8044 61.1641C92.4488 61.8085 92.8113 62.6822 92.8125 63.5935V75.6248H87.6563ZM92.8125 79.0623V89.3748H87.6563V79.0623H92.8125ZM61.209 92.8123L60.6354 94.531H49.3647L48.791 92.8123H61.209ZM48.125 89.3748V79.0623H53.2813V89.3748H48.125ZM67.0313 54.9998V53.281H73.9063V54.9955C73.8461 55.4402 72.0457 56.7185 70.4688 56.7185C68.8918 56.7185 67.0893 55.438 67.0313 54.9998ZM61.875 30.9373C61.8768 29.5703 62.4207 28.2598 63.3873 27.2933C64.3538 26.3267 65.6643 25.7828 67.0313 25.781H73.9063C75.1084 25.7827 76.2722 26.2039 77.197 26.9718C78.1218 27.7398 78.7497 28.8064 78.9723 29.9877C75.0234 31.8912 66.5307 32.5056 61.875 32.6302V30.9373ZM61.875 36.0656C63.4498 36.0226 65.9442 35.9195 68.6985 35.6552C73.0963 35.2363 76.5617 34.5681 79.0625 33.6593V44.6873C79.0607 46.0542 78.5169 47.3647 77.5503 48.3313C76.5837 49.2979 75.2732 49.8417 73.9063 49.8435H67.0313C66.3063 49.8438 65.5895 49.6908 64.9279 49.3946C64.2662 49.0984 63.6747 48.6657 63.192 48.1248H68.75C69.2059 48.1248 69.643 47.9437 69.9654 47.6214C70.2877 47.299 70.4688 46.8619 70.4688 46.406C70.4688 45.9502 70.2877 45.513 69.9654 45.1907C69.643 44.8683 69.2059 44.6873 68.75 44.6873H61.875V36.0656ZM56.7188 34.4156C56.7188 34.4027 56.7209 34.3898 56.7209 34.3748H58.4375V39.531H56.7188V34.4156ZM56.7188 42.9685H58.4375V44.6873H56.7188V42.9685ZM53.2813 36.0935V46.406C53.2813 46.8619 53.4623 47.299 53.7847 47.6214C54.107 47.9437 54.5442 48.1248 55 48.1248H59.1572C60.0286 50.1068 61.6117 51.69 63.5938 52.5613V53.657L51.3369 56.7228C49.5543 56.7832 47.8648 57.5333 46.6244 58.815C45.3839 60.0967 44.6895 61.8099 44.6875 63.5935V89.3748H10.3125V45.9162C13.9505 48.9771 18.4143 50.8908 23.1397 51.4154C27.8651 51.9401 32.6399 51.0521 36.8608 48.8638L42.2361 51.399C42.5256 51.5355 42.8474 51.5885 43.1653 51.552C43.4832 51.5156 43.7846 51.3911 44.0356 51.1926C44.2866 50.994 44.4772 50.7294 44.5859 50.4284C44.6946 50.1275 44.7172 49.8021 44.651 49.489L43.4586 43.8257C45.5426 41.5803 47.1756 38.9553 48.269 36.0935H53.2813ZM5.15626 27.4998C5.161 24.5257 5.8089 21.5877 7.05552 18.8875C8.30215 16.1873 10.118 13.7886 12.3786 11.8559C14.6392 9.92326 17.291 8.50236 20.1522 7.69065C23.0134 6.87895 26.0163 6.69563 28.955 7.15328C31.8937 7.61094 34.6986 8.69873 37.1775 10.3421C39.6564 11.9854 41.7505 14.1454 43.3163 16.674C44.8821 19.2025 45.8826 22.0398 46.2491 24.9912C46.6155 27.9427 46.3393 30.9385 45.4395 33.7732C45.418 33.8279 45.4001 33.8838 45.3858 33.9408C44.3778 37.0091 42.6606 39.7966 40.3734 42.0769C40.1716 42.2791 40.0234 42.5283 39.942 42.8021C39.8606 43.0759 39.8486 43.3657 39.9072 43.6453L40.5754 46.8164L37.5375 45.3834C37.2883 45.2659 37.0145 45.2103 36.7393 45.2212C36.464 45.232 36.1954 45.309 35.9563 45.4457C32.818 47.223 29.2686 48.1466 25.6621 48.1244C22.0556 48.1023 18.5178 47.1352 15.4016 45.3195C12.2854 43.5038 9.69956 40.9029 7.9019 37.7763C6.10424 34.6496 5.15757 31.1064 5.15626 27.4998ZM104.844 97.9685C104.843 98.8798 104.48 99.7535 103.836 100.398C103.191 101.042 102.318 101.405 101.406 101.406H8.59376C7.68245 101.405 6.8088 101.042 6.1644 100.398C5.52 99.7535 5.15745 98.8798 5.15626 97.9685V92.8123H45.1666L46.4943 96.7933C46.6084 97.1355 46.8273 97.4332 47.12 97.6441C47.4126 97.855 47.7643 97.9685 48.125 97.9685H61.875C62.2358 97.9685 62.5874 97.855 62.88 97.6441C63.1727 97.4332 63.3916 97.1355 63.5057 96.7933L64.8334 92.8123H104.844V97.9685Z" fill="#A9ADB7"/>
<path d="M30.9375 94.5312H13.75C13.2942 94.5312 12.857 94.7123 12.5347 95.0347C12.2123 95.357 12.0312 95.7942 12.0312 96.25C12.0312 96.7058 12.2123 97.143 12.5347 97.4653C12.857 97.7877 13.2942 97.9688 13.75 97.9688H30.9375C31.3933 97.9688 31.8305 97.7877 32.1528 97.4653C32.4752 97.143 32.6562 96.7058 32.6562 96.25C32.6562 95.7942 32.4752 95.357 32.1528 95.0347C31.8305 94.7123 31.3933 94.5312 30.9375 94.5312Z" fill="#C97B00"/>
<path d="M37.8125 94.5312H36.0938C35.6379 94.5312 35.2007 94.7123 34.8784 95.0347C34.5561 95.357 34.375 95.7942 34.375 96.25C34.375 96.7058 34.5561 97.143 34.8784 97.4653C35.2007 97.7877 35.6379 97.9688 36.0938 97.9688H37.8125C38.2683 97.9688 38.7055 97.7877 39.0278 97.4653C39.3502 97.143 39.5312 96.7058 39.5312 96.25C39.5312 95.7942 39.3502 95.357 39.0278 95.0347C38.7055 94.7123 38.2683 94.5312 37.8125 94.5312Z" fill="#C97B00"/>
<path d="M25.7812 44.6886C29.4082 44.6977 32.9436 43.5508 35.8746 41.4144V41.4123C37.4401 40.2767 38.8027 38.885 39.9051 37.2958C40.4774 36.4693 40.7408 35.4679 40.6493 34.4668C40.5578 33.4656 40.1172 32.5285 39.4045 31.8195L35.6941 28.1091C34.8879 27.3043 33.7954 26.8523 32.6562 26.8523C31.5171 26.8523 30.4245 27.3043 29.6183 28.1091L27.0187 30.7087C26.9392 30.7388 26.8597 30.7667 26.776 30.7925C26.1806 30.9718 25.5477 30.9864 24.9447 30.8347C24.3417 30.683 23.791 30.3707 23.3514 29.931C22.9117 29.4913 22.5994 28.9407 22.4477 28.3377C22.296 27.7347 22.3105 27.1018 22.4898 26.5064C22.5156 26.4226 22.5435 26.3431 22.5736 26.2636L25.1732 23.664C25.978 22.8578 26.43 21.7653 26.43 20.6261C26.43 19.487 25.978 18.3944 25.1732 17.5882L21.4629 13.8779C20.7538 13.1652 19.8167 12.7245 18.8156 12.633C17.8145 12.5415 16.813 12.805 15.9865 13.3773C14.3972 14.4794 13.0055 15.8421 11.8701 17.4078H11.8679C10.0076 19.9729 8.89258 23.0023 8.64592 26.1613C8.39926 29.3204 9.03061 32.4862 10.4702 35.3089C11.9098 38.1317 14.1017 40.5016 16.8037 42.1569C19.5056 43.8121 22.6126 44.6883 25.7812 44.6886ZM32.0482 30.539C32.2096 30.3781 32.4283 30.2877 32.6562 30.2877C32.8842 30.2877 33.1028 30.3781 33.2642 30.539L36.9746 34.2494C37.1169 34.3893 37.2057 34.5748 37.2253 34.7735C37.2449 34.9721 37.1942 35.1714 37.082 35.3365C36.4773 36.207 35.7745 37.005 34.9873 37.7148L29.9299 32.6574L32.0482 30.539ZM17.9459 16.2003C18.111 16.0881 18.3102 16.0374 18.5089 16.057C18.7076 16.0767 18.893 16.1654 19.033 16.3078L22.7433 20.0181C22.9043 20.1795 22.9947 20.3982 22.9947 20.6261C22.9947 20.8541 22.9043 21.0727 22.7433 21.2341L20.625 23.3525L15.5676 18.2951C16.2773 17.5079 17.0754 16.805 17.9459 16.2003ZM13.5738 21.1632L18.9707 26.558C18.8256 27.6102 18.9262 28.6818 19.2645 29.6886C19.6029 30.6955 20.1698 31.6103 20.9209 32.3614C21.672 33.1125 22.5869 33.6795 23.5937 34.0178C24.6006 34.3562 25.6721 34.4568 26.7244 34.3117L32.1191 39.7085C29.5252 41.0526 26.5707 41.5361 23.6836 41.0889C20.7966 40.6417 18.1268 39.2872 16.061 37.2214C13.9952 35.1556 12.6406 32.4858 12.1934 29.5987C11.7463 26.7116 12.2297 23.7572 13.5738 21.1632Z" fill="#C97B00"/>
</svg>
