<svg width="110" height="110" viewBox="0 0 110 110" fill="none" xmlns="http://www.w3.org/2000/svg">
<path d="M101.406 12.0312H8.59375C6.77112 12.0336 5.02382 12.7587 3.73503 14.0475C2.44623 15.3363 1.72114 17.0836 1.71875 18.9062V77.3438C1.72114 79.1664 2.44623 80.9137 3.73503 82.2025C5.02382 83.4913 6.77112 84.2164 8.59375 84.2188H44.0215L41.7291 91.0938H36.0938C35.6379 91.0938 35.2007 91.2748 34.8784 91.5972C34.5561 91.9195 34.375 92.3567 34.375 92.8125V96.25H18.9062C18.4504 96.25 18.0132 96.4311 17.6909 96.7534C17.3686 97.0757 17.1875 97.5129 17.1875 97.9688C17.1875 98.4246 17.3686 98.8618 17.6909 99.1841C18.0132 99.5064 18.4504 99.6875 18.9062 99.6875H94.5312C94.9871 99.6875 95.4243 99.5064 95.7466 99.1841C96.0689 98.8618 96.25 98.4246 96.25 97.9688C96.25 97.5129 96.0689 97.0757 95.7466 96.7534C95.4243 96.4311 94.9871 96.25 94.5312 96.25H75.625V92.8125C75.625 92.3567 75.4439 91.9195 75.1216 91.5972C74.7993 91.2748 74.3621 91.0938 73.9062 91.0938H68.2709L65.9785 84.2188H101.406C103.229 84.2164 104.976 83.4913 106.265 82.2025C107.554 80.9137 108.279 79.1664 108.281 77.3438V18.9062C108.279 17.0836 107.554 15.3363 106.265 14.0475C104.976 12.7587 103.229 12.0336 101.406 12.0312ZM72.1875 94.5312V96.25H37.8125V94.5312H72.1875ZM45.3535 91.0938L47.6459 84.2188H62.3541L64.6465 91.0938H45.3535ZM104.844 77.3438C104.843 78.2551 104.48 79.1287 103.836 79.7731C103.191 80.4175 102.318 80.7801 101.406 80.7812H8.59375C7.68244 80.7801 6.80879 80.4175 6.16439 79.7731C5.51999 79.1287 5.15744 78.2551 5.15625 77.3438V73.9062H104.844V77.3438ZM30.8645 55L30.2199 70.4688H28.2176L27.573 55H30.8645ZM27.8094 51.5625L28.9566 44.6875H29.4809L30.6281 51.5625H27.8094ZM29.2188 41.25C27.3561 41.25 25.7812 38.8889 25.7812 36.0938C25.7812 34.3299 27.5816 31.7668 29.2145 29.96C30.6861 31.5928 32.6562 34.2031 32.6562 36.0938C32.6562 38.8889 31.0814 41.25 29.2188 41.25ZM47.923 37.8125L48.125 38.2186V39.5312H41.25V38.2186L41.452 37.8125H47.923ZM43.1707 34.375L44.6875 31.3436L46.2043 34.375H43.1707ZM48.125 42.9688V70.2539C48.1257 70.3258 48.1307 70.3975 48.14 70.4688H41.235C41.2443 70.3975 41.2493 70.3258 41.25 70.2539V42.9688H48.125ZM63.5938 36.0938H68.75V39.5312H67.0312C66.5754 39.5312 66.1382 39.7123 65.8159 40.0347C65.4936 40.357 65.3125 40.7942 65.3125 41.25C65.3125 41.7058 65.4936 42.143 65.8159 42.4653C66.1382 42.7877 66.5754 42.9688 67.0312 42.9688H68.75V46.4062H63.5938C63.1379 46.4062 62.7007 46.5873 62.3784 46.9097C62.0561 47.232 61.875 47.6692 61.875 48.125C61.875 48.5808 62.0561 49.018 62.3784 49.3403C62.7007 49.6627 63.1379 49.8438 63.5938 49.8438H68.75V53.2812H67.0312C66.5754 53.2812 66.1382 53.4623 65.8159 53.7847C65.4936 54.107 65.3125 54.5442 65.3125 55C65.3125 55.4558 65.4936 55.893 65.8159 56.2153C66.1382 56.5377 66.5754 56.7188 67.0312 56.7188H68.75V60.1562H63.5938C63.1379 60.1562 62.7007 60.3373 62.3784 60.6597C62.0561 60.982 61.875 61.4192 61.875 61.875C61.875 62.3308 62.0561 62.768 62.3784 63.0903C62.7007 63.4127 63.1379 63.5938 63.5938 63.5938H68.75V70.4688H56.7188V29.2188H68.75V32.6562H63.5938C63.1379 32.6562 62.7007 32.8373 62.3784 33.1597C62.0561 33.482 61.875 33.9192 61.875 34.375C61.875 34.8308 62.0561 35.268 62.3784 35.5903C62.7007 35.9127 63.1379 36.0938 63.5938 36.0938ZM84.2188 56.7188V70.2539C84.2194 70.3258 84.2244 70.3975 84.2338 70.4688H77.3287C77.3381 70.3975 77.3431 70.3258 77.3438 70.2539V56.7188H84.2188ZM77.3438 53.2812V51.9686L80.7812 45.0936L84.2188 51.9686V53.2812H77.3438ZM104.844 70.4688H87.6412C87.6506 70.3975 87.6556 70.3258 87.6562 70.2539V51.5625C87.656 51.2957 87.5942 51.0325 87.4758 50.7934L82.3195 40.4809C82.1765 40.1954 81.9568 39.9554 81.6852 39.7877C81.4135 39.62 81.1005 39.5312 80.7812 39.5312C80.462 39.5312 80.149 39.62 79.8773 39.7877C79.6057 39.9554 79.386 40.1954 79.243 40.4809L74.0867 50.7934C73.9683 51.0325 73.9065 51.2957 73.9062 51.5625V70.2539C73.9069 70.3258 73.9119 70.3975 73.9213 70.4688H72.1875V27.5C72.1875 27.0442 72.0064 26.607 71.6841 26.2847C71.3618 25.9623 70.9246 25.7812 70.4688 25.7812H55C54.5442 25.7812 54.107 25.9623 53.7847 26.2847C53.4623 26.607 53.2812 27.0442 53.2812 27.5V70.4688H51.5475C51.5568 70.3975 51.5618 70.3258 51.5625 70.2539V37.8125C51.5623 37.5457 51.5005 37.2825 51.382 37.0434L46.2258 26.7309C46.0827 26.4454 45.8631 26.2054 45.5914 26.0377C45.3197 25.87 45.0068 25.7812 44.6875 25.7812C44.3682 25.7812 44.0553 25.87 43.7836 26.0377C43.5119 26.2054 43.2923 26.4454 43.1492 26.7309L37.993 37.0434C37.8745 37.2825 37.8127 37.5457 37.8125 37.8125V70.2539C37.8132 70.3258 37.8182 70.3975 37.8275 70.4688H33.6596L34.3729 53.3521C34.375 53.3135 34.3729 53.2748 34.3729 53.234V53.1824C34.3689 53.1219 34.3617 53.0617 34.3514 53.002V52.9977L32.7615 43.4564C34.7574 41.9504 36.0938 39.2133 36.0938 36.0938C36.0938 31.6766 30.974 26.7846 30.3896 26.241C30.0712 25.9458 29.653 25.7818 29.2188 25.7818C28.7845 25.7818 28.3663 25.9458 28.0479 26.241C27.4635 26.7846 22.3438 31.6766 22.3438 36.0938C22.3438 39.2133 23.6801 41.9504 25.676 43.4564L24.0861 52.9977V53.002C24.0758 53.0617 24.0686 53.1219 24.0646 53.1824V53.234C24.0646 53.2748 24.0625 53.3135 24.0646 53.3521L24.7779 70.4688H5.15625V18.9062C5.15744 17.9949 5.51999 17.1213 6.16439 16.4769C6.80879 15.8325 7.68244 15.4699 8.59375 15.4688H101.406C102.318 15.4699 103.191 15.8325 103.836 16.4769C104.48 17.1213 104.843 17.9949 104.844 18.9062V70.4688Z" fill="#A9ADB7"/>
<path d="M20.625 75.625H10.3125C9.85666 75.625 9.41949 75.8061 9.09716 76.1284C8.77483 76.4507 8.59375 76.8879 8.59375 77.3438C8.59375 77.7996 8.77483 78.2368 9.09716 78.5591C9.41949 78.8814 9.85666 79.0625 10.3125 79.0625H20.625C21.0808 79.0625 21.518 78.8814 21.8403 78.5591C22.1627 78.2368 22.3438 77.7996 22.3438 77.3438C22.3438 76.8879 22.1627 76.4507 21.8403 76.1284C21.518 75.8061 21.0808 75.625 20.625 75.625Z" fill="#C97B00"/>
<path d="M27.5 75.625H25.7812C25.3254 75.625 24.8882 75.8061 24.5659 76.1284C24.2436 76.4507 24.0625 76.8879 24.0625 77.3438C24.0625 77.7996 24.2436 78.2368 24.5659 78.5591C24.8882 78.8814 25.3254 79.0625 25.7812 79.0625H27.5C27.9558 79.0625 28.393 78.8814 28.7153 78.5591C29.0377 78.2368 29.2188 77.7996 29.2188 77.3438C29.2188 76.8879 29.0377 76.4507 28.7153 76.1284C28.393 75.8061 27.9558 75.625 27.5 75.625Z" fill="#C97B00"/>
<path d="M44.6875 44.6875C44.2317 44.6875 43.7945 44.8686 43.4722 45.1909C43.1498 45.5132 42.9688 45.9504 42.9688 46.4062V65.3125C42.9688 65.7683 43.1498 66.2055 43.4722 66.5278C43.7945 66.8502 44.2317 67.0312 44.6875 67.0312C45.1433 67.0312 45.5805 66.8502 45.9028 66.5278C46.2252 66.2055 46.4062 65.7683 46.4062 65.3125V46.4062C46.4062 45.9504 46.2252 45.5132 45.9028 45.1909C45.5805 44.8686 45.1433 44.6875 44.6875 44.6875Z" fill="#A9ADB7"/>
<path d="M80.7812 58.4375C80.3254 58.4375 79.8882 58.6186 79.5659 58.9409C79.2436 59.2632 79.0625 59.7004 79.0625 60.1562V65.3125C79.0625 65.7683 79.2436 66.2055 79.5659 66.5278C79.8882 66.8502 80.3254 67.0312 80.7812 67.0312C81.2371 67.0312 81.6743 66.8502 81.9966 66.5278C82.3189 66.2055 82.5 65.7683 82.5 65.3125V60.1562C82.5 59.7004 82.3189 59.2632 81.9966 58.9409C81.6743 58.6186 81.2371 58.4375 80.7812 58.4375Z" fill="#C97B00"/>
<path d="M10.3125 22.3438H24.0625C24.5183 22.3438 24.9555 22.1627 25.2778 21.8403C25.6002 21.518 25.7812 21.0808 25.7812 20.625C25.7812 20.1692 25.6002 19.732 25.2778 19.4097C24.9555 19.0873 24.5183 18.9062 24.0625 18.9062H10.3125C9.85666 18.9062 9.41949 19.0873 9.09716 19.4097C8.77483 19.732 8.59375 20.1692 8.59375 20.625C8.59375 21.0808 8.77483 21.518 9.09716 21.8403C9.41949 22.1627 9.85666 22.3438 10.3125 22.3438Z" fill="#C97B00"/>
<path d="M10.3125 27.5H13.75C14.2058 27.5 14.643 27.3189 14.9653 26.9966C15.2877 26.6743 15.4688 26.2371 15.4688 25.7812C15.4688 25.3254 15.2877 24.8882 14.9653 24.5659C14.643 24.2436 14.2058 24.0625 13.75 24.0625H10.3125C9.85666 24.0625 9.41949 24.2436 9.09716 24.5659C8.77483 24.8882 8.59375 25.3254 8.59375 25.7812C8.59375 26.2371 8.77483 26.6743 9.09716 26.9966C9.41949 27.3189 9.85666 27.5 10.3125 27.5Z" fill="#C97B00"/>
<path d="M92.8125 67.0312H99.6875C100.143 67.0312 100.581 66.8502 100.903 66.5278C101.225 66.2055 101.406 65.7683 101.406 65.3125C101.406 64.8567 101.225 64.4195 100.903 64.0972C100.581 63.7748 100.143 63.5938 99.6875 63.5938H92.8125C92.3567 63.5938 91.9195 63.7748 91.5972 64.0972C91.2748 64.4195 91.0938 64.8567 91.0938 65.3125C91.0938 65.7683 91.2748 66.2055 91.5972 66.5278C91.9195 66.8502 92.3567 67.0312 92.8125 67.0312Z" fill="#C97B00"/>
<path d="M97.9688 61.875H99.6875C100.143 61.875 100.581 61.6939 100.903 61.3716C101.225 61.0493 101.406 60.6121 101.406 60.1562C101.406 59.7004 101.225 59.2632 100.903 58.9409C100.581 58.6186 100.143 58.4375 99.6875 58.4375H97.9688C97.5129 58.4375 97.0757 58.6186 96.7534 58.9409C96.4311 59.2632 96.25 59.7004 96.25 60.1562C96.25 60.6121 96.4311 61.0493 96.7534 61.3716C97.0757 61.6939 97.5129 61.875 97.9688 61.875Z" fill="#C97B00"/>
</svg>
