<?xml version="1.0" encoding="UTF-8"?>
<svg width="48px" height="48px" viewBox="0 0 48 48" version="1.1" xmlns="http://www.w3.org/2000/svg" xmlns:xlink="http://www.w3.org/1999/xlink">
    <!-- Generator: Sketch 41.2 (35397) - http://www.bohemiancoding.com/sketch -->
    <title>News icon</title>
    <desc>Created with Sketch.</desc>
    <defs></defs>
    <g id="Symbols" stroke="none" stroke-width="1" fill="none" fill-rule="evenodd">
        <g id="News-icon">
            <g id="ic_star_border_black_48px-copy">
                <g id="ic_star_border_black_48px">
                    <g id="Group">
                        <polygon id="Shape" points="0 0 44 0 44 44 0 44"></polygon>
                    </g>
                </g>
            </g>
            <g id="ic_star_border_black_48px">
                <g id="Group">
                    <g>
                        <polygon id="Shape" points="0 0 44 0 44 44 0 44"></polygon>
                    </g>
                </g>
            </g>
            <g id="Group-8">
                <rect id="Rectangle-53" x="0" y="0" width="48" height="48"></rect>
            </g>
            <path d="M30.3636364,24 L24,24 L24,28.4444444 L30.3636364,28.4444444 L30.3636364,24 Z M22.1818182,24 L22.1818182,19.5555556 L17.6363636,19.5555556 L17.6363636,24 L22.1818182,24 Z M32.1818182,16 L15.8181818,16 C14.8181818,16 14,16.8 14,17.7777778 L14,30.2222222 C14,31.2 14.8181818,32 15.8181818,32 L32.1818182,32 C33.1818182,32 34,31.2 34,30.2222222 L34,17.7777778 C34,16.8 33.1818182,16 32.1818182,16 Z M32.1818182,30.2311111 L15.8181818,30.2311111 L15.8181818,17.7688889 L32.1818182,17.7688889 L32.1818182,30.2311111 L32.1818182,30.2311111 Z M24,19.5555556 L30.3636364,19.5555556 L30.3636364,20.4444444 L24,20.4444444 L24,19.5555556 Z M24,21.3333333 L30.3636364,21.3333333 L30.3636364,22.2222222 L24,22.2222222 L24,21.3333333 Z M17.6363636,25.7777778 L22.1818182,25.7777778 L22.1818182,26.6666667 L17.6363636,26.6666667 L17.6363636,25.7777778 Z M17.6363636,27.5555556 L22.1818182,27.5555556 L22.1818182,28.4444444 L17.6363636,28.4444444 L17.6363636,27.5555556 Z" id="Combined-Shape" fill="#464D57"></path>
        </g>
    </g>
</svg>