<?xml version="1.0" encoding="UTF-8"?>
<svg width="48px" height="48px" viewBox="0 0 48 48" version="1.1" xmlns="http://www.w3.org/2000/svg" xmlns:xlink="http://www.w3.org/1999/xlink">
    <!-- Generator: Sketch 46 (44423) - http://www.bohemiancoding.com/sketch -->
    <title>icon Edit</title>
    <desc>Created with Sketch.</desc>
    <defs></defs>
    <g id="Symbols" stroke="none" stroke-width="1" fill="none" fill-rule="evenodd">
        <g id="icon-Edit">
            <g id="Group-4">
                <rect id="Rectangle-14" x="0" y="0" width="48" height="48"></rect>
            </g>
            <g id="Group-12" transform="translate(12.000000, 12.000000)">
                <polygon id="Shape" points="0 0 24 0 24 24 0 24"></polygon>
                <path d="M4,17.0647917 L4,20.5022917 L7.4375,20.5022917 L17.5758333,10.3639583 L14.1383333,6.92645833 L4,17.0647917 Z M20.2341667,7.705625 C20.5916667,7.348125 20.5916667,6.770625 20.2341667,6.413125 L18.0891667,4.268125 C17.7316667,3.910625 17.1541667,3.910625 16.7966667,4.268125 L15.1191667,5.945625 L18.5566667,9.383125 L20.2341667,7.705625 Z" id="Shape" fill="#464D57"></path>
            </g>
        </g>
    </g>
</svg>