<?xml version="1.0" encoding="UTF-8"?>
<svg width="48px" height="48px" viewBox="0 0 48 48" version="1.1" xmlns="http://www.w3.org/2000/svg" xmlns:xlink="http://www.w3.org/1999/xlink">
    <!-- Generator: Sketch 41.2 (35397) - http://www.bohemiancoding.com/sketch -->
    <title>icon Textarea</title>
    <desc>Created with Sketch.</desc>
    <defs>
        <rect id="path-1" x="0" y="0" width="18" height="18" rx="2"></rect>
        <mask id="mask-2" maskContentUnits="userSpaceOnUse" maskUnits="objectBoundingBox" x="0" y="0" width="18" height="18" fill="white">
            <use xlink:href="#path-1"></use>
        </mask>
    </defs>
    <g id="Symbols" stroke="none" stroke-width="1" fill="none" fill-rule="evenodd">
        <g id="icon-Textarea">
            <g id="Group-3">
                <rect id="Rectangle" x="0" y="0" width="48" height="48"></rect>
            </g>
            <g id="Group-2" transform="translate(12.000000, 12.000000)">
                <polygon id="Shape" points="0 0 24 0 24 24 0 24"></polygon>
            </g>
            <g id="Group-4" transform="translate(15.000000, 15.000000)">
                <g id="Group-9" stroke="#464D57" stroke-width="2">
                    <use id="Rectangle-9" mask="url(#mask-2)" xlink:href="#path-1"></use>
                </g>
                <path d="M4.41716785,8.96 C4.38654987,8.9333332 4.37124112,8.90095257 4.37124112,8.86285714 L4.37124112,5.71428571 L3.15746309,5.71428571 C3.11372313,5.71428571 3.07654471,5.70095251 3.04592674,5.67428571 C3.01530876,5.64761891 3,5.61333354 3,5.57142857 L3,5.14285714 C3,5.10095217 3.01421528,5.0666668 3.04264625,5.04 C3.07107723,5.0133332 3.10934913,5 3.15746309,5 L6.51011482,5 C6.55822878,5 6.59759416,5.0133332 6.62821214,5.04 C6.65883011,5.0666668 6.67413887,5.10095217 6.67413887,5.14285714 L6.67413887,5.57142857 C6.67413887,5.61333354 6.65883011,5.64761891 6.62821214,5.67428571 C6.59759416,5.70095251 6.55822878,5.71428571 6.51011482,5.71428571 L5.30289776,5.71428571 L5.30289776,8.86285714 C5.30289776,8.90095257 5.28868248,8.9333332 5.2602515,8.96 C5.23182052,8.9866668 5.19354863,9 5.14543466,9 L4.52870421,9 C4.48496424,9 4.44778583,8.9866668 4.41716785,8.96 Z M6.97922362,8.96571429 C6.95079264,8.94285703 6.93657736,8.91428589 6.93657736,8.88 C6.93657736,8.86476183 6.94532523,8.84190491 6.96282121,8.81142857 L8.4259158,6.96 L7.05467469,5.18857143 C7.0371787,5.16571417 7.02843084,5.14285726 7.02843084,5.12 C7.02843084,5.08571411 7.04264611,5.05714297 7.07107709,5.03428571 C7.09950807,5.01142846 7.13121907,5 7.16621104,5 L7.85511208,5 C7.93384402,5 8.00163996,5.03619011 8.05850191,5.10857143 L9.01640241,6.33142857 L9.98086386,5.10857143 C10.0289778,5.03619011 10.0967738,5 10.1842537,5 L10.833789,5 C10.8687809,5 10.9004919,5.01142846 10.9289229,5.03428571 C10.9573539,5.05714297 10.9715692,5.08571411 10.9715692,5.12 C10.9715692,5.13523817 10.9628213,5.15809509 10.9453253,5.18857143 L9.5740842,6.96 L11.0437397,8.81142857 C11.0568617,8.83428583 11.0634226,8.85714274 11.0634226,8.88 C11.0634226,8.91428589 11.0503008,8.94285703 11.0240569,8.96571429 C10.9978129,8.98857154 10.9650084,9 10.9256424,9 L10.2236195,9 C10.1448875,9 10.0770916,8.96571463 10.0202296,8.89714286 L8.98359759,7.61142857 L7.96008748,8.89714286 C7.90322552,8.96571463 7.83542959,9 7.75669765,9 L7.07435757,9 C7.0393656,9 7.0076546,8.98857154 6.97922362,8.96571429 Z M12.743029,8.96 C12.712411,8.9333332 12.6971022,8.90095257 12.6971022,8.86285714 L12.6971022,5.71428571 L11.4833242,5.71428571 C11.4395843,5.71428571 11.4024058,5.70095251 11.3717879,5.67428571 C11.3411699,5.64761891 11.3258611,5.61333354 11.3258611,5.57142857 L11.3258611,5.14285714 C11.3258611,5.10095217 11.3400764,5.0666668 11.3685074,5.04 C11.3969384,5.0133332 11.4352103,5 11.4833242,5 L14.8359759,5 C14.8840899,5 14.9234553,5.0133332 14.9540733,5.04 C14.9846912,5.0666668 15,5.10095217 15,5.14285714 L15,5.57142857 C15,5.61333354 14.9846912,5.64761891 14.9540733,5.67428571 C14.9234553,5.70095251 14.8840899,5.71428571 14.8359759,5.71428571 L13.6287589,5.71428571 L13.6287589,8.86285714 C13.6287589,8.90095257 13.6145436,8.9333332 13.5861126,8.96 C13.5576817,8.9866668 13.5194098,9 13.4712958,9 L12.8545653,9 C12.8108254,9 12.773647,8.9866668 12.743029,8.96 Z M3.02709823,13.9742857 C3.00903265,13.9571428 3,13.9357144 3,13.91 L3.00903274,13.8714286 L4.09296199,11.1071429 C4.12307128,11.0357139 4.1772672,11 4.25555137,11 L4.75235228,11 C4.83063645,11 4.88483237,11.0357139 4.91494166,11.1071429 L5.99887091,13.8714286 L6.00790365,13.91 C6.00790365,13.9357144 5.99811828,13.9571428 5.97854723,13.9742857 C5.95897619,13.9914287 5.93714728,14 5.91305984,14 L5.51110275,14 C5.44787323,14 5.4042154,13.9728574 5.38012796,13.9185714 L5.17237486,13.4 L3.83552879,13.4 L3.62777569,13.9185714 C3.60368825,13.9728574 3.56003043,14 3.4968009,14 L3.09484381,14 C3.06774544,14 3.04516381,13.9914287 3.02709823,13.9742857 Z M3.99360181,12.9028571 L5.01430184,12.9028571 L4.50395183,11.5828571 L3.99360181,12.9028571 Z M6.45502446,13.97 C6.43394796,13.9499999 6.42340986,13.9257144 6.42340986,13.8971429 L6.42340986,11.1071429 C6.42340986,11.0757141 6.43319524,11.0500001 6.45276628,11.03 C6.47233732,11.0099999 6.49868256,11 6.53180279,11 L7.70154309,11 C8.07188744,11 8.36168507,11.0814278 8.57094467,11.2442857 C8.78020428,11.4071437 8.88483252,11.6385699 8.88483252,11.9385714 C8.88483252,12.1471439 8.83214204,12.3221421 8.7267595,12.4635714 C8.62137697,12.6050007 8.47384363,12.7071425 8.28415506,12.77 L8.93902898,13.8628571 C8.94806177,13.8800001 8.9525781,13.8957142 8.9525781,13.91 C8.9525781,13.9357144 8.94279272,13.9571428 8.92322168,13.9742857 C8.90365064,13.9914287 8.88182172,14 8.85773429,14 L8.44222808,14 C8.3940532,14 8.35641715,13.9892858 8.32931878,13.9678571 C8.30222041,13.9464285 8.27813334,13.9185716 8.25705683,13.8842857 L7.67896123,12.8685714 L7.06021829,12.8685714 L7.06021829,13.8971429 C7.06021829,13.9257144 7.0496802,13.9499999 7.02860369,13.97 C7.00752718,13.9900001 6.98042922,14 6.947309,14 L6.53180279,14 C6.50169349,14 6.47610097,13.9900001 6.45502446,13.97 Z M7.68799398,12.38 C7.86864976,12.38 8.00413956,12.3421432 8.09446744,12.2664286 C8.18479533,12.1907139 8.2299586,12.0800007 8.2299586,11.9342857 C8.2299586,11.7885707 8.18479533,11.676429 8.09446744,11.5978571 C8.00413956,11.5192853 7.86864976,11.48 7.68799398,11.48 L7.06021829,11.48 L7.06021829,12.38 L7.68799398,12.38 Z M9.49905909,13.97 C9.47798258,13.9499999 9.46744449,13.9257144 9.46744449,13.8971429 L9.46744449,11.1071429 C9.46744449,11.0757141 9.47722986,11.0500001 9.4968009,11.03 C9.51637195,11.0099999 9.54271718,11 9.57583741,11 L11.5675574,11 C11.6006776,11 11.6277756,11.0099999 11.6488521,11.03 C11.6699286,11.0500001 11.6804667,11.0757141 11.6804667,11.1071429 L11.6804667,11.3942857 C11.6804667,11.4257144 11.6699286,11.4507142 11.6488521,11.4692857 C11.6277756,11.4878572 11.6006776,11.4971429 11.5675574,11.4971429 L10.0861874,11.4971429 L10.0861874,12.2471429 L11.4681972,12.2471429 C11.5013174,12.2471429 11.5284154,12.2571428 11.5494919,12.2771429 C11.5705684,12.297143 11.5811065,12.322857 11.5811065,12.3542857 L11.5811065,12.6242857 C11.5811065,12.6557144 11.5705684,12.6807142 11.5494919,12.6992857 C11.5284154,12.7178572 11.5013174,12.7271429 11.4681972,12.7271429 L10.0861874,12.7271429 L10.0861874,13.5028571 L11.6036884,13.5028571 C11.6368086,13.5028571 11.6639066,13.5121428 11.6849831,13.5307143 C11.7060596,13.5492858 11.7165977,13.5742856 11.7165977,13.6057143 L11.7165977,13.8971429 C11.7165977,13.9285716 11.7060596,13.9535713 11.6849831,13.9721429 C11.6639066,13.9907144 11.6368086,14 11.6036884,14 L9.57583741,14 C9.54572811,14 9.5201356,13.9900001 9.49905909,13.97 Z M12.0191946,13.9742857 C12.001129,13.9571428 11.9920963,13.9357144 11.9920963,13.91 L12.0011291,13.8714286 L13.0850583,11.1071429 C13.1151676,11.0357139 13.1693636,11 13.2476477,11 L13.7444486,11 C13.8227328,11 13.8769287,11.0357139 13.907038,11.1071429 L14.9909673,13.8714286 L15,13.91 C15,13.9357144 14.9902146,13.9571428 14.9706436,13.9742857 C14.9510725,13.9914287 14.9292436,14 14.9051562,14 L14.5031991,14 C14.4399696,14 14.3963118,13.9728574 14.3722243,13.9185714 L14.1644712,13.4 L12.8276251,13.4 L12.619872,13.9185714 C12.5957846,13.9728574 12.5521268,14 12.4888973,14 L12.0869402,14 C12.0598418,14 12.0372602,13.9914287 12.0191946,13.9742857 Z M12.9856982,12.9028571 L14.0063982,12.9028571 L13.4960482,11.5828571 L12.9856982,12.9028571 Z" id="Combined-Shape" fill="#464D57"></path>
            </g>
        </g>
    </g>
</svg>