;outer_blue
REGIONNAME Doncaster
blueBackground N053.25.27.838 W001.08.02.849
N053.34.00.597 W001.02.52.888
N053.31.51.041 W000.52.23.430
N053.23.08.986 W000.57.37.908

;grass_border
REGIONNAME Doncaster
smrGrass N053.27.43.978 W001.00.52.335
N053.27.39.105 W001.00.36.539
N053.27.38.030 W001.00.32.954
N053.27.45.100 W001.00.29.224
N053.27.46.232 W001.00.26.609
N053.27.47.601 W001.00.24.848
N053.27.48.496 W001.00.24.105
N053.27.54.845 W001.00.20.831
N053.27.55.467 W001.00.20.334
N053.28.17.926 W001.00.08.289
N053.28.19.238 W001.00.07.422
N053.28.21.711 W001.00.06.076
N053.28.23.925 W001.00.05.032
N053.28.25.490 W001.00.03.893
N053.28.26.151 W001.00.03.234
N053.28.27.971 W001.00.02.395
N053.28.29.314 W001.00.02.162
N053.28.30.549 W001.00.01.613
N053.28.32.612 W001.00.00.756
N053.28.33.608 W001.00.00.264
N053.28.35.355 W000.59.59.183
N053.28.36.864 W000.59.58.201
N053.28.39.552 W000.59.55.382
N053.28.47.171 W000.59.45.926
N053.28.48.070 W000.59.48.174
N053.28.54.501 W000.59.39.884
N053.28.55.336 W000.59.41.428
N053.28.56.681 W000.59.47.474
N053.28.59.682 W000.59.46.332
N053.29.02.387 W000.59.45.129
N053.29.04.403 W000.59.43.926
N053.29.07.561 W000.59.41.878
N053.29.08.807 W000.59.40.802
N053.29.12.543 W000.59.36.286
N053.29.13.287 W000.59.36.912
N053.29.13.726 W000.59.35.805
N053.29.15.147 W000.59.33.071
N053.29.15.034 W000.59.30.965
N053.29.19.071 W000.59.29.260
N053.29.19.954 W000.59.30.281
N053.29.20.879 W000.59.40.697
N053.29.21.424 W000.59.41.599
N053.29.26.372 W000.59.40.379
N053.29.30.641 W001.00.10.504
N053.29.17.957 W001.00.12.275
N053.29.17.646 W001.00.28.387
N053.29.09.317 W001.00.41.040
N053.29.08.249 W001.00.41.715
N053.29.07.945 W001.00.42.200
N053.29.07.756 W001.00.45.548
N053.29.04.448 W001.00.47.282
N053.29.04.254 W001.00.56.552
N053.29.04.082 W001.00.59.887
N053.29.02.481 W001.01.01.898
N053.29.01.568 W001.01.03.473
N053.29.01.506 W001.01.03.557
N053.28.59.349 W001.01.06.828
N053.28.57.980 W001.01.08.436
N053.28.56.060 W001.01.09.528
N053.28.54.957 W001.01.09.347
N053.28.54.491 W001.01.09.444
N053.28.51.961 W001.01.10.744
N053.28.47.821 W001.01.14.067
N053.28.46.743 W001.01.13.734
N053.28.44.837 W001.01.12.286
N053.28.43.449 W001.01.10.800
N053.28.42.566 W001.01.08.616
N053.28.41.988 W001.01.06.792
N053.28.41.548 W001.01.03.929
N053.28.41.024 W001.01.02.407
N053.28.39.946 W001.01.01.018
N053.28.37.812 W001.00.58.455
N053.28.37.191 W001.00.57.059
N053.28.37.418 W001.00.56.342
N053.28.37.205 W001.00.54.838
N053.28.36.663 W001.00.54.275
N053.28.36.457 W001.00.52.125
N053.28.36.713 W001.00.50.670
N053.28.37.264 W001.00.49.071
N053.28.37.823 W001.00.47.885
N053.28.34.551 W001.00.44.702
N053.28.30.333 W001.00.39.065
N053.28.27.576 W001.00.41.823
N053.28.27.616 W001.00.39.203
N053.28.18.735 W001.00.39.302
N053.28.06.827 W001.00.45.616
N053.28.00.789 W001.00.45.618

;black_taxiway_border
REGIONNAME Doncaster
smrTaxiway N053.27.46.712 W001.00.40.294
N053.27.45.843 W001.00.35.626
N053.27.45.697 W001.00.34.684
N053.27.45.668 W001.00.33.655
N053.27.45.674 W001.00.32.839
N053.27.45.760 W001.00.31.680
N053.27.45.870 W001.00.31.019
N053.27.46.070 W001.00.30.254
N053.27.46.382 W001.00.29.281
N053.27.46.694 W001.00.28.481
N053.27.47.047 W001.00.27.823
N053.27.47.448 W001.00.27.190
N053.27.47.893 W001.00.26.624
N053.27.48.274 W001.00.26.246
N053.27.49.945 W001.00.25.392
N053.27.55.436 W001.00.22.447
N053.28.27.977 W001.00.05.063
N053.28.37.336 W001.00.00.162
N053.28.41.302 W000.59.57.018
N053.28.42.010 W000.59.56.559
N053.28.42.547 W000.59.56.215
N053.28.51.800 W000.59.51.371
N053.28.54.673 W000.59.49.784
N053.28.54.707 W000.59.49.598
N053.28.54.705 W000.59.49.285
N053.28.54.305 W000.59.47.164
N053.28.54.148 W000.59.46.953
N053.28.53.698 W000.59.47.220
N053.28.53.576 W000.59.46.496
N053.28.53.315 W000.59.46.661
N053.28.53.193 W000.59.45.975
N053.28.52.803 W000.59.46.186
N053.28.52.627 W000.59.45.249
N053.28.52.349 W000.59.45.040
N053.28.52.269 W000.59.45.336
N053.28.51.252 W000.59.44.660
N053.28.51.412 W000.59.43.899
N053.28.51.548 W000.59.43.942
N053.28.51.599 W000.59.43.752
N053.28.53.312 W000.59.44.716
N053.28.53.395 W000.59.44.732
N053.28.54.539 W000.59.44.148
N053.28.54.616 W000.59.44.046
N053.28.54.674 W000.59.43.894
N053.28.54.669 W000.59.43.745
N053.28.54.641 W000.59.43.535
N053.28.54.684 W000.59.43.450
N053.28.54.751 W000.59.43.460
N053.28.55.162 W000.59.43.779
N053.28.55.336 W000.59.44.797
N053.28.55.714 W000.59.44.621
N053.28.56.041 W000.59.46.588
N053.28.55.408 W000.59.46.914
N053.28.55.688 W000.59.48.858
N053.28.55.770 W000.59.49.014
N053.28.55.887 W000.59.49.119
N053.28.55.988 W000.59.49.115
N053.28.56.121 W000.59.49.044
N053.29.02.765 W000.59.45.500
N053.29.03.913 W000.59.44.881
N053.29.04.662 W000.59.44.697
N053.29.05.217 W000.59.44.648
N053.29.06.168 W000.59.44.681
N053.29.07.033 W000.59.44.994
N053.29.07.827 W000.59.45.648
N053.29.08.511 W000.59.46.328
N053.29.09.178 W000.59.47.272
N053.29.09.692 W000.59.48.218
N053.29.10.083 W000.59.49.263
N053.29.10.332 W000.59.50.078
N053.29.10.714 W000.59.51.966
N053.29.15.321 W000.59.49.563
N053.29.16.116 W000.59.53.589
N053.29.13.429 W000.59.55.005
N053.29.12.697 W000.59.54.464
N053.29.11.705 W000.59.54.977
N053.29.11.576 W000.59.55.711
N053.29.11.728 W000.59.57.141
N053.29.11.788 W000.59.57.751
N053.29.11.818 W000.59.58.421
N053.29.11.805 W000.59.59.144
N053.29.11.815 W000.59.59.847
N053.29.11.837 W001.00.00.391
N053.29.11.892 W001.00.00.588
N053.29.11.991 W001.00.00.910
N053.29.12.076 W001.00.01.095
N053.29.11.886 W001.00.02.149
N053.29.11.741 W001.00.02.331
N053.29.11.639 W001.00.02.550
N053.29.11.620 W001.00.02.889
N053.29.11.682 W001.00.03.434
N053.29.11.770 W001.00.03.943
N053.29.11.937 W001.00.04.635
N053.29.12.150 W001.00.04.942
N053.29.12.326 W001.00.05.129
N053.29.16.645 W001.00.06.783
N053.29.18.834 W001.00.06.464
N053.29.19.523 W001.00.06.359
N053.29.22.737 W001.00.05.724
N053.29.22.954 W001.00.05.484
N053.29.23.141 W001.00.05.010
N053.29.23.199 W001.00.04.328
N053.29.23.148 W001.00.04.078
N053.29.23.772 W001.00.03.870
N053.29.24.081 W001.00.07.949
N053.29.24.206 W001.00.08.342
N053.29.24.498 W001.00.08.881
N053.29.24.721 W001.00.09.096
N053.29.24.824 W001.00.10.061
N053.29.22.641 W001.00.10.500
N053.29.22.690 W001.00.11.540
N053.29.19.662 W001.00.11.986
N053.29.19.403 W001.00.11.246
N053.29.19.495 W001.00.09.978
N053.29.19.147 W001.00.08.288
N053.29.18.956 W001.00.07.839
N053.29.18.683 W001.00.07.574
N053.29.18.439 W001.00.07.500
N053.29.16.815 W001.00.07.879
N053.29.14.701 W001.00.07.079
N053.29.14.477 W001.00.07.160
N053.29.14.289 W001.00.07.332
N053.29.14.094 W001.00.07.634
N053.29.13.972 W001.00.07.939
N053.29.13.907 W001.00.08.233
N053.29.13.880 W001.00.08.566
N053.29.13.902 W001.00.08.750
N053.29.14.331 W001.00.11.132
N053.29.14.463 W001.00.11.921
N053.29.14.523 W001.00.12.630
N053.29.14.581 W001.00.13.185
N053.29.14.619 W001.00.14.391
N053.29.14.646 W001.00.14.854
N053.29.14.781 W001.00.15.160
N053.29.14.932 W001.00.15.400
N053.29.15.090 W001.00.15.529
N053.29.15.280 W001.00.15.628
N053.29.15.758 W001.00.15.639
N053.29.16.190 W001.00.15.711
N053.29.16.424 W001.00.15.749
N053.29.16.646 W001.00.16.003
N053.29.16.925 W001.00.16.411
N053.29.17.195 W001.00.16.951
N053.29.17.289 W001.00.17.309
N053.29.17.435 W001.00.17.863
N053.29.17.489 W001.00.18.453
N053.29.17.512 W001.00.18.871
N053.29.16.625 W001.00.23.860
N053.29.16.416 W001.00.23.734
N053.29.16.089 W001.00.24.911
N053.29.15.612 W001.00.26.740
N053.29.15.718 W001.00.26.979
N053.29.14.045 W001.00.31.234
N053.29.13.750 W001.00.30.996
N053.29.13.095 W001.00.32.034
N053.29.12.733 W001.00.32.248
N053.29.11.864 W001.00.33.627
N053.29.11.739 W001.00.34.116
N053.29.11.066 W001.00.35.239
N053.29.11.169 W001.00.35.570
N053.29.08.533 W001.00.38.519
N053.29.08.351 W001.00.38.068
N053.29.07.671 W001.00.38.554
N053.29.07.592 W001.00.38.844
N053.29.06.667 W001.00.39.290
N053.29.06.682 W001.00.39.825
N053.29.03.677 W001.00.41.171
N053.29.03.282 W001.00.37.962
N053.29.04.754 W001.00.37.222
N053.29.04.692 W001.00.36.816
N053.29.04.609 W001.00.36.485
N053.29.04.500 W001.00.36.401
N053.29.03.398 W001.00.36.684
N053.29.02.664 W001.00.38.531
N053.28.58.087 W001.00.34.546
N053.28.58.281 W001.00.33.708
N053.28.57.796 W001.00.33.289
N053.28.57.540 W001.00.33.293
N053.28.57.531 W001.00.33.297
N053.28.56.408 W001.00.33.891
N053.28.54.661 W001.00.34.915
N053.28.42.455 W001.00.41.383
N053.28.40.994 W001.00.33.702
N053.28.48.808 W001.00.29.550
N053.28.49.502 W001.00.28.955
N053.28.49.586 W001.00.28.773
N053.28.49.561 W001.00.28.561
N053.28.49.436 W001.00.27.101
N053.28.49.313 W001.00.25.389
N053.28.49.226 W001.00.24.843
N053.28.49.084 W001.00.24.287
N053.28.48.554 W001.00.21.814
N053.28.48.453 W001.00.21.521
N053.28.47.482 W001.00.18.824
N053.28.47.361 W001.00.18.635
N053.28.47.277 W001.00.18.579
N053.28.47.186 W001.00.18.576
N053.28.45.157 W001.00.18.960
N053.28.45.102 W001.00.18.877
N053.28.25.381 W001.00.29.358
N053.28.23.541 W001.00.30.414
N053.28.22.460 W001.00.31.258
N053.28.21.584 W001.00.31.964
N053.28.21.356 W001.00.32.342
N053.28.21.180 W001.00.32.812
N053.28.21.123 W001.00.33.282
N053.28.21.144 W001.00.33.804
N053.28.21.293 W001.00.34.113
N053.28.21.647 W001.00.34.321
N053.28.21.994 W001.00.34.237
N053.28.22.159 W001.00.33.619
N053.28.22.123 W001.00.33.369
N053.28.24.316 W001.00.32.136
N053.28.25.105 W001.00.36.441
N053.28.22.091 W001.00.38.045
N053.28.20.834 W001.00.37.068
N053.28.20.424 W001.00.36.934
N053.28.18.730 W001.00.37.845
N053.28.18.329 W001.00.37.628
N053.28.18.268 W001.00.37.295
N053.28.17.897 W001.00.37.398
N053.28.17.420 W001.00.37.464
N053.28.17.071 W001.00.37.237
N053.28.16.769 W001.00.36.870
N053.28.16.557 W001.00.36.397
N053.28.16.391 W001.00.35.724
N053.28.16.249 W001.00.35.132
N053.28.16.010 W001.00.34.807
N053.28.15.775 W001.00.34.611
N053.28.15.642 W001.00.34.585
N053.28.13.472 W001.00.35.683
N053.28.13.247 W001.00.35.984
N053.28.13.097 W001.00.36.370
N053.28.13.029 W001.00.36.748
N053.28.13.041 W001.00.37.054
N053.28.13.091 W001.00.37.477
N053.28.13.172 W001.00.38.214
N053.28.13.153 W001.00.38.687
N053.28.13.090 W001.00.39.136
N053.28.12.943 W001.00.39.615
N053.28.12.692 W001.00.40.061
N053.28.12.367 W001.00.40.350
N053.28.12.019 W001.00.40.544
N053.28.12.079 W001.00.40.909
N053.28.11.897 W001.00.41.496
N053.28.11.114 W001.00.41.894
N053.28.10.441 W001.00.41.426
N053.28.08.947 W001.00.42.172
N053.28.09.063 W001.00.42.810
N053.28.08.970 W001.00.43.362
N053.28.08.854 W001.00.43.763
N053.28.08.594 W001.00.44.051
N053.28.06.663 W001.00.45.106
N053.28.06.317 W001.00.44.906
N053.28.06.117 W001.00.44.651
N053.28.05.933 W001.00.44.376
N053.28.05.336 W001.00.44.677
N053.28.05.213 W001.00.43.981
N053.28.05.357 W001.00.43.348
N053.28.05.188 W001.00.43.233
N053.28.05.035 W001.00.42.943
N053.28.04.866 W001.00.42.650
N053.28.04.718 W001.00.42.216
N053.28.04.628 W001.00.41.864
N053.28.04.561 W001.00.41.547
N053.28.04.441 W001.00.41.276
N053.28.04.294 W001.00.41.092
N053.28.04.139 W001.00.40.958
N053.28.03.960 W001.00.40.880
N053.28.03.836 W001.00.40.830
N053.27.53.807 W001.00.46.183
N053.27.53.099 W001.00.46.701
N053.27.52.741 W001.00.46.848
N053.27.52.303 W001.00.46.998
N053.27.51.829 W001.00.47.109
N053.27.51.450 W001.00.47.116
N053.27.51.038 W001.00.47.085
N053.27.50.630 W001.00.46.998
N053.27.50.180 W001.00.46.790
N053.27.49.731 W001.00.46.536
N053.27.49.345 W001.00.46.206
N053.27.48.973 W001.00.45.835
N053.27.48.521 W001.00.45.335
N053.27.48.205 W001.00.44.855
N053.27.47.917 W001.00.44.332
N053.27.47.649 W001.00.43.774
N053.27.47.419 W001.00.43.204
N053.27.47.256 W001.00.42.656
N053.27.47.117 W001.00.42.122
N053.27.46.989 W001.00.41.585
N053.27.46.872 W001.00.41.059

;Eastern_Side_1
REGIONNAME Doncaster
smrGrass N053.27.46.623 W001.00.35.791
N053.27.49.095 W001.00.34.508
N053.27.49.855 W001.00.35.144
N053.28.45.294 W001.00.05.575
N053.28.43.429 W000.59.56.843
N053.28.42.683 W000.59.57.215
N053.28.41.588 W000.59.57.918
N053.28.38.025 W001.00.00.719
N053.28.21.036 W001.00.09.870
N053.27.50.265 W001.00.26.288
N053.27.49.750 W001.00.26.680
N053.27.49.039 W001.00.27.054
N053.27.48.405 W001.00.27.496
N053.27.47.868 W001.00.28.134
N053.27.47.361 W001.00.28.960
N053.27.47.041 W001.00.29.768
N053.27.46.753 W001.00.30.594
N053.27.46.578 W001.00.31.369
N053.27.46.447 W001.00.31.971
N053.27.46.374 W001.00.32.728
N053.27.46.355 W001.00.33.362
N053.27.46.384 W001.00.34.017
N053.27.46.405 W001.00.34.696
N053.27.46.505 W001.00.35.283

;Eastern_Side_2
REGIONNAME Doncaster
smrGrass N053.28.45.548 W001.00.05.436
N053.28.45.485 W001.00.05.206
N053.28.43.877 W000.59.57.738
N053.28.43.952 W000.59.56.529
N053.29.02.758 W000.59.46.537
N053.29.03.418 W000.59.46.399
N053.29.04.241 W000.59.45.940
N053.29.04.667 W000.59.45.839
N053.29.05.116 W000.59.45.753
N053.29.05.591 W000.59.45.793
N053.29.06.036 W000.59.45.854
N053.29.06.402 W000.59.45.983
N053.29.06.884 W000.59.46.204
N053.29.07.256 W000.59.46.437
N053.29.07.616 W000.59.46.661
N053.29.07.994 W000.59.47.101
N053.29.08.346 W000.59.47.600
N053.29.08.695 W000.59.48.059
N053.29.08.961 W000.59.48.527
N053.29.09.240 W000.59.49.219
N053.29.09.454 W000.59.49.852
N053.29.09.624 W000.59.50.420
N053.29.09.806 W000.59.51.232
N053.29.09.861 W000.59.51.663
N053.29.09.814 W000.59.51.897
N053.29.09.602 W000.59.52.434
N053.29.09.474 W000.59.52.621
N053.29.07.882 W000.59.53.524

;A_C_Rwy
REGIONNAME Doncaster
smrGrass N053.29.10.014 W000.59.55.879
N053.28.46.828 W001.00.08.237
N053.28.47.084 W001.00.11.373
N053.28.47.589 W001.00.13.612
N053.28.48.159 W001.00.15.285
N053.28.48.277 W001.00.15.473
N053.28.48.437 W001.00.15.515
N053.28.49.053 W001.00.15.718
N053.29.07.182 W001.00.06.056
N053.29.07.898 W001.00.05.662
N053.29.08.306 W001.00.05.432
N053.29.08.682 W001.00.05.175
N053.29.08.968 W001.00.04.907
N053.29.09.315 W001.00.04.556
N053.29.09.639 W001.00.04.156
N053.29.09.893 W001.00.03.643
N053.29.10.150 W001.00.03.209
N053.29.10.394 W001.00.02.558
N053.29.10.581 W001.00.02.070
N053.29.10.765 W001.00.01.367
N053.29.10.993 W001.00.00.315
N053.29.10.885 W000.59.59.811
N053.29.10.912 W000.59.58.489
N053.29.10.837 W000.59.57.667
N053.29.10.704 W000.59.56.814
N053.29.10.630 W000.59.56.237
N053.29.10.547 W000.59.56.075
N053.29.10.433 W000.59.55.950
N053.29.10.321 W000.59.55.902
N053.29.10.176 W000.59.55.871

;A_B_C_Rwy
REGIONNAME Doncaster
smrGrass N053.28.46.352 W001.00.17.148
N053.28.46.953 W001.00.16.228
N053.28.47.049 W001.00.15.958
N053.28.46.825 W001.00.14.101
N053.28.46.863 W001.00.14.071
N053.28.46.422 W001.00.12.019
N053.28.46.367 W001.00.11.974
N053.28.45.340 W001.00.09.067
N053.28.21.129 W001.00.21.920
N053.28.20.848 W001.00.22.229
N053.28.20.709 W001.00.22.551
N053.28.20.646 W001.00.22.871
N053.28.20.667 W001.00.23.143
N053.28.20.741 W001.00.23.554
N053.28.20.859 W001.00.24.057
N053.28.20.995 W001.00.24.375
N053.28.21.452 W001.00.25.314
N053.28.21.781 W001.00.25.772
N053.28.23.448 W001.00.27.524
N053.28.23.800 W001.00.27.773
N053.28.24.174 W001.00.27.935
N053.28.24.399 W001.00.28.016
N053.28.25.022 W001.00.27.963
N053.28.25.393 W001.00.27.876
N053.28.25.833 W001.00.27.717
N053.28.26.268 W001.00.27.529
N053.28.27.953 W001.00.26.806
N053.28.28.102 W001.00.26.912

;A_B_Rwy
REGIONNAME Doncaster
smrGrass N053.28.23.423 W001.00.29.336
N053.28.21.553 W001.00.27.313
N053.28.21.129 W001.00.26.852
N053.28.20.809 W001.00.26.408
N053.28.20.496 W001.00.25.971
N053.28.20.188 W001.00.25.522
N053.28.19.943 W001.00.25.083
N053.28.19.708 W001.00.24.684
N053.28.19.452 W001.00.24.125
N053.28.19.245 W001.00.23.702
N053.28.19.041 W001.00.23.465
N053.28.18.850 W001.00.23.357
N053.28.18.628 W001.00.23.322
N053.28.18.400 W001.00.23.341
N053.27.48.102 W001.00.39.513
N053.27.48.072 W001.00.39.618
N053.27.47.724 W001.00.39.951
N053.27.47.617 W001.00.40.286
N053.27.47.559 W001.00.40.591
N053.27.47.578 W001.00.40.871
N053.27.47.626 W001.00.41.183
N053.27.47.703 W001.00.41.587
N053.27.47.790 W001.00.41.921
N053.27.47.918 W001.00.42.307
N053.27.48.128 W001.00.42.872
N053.27.48.322 W001.00.43.339
N053.27.48.477 W001.00.43.699
N053.27.48.709 W001.00.44.032
N053.27.48.918 W001.00.44.335
N053.27.49.137 W001.00.44.626
N053.27.49.376 W001.00.44.871
N053.27.49.637 W001.00.45.149
N053.27.49.872 W001.00.45.347
N053.27.50.122 W001.00.45.506
N053.27.50.465 W001.00.45.678
N053.27.50.838 W001.00.45.812
N053.27.51.206 W001.00.45.911
N053.27.51.529 W001.00.45.938
N053.27.51.939 W001.00.45.924
N053.27.52.255 W001.00.45.826
N053.27.52.747 W001.00.45.630
N053.27.53.315 W001.00.45.388
N053.28.22.981 W001.00.29.621

;Fire_Training_Loop_1
REGIONNAME Doncaster
smrGrass N053.28.05.484 W001.00.42.160
N053.28.08.515 W001.00.40.555
N053.28.08.565 W001.00.40.360
N053.28.08.561 W001.00.40.135
N053.28.08.528 W001.00.39.870
N053.28.08.477 W001.00.39.570
N053.28.08.391 W001.00.39.281
N053.28.08.268 W001.00.39.050
N053.28.08.124 W001.00.38.894
N053.28.07.969 W001.00.38.790
N053.28.07.855 W001.00.38.764
N053.28.07.793 W001.00.38.741
N053.28.05.596 W001.00.39.892
N053.28.05.457 W001.00.40.072
N053.28.05.361 W001.00.40.233
N053.28.05.289 W001.00.40.400
N053.28.05.247 W001.00.40.599
N053.28.05.203 W001.00.40.837
N053.28.05.200 W001.00.41.030
N053.28.05.209 W001.00.41.237
N053.28.05.253 W001.00.41.531
N053.28.05.286 W001.00.41.674
N053.28.05.351 W001.00.41.879
N053.28.05.404 W001.00.42.016

;Fire_Training_Loop_2
REGIONNAME Doncaster
smrGrass N053.28.10.304 W001.00.40.437
N053.28.10.633 W001.00.39.387
N053.28.11.422 W001.00.39.005
N053.28.11.787 W001.00.39.294
N053.28.11.836 W001.00.39.590
N053.28.11.940 W001.00.39.541
N053.28.12.034 W001.00.39.441
N053.28.12.179 W001.00.39.270
N053.28.12.308 W001.00.39.051
N053.28.12.385 W001.00.38.811
N053.28.12.438 W001.00.38.620
N053.28.12.464 W001.00.38.379
N053.28.12.465 W001.00.38.124
N053.28.12.441 W001.00.37.821
N053.28.12.402 W001.00.37.607
N053.28.12.354 W001.00.37.434
N053.28.12.285 W001.00.37.226
N053.28.12.205 W001.00.37.059
N053.28.12.091 W001.00.36.911
N053.28.11.962 W001.00.36.774
N053.28.11.859 W001.00.36.715
N053.28.11.718 W001.00.36.694
N053.28.11.630 W001.00.36.704
N053.28.09.408 W001.00.37.890
N053.28.09.346 W001.00.38.006
N053.28.09.275 W001.00.38.151
N053.28.09.210 W001.00.38.339
N053.28.09.158 W001.00.38.504
N053.28.09.121 W001.00.38.656
N053.28.09.101 W001.00.38.856
N053.28.09.111 W001.00.39.064
N053.28.09.144 W001.00.39.328
N053.28.09.202 W001.00.39.585
N053.28.09.259 W001.00.39.778
N053.28.09.335 W001.00.39.965
N053.28.09.434 W001.00.40.132
N053.28.09.549 W001.00.40.302
N053.28.09.666 W001.00.40.384
N053.28.09.797 W001.00.40.445
N053.28.09.937 W001.00.40.497
N053.28.10.107 W001.00.40.527

;Engine_Test_Facility_Loop
REGIONNAME Doncaster
smrGrass N053.28.16.963 W001.00.35.071
N053.28.16.948 W001.00.34.867
N053.28.16.963 W001.00.34.683
N053.28.16.981 W001.00.34.472
N053.28.17.019 W001.00.34.265
N053.28.17.061 W001.00.34.109
N053.28.17.138 W001.00.33.941
N053.28.17.216 W001.00.33.825
N053.28.17.314 W001.00.33.699
N053.28.17.363 W001.00.33.643
N053.28.19.479 W001.00.32.535
N053.28.19.583 W001.00.32.532
N053.28.19.678 W001.00.32.559
N053.28.19.758 W001.00.32.606
N053.28.19.852 W001.00.32.666
N053.28.19.928 W001.00.32.729
N053.28.20.011 W001.00.32.820
N053.28.20.077 W001.00.32.909
N053.28.20.109 W001.00.32.963
N053.28.20.162 W001.00.33.117
N053.28.20.209 W001.00.33.276
N053.28.20.249 W001.00.33.439
N053.28.20.291 W001.00.33.682
N053.28.20.321 W001.00.33.987
N053.28.20.300 W001.00.34.260
N053.28.20.263 W001.00.34.483
N053.28.20.219 W001.00.34.696
N053.28.20.162 W001.00.34.869
N053.28.20.065 W001.00.35.064
N053.28.19.960 W001.00.35.243
N053.28.19.862 W001.00.35.383
N053.28.19.696 W001.00.35.503
N053.28.19.037 W001.00.34.931
N053.28.18.243 W001.00.35.363
N053.28.18.062 W001.00.35.960
N053.28.18.111 W001.00.36.269
N053.28.17.966 W001.00.36.345
N053.28.17.840 W001.00.36.363
N053.28.17.705 W001.00.36.344
N053.28.17.578 W001.00.36.306
N053.28.17.461 W001.00.36.228
N053.28.17.355 W001.00.36.111
N053.28.17.275 W001.00.36.008
N053.28.17.187 W001.00.35.870
N053.28.17.128 W001.00.35.718
N053.28.17.059 W001.00.35.538
N053.28.17.002 W001.00.35.325

;A_C_E_F
REGIONNAME Doncaster
smrGrass N053.28.49.225 W001.00.21.212
N053.28.48.947 W001.00.17.980
N053.28.48.984 W001.00.17.743
N053.28.49.069 W001.00.17.662
N053.28.49.061 W001.00.17.610
N053.28.50.902 W001.00.15.905
N053.28.50.894 W001.00.15.797
N053.28.58.012 W001.00.11.975
N053.28.58.123 W001.00.11.951
N053.28.58.258 W001.00.11.968
N053.28.58.340 W001.00.11.994
N053.28.58.444 W001.00.12.030
N053.28.58.535 W001.00.12.106
N053.28.58.627 W001.00.12.204
N053.28.58.713 W001.00.12.328
N053.28.58.812 W001.00.12.492
N053.28.58.884 W001.00.12.650
N053.28.58.933 W001.00.12.882
N053.28.58.971 W001.00.13.070
N053.28.58.985 W001.00.13.252
N053.28.58.995 W001.00.13.455
N053.28.58.974 W001.00.13.663
N053.28.58.954 W001.00.13.847
N053.28.59.250 W001.00.15.398
N053.28.59.334 W001.00.15.348
N053.28.59.423 W001.00.15.460
N053.28.59.590 W001.00.16.401
N053.28.59.623 W001.00.16.622
N053.28.59.640 W001.00.16.857
N053.28.59.630 W001.00.17.073
N053.28.59.602 W001.00.17.189
N053.28.59.970 W001.00.19.168
N053.29.00.213 W001.00.19.304
N053.29.00.375 W001.00.19.421
N053.29.00.535 W001.00.19.588
N053.29.00.665 W001.00.19.740
N053.29.00.891 W001.00.20.070
N053.29.01.614 W001.00.21.853
N053.28.58.357 W001.00.32.387
N053.28.57.917 W001.00.32.634
N053.28.55.325 W001.00.33.989
N053.28.53.918 W001.00.26.663
N053.28.51.335 W001.00.28.007
N053.28.51.216 W001.00.28.017
N053.28.51.158 W001.00.27.976
N053.28.51.095 W001.00.27.895
N053.28.50.462 W001.00.26.128
N053.28.50.054 W001.00.25.030
N053.28.49.584 W001.00.22.969
N053.28.49.297 W001.00.21.585

;E_D_Disused
REGIONNAME Doncaster
smrGrass N053.29.00.297 W001.00.16.144
N053.28.59.569 W001.00.12.339
N053.28.59.552 W001.00.12.110
N053.28.59.553 W001.00.11.876
N053.28.59.598 W001.00.11.652
N053.28.59.655 W001.00.11.469
N053.28.59.732 W001.00.11.295
N053.28.59.836 W001.00.11.127
N053.28.59.933 W001.00.11.016
N053.29.00.025 W001.00.10.908
N053.29.00.291 W001.00.10.772
N053.29.06.883 W001.00.07.242
N053.29.07.155 W001.00.07.161
N053.29.07.281 W001.00.07.137
N053.29.07.710 W001.00.06.958
N053.29.07.861 W001.00.06.961
N053.29.07.998 W001.00.07.018
N053.29.08.126 W001.00.07.088
N053.29.08.233 W001.00.07.188
N053.29.08.341 W001.00.07.321
N053.29.08.455 W001.00.07.504
N053.29.08.548 W001.00.07.704
N053.29.08.677 W001.00.08.227
N053.29.08.724 W001.00.08.213
N053.29.09.597 W001.00.12.761
N053.29.09.698 W001.00.13.447
N053.29.09.765 W001.00.13.996
N053.29.09.771 W001.00.14.508
N053.29.09.792 W001.00.15.121
N053.29.09.768 W001.00.15.769
N053.29.09.743 W001.00.16.279
N053.29.09.657 W001.00.16.907
N053.29.09.574 W001.00.17.416
N053.29.09.435 W001.00.18.119
N053.29.09.250 W001.00.18.734
N053.29.09.083 W001.00.19.256
N053.29.08.856 W001.00.19.750
N053.29.08.605 W001.00.20.287
N053.29.08.377 W001.00.20.691
N053.29.08.241 W001.00.20.901
N053.29.08.125 W001.00.20.965
N053.29.07.966 W001.00.20.965
N053.29.07.835 W001.00.20.804
N053.29.07.428 W001.00.19.893
N053.29.07.420 W001.00.19.065
N053.29.07.627 W001.00.18.695
N053.29.07.657 W001.00.18.508
N053.29.07.648 W001.00.18.330
N053.29.07.621 W001.00.18.165
N053.29.06.954 W001.00.16.684
N053.29.06.865 W001.00.16.581
N053.29.06.774 W001.00.16.521
N053.29.06.664 W001.00.16.520
N053.29.06.563 W001.00.16.554
N053.29.06.377 W001.00.16.766
N053.29.05.926 W001.00.16.542
N053.29.05.812 W001.00.16.271
N053.29.05.657 W001.00.16.453
N053.29.05.764 W001.00.16.729
N053.29.05.763 W001.00.17.541
N053.29.05.614 W001.00.17.730
N053.29.05.578 W001.00.17.838
N053.29.05.544 W001.00.18.000
N053.29.05.540 W001.00.18.122
N053.29.05.527 W001.00.18.259
N053.29.05.558 W001.00.18.385
N053.29.05.595 W001.00.18.549
N053.29.06.246 W001.00.19.955
N053.29.06.380 W001.00.20.069
N053.29.06.499 W001.00.20.103
N053.29.06.589 W001.00.20.061
N053.29.06.730 W001.00.19.952
N053.29.06.808 W001.00.19.838
N053.29.07.204 W001.00.20.025
N053.29.07.708 W001.00.21.028
N053.29.07.725 W001.00.21.235
N053.29.07.720 W001.00.21.404
N053.29.07.692 W001.00.21.548
N053.29.07.643 W001.00.21.649
N053.29.05.266 W001.00.24.365
N053.29.04.827 W001.00.24.611
N053.29.04.462 W001.00.24.671
N053.29.04.156 W001.00.24.624
N053.29.03.874 W001.00.24.521
N053.29.03.598 W001.00.24.363
N053.29.03.351 W001.00.24.128
N053.29.03.155 W001.00.23.875
N053.29.03.010 W001.00.23.624
N053.29.02.858 W001.00.23.358
N053.29.02.818 W001.00.23.121
N053.29.01.932 W001.00.20.971
N053.29.01.887 W001.00.20.960
N053.29.00.907 W001.00.18.549
N053.29.00.808 W001.00.18.263
N053.29.00.734 W001.00.18.033
N053.29.00.376 W001.00.16.231
N053.29.00.351 W001.00.16.118

;15_16
REGIONNAME Doncaster
smrGrass N053.29.07.498 W001.00.23.212
N053.29.09.468 W001.00.28.065
N053.29.09.562 W001.00.28.013
N053.29.09.640 W001.00.27.957
N053.29.09.700 W001.00.27.815
N053.29.09.762 W001.00.27.645
N053.29.09.826 W001.00.27.439
N053.29.09.857 W001.00.27.269
N053.29.09.867 W001.00.26.997
N053.29.09.852 W001.00.26.744
N053.29.09.816 W001.00.26.501
N053.29.09.749 W001.00.26.258
N053.29.09.481 W001.00.25.608
N053.29.09.431 W001.00.25.639
N053.29.08.809 W001.00.25.496
N053.29.08.308 W001.00.24.376
N053.29.08.353 W001.00.23.678
N053.29.08.518 W001.00.23.460
N053.29.08.139 W001.00.22.643
N053.29.07.990 W001.00.22.594

;14_15
REGIONNAME Doncaster
smrGrass N053.29.09.006 W001.00.22.877
N053.29.09.148 W001.00.22.689
N053.29.09.567 W001.00.22.786
N053.29.10.085 W001.00.23.932
N053.29.09.966 W001.00.25.039
N053.29.10.226 W001.00.25.661
N053.29.10.397 W001.00.25.852
N053.29.10.570 W001.00.25.986
N053.29.10.771 W001.00.26.032
N053.29.10.955 W001.00.26.025
N053.29.11.123 W001.00.25.969
N053.29.11.334 W001.00.25.794
N053.29.11.471 W001.00.25.591
N053.29.11.620 W001.00.25.289
N053.29.11.705 W001.00.25.053
N053.29.11.752 W001.00.24.779
N053.29.11.773 W001.00.24.449
N053.29.11.755 W001.00.24.175
N053.29.11.700 W001.00.23.915
N053.29.11.619 W001.00.23.651
N053.29.11.503 W001.00.23.445
N053.29.11.176 W001.00.23.031
N053.29.10.507 W001.00.23.204
N053.29.09.811 W001.00.22.330
N053.29.09.739 W001.00.21.723
N053.29.09.865 W001.00.21.430
N053.29.09.333 W001.00.20.798
N053.29.09.199 W001.00.20.791
N053.29.09.025 W001.00.21.139
N053.29.08.939 W001.00.21.389
N053.29.08.880 W001.00.21.638
N053.29.08.840 W001.00.21.895
N053.29.08.843 W001.00.22.161
N053.29.08.862 W001.00.22.406
N053.29.08.892 W001.00.22.613

;13_14
REGIONNAME Doncaster
smrGrass N053.29.11.517 W001.00.22.206
N053.29.11.415 W001.00.21.098
N053.29.10.737 W001.00.20.269
N053.29.10.342 W001.00.20.383
N053.29.10.221 W001.00.20.647
N053.29.10.096 W001.00.20.524
N053.29.10.030 W001.00.20.347
N053.29.09.958 W001.00.20.136
N053.29.09.884 W001.00.19.897
N053.29.09.854 W001.00.19.695
N053.29.09.849 W001.00.19.465
N053.29.09.867 W001.00.19.188
N053.29.09.919 W001.00.18.928
N053.29.09.981 W001.00.18.701
N053.29.10.027 W001.00.18.549
N053.29.10.061 W001.00.18.508
N053.29.10.116 W001.00.18.489
N053.29.10.182 W001.00.18.486
N053.29.10.778 W001.00.18.807
N053.29.10.711 W001.00.19.128
N053.29.10.884 W001.00.19.751
N053.29.11.677 W001.00.20.204
N053.29.12.306 W001.00.19.682
N053.29.12.741 W001.00.19.936
N053.29.12.850 W001.00.20.097
N053.29.12.951 W001.00.20.267
N053.29.13.039 W001.00.20.465
N053.29.13.107 W001.00.20.672
N053.29.13.158 W001.00.20.918
N053.29.13.179 W001.00.21.204
N053.29.13.163 W001.00.21.477
N053.29.13.078 W001.00.21.862
N053.29.12.959 W001.00.22.215
N053.29.12.775 W001.00.22.530
N053.29.12.581 W001.00.22.707
N053.29.12.381 W001.00.22.785
N053.29.12.215 W001.00.22.801
N053.29.12.037 W001.00.22.740
N053.29.11.891 W001.00.22.673
N053.29.11.777 W001.00.22.565

;12_13
REGIONNAME Doncaster
smrGrass N053.29.11.183 W001.00.15.841
N053.29.11.181 W001.00.16.225
N053.29.11.442 W001.00.16.686
N053.29.12.281 W001.00.16.712
N053.29.12.810 W001.00.15.907
N053.29.13.203 W001.00.15.930
N053.29.13.389 W001.00.16.054
N053.29.13.541 W001.00.16.173
N053.29.13.664 W001.00.16.346
N053.29.13.771 W001.00.16.559
N053.29.13.861 W001.00.16.811
N053.29.13.915 W001.00.17.105
N053.29.13.917 W001.00.17.332
N053.29.13.908 W001.00.17.592
N053.29.13.855 W001.00.17.937
N053.29.13.802 W001.00.18.218
N053.29.13.656 W001.00.18.541
N053.29.13.458 W001.00.18.781
N053.29.13.259 W001.00.18.913
N053.29.13.088 W001.00.18.959
N053.29.12.931 W001.00.18.956
N053.29.12.764 W001.00.18.905
N053.29.12.498 W001.00.18.760
N053.29.12.185 W001.00.17.698
N053.29.11.381 W001.00.17.248
N053.29.11.029 W001.00.17.558
N053.29.10.976 W001.00.17.867
N053.29.10.871 W001.00.17.833
N053.29.10.765 W001.00.17.725
N053.29.10.682 W001.00.17.614
N053.29.10.574 W001.00.17.414
N053.29.10.504 W001.00.17.234
N053.29.10.440 W001.00.17.025
N053.29.10.407 W001.00.16.842
N053.29.10.384 W001.00.16.679
N053.29.10.379 W001.00.16.544
N053.29.10.388 W001.00.16.405
N053.29.10.405 W001.00.16.176
N053.29.10.442 W001.00.15.983
N053.29.10.475 W001.00.15.894
N053.29.10.518 W001.00.15.841
N053.29.10.551 W001.00.15.828

;11_12
REGIONNAME Doncaster
smrGrass N053.29.11.443 W001.00.13.477
N053.29.12.249 W001.00.13.098
N053.29.12.577 W001.00.12.085
N053.29.12.630 W001.00.12.035
N053.29.12.945 W001.00.11.895
N053.29.13.089 W001.00.11.891
N053.29.13.242 W001.00.11.930
N053.29.13.420 W001.00.12.021
N053.29.13.568 W001.00.12.161
N053.29.13.701 W001.00.12.336
N053.29.13.796 W001.00.12.522
N053.29.13.875 W001.00.12.696
N053.29.13.906 W001.00.12.840
N053.29.13.949 W001.00.13.538
N053.29.13.941 W001.00.13.850
N053.29.13.874 W001.00.14.143
N053.29.13.767 W001.00.14.417
N053.29.13.627 W001.00.14.632
N053.29.13.472 W001.00.14.810
N053.29.13.314 W001.00.14.890
N053.29.13.158 W001.00.14.949
N053.29.12.810 W001.00.14.933
N053.29.12.333 W001.00.14.107
N053.29.11.478 W001.00.14.046
N053.29.11.204 W001.00.14.525
N053.29.11.198 W001.00.14.844
N053.29.11.040 W001.00.14.841
N053.29.10.913 W001.00.14.753
N053.29.10.801 W001.00.14.648
N053.29.10.664 W001.00.14.486
N053.29.10.556 W001.00.14.287
N053.29.10.479 W001.00.14.096
N053.29.10.431 W001.00.13.930
N053.29.10.384 W001.00.13.694
N053.29.10.348 W001.00.13.394
N053.29.10.335 W001.00.13.189
N053.29.10.415 W001.00.13.106
N053.29.11.017 W001.00.12.820
N053.29.11.085 W001.00.13.158

;D_11
REGIONNAME Doncaster
smrGrass N053.29.09.943 W001.00.11.206
N053.29.09.215 W001.00.07.165
N053.29.09.244 W001.00.06.783
N053.29.09.309 W001.00.06.504
N053.29.09.402 W001.00.06.232
N053.29.09.383 W001.00.06.142
N053.29.09.606 W001.00.05.795
N053.29.09.855 W001.00.05.646
N053.29.10.106 W001.00.05.544
N053.29.10.327 W001.00.05.482
N053.29.10.561 W001.00.05.437
N053.29.10.926 W001.00.05.488
N053.29.11.283 W001.00.05.633
N053.29.11.742 W001.00.05.850
N053.29.12.116 W001.00.06.129
N053.29.12.440 W001.00.06.414
N053.29.12.689 W001.00.06.796
N053.29.12.909 W001.00.07.299
N053.29.13.041 W001.00.07.691
N053.29.13.158 W001.00.08.178
N053.29.13.256 W001.00.08.686
N053.29.13.404 W001.00.09.485
N053.29.13.354 W001.00.09.846
N053.29.13.280 W001.00.10.174
N053.29.13.174 W001.00.10.486
N053.29.13.028 W001.00.10.699
N053.29.12.835 W001.00.10.908
N053.29.12.676 W001.00.10.989
N053.29.12.476 W001.00.11.090
N053.29.12.394 W001.00.11.118
N053.29.11.829 W001.00.10.557
N053.29.11.000 W001.00.10.936
N053.29.10.809 W001.00.11.553
N053.29.10.857 W001.00.11.849
N053.29.10.705 W001.00.11.885
N053.29.10.609 W001.00.11.892
N053.29.10.451 W001.00.11.836
N053.29.10.291 W001.00.11.741
N053.29.10.145 W001.00.11.603
N053.29.10.038 W001.00.11.437

;F_E3
REGIONNAME Doncaster
smrGrass N053.28.59.302 W001.00.34.747
N053.29.02.427 W001.00.24.590
N053.29.02.471 W001.00.24.650
N053.29.02.583 W001.00.24.284
N053.29.02.854 W001.00.25.070
N053.29.03.008 W001.00.25.604
N053.29.03.134 W001.00.26.148
N053.29.03.298 W001.00.26.858
N053.29.03.406 W001.00.27.527
N053.29.03.478 W001.00.28.204
N053.29.03.549 W001.00.28.775
N053.29.03.667 W001.00.29.320
N053.29.04.358 W001.00.31.198
N053.29.04.468 W001.00.31.718
N053.29.04.517 W001.00.32.096
N053.29.04.526 W001.00.32.544
N053.29.04.522 W001.00.32.950
N053.29.04.483 W001.00.33.357
N053.29.04.428 W001.00.33.710
N053.29.04.372 W001.00.33.863
N053.29.04.301 W001.00.33.942
N053.29.02.872 W001.00.32.754
N053.29.03.024 W001.00.32.208
N053.29.02.208 W001.00.31.528
N053.29.02.147 W001.00.31.534
N053.29.01.507 W001.00.31.909
N053.29.01.429 W001.00.32.144
N053.29.01.490 W001.00.32.509
N053.29.01.303 W001.00.32.843
N053.29.01.205 W001.00.33.121
N053.29.01.113 W001.00.33.448
N053.29.01.025 W001.00.33.857
N053.29.00.944 W001.00.34.235
N053.29.00.853 W001.00.34.627
N053.29.00.760 W001.00.34.923
N053.29.00.671 W001.00.35.148
N053.29.00.627 W001.00.35.202
N053.29.00.562 W001.00.35.159
N053.29.00.003 W001.00.34.634
N053.28.59.826 W001.00.35.234

;Misc
REGIONNAME Doncaster
smrGrass N053.29.02.658 W001.00.33.508
N053.29.03.848 W001.00.34.479
N053.29.03.868 W001.00.34.790
N053.29.02.406 W001.00.36.472
N053.29.02.293 W001.00.36.681
N053.29.02.215 W001.00.36.904
N053.29.02.170 W001.00.37.048
N053.29.02.050 W001.00.37.201
N053.29.01.914 W001.00.37.237
N053.29.01.819 W001.00.37.261
N053.29.00.808 W001.00.36.414
N053.29.00.710 W001.00.36.255
N053.29.00.676 W001.00.36.100
N053.29.00.664 W001.00.35.945
N053.29.00.679 W001.00.35.778
N053.29.00.810 W001.00.35.354
N053.29.00.987 W001.00.34.788
N053.29.01.053 W001.00.34.436
N053.29.01.165 W001.00.33.892
N053.29.01.267 W001.00.33.518
N053.29.01.372 W001.00.33.120
N053.29.01.514 W001.00.32.832
N053.29.01.552 W001.00.32.779
N053.29.01.667 W001.00.33.364
N053.29.02.497 W001.00.34.038

;Misc2
REGIONNAME Doncaster
smrGrass N053.29.04.034 W001.00.35.626
N053.29.05.786 W001.00.33.605
N053.29.05.894 W001.00.33.619
N053.29.05.968 W001.00.33.697
N053.29.06.151 W001.00.34.462
N053.29.06.148 W001.00.34.655
N053.29.05.964 W001.00.34.810
N053.29.05.357 W001.00.35.161
N053.29.04.661 W001.00.35.497
N053.29.04.112 W001.00.35.699
N053.29.04.075 W001.00.35.697

;Hangar3_1
REGIONNAME Doncaster
smrGrass N053.29.06.669 W001.00.33.954
N053.29.06.586 W001.00.33.402
N053.29.06.623 W001.00.33.021
N053.29.06.699 W001.00.32.732
N053.29.06.845 W001.00.32.452
N053.29.07.140 W001.00.32.078
N053.29.09.373 W001.00.29.566
N053.29.09.520 W001.00.29.487
N053.29.09.687 W001.00.29.449
N053.29.09.920 W001.00.29.524
N053.29.10.040 W001.00.29.621
N053.29.10.113 W001.00.29.688
N053.29.10.318 W001.00.30.068
N053.29.10.335 W001.00.30.304
N053.29.10.304 W001.00.30.449
N053.29.10.228 W001.00.30.591
N053.29.09.578 W001.00.31.459
N053.29.08.680 W001.00.32.497
N053.29.08.029 W001.00.33.146
N053.29.07.595 W001.00.33.573
N053.29.07.230 W001.00.33.890
N053.29.06.870 W001.00.34.194
N053.29.06.799 W001.00.34.222
N053.29.06.737 W001.00.34.137

;Hangar3_2
REGIONNAME Doncaster
smrGrass N053.29.07.079 W001.00.35.552
N053.29.06.975 W001.00.35.193
N053.29.06.949 W001.00.34.954
N053.29.06.984 W001.00.34.859
N053.29.07.020 W001.00.34.800
N053.29.07.029 W001.00.34.790
N053.29.08.131 W001.00.33.817
N053.29.08.709 W001.00.33.247
N053.29.09.276 W001.00.32.631
N053.29.09.958 W001.00.31.792
N053.29.10.540 W001.00.30.942
N053.29.10.606 W001.00.30.911
N053.29.10.662 W001.00.30.909
N053.29.10.725 W001.00.30.988
N053.29.10.753 W001.00.31.029
N053.29.10.838 W001.00.31.406
N053.29.10.871 W001.00.31.863
N053.29.10.877 W001.00.32.300
N053.29.10.814 W001.00.32.808
N053.29.10.725 W001.00.33.213
N053.29.10.603 W001.00.33.537
N053.29.10.509 W001.00.33.712
N053.29.10.253 W001.00.32.998
N053.29.07.600 W001.00.35.748
N053.29.07.717 W001.00.36.061
N053.29.07.540 W001.00.36.219
N053.29.07.501 W001.00.36.020
N053.29.07.372 W001.00.36.104
N053.29.07.232 W001.00.35.949
N053.29.07.156 W001.00.35.762

;Hangar2
REGIONNAME Doncaster
smrGrass N053.29.10.887 W001.00.27.755
N053.29.11.465 W001.00.27.012
N053.29.11.930 W001.00.26.244
N053.29.12.458 W001.00.25.249
N053.29.12.890 W001.00.24.365
N053.29.13.103 W001.00.23.997
N053.29.13.215 W001.00.23.893
N053.29.13.408 W001.00.23.818
N053.29.13.580 W001.00.23.804
N053.29.13.793 W001.00.23.958
N053.29.14.048 W001.00.24.138
N053.29.14.282 W001.00.24.377
N053.29.14.435 W001.00.24.615
N053.29.14.555 W001.00.24.938
N053.29.14.630 W001.00.25.286
N053.29.14.642 W001.00.25.614
N053.29.14.260 W001.00.25.136
N053.29.12.513 W001.00.29.489
N053.29.12.828 W001.00.29.985
N053.29.12.555 W001.00.30.267
N053.29.12.275 W001.00.30.372
N053.29.11.933 W001.00.30.470
N053.29.11.601 W001.00.30.398
N053.29.11.281 W001.00.30.208
N053.29.11.065 W001.00.29.866
N053.29.10.864 W001.00.29.607
N053.29.10.689 W001.00.29.252
N053.29.10.639 W001.00.28.965
N053.29.10.635 W001.00.28.764
N053.29.10.650 W001.00.28.459
N053.29.10.687 W001.00.28.228
N053.29.10.764 W001.00.28.020

;Hangar1
REGIONNAME Doncaster
smrGrass N053.29.13.768 W001.00.22.034
N053.29.13.877 W001.00.21.523
N053.29.14.066 W001.00.20.688
N053.29.14.220 W001.00.19.890
N053.29.14.357 W001.00.19.075
N053.29.14.494 W001.00.18.030
N053.29.14.528 W001.00.17.541
N053.29.14.542 W001.00.17.449
N053.29.14.733 W001.00.16.954
N053.29.14.903 W001.00.16.708
N053.29.15.034 W001.00.16.647
N053.29.15.142 W001.00.16.583
N053.29.15.404 W001.00.16.635
N053.29.15.583 W001.00.16.646
N053.29.15.780 W001.00.16.772
N053.29.15.865 W001.00.16.864
N053.29.16.002 W001.00.17.068
N053.29.16.052 W001.00.17.175
N053.29.15.906 W001.00.17.905
N053.29.15.797 W001.00.17.897
N053.29.14.912 W001.00.22.788
N053.29.15.337 W001.00.23.016
N053.29.15.281 W001.00.23.221
N053.29.15.089 W001.00.23.367
N053.29.14.824 W001.00.23.498
N053.29.14.587 W001.00.23.461
N053.29.14.344 W001.00.23.310
N053.29.14.120 W001.00.23.100
N053.29.13.959 W001.00.22.921
N053.29.13.883 W001.00.22.731
N053.29.13.821 W001.00.22.522
N053.29.13.790 W001.00.22.332
N053.29.13.777 W001.00.22.187

;Misc3
REGIONNAME Doncaster
smrGrass N053.29.20.356 W001.00.09.667
N053.29.20.102 W001.00.09.326
N053.29.19.947 W001.00.08.848
N053.29.19.898 W001.00.08.517
N053.29.19.897 W001.00.08.229
N053.29.19.965 W001.00.07.859
N053.29.20.075 W001.00.07.597
N053.29.20.199 W001.00.07.418
N053.29.20.371 W001.00.07.250
N053.29.20.493 W001.00.07.205
N053.29.22.725 W001.00.06.804
N053.29.22.927 W001.00.06.919
N053.29.23.124 W001.00.07.119
N053.29.23.252 W001.00.07.405
N053.29.23.364 W001.00.07.794
N053.29.23.397 W001.00.08.167
N053.29.23.380 W001.00.08.509
N053.29.23.280 W001.00.08.830
N053.29.23.149 W001.00.09.186
N053.29.22.927 W001.00.09.427
N053.29.22.682 W001.00.09.498
N053.29.22.585 W001.00.09.502
N053.29.22.535 W001.00.08.664
N053.29.22.008 W001.00.08.585
N053.29.20.761 W001.00.08.741
N053.29.20.352 W001.00.09.048

;main_apron
REGIONNAME Doncaster
smrDarkApron N053.28.42.671 W001.00.40.306
N053.28.42.594 W001.00.40.269
N053.28.42.526 W001.00.40.171
N053.28.42.473 W001.00.40.059
N053.28.41.948 W001.00.37.257
N053.28.41.927 W001.00.37.145
N053.28.41.932 W001.00.37.046
N053.28.41.961 W001.00.36.935
N053.28.41.999 W001.00.36.839
N053.28.42.047 W001.00.36.750
N053.28.42.077 W001.00.36.735
N053.28.54.101 W001.00.30.343
N053.28.54.181 W001.00.30.336
N053.28.54.233 W001.00.30.358
N053.28.54.295 W001.00.30.405
N053.28.54.350 W001.00.30.485
N053.28.54.386 W001.00.30.584
N053.28.54.922 W001.00.33.404
N053.28.54.932 W001.00.33.516
N053.28.54.916 W001.00.33.640
N053.28.54.888 W001.00.33.743
N053.28.54.844 W001.00.33.854
N053.28.54.794 W001.00.33.901
N053.28.42.776 W001.00.40.297

;16to18
REGIONNAME Doncaster
smrDarkApron N053.29.03.662 W001.00.29.223
N053.29.07.927 W001.00.24.366
N053.29.09.474 W001.00.28.179
N053.29.05.342 W001.00.33.481

;15
REGIONNAME Doncaster
smrDarkApron N053.29.08.835 W001.00.25.467
N053.29.09.404 W001.00.25.590
N053.29.09.938 W001.00.24.951
N053.29.10.039 W001.00.23.970
N053.29.09.559 W001.00.22.870
N053.29.09.171 W001.00.22.754
N053.29.08.402 W001.00.23.685
N053.29.08.337 W001.00.24.336

;14
REGIONNAME Doncaster
smrDarkApron N053.29.09.784 W001.00.21.756
N053.29.09.833 W001.00.22.249
N053.29.10.508 W001.00.23.108
N053.29.11.134 W001.00.22.934
N053.29.11.465 W001.00.22.194
N053.29.11.373 W001.00.21.137
N053.29.10.738 W001.00.20.348
N053.29.10.347 W001.00.20.465

;13
REGIONNAME Doncaster
smrDarkApron N053.29.10.768 W001.00.19.127
N053.29.11.056 W001.00.17.648
N053.29.11.389 W001.00.17.328
N053.29.12.153 W001.00.17.762
N053.29.12.444 W001.00.18.732
N053.29.12.267 W001.00.19.607
N053.29.11.657 W001.00.20.086
N053.29.10.918 W001.00.19.670

;12
REGIONNAME Doncaster
smrDarkApron N053.29.11.224 W001.00.16.164
N053.29.11.253 W001.00.14.542
N053.29.11.489 W001.00.14.143
N053.29.12.308 W001.00.14.172
N053.29.12.747 W001.00.14.971
N053.29.12.749 W001.00.15.859
N053.29.12.252 W001.00.16.627
N053.29.11.450 W001.00.16.585

;11
REGIONNAME Doncaster
smrDarkApron N053.29.11.106 W001.00.13.036
N053.29.10.853 W001.00.11.575
N053.29.11.013 W001.00.11.039
N053.29.11.818 W001.00.10.642
N053.29.12.357 W001.00.11.145
N053.29.12.531 W001.00.12.085
N053.29.12.215 W001.00.13.007
N053.29.11.445 W001.00.13.376

;control_tower
REGIONNAME Doncaster
smrBuilding N053.28.53.831 W000.59.46.075
N053.28.53.733 W000.59.45.525
N053.28.54.018 W000.59.45.362
N053.28.53.932 W000.59.44.825
N053.28.54.391 W000.59.44.546
N053.28.54.627 W000.59.45.763
N053.28.54.479 W000.59.45.869
N053.28.54.467 W000.59.45.765

;radar
REGIONNAME Doncaster
smrBuilding N053.28.46.280 W000.59.50.738
N053.28.46.227 W000.59.49.265
N053.28.46.821 W000.59.49.224
N053.28.46.846 W000.59.50.710

;fire_station
REGIONNAME Doncaster
smrBuilding N053.28.43.088 W000.59.55.062
N053.28.42.921 W000.59.54.126
N053.28.43.730 W000.59.53.670
N053.28.43.559 W000.59.52.771
N053.28.43.981 W000.59.52.538
N053.28.44.335 W000.59.54.456
N053.28.43.900 W000.59.54.725
N053.28.43.884 W000.59.54.641

;terminal_building
REGIONNAME Doncaster
smrBuilding N053.28.49.565 W001.00.41.665
N053.28.48.938 W001.00.38.113
N053.28.52.272 W001.00.36.328
N053.28.52.955 W001.00.39.776

;hangar_1
REGIONNAME Doncaster
smrBuilding N053.29.14.968 W001.00.22.731
N053.29.15.821 W001.00.17.927
N053.29.17.486 W001.00.18.822
N053.29.16.614 W001.00.23.612

;hangar_2
REGIONNAME Doncaster
smrBuilding N053.29.14.064 W001.00.30.989
N053.29.12.679 W001.00.29.411
N053.29.14.291 W001.00.25.392
N053.29.15.692 W001.00.26.982

;hangar_3
REGIONNAME Doncaster
smrBuilding N053.29.08.657 W001.00.38.287
N053.29.07.719 W001.00.35.870
N053.29.10.242 W001.00.33.247
N053.29.11.104 W001.00.35.564

;hangar_4
REGIONNAME Doncaster
smrBuilding N053.29.03.785 W001.00.40.973
N053.29.03.353 W001.00.38.033
N053.29.06.214 W001.00.36.865
N053.29.06.630 W001.00.39.776

;building_1
REGIONNAME Doncaster
smrBuilding N053.29.02.679 W001.00.58.536
N053.29.02.630 W001.00.57.847
N053.29.03.057 W001.00.57.778
N053.29.03.128 W001.00.58.534

;building_2
REGIONNAME Doncaster
smrBuilding N053.29.02.343 W001.00.55.312
N053.29.02.249 W001.00.54.495
N053.29.02.638 W001.00.54.412
N053.29.02.654 W001.00.55.202

;building_3
REGIONNAME Doncaster
smrBuilding N053.29.04.569 W001.00.45.951
N053.29.04.255 W001.00.43.494
N053.29.07.082 W001.00.42.494
N053.29.07.461 W001.00.44.904

;building_4
REGIONNAME Doncaster
smrBuilding N053.28.59.251 W001.00.39.438
N053.28.57.467 W001.00.37.736
N053.28.57.687 W001.00.36.955
N053.28.58.586 W001.00.37.755
N053.28.58.609 W001.00.37.147
N053.28.58.781 W001.00.37.037
N053.28.58.861 W001.00.36.765
N053.28.57.980 W001.00.35.960
N053.28.58.280 W001.00.34.915
N053.29.00.242 W001.00.36.703
N053.28.59.847 W001.00.38.123
N053.28.59.660 W001.00.38.073

;disused
REGIONNAME Doncaster
smrGrey N053.29.01.907 W001.00.20.981
N053.29.04.960 W001.00.11.004
N053.29.06.962 W001.00.09.927
N053.29.02.844 W001.00.23.303