[
  {
    "id": 1,
    "firstName": "John",
    "lastName": "Doe",
    "email": "john.doe@gmail.com",
    "orders": [
      {
        "id": "87109d1c-9576-4679-b826-0431035c8015",
        "orderPrice": 100,
        "products": [
          {
            "id": "cae5a3f3-3278-493f-ba5c-cba789e06d68",
            "productName": "Non Iron Radcliffe Slim Fit Navy Chino",
            "productDescription": "Our best-selling casual trouser with Max Performance technology, the Non Iron Slim Fit Navy Radcliffe Chino is the essential trouser for daily wear. The fabric composition is 97% cotton and 3% elastane for stretch and movement. The stretch waistband adds comfort. The anti-fade, anti-pilling fabric keeps colours strong and the material smooth to the touch for longer. With anti-shrink technology, it can be washed with confidence. Non-iron for express dressing and easy maintenance.",
            "productPrice": 100,
            "categoryName": "Trousers",
            "productRating": 4.5,
            "productReviews": []
          }
        ],
        "purchaseDate": "2021-03-30T11:04:28.836Z",
        "buyerId": "TBQ91238212",
        "discount": 0,
        "totalTax": 100
      }
    ],
    "signUpDate": "2020-03-30T11:04:28.836Z",
    "lastLoginDate": "2021-02-20T11:04:28.836Z",
    "refererId": "RF0129321",
    "partnerCode": "C0912832",
    "firebaseCloudMessagingToken": ""
  },
  {
    "id": 2,
    "firstName": "John",
    "lastName": "Doe",
    "email": "john.doe@gmail.com",
    "orders": [
      {
        "id": "8adeb24e-acb9-4e36-af66-5365cb0d64d1",
        "orderPrice": 1000,
        "products": [
          {
            "id": "8b0cf79f-b578-4eb8-890a-1afdca735062",
            "productName": "Non-Iron White Twill Slim Fit Shirt",
            "productDescription": "Quality you can see and feel. Our ultimate non-iron shirt has a superior suppleness for incredible comfort to keep you looking the business all day.",
            "productPrice": 1000,
            "categoryName": "Shirts",
            "productRating": 4.2,
            "productReviews": []
          }
        ],
        "purchaseDate": "2021-03-11T11:04:28.836Z",
        "buyerId": "TBQ91238212",
        "discount": 0.05,
        "totalTax": 100
      }
    ],
    "signUpDate": "2020-03-12:04:28.836Z",
    "lastLoginDate": "2021-02-15T11:04:28.836Z",
    "refererId": "RF0129321",
    "partnerCode": "C0912832",
    "firebaseCloudMessagingToken": ""
  },
  {
    "id": 3,
    "firstName": "John",
    "lastName": "Doe",
    "email": "john.doe@gmail.com",
    "orders": [
      {
        "id": "87109d1c-9576-4679-b826-0431035c8015",
        "orderPrice": 3000,
        "products": [
          {
            "id": "cae5a3f3-3278-493f-ba5c-cba789e06d68",
            "productName": "Non Iron Radcliffe Slim Fit Navy Chino",
            "productDescription": "Our best-selling casual trouser with Max Performance technology, the Non Iron Slim Fit Navy Radcliffe Chino is the essential trouser for daily wear. The fabric composition is 97% cotton and 3% elastane for stretch and movement. The stretch waistband adds comfort. The anti-fade, anti-pilling fabric keeps colours strong and the material smooth to the touch for longer. With anti-shrink technology, it can be washed with confidence. Non-iron for express dressing and easy maintenance.",
            "productPrice": 3000,
            "categoryName": "Trousers",
            "productRating": 4.5,
            "productReviews": []
          }
        ],
        "purchaseDate": "2021-03-30T11:04:28.836Z",
        "buyerId": "TBQ91238212",
        "discount": 0.1,
        "totalTax": 100
      }
    ],
    "signUpDate": "2020-03-30T11:04:28.836Z",
    "lastLoginDate": "2021-02-20T11:04:28.836Z",
    "refererId": "RF0129321",
    "partnerCode": "C0912832",
    "firebaseCloudMessagingToken": ""
  },
  {
    "id": 4,
    "firstName": "John",
    "lastName": "Doe",
    "email": "john.doe@gmail.com",
    "orders": [
      {
        "id": "8adeb24e-acb9-4e36-af66-5365cb0d64d1",
        "orderPrice": 5000,
        "products": [
          {
            "id": "8b0cf79f-b578-4eb8-890a-1afdca735062",
            "productName": "Non-Iron White Twill Slim Fit Shirt",
            "productDescription": "Quality you can see and feel. Our ultimate non-iron shirt has a superior suppleness for incredible comfort to keep you looking the business all day.",
            "productPrice": 5000,
            "categoryName": "Shirts",
            "productRating": 4.2,
            "productReviews": []
          }
        ],
        "purchaseDate": "2021-03-11T11:04:28.836Z",
        "buyerId": "TBQ91238212",
        "discount": 0.1,
        "totalTax": 100
      }
    ],
    "signUpDate": "2020-03-12:04:28.836Z",
    "lastLoginDate": "2021-02-15T11:04:28.836Z",
    "refererId": "RF0129321",
    "partnerCode": "C0912832",
    "firebaseCloudMessagingToken": ""
  },
  {
    "id": 5,
    "firstName": "John",
    "lastName": "Doe",
    "email": "john.doe@gmail.com",
    "orders": [
      {
        "id": "8adeb24e-acb9-4e36-af66-5365cb0d64d1",
        "orderPrice": 950,
        "products": [
          {
            "id": "8b0cf79f-b578-4eb8-890a-1afdca735062",
            "productName": "Non-Iron White Twill Slim Fit Shirt",
            "productDescription": "Quality you can see and feel. Our ultimate non-iron shirt has a superior suppleness for incredible comfort to keep you looking the business all day.",
            "productPrice": 950,
            "categoryName": "Shirts",
            "productRating": 4.2,
            "productReviews": []
          }
        ],
        "purchaseDate": "2021-03-11T11:04:28.836Z",
        "buyerId": "TBQ91238212",
        "discount": 0.05,
        "totalTax": 100
      }
    ],
    "signUpDate": "2020-03-12:04:28.836Z",
    "lastLoginDate": "2021-02-15T11:04:28.836Z",
    "refererId": "RF0129321",
    "partnerCode": "C0912832",
    "firebaseCloudMessagingToken": ""
  },
  {
    "id": 6,
    "firstName": "John",
    "lastName": "Doe",
    "email": "john.doe@gmail.com",
    "orders": [
      {
        "id": "8adeb24e-acb9-4e36-af66-5365cb0d64d1",
        "orderPrice": 3000,
        "products": [
          {
            "id": "8b0cf79f-b578-4eb8-890a-1afdca735062",
            "productName": "Non-Iron White Twill Slim Fit Shirt",
            "productDescription": "Quality you can see and feel. Our ultimate non-iron shirt has a superior suppleness for incredible comfort to keep you looking the business all day.",
            "productPrice": 3000,
            "categoryName": "Shirts",
            "productRating": 4.2,
            "productReviews": []
          }
        ],
        "purchaseDate": "2021-03-11T11:04:28.836Z",
        "buyerId": "TBQ91238212",
        "discount": 0.1,
        "totalTax": 100
      },
      {
        "id": "8adeb24e-acb9-4e36-af66-5365cb0d64d1",
        "orderPrice": 3000,
        "products": [
          {
            "id": "8b0cf79f-b578-4eb8-890a-1afdca735062",
            "productName": "Non-Iron White Twill Slim Fit Shirt",
            "productDescription": "Quality you can see and feel. Our ultimate non-iron shirt has a superior suppleness for incredible comfort to keep you looking the business all day.",
            "productPrice": 3000,
            "categoryName": "Shirts",
            "productRating": 4.2,
            "productReviews": []
          }
        ],
        "purchaseDate": "2021-03-11T11:04:28.836Z",
        "buyerId": "TBQ91238212",
        "discount": 0.1,
        "totalTax": 100
      }
    ],
    "signUpDate": "2020-03-12:04:28.836Z",
    "lastLoginDate": "2021-02-15T11:04:28.836Z",
    "refererId": "RF0129321",
    "partnerCode": "C0912832",
    "firebaseCloudMessagingToken": ""
  },
  {
    "id": 7,
    "firstName": "John",
    "lastName": "Doe",
    "email": "john.doe@gmail.com",
    "orders": [
      
    ],
    "signUpDate": "2020-03-12:04:28.836Z",
    "lastLoginDate": "2021-02-15T11:04:28.836Z",
    "refererId": "RF0129321",
    "partnerCode": "C0912832",
    "firebaseCloudMessagingToken": ""
  }
]