Started at Fri Apr 29 01:10:50 UTC 2022
Processing build Docker image
Offering build Docker image to Project Build Discarder
Processing Projeto de teste
Offering Projeto de teste to Project Build Discarder
Processing test2
Offering test2 to Project Build Discarder
Finished at Fri Apr 29 01:10:50 UTC 2022. 3ms
Started at Fri Apr 29 02:10:50 UTC 2022
Processing build Docker image
Offering build Docker image to Project Build Discarder
Processing Projeto de teste
Offering Projeto de teste to Project Build Discarder
Processing test2
Offering test2 to Project Build Discarder
Finished at Fri Apr 29 02:10:50 UTC 2022. 5ms
