Started at Wed Apr 27 01:40:07 UTC 2022
Cleaned up 0 records
Finished at Wed Apr 27 01:40:07 UTC 2022. 4ms
Started at Thu Apr 28 01:40:07 UTC 2022
Cleaned up 0 records
Finished at Thu Apr 28 01:40:07 UTC 2022. 1ms
