Started at Thu Apr 28 00:14:59 UTC 2022
Processing build Docker image
Offering build Docker image to Project Build Discarder
Processing Projeto de teste
Offering Projeto de teste to Project Build Discarder
Processing test2
Offering test2 to Project Build Discarder
Finished at Thu Apr 28 00:14:59 UTC 2022. 1ms
Started at Thu Apr 28 01:14:59 UTC 2022
Processing build Docker image
Offering build Docker image to Project Build Discarder
Processing Projeto de teste
Offering Projeto de teste to Project Build Discarder
Processing test2
Offering test2 to Project Build Discarder
Finished at Thu Apr 28 01:14:59 UTC 2022. 1ms
Started at Thu Apr 28 02:14:59 UTC 2022
Processing build Docker image
Offering build Docker image to Project Build Discarder
Processing Projeto de teste
Offering Projeto de teste to Project Build Discarder
Processing test2
Offering test2 to Project Build Discarder
Finished at Thu Apr 28 02:14:59 UTC 2022. 2ms
Started at Thu Apr 28 03:14:59 UTC 2022
Processing build Docker image
Offering build Docker image to Project Build Discarder
Processing Projeto de teste
Offering Projeto de teste to Project Build Discarder
Processing test2
Offering test2 to Project Build Discarder
Finished at Thu Apr 28 03:14:59 UTC 2022. 0ms
Started at Thu Apr 28 04:14:59 UTC 2022
Processing build Docker image
Offering build Docker image to Project Build Discarder
Processing Projeto de teste
Offering Projeto de teste to Project Build Discarder
Processing test2
Offering test2 to Project Build Discarder
Finished at Thu Apr 28 04:14:59 UTC 2022. 1ms
Started at Thu Apr 28 05:14:59 UTC 2022
Processing build Docker image
Offering build Docker image to Project Build Discarder
Processing Projeto de teste
Offering Projeto de teste to Project Build Discarder
Processing test2
Offering test2 to Project Build Discarder
Finished at Thu Apr 28 05:14:59 UTC 2022. 1ms
Started at Thu Apr 28 06:14:59 UTC 2022
Processing build Docker image
Offering build Docker image to Project Build Discarder
Processing Projeto de teste
Offering Projeto de teste to Project Build Discarder
Processing test2
Offering test2 to Project Build Discarder
Finished at Thu Apr 28 06:14:59 UTC 2022. 1ms
Started at Thu Apr 28 07:14:59 UTC 2022
Processing build Docker image
Offering build Docker image to Project Build Discarder
Processing Projeto de teste
Offering Projeto de teste to Project Build Discarder
Processing test2
Offering test2 to Project Build Discarder
Finished at Thu Apr 28 07:14:59 UTC 2022. 1ms
Started at Thu Apr 28 08:14:59 UTC 2022
Processing build Docker image
Offering build Docker image to Project Build Discarder
Processing Projeto de teste
Offering Projeto de teste to Project Build Discarder
Processing test2
Offering test2 to Project Build Discarder
Finished at Thu Apr 28 08:14:59 UTC 2022. 1ms
Started at Thu Apr 28 09:14:59 UTC 2022
Processing build Docker image
Offering build Docker image to Project Build Discarder
Processing Projeto de teste
Offering Projeto de teste to Project Build Discarder
Processing test2
Offering test2 to Project Build Discarder
Finished at Thu Apr 28 09:14:59 UTC 2022. 0ms
Started at Thu Apr 28 10:14:59 UTC 2022
Processing build Docker image
Offering build Docker image to Project Build Discarder
Processing Projeto de teste
Offering Projeto de teste to Project Build Discarder
Processing test2
Offering test2 to Project Build Discarder
Finished at Thu Apr 28 10:14:59 UTC 2022. 0ms
Started at Thu Apr 28 11:14:59 UTC 2022
Processing build Docker image
Offering build Docker image to Project Build Discarder
Processing Projeto de teste
Offering Projeto de teste to Project Build Discarder
Processing test2
Offering test2 to Project Build Discarder
Finished at Thu Apr 28 11:14:59 UTC 2022. 1ms
Started at Thu Apr 28 12:14:59 UTC 2022
Processing build Docker image
Offering build Docker image to Project Build Discarder
Processing Projeto de teste
Offering Projeto de teste to Project Build Discarder
Processing test2
Offering test2 to Project Build Discarder
Finished at Thu Apr 28 12:14:59 UTC 2022. 0ms
Started at Thu Apr 28 13:14:59 UTC 2022
Processing build Docker image
Offering build Docker image to Project Build Discarder
Processing Projeto de teste
Offering Projeto de teste to Project Build Discarder
Processing test2
Offering test2 to Project Build Discarder
Finished at Thu Apr 28 13:14:59 UTC 2022. 1ms
Started at Thu Apr 28 14:14:59 UTC 2022
Processing build Docker image
Offering build Docker image to Project Build Discarder
Processing Projeto de teste
Offering Projeto de teste to Project Build Discarder
Processing test2
Offering test2 to Project Build Discarder
Finished at Thu Apr 28 14:14:59 UTC 2022. 4ms
