Started at Fri Apr 29 03:36:22 UTC 2022
Processing build Docker image
Offering build Docker image to Project Build Discarder
Processing Projeto de teste
Offering Projeto de teste to Project Build Discarder
Processing test2
Offering test2 to Project Build Discarder
Finished at Fri Apr 29 03:36:22 UTC 2022. 6ms
Started at Fri Apr 29 04:36:22 UTC 2022
Processing build Docker image
Offering build Docker image to Project Build Discarder
Processing Projeto de teste
Offering Projeto de teste to Project Build Discarder
Processing test2
Offering test2 to Project Build Discarder
Finished at Fri Apr 29 04:36:22 UTC 2022. 0ms
Started at Fri Apr 29 05:36:22 UTC 2022
Processing build Docker image
Offering build Docker image to Project Build Discarder
Processing Projeto de teste
Offering Projeto de teste to Project Build Discarder
Processing test2
Offering test2 to Project Build Discarder
Finished at Fri Apr 29 05:36:22 UTC 2022. 0ms
Started at Fri Apr 29 06:36:22 UTC 2022
Processing build Docker image
Offering build Docker image to Project Build Discarder
Processing Projeto de teste
Offering Projeto de teste to Project Build Discarder
Processing test2
Offering test2 to Project Build Discarder
Finished at Fri Apr 29 06:36:22 UTC 2022. 0ms
Started at Fri Apr 29 07:36:22 UTC 2022
Processing build Docker image
Offering build Docker image to Project Build Discarder
Processing Projeto de teste
Offering Projeto de teste to Project Build Discarder
Processing test2
Offering test2 to Project Build Discarder
Finished at Fri Apr 29 07:36:22 UTC 2022. 0ms
Started at Fri Apr 29 08:36:22 UTC 2022
Processing build Docker image
Offering build Docker image to Project Build Discarder
Processing Projeto de teste
Offering Projeto de teste to Project Build Discarder
Processing test2
Offering test2 to Project Build Discarder
Finished at Fri Apr 29 08:36:22 UTC 2022. 0ms
Started at Fri Apr 29 09:36:22 UTC 2022
Processing build Docker image
Offering build Docker image to Project Build Discarder
Processing Projeto de teste
Offering Projeto de teste to Project Build Discarder
Processing test2
Offering test2 to Project Build Discarder
Finished at Fri Apr 29 09:36:22 UTC 2022. 0ms
Started at Fri Apr 29 10:36:22 UTC 2022
Processing build Docker image
Offering build Docker image to Project Build Discarder
Processing Projeto de teste
Offering Projeto de teste to Project Build Discarder
Processing test2
Offering test2 to Project Build Discarder
Finished at Fri Apr 29 10:36:22 UTC 2022. 0ms
Started at Fri Apr 29 11:36:22 UTC 2022
Processing build Docker image
Offering build Docker image to Project Build Discarder
Processing Projeto de teste
Offering Projeto de teste to Project Build Discarder
Processing test2
Offering test2 to Project Build Discarder
Finished at Fri Apr 29 11:36:22 UTC 2022. 0ms
Started at Fri Apr 29 12:36:22 UTC 2022
Processing build Docker image
Offering build Docker image to Project Build Discarder
Processing Projeto de teste
Offering Projeto de teste to Project Build Discarder
Processing test2
Offering test2 to Project Build Discarder
Finished at Fri Apr 29 12:36:22 UTC 2022. 0ms
Started at Fri Apr 29 13:36:22 UTC 2022
Processing build Docker image
Offering build Docker image to Project Build Discarder
Processing Projeto de teste
Offering Projeto de teste to Project Build Discarder
Processing test2
Offering test2 to Project Build Discarder
Finished at Fri Apr 29 13:36:22 UTC 2022. 0ms
Started at Fri Apr 29 14:36:22 UTC 2022
Processing build Docker image
Offering build Docker image to Project Build Discarder
Processing Projeto de teste
Offering Projeto de teste to Project Build Discarder
Processing test2
Offering test2 to Project Build Discarder
Finished at Fri Apr 29 14:36:22 UTC 2022. 0ms
Started at Fri Apr 29 15:36:22 UTC 2022
Processing build Docker image
Offering build Docker image to Project Build Discarder
Processing Projeto de teste
Offering Projeto de teste to Project Build Discarder
Processing test2
Offering test2 to Project Build Discarder
Finished at Fri Apr 29 15:36:22 UTC 2022. 0ms
Started at Fri Apr 29 16:36:22 UTC 2022
Processing build Docker image
Offering build Docker image to Project Build Discarder
Processing Projeto de teste
Offering Projeto de teste to Project Build Discarder
Processing test2
Offering test2 to Project Build Discarder
Finished at Fri Apr 29 16:36:22 UTC 2022. 0ms
Started at Fri Apr 29 17:36:22 UTC 2022
Processing build Docker image
Offering build Docker image to Project Build Discarder
Processing Projeto de teste
Offering Projeto de teste to Project Build Discarder
Processing test2
Offering test2 to Project Build Discarder
Finished at Fri Apr 29 17:36:22 UTC 2022. 3ms
Started at Fri Apr 29 18:36:22 UTC 2022
Processing build Docker image
Offering build Docker image to Project Build Discarder
Processing Projeto de teste
Offering Projeto de teste to Project Build Discarder
Processing test2
Offering test2 to Project Build Discarder
Finished at Fri Apr 29 18:36:22 UTC 2022. 1ms
Started at Fri Apr 29 19:36:22 UTC 2022
Processing build Docker image
Offering build Docker image to Project Build Discarder
Processing Projeto de teste
Offering Projeto de teste to Project Build Discarder
Processing test2
Offering test2 to Project Build Discarder
Finished at Fri Apr 29 19:36:22 UTC 2022. 2ms
Started at Fri Apr 29 20:36:22 UTC 2022
Processing build Docker image
Offering build Docker image to Project Build Discarder
Processing Projeto de teste
Offering Projeto de teste to Project Build Discarder
Processing test2
Offering test2 to Project Build Discarder
Finished at Fri Apr 29 20:36:22 UTC 2022. 0ms
Started at Fri Apr 29 21:36:22 UTC 2022
Processing build Docker image
Offering build Docker image to Project Build Discarder
Processing Projeto de teste
Offering Projeto de teste to Project Build Discarder
Processing test2
Offering test2 to Project Build Discarder
Finished at Fri Apr 29 21:36:22 UTC 2022. 4ms
Started at Fri Apr 29 22:36:22 UTC 2022
Processing build Docker image
Offering build Docker image to Project Build Discarder
Processing Projeto de teste
Offering Projeto de teste to Project Build Discarder
Processing test2
Offering test2 to Project Build Discarder
Finished at Fri Apr 29 22:36:22 UTC 2022. 5ms
Started at Fri Apr 29 23:36:22 UTC 2022
Processing build Docker image
Offering build Docker image to Project Build Discarder
Processing Projeto de teste
Offering Projeto de teste to Project Build Discarder
Processing test2
Offering test2 to Project Build Discarder
Finished at Fri Apr 29 23:36:22 UTC 2022. 1ms
Started at Sat Apr 30 00:36:22 UTC 2022
Processing build Docker image
Offering build Docker image to Project Build Discarder
Processing Projeto de teste
Offering Projeto de teste to Project Build Discarder
Processing test2
Offering test2 to Project Build Discarder
Finished at Sat Apr 30 00:36:22 UTC 2022. 0ms
Started at Sat Apr 30 01:36:22 UTC 2022
Processing build Docker image
Offering build Docker image to Project Build Discarder
Processing Projeto de teste
Offering Projeto de teste to Project Build Discarder
Processing test2
Offering test2 to Project Build Discarder
Finished at Sat Apr 30 01:36:22 UTC 2022. 1ms
Started at Sat Apr 30 02:36:22 UTC 2022
Processing build Docker image
Offering build Docker image to Project Build Discarder
Processing Projeto de teste
Offering Projeto de teste to Project Build Discarder
Processing test2
Offering test2 to Project Build Discarder
Finished at Sat Apr 30 02:36:22 UTC 2022. 1ms
Started at Sat Apr 30 03:36:22 UTC 2022
Processing build Docker image
Offering build Docker image to Project Build Discarder
Processing Projeto de teste
Offering Projeto de teste to Project Build Discarder
Processing test2
Offering test2 to Project Build Discarder
Finished at Sat Apr 30 03:36:22 UTC 2022. 1ms
