Started at Thu Apr 28 16:03:54 UTC 2022
Processing build Docker image
Offering build Docker image to Project Build Discarder
Processing Projeto de teste
Offering Projeto de teste to Project Build Discarder
Processing test2
Offering test2 to Project Build Discarder
Finished at Thu Apr 28 16:03:54 UTC 2022. 3ms
Started at Thu Apr 28 17:03:54 UTC 2022
Processing build Docker image
Offering build Docker image to Project Build Discarder
Processing Projeto de teste
Offering Projeto de teste to Project Build Discarder
Processing test2
Offering test2 to Project Build Discarder
Finished at Thu Apr 28 17:03:54 UTC 2022. 2ms
Started at Thu Apr 28 18:03:54 UTC 2022
Processing build Docker image
Offering build Docker image to Project Build Discarder
Processing Projeto de teste
Offering Projeto de teste to Project Build Discarder
Processing test2
Offering test2 to Project Build Discarder
Finished at Thu Apr 28 18:03:54 UTC 2022. 0ms
Started at Thu Apr 28 19:03:54 UTC 2022
Processing build Docker image
Offering build Docker image to Project Build Discarder
Processing Projeto de teste
Offering Projeto de teste to Project Build Discarder
Processing test2
Offering test2 to Project Build Discarder
Finished at Thu Apr 28 19:03:54 UTC 2022. 0ms
Started at Thu Apr 28 20:03:54 UTC 2022
Processing build Docker image
Offering build Docker image to Project Build Discarder
Processing Projeto de teste
Offering Projeto de teste to Project Build Discarder
Processing test2
Offering test2 to Project Build Discarder
Finished at Thu Apr 28 20:03:54 UTC 2022. 0ms
Started at Thu Apr 28 21:03:54 UTC 2022
Processing build Docker image
Offering build Docker image to Project Build Discarder
Processing Projeto de teste
Offering Projeto de teste to Project Build Discarder
Processing test2
Offering test2 to Project Build Discarder
Finished at Thu Apr 28 21:03:54 UTC 2022. 0ms
Started at Thu Apr 28 22:03:54 UTC 2022
Processing build Docker image
Offering build Docker image to Project Build Discarder
Processing Projeto de teste
Offering Projeto de teste to Project Build Discarder
Processing test2
Offering test2 to Project Build Discarder
Finished at Thu Apr 28 22:03:54 UTC 2022. 2ms
Started at Thu Apr 28 23:03:54 UTC 2022
Processing build Docker image
Offering build Docker image to Project Build Discarder
Processing Projeto de teste
Offering Projeto de teste to Project Build Discarder
Processing test2
Offering test2 to Project Build Discarder
Finished at Thu Apr 28 23:03:54 UTC 2022. 1ms
