code,building_type,building_usage,landscape,morphological_position,geographical_position,social_class
141010000,Housing subdivisions,Housing,Countryside,Peri-urban,North-East,Middle
141180102,Towers,Other activities,Green areas,Urban,Centre,Upper middle
141180201,Towers,Shopping,Urban,Central,Centre,Upper middle
141180202,Mixed,Housing,Urban,Urban,Centre,Upper middle
141180402,Towers,Other activities,Forest,Peri-urban,North-East,Middle
141181201,Mixed,Other activities,Green areas,Urban,South,Lower middle
141181404,Towers,Other activities,Green areas,Urban,South,Middle
141181501,Mixed,Housing,Green areas,Urban,West,Lower
141181601,Mixed,Other activities,Urban,Urban,Centre,Middle
141182004,Towers,Shopping,Green areas,Urban,South,Lower middle
141182006,Mixed,Housing,Green areas,Urban,South,Middle
141182007,Towers,Housing,Green areas,Urban,South-East,Lower middle
143270101,Mixed,Other activities,Forest,Peri-urban,South-West,Middle
143270102,Mixed,Housing,Green areas,Urban,South-East,Middle
143270201,Housing estates,Housing,Urban,Urban,South-East,Lower
143270302,Towers,Housing,Green areas,Urban,South-East,Lower middle
143270401,Towers,Shopping,Green areas,Urban,South-East,Lower
143270602,Housing estates,Housing,Green areas,Urban,South-East,Lower
143270603,Towers,Shopping,Urban,Urban,South-East,Lower middle
143650000,Houses,Housing,Countryside,Rural,South,Lower middle
143830000,Housing subdivisions,Housing,Countryside,Peri-urban,North-East,Middle
144070000,Houses,Housing,Countryside,Rural,South,Middle
144370106,Mixed,Other activities,Urban,Peri-urban,West,Middle
144880101,Houses,Housing,Forest,Urban,South-West,Middle
144880103,Houses,Housing,Green areas,Urban,South-West,Lower middle
144880104,Houses,Housing,Green areas,Urban,South-West,Lower middle
173060101,Mixed,Housing,Green areas,Urban,South,Upper middle
173060102,Mixed,Housing,Green areas,Urban,South,Upper middle
340230101,Mixed,Housing,Green areas,Peri-urban,West,Middle
341450101,Mixed,Shopping,Urban,Urban,South,Upper middle
341540105,Housing subdivisions,Housing,Urban,Urban,Centre,Upper middle
430480000,Houses,Housing,Countryside,Rural,Centre,Lower middle
594780000,Houses,Housing,Countryside,Rural,North,Lower middle
596650000,Houses,Housing,Countryside,Rural,North,Lower middle
620010000,Houses,Housing,Countryside,Rural,North-East,Middle
620410401,Mixed,Other activities,Forest,Urban,East,Middle
620410801,Mixed,Housing,Urban,Central,Centre,Upper middle
622130000,Houses,Housing,Countryside,Rural,North-East,Lower middle
626090000,Houses,Housing,Countryside,Rural,South,Lower middle
627440000,Mixed,Housing,Forest,Peri-urban,South-East,Lower middle
628010000,Houses,Housing,Countryside,Rural,North-East,Middle
631950000,Houses,Housing,Forest,Rural,Centre,Middle
690340104,Mixed,Housing,Urban,Central,Centre,Upper middle
690440000,Houses,Housing,Green areas,Peri-urban,West,Upper
690690103,Mixed,Shopping,Urban,Urban,Centre,Middle
690760000,Houses,Housing,Forest,Peri-urban,West,Upper
691940101,Houses,Housing,Forest,Peri-urban,West,Upper
691940102,Houses,Housing,Forest,Peri-urban,West,Upper
692440201,Houses,Housing,Green areas,Peri-urban,West,Upper middle
692440202,Mixed,Shopping,Urban,Peri-urban,East,Middle
692500000,Houses,Housing,Forest,Peri-urban,West,Upper middle
692660201,Mixed,Other activities,Green areas,Central,East,Lower middle
692660302,Towers,Housing,Urban,Central,East,Lower
692660403,Towers,Housing,Urban,Urban,Centre,Lower
692660502,Towers,Shopping,Urban,Central,North,Lower
692661802,Towers,Housing,Urban,Central,East,Lower
693820204,Mixed,Shopping,Urban,Central,Centre,Upper
693830301,Towers,Other activities,Urban,Central,Centre,Middle
693860103,Houses,Housing,Green areas,Urban,South,Upper
693870704,Towers,Housing,Urban,Central,Centre,Lower middle
740100202,Mixed,Shopping,Green areas,Peri-urban,South,Middle
751010105,Houses,Other activities,Green areas,Urban,Centre,Upper
913770113,Mixed,Other activities,Urban,Central,Centre,Middle
914770107,Mixed,Other activities,Forest,Peri-urban,East,Middle
