code,building_type,building_usage,landscape,morphological_position,geographical_position,social_class
594780000,Houses,Housing,Countryside,Rural,North,Lower middle
622130000,Houses,Housing,Countryside,Rural,North-East,Lower middle
620010000,Houses,Housing,Countryside,Rural,North-East,Middle
628010000,Houses,Housing,Countryside,Rural,North-East,Middle
596650000,Houses,Housing,Countryside,Rural,North,Lower middle
620410801,Mixed,Housing,Urban,Central,Centre,Upper middle
626090000,Houses,Housing,Countryside,Rural,South,Lower middle
627440000,Mixed,Housing,Forest,Peri-urban,South-East,Lower middle
620410401,Mixed,Other activities,Forest,Urban,East,Middle
141181601,Mixed,Other activities,Urban,Urban,Centre,Middle
141181501,Mixed,Housing,Green areas,Urban,West,Lower
144370106,Mixed,Other activities,Urban,Peri-urban,West,Middle
143270101,Mixed,Other activities,Forest,Peri-urban,South-West,Middle
141181201,Mixed,Other activities,Green areas,Urban,South,Lower middle
141180201,Towers,Shopping,Urban,Central,Centre,Upper middle
141180402,Towers,Other activities,Forest,Peri-urban,North-East,Middle
141180102,Towers,Other activities,Green areas,Urban,Centre,Upper middle
141180202,Mixed,Housing,Urban,Urban,Centre,Upper middle
693860103,Houses,Housing,Green areas,Urban,South,Upper
141182004,Towers,Shopping,Green areas,Urban,South,Lower middle
141182006,Mixed,Housing,Green areas,Urban,South,Middle
141182007,Towers,Housing,Green areas,Urban,South-East,Lower middle
141181404,Towers,Other activities,Green areas,Urban,South,Middle
141010000,Housing subdivisions,Housing,Countryside,Peri-urban,North-East,Middle
143830000,Housing subdivisions,Housing,Countryside,Peri-urban,North-East,Middle
144880101,Houses,Housing,Forest,Urban,South-West,Middle
144880104,Houses,Housing,Green areas,Urban,South-West,Lower middle
144880103,Houses,Housing,Green areas,Urban,South-West,Lower middle
143650000,Houses,Housing,Countryside,Rural,South,Lower middle
144070000,Houses,Housing,Countryside,Rural,South,Middle
143270401,Towers,Shopping,Green areas,Urban,South-East,Lower
143270102,Mixed,Housing,Green areas,Urban,South-East,Middle
143270201,Housing estates,Housing,Urban,Urban,South-East,Lower
143270302,Towers,Housing,Green areas,Urban,South-East,Lower middle
143270602,Housing estates,Housing,Green areas,Urban,South-East,Lower
143270603,Towers,Shopping,Urban,Urban,South-East,Lower middle
