{
	"_id": "5be32b9df3f0b960b1f8afb2",
	"geometry": {
		"type": "Polygon",
		"coordinates": [
			[
				[
					4.8261667,
					45.7619681
				],
				[
					4.8266156,
					45.7618077
				],
				[
					4.8271708,
					45.7614735
				],
				[
					4.8270125,
					45.7610428
				],
				[
					4.8268371,
					45.760798
				],
				[
					4.8277022,
					45.7597202
				],
				[
					4.8278866,
					45.7596533
				],
				[
					4.8276949,
					45.75946
				],
				[
					4.8273323,
					45.7590993
				],
				[
					4.8268847,
					45.7586589
				],
				[
					4.8259448,
					45.7577454
				],
				[
					4.8249781,
					45.7576206
				],
				[
					4.8215999,
					45.7574113
				],
				[
					4.821524,
					45.7574143
				],
				[
					4.8215732,
					45.7574621
				],
				[
					4.8236729,
					45.7586595
				],
				[
					4.823772,
					45.7587381
				],
				[
					4.823824,
					45.7587922
				],
				[
					4.8240387,
					45.7590616
				],
				[
					4.8241172,
					45.7591774
				],
				[
					4.8246028,
					45.760146
				],
				[
					4.8249879,
					45.7609954
				],
				[
					4.8250185,
					45.7610643
				],
				[
					4.8251306,
					45.7612643
				],
				[
					4.8252105,
					45.7613837
				],
				[
					4.8253343,
					45.7615456
				],
				[
					4.8254896,
					45.7617277
				],
				[
					4.8256979,
					45.7619189
				],
				[
					4.8258516,
					45.7620146
				],
				[
					4.8258779,
					45.7620295
				],
				[
					4.8259143,
					45.7620406
				],
				[
					4.8259925,
					45.7620339
				],
				[
					4.8260651,
					45.7620084
				],
				[
					4.8261667,
					45.7619681
				]
			]
		]
	},
	"type": "Feature",
	"properties": {
		"IRIS": "0103",
		"NOM_IRIS": "Saint-Georges",
		"TYP_IRIS": "H",
		"DEP": "69",
		"INSEE_COM": "69385",
		"NOM_COM": "Lyon 5e Arrondissement",
		"REG": "84",
		"CODE_IRIS": "693850103",
		"LIBIRIS": "Saint-Georges",
		"GRD_QUART": "6938501",
		"LAB_IRIS": "1",
		"MODIF_IRIS": "0",
		"TRIRIS": "690881",
		"UU2010": "00758",
		"raw_indicators": {
			"percent_greens": 1,
			"human_pressure": 110,
			"percent_built": 99
		}
	}
}