0,P14_POP0002,P14_POPMEN2554,P14_RP_6080M2,P14_RPAPPART_ACH70,P14_RP_3040M2,P14_ANEM_RP,P14_POP0610,AREA,P14_POP1824,P14_NSCOL15P_SUP,P14_LOG,DENSITY,C14_MENPSEUL,P14_POP2539,P14_POPMEN5579,P14_RPMAISON,P14_POP,C14_NE24F3,P14_SCOL1824,DEC_D614,P14_ANEM_RP_LOCHLMV,P14_SCOL1114,DEC_D814,DEC_D914,P14_NPER_RP_PROP,C14_ACTOCC15P_MAR,P14_APPART,P14_POP1529,P14_RP_ACH05,DEC_D114,P14_NPER_RP_LOCHLMV,P14_RPAPPART_ACH19,DEC_D414,P14_ACTOCC15P_ILT5,P14_RP_CCCOLL,C14_PMEN_CS3,P14_RP_ACH19,P14_INACT1564,P14_ANEM_RP_PROP,P14_CHOM1564,P14_ACTOCC15P_ILT2,P14_MAISON,P14_PMEN_ANEM0509,P14_RP_2P,P14_RP_VOIT1P,P14_POP2554,P14_ACTOCC15P_ILT2P,P14_RP_M30M2,P14_RP_PROP,P14_NPER_RP_GRAT,P14_POP1524,P14_RPAPPART_ACHTOT,P14_PMEN_ANEM10P,C14_ACTOCC15P_DROU,C14_PMEN_MENFAM,P14_RP_ACH90,P14_NBPI_RP,C14_PMEN_CS6,C14_MENFSEUL,C14_NE24F2,C14_ACT1564_CS3,DEC_D214,P14_ACTOCC15P_ILT1,P14_POP_IMM,P14_RSECOCC,C14_ACT1564_CS5,C14_PMEN_CS5,P14_NBPI_RPMAISON,P14_POP1524_PSEUL,P14_RP_ACH45,NB_A504,C14_PMEN_CS4,C14_ACTOCC15P,C14_MEN_CS6,P14_ACT1524,C14_PMEN_CS2,P14_RPAPPART,P14_RPMAISON_ACHTOT,P14_RPMAISON_ACH90,P14_NBPI_RPAPPART,C14_POP15P_CS5,P14_ANEM_RP_GRAT,C14_ACTOCC15P_PAS,P14_POP30P,P14_RP_GARL,P14_POP0019,P14_ACT2554,P14_RP_LOC,C14_PMEN,C14_ACT1564_CS4,C14_PMEN_MENCOUPSENF,P14_POP0205,C14_ACTOCC1564_CS3,DEC_D314,P14_ACTOCC15P_TP,P14_RPAPPART_ACH90,P14_SAL15P_APPR,P14_POP15P,C14_PMEN_MENCOUPAENF,DEC_D714,C14_MEN_CS3,P14_RPAPPART_ACH45,P14_RP_1P,P14_CHOM2554,P14_RP_CCIND,C14_MEN_CS8,P14_RP_80100M2,C14_POP15P_CS3,P14_RPMAISON_ACH45,C14_ACTOCC1564_CS2,C14_ACT1564_CS2,P14_RP_5PP,P14_SCOL1517,,,,,
1,P14_POPMEN2554,P14_PMEN_ANEM0002,P14_PMEN,DEC_Q114,P14_RPAPPART_ACH70,P14_SCOL0205,P14_RP_3040M2,P14_ANEM_RP,P14_RP_3P,P14_POP0610,AREA,P14_MEN_ANEM0002,P14_NSCOL15P_SUP,P14_LOG,DENSITY,P14_POP0014,C14_MENPSEUL,P14_POPMEN1524,P14_POP2539,P14_POPMEN5579,P14_POP,C14_MENCOUPSENF,P14_SCOL1824,P14_MEN_ANEM0204,P14_ANEM_RP_LOCHLMV,P14_RP_LOCHLMV,P14_LOGVAC,C14_ACTOCC1564,P14_POP4054,DEC_D914,P14_NPER_RP_PROP,P14_POP0305,P14_APPART,P14_RP_ACH05,P14_ACTOCC2554,DEC_D114,P14_NPER_RP_LOCHLMV,C14_POP15P_CS6,P14_RPAPPART_ACH19,DEC_D414,P14_RP_CCCOLL,C14_PMEN_CS3,P14_RP_ACH19,P14_ANEM_RP_PROP,P14_SCOL2529,P14_ACTOCC15P_ILT2,P14_RP_2P,P14_PMEN_ANEM0509,P14_RP_VOIT1P,P14_SAL15P_CDI,P14_NBPI_RP_ANEM0509,P14_ACTOCC15P_ILT2P,P14_AINACT1564,C14_PMEN_MENFAMMONO,P14_RP_PROP,C14_FAMMONO,P14_POP1524,P14_RPAPPART_ACHTOT,P14_POP_FR,C14_PMEN_MENFAM,P14_RP_ACH90,P14_NBPI_RP,C14_PMEN_CS6,C14_POP15P_CS7,C14_ACT1564_CS3,P14_F1529,P14_RP_ACH11,DEC_D214,P14_ACTOCC15P_ILT1,P14_POP_IMM,P14_RSECOCC,C14_NE24F1,P14_POP4559,C14_PMEN_CS5,P14_POP1524_PSEUL,P14_RP_ACH45,NB_A504,P14_NPER_RP_LOC,C14_ACTOCC15P,DEC_MED14,C14_MEN_CS6,P14_RPAPPART,P14_RPMAISON_ACHTOT,P14_NBPI_RPAPPART,P14_RPMAISON_ACH90,P14_POP2064,C14_COUPAENF,C14_MENCOUPAENF,P14_ANEM_RP_LOC,C14_ACTOCC15P_PAS,P14_POP30P,P14_ACTOCC15P,P14_POP0019,C14_POP15P_CS4,P14_RP_LOC,P14_NSCOL15P_CAPBEP,C14_POP15P_CS8,C14_ACTOCC1564_CS3,DEC_D314,P14_RPAPPART_ACH90,P14_POP15P,C14_PMEN_MENCOUPAENF,C14_MEN_CS3,DEC_Q314,P14_NSCOL15P,P14_RP_GRAT,P14_RPAPPART_ACH45,P14_RP_1P,C14_MENSFAM,P14_RP_4060M2,C14_POP15P_CS3,C14_PMEN_MENSFAM,P14_NBPI_RP_ANEM0204,DEC_TP6014,,,,
2,P14_POP0002,P14_RP_6080M2,P14_PMEN_ANEM0002,P14_PMEN,DEC_Q114,P14_RPAPPART_ACH70,P14_RP_3040M2,P14_ANEM_RP,P14_POP0610,AREA,P14_POP1824,P14_NSCOL15P_SUP,DENSITY,P14_POP0014,C14_MENPSEUL,P14_POPMEN1524,P14_POPMEN5579,P14_RP_VOIT2P,P14_RPMAISON,P14_POP,P14_SCOL1824,DEC_D614,P14_MEN_ANEM0204,P14_ANEM_RP_LOCHLMV,P14_RP_LOCHLMV,C14_MEN_CS7,C14_ACTOCC1564,P14_ACTOCC1524,DEC_D814,DEC_D914,P14_RP_4P,P14_NPER_RP_PROP,P14_F3044,C14_ACTOCC15P_MAR,P14_APPART,DEC_D114,P14_NPER_RP_LOCHLMV,P14_RP_VOIT1,C14_MENHSEUL,P14_POP15P_MARIEE,P14_RPAPPART_ACH19,P14_POP2529,DEC_D414,C14_PMEN_CS7,C14_PMEN_CS3,P14_RP_ACH19,P14_RP_CCCOLL,P14_ANEM_RP_PROP,P14_ACTOCC15P_ILT2,P14_RP_2P,P14_PMEN_ANEM0509,P14_RP_ACH70,P14_POP2554,P14_ACTOCC15P_ILT2P,P14_RP_M30M2,P14_RP_PROP,P14_POP15P_NONMARIEE,C14_NE24F0,C14_ACTOCC1564_CS6,P14_NPER_RP_GRAT,P14_RPAPPART_ACHTOT,P14_PMEN_ANEM10P,C14_PMEN_MENFAM,P14_NBPI_RP,P14_RP_ACH90,C14_POP15P_CS2,C14_NE24F2,C14_POP15P_CS7,C14_ACT1564_CS3,DEC_D214,P14_NSCOL15P_BAC,P14_RSECOCC,P14_RP_CINDELEC,P14_POP1524_PSEUL,P14_RP_ACH45,NB_A504,P14_POP5579,C14_PMEN_CS8,C14_PMEN_CS4,C14_ACTOCC15P,DEC_MED14,P14_ACT1524,C14_PMEN_CS2,P14_RPMAISON_ACH90,P14_NBPI_RPAPPART,P14_ANEM_RP_GRAT,P14_ANEM_RP_LOC,P14_POP30P,C14_ACTOCC15P_TCOM,P14_RP_LOC,P14_POP65P,P14_RP_ACHTOT,C14_POP15P_CS8,C14_PMEN_MENCOUPSENF,C14_ACTOCC1564_CS3,DEC_D314,P14_ACTOCC15P_TP,P14_RPAPPART_ACH90,P14_RPMAISON_ACH11,P14_POP15P,C14_PMEN_MENCOUPAENF,DEC_D714,DEC_Q314,P14_NSCOL15P,C14_MEN_CS3,C14_ACTOCC15P_VOIT,P14_RPAPPART_ACH45,P14_RP_1P,P14_CHOM2554,C14_MENSFAM,P14_RP_CCIND,P14_SAL15P,P14_RP_4060M2,P14_RPAPPART_ACH11,P14_RP_80100M2,C14_PMEN_MENSFAM,NB_B302,
3,P14_POPMEN2554,P14_ACTOCC15P_ILT3,P14_PMEN,P14_NSAL15P_INDEP,P14_RPAPPART_ACH70,P14_RP_3040M2,C14_ACT1564_CS6,P14_NBPI_RP_ANEM10P,P14_ANEM_RP,P14_RP_3P,P14_POP0610,P14_NSAL15P,AREA,P14_POP1824,P14_MEN_ANEM0002,P14_NSCOL15P_SUP,DENSITY,P14_POP0014,P14_POPMEN1524,C14_MENPSEUL,P14_POPMEN5579,P14_RPMAISON,P14_POP,C14_MENCOUPSENF,P14_MEN_ANEM0204,P14_ANEM_RP_LOCHLMV,P14_LOGVAC,DEC_D814,DEC_D914,P14_NPER_RP_PROP,P14_POP0305,P14_NSCOL15P_DIPLMIN,C14_ACTOCC15P_MAR,P14_APPART,P14_ACTOCC2554,P14_NPER_RP_LOCHLMV,P14_RP_VOIT1,P14_POP15P_MARIEE,P14_RPAPPART_ACH19,P14_POP1517,C14_POP15P_CS6,DEC_D414,P14_POP1117,P14_RP_CCCOLL,C14_PMEN_CS3,P14_RP_ACH19,P14_CHOM1524,P14_ANEM_RP_PROP,P14_SCOL2529,P14_ACTOCC15P_ILT2,P14_MAISON,C14_MEN_CS2,P14_PMEN_ANEM0509,P14_RP_ACH70,P14_RP_VOIT1P,P14_RP_2P,P14_SAL15P_CDI,P14_ACTOCC15P_ILT2P,P14_RP_M30M2,C14_PMEN_MENFAMMONO,P14_NPER_RP_GRAT,C14_ACTOCC1564_CS6,P14_POP1524,P14_RPAPPART_ACHTOT,P14_PMEN_ANEM10P,C14_ACTOCC15P_DROU,C14_PMEN_MENFAM,P14_RP_ACH90,C14_PMEN_CS6,C14_MENFSEUL,C14_ACT1564_CS3,P14_NSCOL15P_BAC,P14_ACTOCC15P_ILT1,P14_POP_IMM,P14_RSECOCC,C14_MENFAMMONO,P14_RP_CINDELEC,P14_ACTOCC1564,P14_SCOL0610,P14_NBPI_RPMAISON,P14_POP1524_PSEUL,P14_POP5579,P14_NPER_RP_LOC,C14_PMEN_CS8,C14_ACTOCC15P,DEC_MED14,P14_ACT1524,P14_RPMAISON_ACHTOT,P14_RPAPPART,P14_RPMAISON_ACH90,P14_NBPI_RPAPPART,P14_POP_ETR,P14_ACT5564,P14_ANEM_RP_GRAT,P14_NBPI_RP_ANEM0002,P14_ANEM_RP_LOC,C14_ACTOCC15P_PAS,P14_RPAPPART_ACH05,C14_ACTOCC15P_TCOM,C14_PMEN,P14_NSCOL15P_CAPBEP,C14_PMEN_MENCOUPSENF,C14_POP15P_CS8,P14_POP0205,P14_SAL15P_APPR,DEC_D714,C14_MEN_CS3,DEC_Q314,P14_PMEN_ANEM0204,P14_RP_1P,P14_RP_CCIND,P14_SAL15P,P14_RP_4060M2,C14_ACTOCC1564_CS2,C14_POP15P_CS3,C14_ACT1564_CS2,P14_NBPI_RP_ANEM0204,P14_RP_5PP
4,P14_RP_6080M2,P14_MEN_ANEM10P,P14_ACTOCC15P_ILT3,P14_PMEN,DEC_Q114,P14_RPAPPART_ACH70,P14_SCOL0205,P14_RP_3P,P14_POP0610,AREA,P14_MEN_ANEM0002,P14_NSCOL15P_SUP,P14_POP6074,DENSITY,P14_POPMEN5579,C14_NE24F4P,P14_RPMAISON,P14_POP,P14_CHOM5564,P14_SCOL1824,DEC_D614,P14_POP1564,P14_ANEM_RP_LOCHLMV,P14_RP_LOCHLMV,P14_LOGVAC,DEC_D814,DEC_D914,P14_NPER_RP_PROP,P14_NSCOL15P_DIPLMIN,C14_ACTOCC15P_MAR,P14_APPART,P14_RP_ACH05,DEC_D114,P14_ACTOCC2554,P14_NPER_RP_LOCHLMV,P14_POP15P_MARIEE,P14_RPAPPART_ACH19,DEC_D414,P14_ACTOCC15P_ILT5,P14_RP_CCCOLL,C14_PMEN_CS3,P14_RP_ACH19,P14_ANEM_RP_PROP,P14_PHORMEN,P14_SCOL2529,P14_RP_2P,P14_ACTOCC15P_ILT2,P14_PMEN_ANEM0509,P14_RP_ACH70,P14_POP6579,P14_ACTOCC15P_ILT2P,P14_RP_M30M2,P14_ACTOCC5564,P14_POP15P_NONMARIEE,P14_RPAPPART_ACHTOT,P14_PMEN_ANEM10P,P14_RP_ACH90,C14_PMEN_CS6,C14_POP15P_CS7,C14_ACT1564_CS3,P14_RP_ACH11,DEC_D214,P14_ACTOCC15P_ILT1,P14_POP_IMM,P14_RSECOCC,P14_RP_CINDELEC,C14_NE24F1,P14_NBPI_RPMAISON,P14_POP1524_PSEUL,P14_RP_ACH45,P14_NPER_RP_LOC,C14_PMEN_CS8,P14_RP_120M2P,DEC_MED14,P14_RPAPPART,P14_RPMAISON_ACH90,P14_NBPI_RPAPPART,P14_POP_ETR,P14_ANEM_RP_GRAT,P14_NBPI_RP_ANEM0002,P14_ANEM_RP_LOC,P14_RPAPPART_ACH05,C14_ACTOCC15P_TCOM,P14_RP_GARL,C14_POP15P_CS4,P14_RP_LOC,C14_ACTOCC1564_CS3,P14_RPAPPART_ACH90,DEC_D714,DEC_Q314,C14_MEN_CS3,P14_RP_GRAT,P14_RPAPPART_ACH45,P14_RP_1P,C14_MENSFAM,C14_MEN_CS8,P14_RP_4060M2,P14_RPAPPART_ACH11,P14_RP_80100M2,C14_POP15P_CS3,P14_ETUD1564,C14_PMEN_MENSFAM,P14_NBPI_RP_ANEM0204,,,,,,,,,,,,,,,
5,C14_POP15P,P14_RP_6080M2,P14_PMEN_ANEM0002,P14_MEN_ANEM10P,P14_ACTOCC15P_ILT3,DEC_Q114,P14_RPAPPART_ACH70,P14_RP_3040M2,C14_ACT1564_CS6,P14_NBPI_RP_ANEM10P,P14_ANEM_RP,P14_NSAL15P,AREA,P14_POP1824,P14_MEN_ANEM0002,DENSITY,C14_ACT1564,P14_POPMEN1524,C14_MENPSEUL,P14_POP,P14_NSAL15P_EMPLOY,P14_SCOL1824,DEC_D614,P14_MEN_ANEM0204,P14_ANEM_RP_LOCHLMV,P14_RP_LOCHLMV,P14_LOGVAC,P14_POP4054,DEC_D814,DEC_D914,P14_APPART,P14_POP1529,P14_RP_ACH05,DEC_D114,P14_NPER_RP_LOCHLMV,P14_RP_VOIT1,C14_MENHSEUL,P14_RPMAISON_ACH19,P14_POP15P_MARIEE,P14_RPAPPART_ACH19,DEC_D414,P14_RP_CCCOLL,C14_PMEN_CS3,P14_RP_ACH19,P14_CHOM1524,P14_ANEM_RP_PROP,P14_RP_2P,P14_ACTOCC15P_ILT2,C14_MEN_CS2,P14_RP_ACH70,P14_ACTOCC15P_ILT2P,P14_RP,P14_RP_M30M2,C14_PMEN_MENFAMMONO,P14_POP15P_NONMARIEE,C14_ACTOCC1564_CS6,P14_POPMEN15P,P14_PMEN_ANEM10P,C14_PMEN_MENFAM,C14_PMEN_CS6,C14_MENFSEUL,C14_ACT1564_CS3,DEC_D214,P14_ACTOCC15P_ILT1,P14_POP_IMM,P14_RSECOCC,P14_RP_CINDELEC,P14_POP4559,C14_PMEN_CS5,P14_POP1524_PSEUL,P14_RP_ACH45,P14_NPER_RP_LOC,P14_RPMAISON_ACH70,C14_PMEN_CS8,C14_PMEN_CS4,C14_ACTOCC15P,DEC_MED14,C14_MEN_CS6,P14_ACT1524,P14_RPAPPART,P14_NBPI_RPAPPART,P14_POP_ETR,P14_ANEM_RP_GRAT,P14_NBPI_RP_ANEM0002,P14_ANEM_RP_LOC,P14_RPAPPART_ACH05,P14_ACTOCC15P,C14_ACTOCC15P_TCOM,P14_RP_GARL,P14_SCOL30P,P14_POP0019,C14_POP15P_CS8,C14_ACTOCC1564_CS3,DEC_D314,P14_RPAPPART_ACH90,P14_SAL15P_APPR,DEC_D714,P14_RP_100120M2,C14_MEN_CS3,P14_NSCOL15P,DEC_Q314,C14_ACTOCC15P_VOIT,P14_RPAPPART_ACH45,P14_RP_1P,P14_RPMAISON_ACH05,C14_MENSFAM,C14_MEN_CS8,P14_RP_4060M2,P14_RPAPPART_ACH11,P14_RP_80100M2,C14_POP15P_CS3,C14_PMEN_MENSFAM,NB_B302,,,,,
