11000000000000000000000000000000 00000000000000000000000000000000
00011101011101000100010100011011 11101111101000111100100001000010
10101010101010101010101010101010 10101010101010101010101010101010
10000110001011101100100001011111 11101100100111111000010001101000
11111111111111111111111111111111 11111111111111111111111111111111
