00000000000000000000000000000001
00000000000000000000000000000010
11111111111111111111100000110001
11111111111111111111110000101001
11111111111110000000000000000001
00000000000001000000000000000010
11111111111111100110001000000001
