280513 44536 28693 10344 2549 449
745589 38534 31206 11564 1842 721
914552 149812 11869 13080 6 530
1020569 205173 18193 5533 3649 147
878734 6167 32129 3809 820 470
1042186 244779 40983 12857 2331 540
154279 256924 14016 6515 2554 402
105003 198098 54953 9228 1734 521
77200 220236 21404 14129 865 1010
142377 127295 56737 11906 3759 351
785965 245629 45924 6949 1676 138
211493 129798 35907 10822 1515 304
146007 33900 56594 16155 2771 270
17723 148801 53393 4943 3455 363
625138 66590 38578 9847 4010 670
291936 125753 63143 7611 3736 547
83299 37519 62426 15674 2868 848
392088 6850 22544 10774 3281 445
753194 147609 41651 13563 813 234
256414 94082 33818 3848 3456 266
81477 239279 29482 7589 1260 1008
783205 1150 10080 14425 502 264
334871 67003 49514 12446 2882 428
279354 150514 59642 8871 1372 701
355931 24638 22253 8857 1904 537
979814 152160 21995 2018 1684 695
863017 24493 20658 6656 3197 60
509117 98355 37554 5476 1191 617
206315 230638 27075 12725 1469 265
412471 9692 63001 9586 2767 481
961449 193560 24769 2546 1549 424
521596 197012 22317 15492 2822 226
602137 219581 58171 14855 4029 998
573923 50964 1099 111 2300 265
681606 59401 31832 4751 968 133
223570 22791 50824 2222 2583 638
564191 4142 45845 14498 2710 161
805022 248869 58195 6052 717 56
193246 225825 60896 3892 233 928
870966 191241 665 5300 949 499
631698 105849 51672 14050 4070 110
676300 150528 28567 6075 791 28
854834 137520 44224 3112 2499 148
399297 125319 110 9923 1399 681
319833 181632 8694 5317 63 864
143273 122947 43663 4168 1777 1022
470189 108868 6294 11123 1205 679
208047 220203 52234 3737 3011 268
654992 132214 51781 7367 4042 327
854229 58435 56397 3525 1458 728
890394 129455 37348 16151 3955 671
309714 205970 23775 11216 842 154
603901 152948 52780 7250 1824 762
363056 1148 61159 68 4 995
874155 126902 43496 10170 3292 426
646992 260211 1454 8502 2015 698
23889 165446 43838 151 2122 99
648054 174153 63519 9997 3452 945
19120 238677 30314 4273 1836 769
43664 52741 7688 12301 3283 717
864024 35216 14181 7835 55 703
325431 9612 59072 9927 3685 859
9470 142558 26098 7837 1828 48
760691 85295 36350 685 1602 915
318566 231464 46065 10474 3145 11
233390 205223 41656 5795 1485 240
20895 187290 52735 10005 1098 243
441925 138088 38431 14985 2234 270
911192 81507 35650 2266 1334 251
729419 226756 50865 14680 2226 149
986770 73055 35952 7499 3976 951
450113 61145 41719 8483 4084 755
822998 80606 14332 15340 2025 549
639994 241593 57376 11513 4043 664
354799 219678 65334 12970 4068 680
238887 62128 32711 15349 871 814
961180 128226 27705 4122 699 637
804217 71443 11137 8454 2912 686
980805 145070 9560 8357 1302 106
178385 181838 24955 4700 535 68
134391 221600 10816 13373 206 797
520135 26204 29197 12552 3152 912
94091 152220 23423 5634 1755 626
105090 104746 62818 7831 1118 170
491576 114244 7073 12583 1607 792
998994 183382 6358 8747 523 710
280521 71010 44973 13358 2044 137
5099 105438 46258 8121 2129 114
316085 213367 12381 15 579 823
254719 29140 50967 13914 3204 496
34481 234242 32228 10798 3734 470
55023 244205 15892 15172 3028 653
256463 54761 36821 5019 1674 563
186567 76559 49197 10930 3260 513
103111 96598 23281 11579 1229 611
598177 183366 40796 6104 4039 113
848745 169061 42479 4733 734 558
168123 69313 37542 8875 1894 87
840690 242000 13401 8625 2818 4
897396 159864 18201 13671 2134 893
