%YAML 1.1
%TAG !u! tag:unity3d.com,2011:
--- !u!114 &11400000
MonoBehaviour:
  m_ObjectHideFlags: 0
  m_CorrespondingSourceObject: {fileID: 0}
  m_PrefabInstance: {fileID: 0}
  m_PrefabAsset: {fileID: 0}
  m_GameObject: {fileID: 0}
  m_Enabled: 0
  m_EditorHideFlags: 0
  m_Script: {fileID: 11500000, guid: 5af5a27ef7c53d4448fd59c82afe7c5a, type: 3}
  m_Name: LevelData_05
  m_EditorClassIdentifier: 
  LevelName: 'Level 5: Smoky Situation'
  LevelPrefab: {fileID: 2572693928105591753, guid: 70bdd7cecefb1f14e84576b6cd25bb97,
    type: 3}
  LevelScene: Level_05
  LevelIndex: {x: 0, y: 0}
