%YAML 1.1
%TAG !u! tag:unity3d.com,2011:
--- !u!114 &-6203657689030639298
MonoBehaviour:
  m_ObjectHideFlags: 11
  m_CorrespondingSourceObject: {fileID: 0}
  m_PrefabInstance: {fileID: 0}
  m_PrefabAsset: {fileID: 0}
  m_GameObject: {fileID: 0}
  m_Enabled: 1
  m_EditorHideFlags: 0
  m_Script: {fileID: 11500000, guid: d0353a89b1f911e48b9e16bdc9f2e058, type: 3}
  m_Name: 
  m_EditorClassIdentifier: 
  version: 1
--- !u!21 &2100000
Material:
  serializedVersion: 6
  m_ObjectHideFlags: 0
  m_CorrespondingSourceObject: {fileID: 0}
  m_PrefabInstance: {fileID: 0}
  m_PrefabAsset: {fileID: 0}
  m_Name: M_WC
  m_Shader: {fileID: -6465566751694194690, guid: b7f939f7f1a1f4e4d9006fcd1ee7e2fc,
    type: 3}
  m_ShaderKeywords: _NORMALMAP _OCCLUSIONMAP
  m_LightmapFlags: 4
  m_EnableInstancingVariants: 0
  m_DoubleSidedGI: 0
  m_CustomRenderQueue: -1
  stringTagMap: {}
  disabledShaderPasses: []
  m_SavedProperties:
    serializedVersion: 3
    m_TexEnvs:
    - Texture2D_1C13F636:
        m_Texture: {fileID: 2800000, guid: 6a8da4c510358d448b4dfb70631f221e, type: 3}
        m_Scale: {x: 1, y: 1}
        m_Offset: {x: 0, y: 0}
    - Texture2D_261E714C:
        m_Texture: {fileID: 2800000, guid: 9744a8f1125c84e4f8599789bdae5dfe, type: 3}
        m_Scale: {x: 1, y: 1}
        m_Offset: {x: 0, y: 0}
    - Texture2D_2FD9BD95:
        m_Texture: {fileID: 0}
        m_Scale: {x: 1, y: 1}
        m_Offset: {x: 0, y: 0}
    - Texture2D_387680B7:
        m_Texture: {fileID: 2800000, guid: 6a8da4c510358d448b4dfb70631f221e, type: 3}
        m_Scale: {x: 1, y: 1}
        m_Offset: {x: 0, y: 0}
    - Texture2D_BA0314B7:
        m_Texture: {fileID: 2800000, guid: 3e79bff22ab5bbb44b12fb217c587b9e, type: 3}
        m_Scale: {x: 1, y: 1}
        m_Offset: {x: 0, y: 0}
    - _BaseMap:
        m_Texture: {fileID: 2800000, guid: 6a8da4c510358d448b4dfb70631f221e, type: 3}
        m_Scale: {x: 1, y: 1}
        m_Offset: {x: 0, y: 0}
    - _BumpMap:
        m_Texture: {fileID: 2800000, guid: 3e79bff22ab5bbb44b12fb217c587b9e, type: 3}
        m_Scale: {x: 1, y: 1}
        m_Offset: {x: 0, y: 0}
    - _EmissionMap:
        m_Texture: {fileID: 0}
        m_Scale: {x: 1, y: 1}
        m_Offset: {x: 0, y: 0}
    - _MainTex:
        m_Texture: {fileID: 2800000, guid: 6a8da4c510358d448b4dfb70631f221e, type: 3}
        m_Scale: {x: 1, y: 1}
        m_Offset: {x: 0, y: 0}
    - _MetallicGlossMap:
        m_Texture: {fileID: 0}
        m_Scale: {x: 1, y: 1}
        m_Offset: {x: 0, y: 0}
    - _OcclusionMap:
        m_Texture: {fileID: 2800000, guid: 9744a8f1125c84e4f8599789bdae5dfe, type: 3}
        m_Scale: {x: 1, y: 1}
        m_Offset: {x: 0, y: 0}
    - _SampleTexture2D_134EC921_Texture_1:
        m_Texture: {fileID: 2800000, guid: 9c6317e6b8d57b04cb37f569cf877a42, type: 3}
        m_Scale: {x: 1, y: 1}
        m_Offset: {x: 0, y: 0}
    - _SpecGlossMap:
        m_Texture: {fileID: 0}
        m_Scale: {x: 1, y: 1}
        m_Offset: {x: 0, y: 0}
    m_Floats:
    - Vector1_13AC9A3B: 0.4
    - Vector1_1AFB16D9: 0
    - Vector1_2FA6AB36: 0.4
    - Vector1_64528CBA: 0
    - Vector1_850A8B81: 0.2
    - Vector1_B46AB542: 0
    - Vector1_C0849F61: 0.1
    - Vector1_C923F2A0: 0
    - Vector1_FA17A299: 0.1
    - _AlphaClip: 0
    - _Blend: 0
    - _BumpScale: 1
    - _Cull: 2
    - _Cutoff: 0.5
    - _DstBlend: 0
    - _EnvironmentReflections: 1
    - _GlossMapScale: 0
    - _Glossiness: 0
    - _GlossyReflections: 0
    - _Metallic: 0
    - _OcclusionStrength: 1
    - _QueueOffset: 0
    - _ReceiveShadows: 1
    - _Smoothness: 0.5
    - _SmoothnessTextureChannel: 0
    - _SpecularHighlights: 1
    - _SrcBlend: 1
    - _Surface: 0
    - _WorkflowMode: 1
    - _ZWrite: 1
    m_Colors:
    - Color_4672BC7C: {r: 1, g: 1, b: 1, a: 0}
    - Color_B782FA6B: {r: 0.2264151, g: 0.2264151, b: 0.2264151, a: 0}
    - Color_B845369: {r: 0.4528302, g: 0.4528302, b: 0.4528302, a: 0}
    - Color_E3C484B5: {r: 1, g: 1, b: 1, a: 0}
    - Color_FE556063: {r: 0.41568628, g: 0.41568628, b: 0.41568628, a: 0}
    - Vector2_4408A5D8: {r: 1, g: 1, b: 0, a: 0}
    - Vector2_5625D11D: {r: 1, g: 1, b: 0, a: 0}
    - Vector2_6003D2FA: {r: 0, g: 0, b: 0, a: 0}
    - Vector2_CD60AAB5: {r: 0, g: 0, b: 0, a: 0}
    - _BaseColor: {r: 1, g: 1, b: 1, a: 1}
    - _Color: {r: 0.8, g: 0.8, b: 0.8, a: 1}
    - _EmissionColor: {r: 0, g: 0, b: 0, a: 0}
    - _SpecColor: {r: 0.2, g: 0.2, b: 0.2, a: 1}
