%YAML 1.1
%TAG !u! tag:unity3d.com,2011:
--- !u!114 &11400000
MonoBehaviour:
  m_ObjectHideFlags: 0
  m_CorrespondingSourceObject: {fileID: 0}
  m_PrefabInstance: {fileID: 0}
  m_PrefabAsset: {fileID: 0}
  m_GameObject: {fileID: 0}
  m_Enabled: 1
  m_EditorHideFlags: 0
  m_Script: {fileID: 11500000, guid: 40af0f3400b6a2b438e6569317228525, type: 3}
  m_Name: T2_Step3
  m_EditorClassIdentifier: 
  TextPrompt: Objects can block your way and slow you down, but you can push them
    to clear the way for your companions. Go to these position first.
  StartNodes:
  - {x: 4, y: 2}
  - {x: 4, y: 3}
  - {x: 4, y: 4}
  - {x: 5, y: 2}
  - {x: 5, y: 4}
  - {x: 6, y: 2}
  - {x: 6, y: 3}
  - {x: 6, y: 4}
  EndNodes:
  - {x: 5, y: 2}
  - {x: 5, y: 4}
  PromptType: 1
  ImmediatelyStart: 0
  Step: 0
