%YAML 1.1
%TAG !u! tag:unity3d.com,2011:
--- !u!114 &11400000
MonoBehaviour:
  m_ObjectHideFlags: 0
  m_CorrespondingSourceObject: {fileID: 0}
  m_PrefabInstance: {fileID: 0}
  m_PrefabAsset: {fileID: 0}
  m_GameObject: {fileID: 0}
  m_Enabled: 1
  m_EditorHideFlags: 0
  m_Script: {fileID: 11500000, guid: 720be651a1f124e488ff07fa7946f43c, type: 3}
  m_Name: SkillTree1FF
  m_EditorClassIdentifier: 
  ProgressionOne:
    array:
    - SkillPoint: {fileID: 11400000, guid: f860c82d63281c247ad2637763b7c441, type: 2}
      Prize: 5
    - SkillPoint: {fileID: 11400000, guid: f860c82d63281c247ad2637763b7c441, type: 2}
      Prize: 10
    - SkillPoint: {fileID: 11400000, guid: f860c82d63281c247ad2637763b7c441, type: 2}
      Prize: 20
  ProgressionTwo:
    array:
    - SkillPoint: {fileID: 11400000, guid: 4f6c0188eeb731c44847d410a0f82362, type: 2}
      Prize: 7
    - SkillPoint: {fileID: 11400000, guid: 4f6c0188eeb731c44847d410a0f82362, type: 2}
      Prize: 15
    - SkillPoint: {fileID: 11400000, guid: 4f6c0188eeb731c44847d410a0f82362, type: 2}
      Prize: 23
  Melee:
    array:
    - SkillPoint: {fileID: 11400000, guid: 7ce45d38fde8145488ab6127d928b5d3, type: 2}
      Prize: 0
    - SkillPoint: {fileID: 11400000, guid: c829c8872a53eba4ebfd966dd53f5c9b, type: 2}
      Prize: 10
    - SkillPoint: {fileID: 11400000, guid: c0bf2b90849da1e468613f51039008d4, type: 2}
      Prize: 30
  Extinguish:
    array:
    - SkillPoint: {fileID: 11400000, guid: 1c146dbe7f2f4614399e2166d90556d1, type: 2}
      Prize: 0
    - SkillPoint: {fileID: 11400000, guid: f65fc50ad17645f459fa32fd9c5134c5, type: 2}
      Prize: 10
    - SkillPoint: {fileID: 11400000, guid: 5a5f71a234c5cdd45bb09016df49b7e2, type: 2}
      Prize: 30
  Utility:
    array:
    - SkillPoint: {fileID: 11400000, guid: c09a155acc434ad45af0238a5293902f, type: 2}
      Prize: 0
    - SkillPoint: {fileID: 11400000, guid: a7e58e331aea4e5418a7afbda6aa8a5e, type: 2}
      Prize: 10
    - SkillPoint: {fileID: 11400000, guid: e7b8897f0f6e75744b2bc065cedead39, type: 2}
      Prize: 30
