%YAML 1.1
%TAG !u! tag:unity3d.com,2011:
--- !u!114 &11400000
MonoBehaviour:
  m_ObjectHideFlags: 0
  m_CorrespondingSourceObject: {fileID: 0}
  m_PrefabInstance: {fileID: 0}
  m_PrefabAsset: {fileID: 0}
  m_GameObject: {fileID: 0}
  m_Enabled: 1
  m_EditorHideFlags: 0
  m_Script: {fileID: 11500000, guid: d8baf49b6d96a3047a20609f21b47387, type: 3}
  m_Name: Smoke fan range+1x1
  m_EditorClassIdentifier: 
  SkillPointName: Turbo Turbine
  Sprite: {fileID: 21300000, guid: 88fddd6a311162c4e8cd988c4c4fa5ab, type: 3}
  IsTypeUpgrade: 0
  TypeTarget: 0
  EquipTarget: 6
  TargetValue: 2
  EnhancedValue: 0
  EnhancedRange: {x: 0, y: 1}
  NewArea: 0
  m_Description: Smoke Fan range +1
