%YAML 1.1
%TAG !u! tag:unity3d.com,2011:
--- !u!21 &2100000
Material:
  serializedVersion: 6
  m_ObjectHideFlags: 0
  m_CorrespondingSourceObject: {fileID: 0}
  m_PrefabInstance: {fileID: 0}
  m_PrefabAsset: {fileID: 0}
  m_Name: M_Tile_Exit
  m_Shader: {fileID: -6465566751694194690, guid: 27020b81e2293744fa8707333581811d,
    type: 3}
  m_ShaderKeywords: 
  m_LightmapFlags: 4
  m_EnableInstancingVariants: 0
  m_DoubleSidedGI: 0
  m_CustomRenderQueue: -1
  stringTagMap: {}
  disabledShaderPasses: []
  m_SavedProperties:
    serializedVersion: 3
    m_TexEnvs:
    - Texture2D_390089E9:
        m_Texture: {fileID: 2800000, guid: 289312b6b5b9c1043890911434d6dc6a, type: 3}
        m_Scale: {x: 1, y: 1}
        m_Offset: {x: 0, y: 0}
    - _SampleTexture2D_F17E7922_Texture_1:
        m_Texture: {fileID: 2800000, guid: 289312b6b5b9c1043890911434d6dc6a, type: 3}
        m_Scale: {x: 1, y: 1}
        m_Offset: {x: 0, y: 0}
    m_Floats:
    - Vector1_27E74A1: 1
    - Vector1_44548098: 7.09
    - Vector1_9969B7F: 0.6
    - Vector1_B5EB4E2C: 0
    - Vector1_B7689C2C: 0
    - Vector1_DD294C40: 0
    - Vector1_E8E9F956: 0
    - Vector1_F270182: 0.17
    - Vector1_F36A1DD1: 0
    m_Colors:
    - Color_BAB8A62: {r: 0, g: 1.1269575, b: 0.087814875, a: 1}
    - Color_DAF01EF9: {r: 1, g: 1, b: 1, a: 0}
    - Vector2_6B1B13DD: {r: 1, g: 1, b: 0, a: 0}
    - Vector2_EA308C5A: {r: 1, g: 1, b: 0, a: 0}
