%YAML 1.1
%TAG !u! tag:unity3d.com,2011:
--- !u!114 &11400000
MonoBehaviour:
  m_ObjectHideFlags: 0
  m_CorrespondingSourceObject: {fileID: 0}
  m_PrefabInstance: {fileID: 0}
  m_PrefabAsset: {fileID: 0}
  m_GameObject: {fileID: 0}
  m_Enabled: 1
  m_EditorHideFlags: 0
  m_Script: {fileID: 11500000, guid: a60aa06632f605644bccd0b74e14a9ef, type: 3}
  m_Name: Generate_Water_2x2
  m_EditorClassIdentifier: 
  Range: {x: 2, y: 2}
  ActionDescription: Some water is leaking!
  LiquidType: 0
