%YAML 1.1
%TAG !u! tag:unity3d.com,2011:
--- !u!1 &6992741359145040802
GameObject:
  m_ObjectHideFlags: 0
  m_CorrespondingSourceObject: {fileID: 0}
  m_PrefabInstance: {fileID: 0}
  m_PrefabAsset: {fileID: 0}
  serializedVersion: 6
  m_Component:
  - component: {fileID: 6291648454826609073}
  m_Layer: 0
  m_Name: PF_KitchenTable
  m_TagString: Untagged
  m_Icon: {fileID: 0}
  m_NavMeshLayer: 0
  m_StaticEditorFlags: 0
  m_IsActive: 1
--- !u!4 &6291648454826609073
Transform:
  m_ObjectHideFlags: 0
  m_CorrespondingSourceObject: {fileID: 0}
  m_PrefabInstance: {fileID: 0}
  m_PrefabAsset: {fileID: 0}
  m_GameObject: {fileID: 6992741359145040802}
  m_LocalRotation: {x: -0, y: -0, z: -0, w: 1}
  m_LocalPosition: {x: 0, y: 0, z: 0}
  m_LocalScale: {x: 1, y: 1, z: 1}
  m_Children:
  - {fileID: 109625319144713451}
  m_Father: {fileID: 0}
  m_RootOrder: 0
  m_LocalEulerAnglesHint: {x: 0, y: 0, z: 0}
--- !u!1001 &4971907378499536881
PrefabInstance:
  m_ObjectHideFlags: 0
  serializedVersion: 2
  m_Modification:
    m_TransformParent: {fileID: 6291648454826609073}
    m_Modifications:
    - target: {fileID: -927199367670048503, guid: 0fd5e25ace831de4e8a5e3f73b5dba9d,
        type: 3}
      propertyPath: m_Name
      value: SM_KitchenTable
      objectReference: {fileID: 0}
    - target: {fileID: -4216859302048453862, guid: 0fd5e25ace831de4e8a5e3f73b5dba9d,
        type: 3}
      propertyPath: m_LocalPosition.x
      value: -0
      objectReference: {fileID: 0}
    - target: {fileID: -4216859302048453862, guid: 0fd5e25ace831de4e8a5e3f73b5dba9d,
        type: 3}
      propertyPath: m_LocalPosition.y
      value: 0
      objectReference: {fileID: 0}
    - target: {fileID: -4216859302048453862, guid: 0fd5e25ace831de4e8a5e3f73b5dba9d,
        type: 3}
      propertyPath: m_LocalPosition.z
      value: 0
      objectReference: {fileID: 0}
    - target: {fileID: -4216859302048453862, guid: 0fd5e25ace831de4e8a5e3f73b5dba9d,
        type: 3}
      propertyPath: m_LocalRotation.x
      value: 0
      objectReference: {fileID: 0}
    - target: {fileID: -4216859302048453862, guid: 0fd5e25ace831de4e8a5e3f73b5dba9d,
        type: 3}
      propertyPath: m_LocalRotation.y
      value: -0
      objectReference: {fileID: 0}
    - target: {fileID: -4216859302048453862, guid: 0fd5e25ace831de4e8a5e3f73b5dba9d,
        type: 3}
      propertyPath: m_LocalRotation.z
      value: -0
      objectReference: {fileID: 0}
    - target: {fileID: -4216859302048453862, guid: 0fd5e25ace831de4e8a5e3f73b5dba9d,
        type: 3}
      propertyPath: m_LocalRotation.w
      value: 1
      objectReference: {fileID: 0}
    - target: {fileID: -4216859302048453862, guid: 0fd5e25ace831de4e8a5e3f73b5dba9d,
        type: 3}
      propertyPath: m_RootOrder
      value: 0
      objectReference: {fileID: 0}
    - target: {fileID: -4216859302048453862, guid: 0fd5e25ace831de4e8a5e3f73b5dba9d,
        type: 3}
      propertyPath: m_LocalEulerAnglesHint.x
      value: 0
      objectReference: {fileID: 0}
    - target: {fileID: -4216859302048453862, guid: 0fd5e25ace831de4e8a5e3f73b5dba9d,
        type: 3}
      propertyPath: m_LocalEulerAnglesHint.y
      value: 0
      objectReference: {fileID: 0}
    - target: {fileID: -4216859302048453862, guid: 0fd5e25ace831de4e8a5e3f73b5dba9d,
        type: 3}
      propertyPath: m_LocalEulerAnglesHint.z
      value: 0
      objectReference: {fileID: 0}
    - target: {fileID: -1504981713932161579, guid: 0fd5e25ace831de4e8a5e3f73b5dba9d,
        type: 3}
      propertyPath: m_Materials.Array.data[0]
      value: 
      objectReference: {fileID: 2100000, guid: 00d97ed45ec83a04ebe6f9b0e8216734, type: 2}
    m_RemovedComponents: []
  m_SourcePrefab: {fileID: 100100000, guid: 0fd5e25ace831de4e8a5e3f73b5dba9d, type: 3}
--- !u!4 &109625319144713451 stripped
Transform:
  m_CorrespondingSourceObject: {fileID: -4216859302048453862, guid: 0fd5e25ace831de4e8a5e3f73b5dba9d,
    type: 3}
  m_PrefabInstance: {fileID: 4971907378499536881}
  m_PrefabAsset: {fileID: 0}
