%YAML 1.1
%TAG !u! tag:unity3d.com,2011:
--- !u!114 &11400000
MonoBehaviour:
  m_ObjectHideFlags: 0
  m_CorrespondingSourceObject: {fileID: 0}
  m_PrefabInstance: {fileID: 0}
  m_PrefabAsset: {fileID: 0}
  m_GameObject: {fileID: 0}
  m_Enabled: 1
  m_EditorHideFlags: 0
  m_Script: {fileID: 11500000, guid: 45b239eb99e28064f83b2265f0224968, type: 3}
  m_Name: FFData_Name3
  m_EditorClassIdentifier: 
  FName: 2
  FFRole: Daredevil
  HealthStatus: 0
  quirk: {fileID: 11400000, guid: 26187d0986b4ddc49885f8c71247a19d, type: 2}
  hiddenQuirk: []
  SkillTree:
    ProgressiveOne: 1
    ProgressiveTwo: 0
    Melee: 1
    Extinguish: 0
    Utility: 1
  baseMovement: 8
  baseHealth: 3
  medikitMovementBoost: 0
  BaseSprite: {fileID: 21300000, guid: b82f802c6fa7c3d4f8b964baac88261e, type: 3}
