%YAML 1.1
%TAG !u! tag:unity3d.com,2011:
--- !u!114 &11400000
MonoBehaviour:
  m_ObjectHideFlags: 0
  m_CorrespondingSourceObject: {fileID: 0}
  m_PrefabInstance: {fileID: 0}
  m_PrefabAsset: {fileID: 0}
  m_GameObject: {fileID: 0}
  m_Enabled: 1
  m_EditorHideFlags: 0
  m_Script: {fileID: 11500000, guid: 45b239eb99e28064f83b2265f0224968, type: 3}
  m_Name: FFData_Name2
  m_EditorClassIdentifier: 
  FName: 1
  FFRole: Strong Arm
  HealthStatus: 0
  quirk: {fileID: 11400000, guid: acae7ebb78467944bb24c75dd7c77715, type: 2}
  hiddenQuirk: []
  SkillTree:
    ProgressiveOne: 1
    ProgressiveTwo: 0
    Melee: 1
    Extinguish: 1
    Utility: 0
  baseMovement: 5
  baseHealth: 5
  medikitMovementBoost: 0
  BaseSprite: {fileID: 21300000, guid: 0ff4bf61369e56e4380aca37858a64fe, type: 3}
