%YAML 1.1
%TAG !u! tag:unity3d.com,2011:
--- !u!1 &385324829485595882
GameObject:
  m_ObjectHideFlags: 0
  m_CorrespondingSourceObject: {fileID: 0}
  m_PrefabInstance: {fileID: 0}
  m_PrefabAsset: {fileID: 0}
  serializedVersion: 6
  m_Component:
  - component: {fileID: 6389856822662010545}
  - component: {fileID: 2480664856344754176}
  - component: {fileID: 216525724863171504}
  m_Layer: 31
  m_Name: Layer1
  m_TagString: Untagged
  m_Icon: {fileID: 0}
  m_NavMeshLayer: 0
  m_StaticEditorFlags: 0
  m_IsActive: 1
--- !u!4 &6389856822662010545
Transform:
  m_ObjectHideFlags: 0
  m_CorrespondingSourceObject: {fileID: 0}
  m_PrefabInstance: {fileID: 0}
  m_PrefabAsset: {fileID: 0}
  m_GameObject: {fileID: 385324829485595882}
  m_LocalRotation: {x: -0, y: -0, z: -0, w: 1}
  m_LocalPosition: {x: 0, y: 0, z: 0}
  m_LocalScale: {x: 1, y: 1, z: 1}
  m_Children: []
  m_Father: {fileID: 2162564182526088134}
  m_RootOrder: 0
  m_LocalEulerAnglesHint: {x: 0, y: 0, z: 0}
--- !u!1839735485 &2480664856344754176
Tilemap:
  m_ObjectHideFlags: 0
  m_CorrespondingSourceObject: {fileID: 0}
  m_PrefabInstance: {fileID: 0}
  m_PrefabAsset: {fileID: 0}
  m_GameObject: {fileID: 385324829485595882}
  m_Enabled: 1
  m_Tiles:
  - first: {x: -3, y: -4, z: 0}
    second:
      m_TileIndex: 29
      m_TileSpriteIndex: 29
      m_TileMatrixIndex: 0
      m_TileColorIndex: 0
      m_ObjectToInstantiate: {fileID: 0}
      m_TileFlags: 1
      m_ColliderType: 1
  - first: {x: -1, y: -4, z: 0}
    second:
      m_TileIndex: 19
      m_TileSpriteIndex: 19
      m_TileMatrixIndex: 0
      m_TileColorIndex: 5
      m_ObjectToInstantiate: {fileID: 0}
      m_TileFlags: 1
      m_ColliderType: 1
  - first: {x: 1, y: -4, z: 0}
    second:
      m_TileIndex: 23
      m_TileSpriteIndex: 23
      m_TileMatrixIndex: 0
      m_TileColorIndex: 8
      m_ObjectToInstantiate: {fileID: 0}
      m_TileFlags: 1
      m_ColliderType: 1
  - first: {x: 3, y: -4, z: 0}
    second:
      m_TileIndex: 26
      m_TileSpriteIndex: 25
      m_TileMatrixIndex: 0
      m_TileColorIndex: 10
      m_ObjectToInstantiate: {fileID: 0}
      m_TileFlags: 1
      m_ColliderType: 1
  - first: {x: 5, y: -4, z: 0}
    second:
      m_TileIndex: 8
      m_TileSpriteIndex: 5
      m_TileMatrixIndex: 0
      m_TileColorIndex: 13
      m_ObjectToInstantiate: {fileID: 0}
      m_TileFlags: 1
      m_ColliderType: 1
  - first: {x: 7, y: -4, z: 0}
    second:
      m_TileIndex: 1
      m_TileSpriteIndex: 0
      m_TileMatrixIndex: 0
      m_TileColorIndex: 17
      m_ObjectToInstantiate: {fileID: 0}
      m_TileFlags: 1
      m_ColliderType: 1
  - first: {x: 9, y: -4, z: 0}
    second:
      m_TileIndex: 34
      m_TileSpriteIndex: 34
      m_TileMatrixIndex: 0
      m_TileColorIndex: 22
      m_ObjectToInstantiate: {fileID: 0}
      m_TileFlags: 1
      m_ColliderType: 1
  - first: {x: 11, y: -4, z: 0}
    second:
      m_TileIndex: 39
      m_TileSpriteIndex: 36
      m_TileMatrixIndex: 0
      m_TileColorIndex: 26
      m_ObjectToInstantiate: {fileID: 0}
      m_TileFlags: 1
      m_ColliderType: 1
  - first: {x: 13, y: -4, z: 0}
    second:
      m_TileIndex: 44
      m_TileSpriteIndex: 44
      m_TileMatrixIndex: 0
      m_TileColorIndex: 30
      m_ObjectToInstantiate: {fileID: 0}
      m_TileFlags: 1
      m_ColliderType: 1
  - first: {x: 15, y: -4, z: 0}
    second:
      m_TileIndex: 49
      m_TileSpriteIndex: 49
      m_TileMatrixIndex: 0
      m_TileColorIndex: 0
      m_ObjectToInstantiate: {fileID: 0}
      m_TileFlags: 1
      m_ColliderType: 1
  - first: {x: -4, y: -3, z: 0}
    second:
      m_TileIndex: 50
      m_TileSpriteIndex: 50
      m_TileMatrixIndex: 0
      m_TileColorIndex: 0
      m_ObjectToInstantiate: {fileID: 0}
      m_TileFlags: 1
      m_ColliderType: 1
  - first: {x: -3, y: -3, z: 0}
    second:
      m_TileIndex: 28
      m_TileSpriteIndex: 28
      m_TileMatrixIndex: 0
      m_TileColorIndex: 0
      m_ObjectToInstantiate: {fileID: 0}
      m_TileFlags: 1
      m_ColliderType: 1
  - first: {x: -1, y: -3, z: 0}
    second:
      m_TileIndex: 18
      m_TileSpriteIndex: 18
      m_TileMatrixIndex: 0
      m_TileColorIndex: 4
      m_ObjectToInstantiate: {fileID: 0}
      m_TileFlags: 1
      m_ColliderType: 1
  - first: {x: 1, y: -3, z: 0}
    second:
      m_TileIndex: 22
      m_TileSpriteIndex: 22
      m_TileMatrixIndex: 0
      m_TileColorIndex: 7
      m_ObjectToInstantiate: {fileID: 0}
      m_TileFlags: 1
      m_ColliderType: 1
  - first: {x: 3, y: -3, z: 0}
    second:
      m_TileIndex: 27
      m_TileSpriteIndex: 24
      m_TileMatrixIndex: 0
      m_TileColorIndex: 9
      m_ObjectToInstantiate: {fileID: 0}
      m_TileFlags: 1
      m_ColliderType: 1
  - first: {x: 5, y: -3, z: 0}
    second:
      m_TileIndex: 10
      m_TileSpriteIndex: 6
      m_TileMatrixIndex: 0
      m_TileColorIndex: 14
      m_ObjectToInstantiate: {fileID: 0}
      m_TileFlags: 1
      m_ColliderType: 1
  - first: {x: 7, y: -3, z: 0}
    second:
      m_TileIndex: 2
      m_TileSpriteIndex: 1
      m_TileMatrixIndex: 0
      m_TileColorIndex: 21
      m_ObjectToInstantiate: {fileID: 0}
      m_TileFlags: 1
      m_ColliderType: 1
  - first: {x: 9, y: -3, z: 0}
    second:
      m_TileIndex: 33
      m_TileSpriteIndex: 33
      m_TileMatrixIndex: 0
      m_TileColorIndex: 23
      m_ObjectToInstantiate: {fileID: 0}
      m_TileFlags: 1
      m_ColliderType: 1
  - first: {x: 11, y: -3, z: 0}
    second:
      m_TileIndex: 38
      m_TileSpriteIndex: 37
      m_TileMatrixIndex: 0
      m_TileColorIndex: 27
      m_ObjectToInstantiate: {fileID: 0}
      m_TileFlags: 1
      m_ColliderType: 1
  - first: {x: 13, y: -3, z: 0}
    second:
      m_TileIndex: 43
      m_TileSpriteIndex: 43
      m_TileMatrixIndex: 0
      m_TileColorIndex: 31
      m_ObjectToInstantiate: {fileID: 0}
      m_TileFlags: 1
      m_ColliderType: 1
  - first: {x: 15, y: -3, z: 0}
    second:
      m_TileIndex: 48
      m_TileSpriteIndex: 48
      m_TileMatrixIndex: 0
      m_TileColorIndex: 0
      m_ObjectToInstantiate: {fileID: 0}
      m_TileFlags: 1
      m_ColliderType: 1
  - first: {x: -3, y: -2, z: 0}
    second:
      m_TileIndex: 13
      m_TileSpriteIndex: 11
      m_TileMatrixIndex: 0
      m_TileColorIndex: 0
      m_ObjectToInstantiate: {fileID: 0}
      m_TileFlags: 1
      m_ColliderType: 1
  - first: {x: -1, y: -2, z: 0}
    second:
      m_TileIndex: 17
      m_TileSpriteIndex: 17
      m_TileMatrixIndex: 0
      m_TileColorIndex: 3
      m_ObjectToInstantiate: {fileID: 0}
      m_TileFlags: 1
      m_ColliderType: 1
  - first: {x: 1, y: -2, z: 0}
    second:
      m_TileIndex: 21
      m_TileSpriteIndex: 21
      m_TileMatrixIndex: 0
      m_TileColorIndex: 6
      m_ObjectToInstantiate: {fileID: 0}
      m_TileFlags: 1
      m_ColliderType: 1
  - first: {x: 3, y: -2, z: 0}
    second:
      m_TileIndex: 25
      m_TileSpriteIndex: 26
      m_TileMatrixIndex: 0
      m_TileColorIndex: 11
      m_ObjectToInstantiate: {fileID: 0}
      m_TileFlags: 1
      m_ColliderType: 1
  - first: {x: 5, y: -2, z: 0}
    second:
      m_TileIndex: 11
      m_TileSpriteIndex: 7
      m_TileMatrixIndex: 0
      m_TileColorIndex: 15
      m_ObjectToInstantiate: {fileID: 0}
      m_TileFlags: 1
      m_ColliderType: 1
  - first: {x: 7, y: -2, z: 0}
    second:
      m_TileIndex: 4
      m_TileSpriteIndex: 2
      m_TileMatrixIndex: 0
      m_TileColorIndex: 20
      m_ObjectToInstantiate: {fileID: 0}
      m_TileFlags: 1
      m_ColliderType: 1
  - first: {x: 9, y: -2, z: 0}
    second:
      m_TileIndex: 32
      m_TileSpriteIndex: 32
      m_TileMatrixIndex: 0
      m_TileColorIndex: 24
      m_ObjectToInstantiate: {fileID: 0}
      m_TileFlags: 1
      m_ColliderType: 1
  - first: {x: 11, y: -2, z: 0}
    second:
      m_TileIndex: 37
      m_TileSpriteIndex: 38
      m_TileMatrixIndex: 0
      m_TileColorIndex: 28
      m_ObjectToInstantiate: {fileID: 0}
      m_TileFlags: 1
      m_ColliderType: 1
  - first: {x: 13, y: -2, z: 0}
    second:
      m_TileIndex: 42
      m_TileSpriteIndex: 42
      m_TileMatrixIndex: 0
      m_TileColorIndex: 32
      m_ObjectToInstantiate: {fileID: 0}
      m_TileFlags: 1
      m_ColliderType: 1
  - first: {x: 15, y: -2, z: 0}
    second:
      m_TileIndex: 47
      m_TileSpriteIndex: 47
      m_TileMatrixIndex: 0
      m_TileColorIndex: 0
      m_ObjectToInstantiate: {fileID: 0}
      m_TileFlags: 1
      m_ColliderType: 1
  - first: {x: -3, y: -1, z: 0}
    second:
      m_TileIndex: 14
      m_TileSpriteIndex: 14
      m_TileMatrixIndex: 0
      m_TileColorIndex: 0
      m_ObjectToInstantiate: {fileID: 0}
      m_TileFlags: 1
      m_ColliderType: 1
  - first: {x: -1, y: -1, z: 0}
    second:
      m_TileIndex: 16
      m_TileSpriteIndex: 10
      m_TileMatrixIndex: 0
      m_TileColorIndex: 2
      m_ObjectToInstantiate: {fileID: 0}
      m_TileFlags: 1
      m_ColliderType: 1
  - first: {x: 1, y: -1, z: 0}
    second:
      m_TileIndex: 20
      m_TileSpriteIndex: 20
      m_TileMatrixIndex: 0
      m_TileColorIndex: 1
      m_ObjectToInstantiate: {fileID: 0}
      m_TileFlags: 1
      m_ColliderType: 1
  - first: {x: 3, y: -1, z: 0}
    second:
      m_TileIndex: 24
      m_TileSpriteIndex: 27
      m_TileMatrixIndex: 0
      m_TileColorIndex: 12
      m_ObjectToInstantiate: {fileID: 0}
      m_TileFlags: 1
      m_ColliderType: 1
  - first: {x: 5, y: -1, z: 0}
    second:
      m_TileIndex: 12
      m_TileSpriteIndex: 8
      m_TileMatrixIndex: 0
      m_TileColorIndex: 16
      m_ObjectToInstantiate: {fileID: 0}
      m_TileFlags: 1
      m_ColliderType: 1
  - first: {x: 7, y: -1, z: 0}
    second:
      m_TileIndex: 6
      m_TileSpriteIndex: 3
      m_TileMatrixIndex: 0
      m_TileColorIndex: 19
      m_ObjectToInstantiate: {fileID: 0}
      m_TileFlags: 1
      m_ColliderType: 1
  - first: {x: 9, y: -1, z: 0}
    second:
      m_TileIndex: 31
      m_TileSpriteIndex: 31
      m_TileMatrixIndex: 0
      m_TileColorIndex: 25
      m_ObjectToInstantiate: {fileID: 0}
      m_TileFlags: 1
      m_ColliderType: 1
  - first: {x: 11, y: -1, z: 0}
    second:
      m_TileIndex: 36
      m_TileSpriteIndex: 39
      m_TileMatrixIndex: 0
      m_TileColorIndex: 29
      m_ObjectToInstantiate: {fileID: 0}
      m_TileFlags: 1
      m_ColliderType: 1
  - first: {x: 13, y: -1, z: 0}
    second:
      m_TileIndex: 41
      m_TileSpriteIndex: 41
      m_TileMatrixIndex: 0
      m_TileColorIndex: 33
      m_ObjectToInstantiate: {fileID: 0}
      m_TileFlags: 1
      m_ColliderType: 1
  - first: {x: 15, y: -1, z: 0}
    second:
      m_TileIndex: 46
      m_TileSpriteIndex: 46
      m_TileMatrixIndex: 0
      m_TileColorIndex: 0
      m_ObjectToInstantiate: {fileID: 0}
      m_TileFlags: 1
      m_ColliderType: 1
  - first: {x: -3, y: 0, z: 0}
    second:
      m_TileIndex: 15
      m_TileSpriteIndex: 15
      m_TileMatrixIndex: 0
      m_TileColorIndex: 0
      m_ObjectToInstantiate: {fileID: 0}
      m_TileFlags: 1
      m_ColliderType: 1
  - first: {x: -1, y: 0, z: 0}
    second:
      m_TileIndex: 0
      m_TileSpriteIndex: 9
      m_TileMatrixIndex: 0
      m_TileColorIndex: 0
      m_ObjectToInstantiate: {fileID: 0}
      m_TileFlags: 1
      m_ColliderType: 1
  - first: {x: 1, y: 0, z: 0}
    second:
      m_TileIndex: 9
      m_TileSpriteIndex: 12
      m_TileMatrixIndex: 0
      m_TileColorIndex: 0
      m_ObjectToInstantiate: {fileID: 0}
      m_TileFlags: 1
      m_ColliderType: 1
  - first: {x: 3, y: 0, z: 0}
    second:
      m_TileIndex: 5
      m_TileSpriteIndex: 16
      m_TileMatrixIndex: 0
      m_TileColorIndex: 0
      m_ObjectToInstantiate: {fileID: 0}
      m_TileFlags: 1
      m_ColliderType: 1
  - first: {x: 5, y: 0, z: 0}
    second:
      m_TileIndex: 3
      m_TileSpriteIndex: 13
      m_TileMatrixIndex: 0
      m_TileColorIndex: 0
      m_ObjectToInstantiate: {fileID: 0}
      m_TileFlags: 1
      m_ColliderType: 1
  - first: {x: 7, y: 0, z: 0}
    second:
      m_TileIndex: 7
      m_TileSpriteIndex: 4
      m_TileMatrixIndex: 0
      m_TileColorIndex: 18
      m_ObjectToInstantiate: {fileID: 0}
      m_TileFlags: 1
      m_ColliderType: 1
  - first: {x: 9, y: 0, z: 0}
    second:
      m_TileIndex: 30
      m_TileSpriteIndex: 30
      m_TileMatrixIndex: 0
      m_TileColorIndex: 0
      m_ObjectToInstantiate: {fileID: 0}
      m_TileFlags: 1
      m_ColliderType: 1
  - first: {x: 11, y: 0, z: 0}
    second:
      m_TileIndex: 35
      m_TileSpriteIndex: 35
      m_TileMatrixIndex: 0
      m_TileColorIndex: 0
      m_ObjectToInstantiate: {fileID: 0}
      m_TileFlags: 1
      m_ColliderType: 1
  - first: {x: 13, y: 0, z: 0}
    second:
      m_TileIndex: 40
      m_TileSpriteIndex: 40
      m_TileMatrixIndex: 0
      m_TileColorIndex: 0
      m_ObjectToInstantiate: {fileID: 0}
      m_TileFlags: 1
      m_ColliderType: 1
  - first: {x: 15, y: 0, z: 0}
    second:
      m_TileIndex: 45
      m_TileSpriteIndex: 45
      m_TileMatrixIndex: 0
      m_TileColorIndex: 0
      m_ObjectToInstantiate: {fileID: 0}
      m_TileFlags: 1
      m_ColliderType: 1
  m_AnimatedTiles: {}
  m_TileAssetArray:
  - m_RefCount: 1
    m_Data: {fileID: 11400000, guid: c591df1e2060f3d438710d00b75ea0b0, type: 2}
  - m_RefCount: 1
    m_Data: {fileID: 11400000, guid: 8491cb8558f1b1647aa1eb202a603716, type: 2}
  - m_RefCount: 1
    m_Data: {fileID: 11400000, guid: 81ebc2e0154402643ad9d56e2fad97f5, type: 2}
  - m_RefCount: 1
    m_Data: {fileID: 11400000, guid: 272583303c793664e984d843eee80fc8, type: 2}
  - m_RefCount: 1
    m_Data: {fileID: 11400000, guid: 0542370bc0b53ab4999837495f14960d, type: 2}
  - m_RefCount: 1
    m_Data: {fileID: 11400000, guid: 4a10a891e4dc8624a8fa1fe9ce6ceab3, type: 2}
  - m_RefCount: 1
    m_Data: {fileID: 11400000, guid: 398dfc1cf526349418f5a5850366238a, type: 2}
  - m_RefCount: 1
    m_Data: {fileID: 11400000, guid: 65f7f1a09000c5e4fb30918d3e91ae51, type: 2}
  - m_RefCount: 1
    m_Data: {fileID: 11400000, guid: fc761641cc49c4c4ea941405dbe8e063, type: 2}
  - m_RefCount: 1
    m_Data: {fileID: 11400000, guid: 7b77e8757006647438723537195306ec, type: 2}
  - m_RefCount: 1
    m_Data: {fileID: 11400000, guid: 7f396f10abf908245a772cb9a96d9846, type: 2}
  - m_RefCount: 1
    m_Data: {fileID: 11400000, guid: d869e556ca8a93348a9bc3fb7977b15a, type: 2}
  - m_RefCount: 1
    m_Data: {fileID: 11400000, guid: 0d71069dfc7758a4b9945eb21b0b286e, type: 2}
  - m_RefCount: 1
    m_Data: {fileID: 11400000, guid: 8a156153998b64c42a2b7c154fd9bace, type: 2}
  - m_RefCount: 1
    m_Data: {fileID: 11400000, guid: efc329f9f78298649a78d00033ba1e4a, type: 2}
  - m_RefCount: 1
    m_Data: {fileID: 11400000, guid: c0abd5a83ded70a46abc6ee503e3b0d0, type: 2}
  - m_RefCount: 1
    m_Data: {fileID: 11400000, guid: 0a6d406bbc89ecf4092d3a2e40d2ed6a, type: 2}
  - m_RefCount: 1
    m_Data: {fileID: 11400000, guid: 5287f067b3ff7ad4dbcc575d358640e5, type: 2}
  - m_RefCount: 1
    m_Data: {fileID: 11400000, guid: d47fc4193df4abc4ca61c6848bfbeab0, type: 2}
  - m_RefCount: 1
    m_Data: {fileID: 11400000, guid: df0cdb3a4ae05c0488694fc3d720942c, type: 2}
  - m_RefCount: 1
    m_Data: {fileID: 11400000, guid: 6676966ae6b6bb84faa02677cc323d38, type: 2}
  - m_RefCount: 1
    m_Data: {fileID: 11400000, guid: e22c4a0802b66c941ac392c130a8c550, type: 2}
  - m_RefCount: 1
    m_Data: {fileID: 11400000, guid: 0d980a0c15c52374cbb8755e6a76f33b, type: 2}
  - m_RefCount: 1
    m_Data: {fileID: 11400000, guid: 0987891fc7603ca4c87f41e05a95cba8, type: 2}
  - m_RefCount: 1
    m_Data: {fileID: 11400000, guid: e05bd9846e5a7c347bb5da7af05b5aa1, type: 2}
  - m_RefCount: 1
    m_Data: {fileID: 11400000, guid: f8cac5c199a10734ca72afa76502cc8c, type: 2}
  - m_RefCount: 1
    m_Data: {fileID: 11400000, guid: 9598a62f608e4a649a01140ff576ce79, type: 2}
  - m_RefCount: 1
    m_Data: {fileID: 11400000, guid: 0888b46d1886aa146967cbee722fa207, type: 2}
  - m_RefCount: 1
    m_Data: {fileID: 11400000, guid: 47c8cd08184a126489810f53e531a1ec, type: 2}
  - m_RefCount: 1
    m_Data: {fileID: 11400000, guid: 02a37e59acf4f5b42a47971d393a77b9, type: 2}
  - m_RefCount: 1
    m_Data: {fileID: 11400000, guid: d848d8e64a6cfde4fa4acb034ca1248c, type: 2}
  - m_RefCount: 1
    m_Data: {fileID: 11400000, guid: 9ed20bb5ea3ed2642bce819f759515c5, type: 2}
  - m_RefCount: 1
    m_Data: {fileID: 11400000, guid: 58abf1934f2266947b050c2b23f8dcec, type: 2}
  - m_RefCount: 1
    m_Data: {fileID: 11400000, guid: d1e424c4cea587c40a23039018af48a6, type: 2}
  - m_RefCount: 1
    m_Data: {fileID: 11400000, guid: c212551cde4383a459bba2d185e9d3ed, type: 2}
  - m_RefCount: 1
    m_Data: {fileID: 11400000, guid: 1a507a44b8b1cc247a5d182f022e9517, type: 2}
  - m_RefCount: 1
    m_Data: {fileID: 11400000, guid: a21d9386b5424b942b67cb83f1d98bee, type: 2}
  - m_RefCount: 1
    m_Data: {fileID: 11400000, guid: 19f2ab22cb4229f4aac9c62a88fb813e, type: 2}
  - m_RefCount: 1
    m_Data: {fileID: 11400000, guid: 186235d9a3fe05544b41f3bb6319ea11, type: 2}
  - m_RefCount: 1
    m_Data: {fileID: 11400000, guid: 96724f52d655d06419997e3c55249caa, type: 2}
  - m_RefCount: 1
    m_Data: {fileID: 11400000, guid: ef3e6b4100bd27f49bdf6a68aebcbbc6, type: 2}
  - m_RefCount: 1
    m_Data: {fileID: 11400000, guid: f050080d602a04142bc6bd6ab61f05db, type: 2}
  - m_RefCount: 1
    m_Data: {fileID: 11400000, guid: dbc8e6390d188fc4ea4d97badcb8fbc1, type: 2}
  - m_RefCount: 1
    m_Data: {fileID: 11400000, guid: cf3511c34530c0445b046e1c857a7a98, type: 2}
  - m_RefCount: 1
    m_Data: {fileID: 11400000, guid: 9428906059130224ab22d4faa42f6172, type: 2}
  - m_RefCount: 1
    m_Data: {fileID: 11400000, guid: 26b70af3544ed6449946b292c83e793e, type: 2}
  - m_RefCount: 1
    m_Data: {fileID: 11400000, guid: 9590dcef674853b4f93712d783c39705, type: 2}
  - m_RefCount: 1
    m_Data: {fileID: 11400000, guid: 4cf6efc15c703fe499837415772a2f21, type: 2}
  - m_RefCount: 1
    m_Data: {fileID: 11400000, guid: a6977d93fc1879849a4d5c25960cc505, type: 2}
  - m_RefCount: 1
    m_Data: {fileID: 11400000, guid: dc97cdbdb12573d4d87df906e828aa3f, type: 2}
  - m_RefCount: 1
    m_Data: {fileID: 11400000, guid: 0ff6ba045b8da174682a55cfd6aafd05, type: 2}
  m_TileSpriteArray:
  - m_RefCount: 1
    m_Data: {fileID: 21300000, guid: 1ffc5523ceda34b4fbd34c4e9386ade8, type: 3}
  - m_RefCount: 1
    m_Data: {fileID: 21300000, guid: 33ca9c9312d060c4ebfe01cb695412ab, type: 3}
  - m_RefCount: 1
    m_Data: {fileID: 21300000, guid: 745d2b64d9025684ea345c86ed7558b7, type: 3}
  - m_RefCount: 1
    m_Data: {fileID: 21300000, guid: c28e63f743105604eaddd086e180fd0d, type: 3}
  - m_RefCount: 1
    m_Data: {fileID: 21300000, guid: f49ecf5e50c93f543bd35fb7c8de7a14, type: 3}
  - m_RefCount: 1
    m_Data: {fileID: 21300000, guid: 0e0c96714ee63864692bda726c3e5824, type: 3}
  - m_RefCount: 1
    m_Data: {fileID: 21300000, guid: 2366ff829e1622148bc6dd5db134acba, type: 3}
  - m_RefCount: 1
    m_Data: {fileID: 21300000, guid: cce7844c8d4bbf549a16b3d5d7f911ac, type: 3}
  - m_RefCount: 1
    m_Data: {fileID: 21300000, guid: bdd9e6ad355bd3e4fadc2364a9b4474a, type: 3}
  - m_RefCount: 1
    m_Data: {fileID: 21300000, guid: 36545a67e9aad624ca56bfb6ab505c9f, type: 3}
  - m_RefCount: 1
    m_Data: {fileID: 21300000, guid: aae4cf2db7d9bab44baeed1399372189, type: 3}
  - m_RefCount: 1
    m_Data: {fileID: 21300000, guid: 6636b79f51ac51948a8e9c69e1b52b2d, type: 3}
  - m_RefCount: 1
    m_Data: {fileID: 21300000, guid: 3bf389404f5b8dd48a3d5ad67b26e148, type: 3}
  - m_RefCount: 1
    m_Data: {fileID: 21300000, guid: 8e798f11c9749904d8f7794bbd949767, type: 3}
  - m_RefCount: 1
    m_Data: {fileID: 21300000, guid: 66ca7de9e1b3c6f46a95277ecf166d6c, type: 3}
  - m_RefCount: 1
    m_Data: {fileID: 21300000, guid: c529fb79e5022e748a9fab5ed04f3586, type: 3}
  - m_RefCount: 1
    m_Data: {fileID: 21300000, guid: 7c7c79889edc25b48b3f291b980877d4, type: 3}
  - m_RefCount: 1
    m_Data: {fileID: 21300000, guid: 7d1c7c60bdd50974c95c029368a4f5f9, type: 3}
  - m_RefCount: 1
    m_Data: {fileID: 21300000, guid: c55c9e71732148243878c2d4fa728b4f, type: 3}
  - m_RefCount: 1
    m_Data: {fileID: 21300000, guid: f9a32414b9e73b84d83c1e1d3849b032, type: 3}
  - m_RefCount: 1
    m_Data: {fileID: 21300000, guid: f29cc3750d781ad469fd8d8a4c7b0b6f, type: 3}
  - m_RefCount: 1
    m_Data: {fileID: 21300000, guid: f35f9e9fad635724199d71d3fa89ea6d, type: 3}
  - m_RefCount: 1
    m_Data: {fileID: 21300000, guid: aeae2d4863666464a94079282c633348, type: 3}
  - m_RefCount: 1
    m_Data: {fileID: 21300000, guid: bd7f742ffe4c7df43a71a148c0aeb6a6, type: 3}
  - m_RefCount: 1
    m_Data: {fileID: 21300000, guid: 72bed2350006cb0498030c48cf9956f2, type: 3}
  - m_RefCount: 1
    m_Data: {fileID: 21300000, guid: 03fc24842cde58f45860437d08335d6a, type: 3}
  - m_RefCount: 1
    m_Data: {fileID: 21300000, guid: 56d77433091ef63499838bc0bafc9aab, type: 3}
  - m_RefCount: 1
    m_Data: {fileID: 21300000, guid: 86656d522538a8842a536a4269acb884, type: 3}
  - m_RefCount: 1
    m_Data: {fileID: 21300000, guid: 6eda9c30daf45394984d4dca920e0823, type: 3}
  - m_RefCount: 1
    m_Data: {fileID: 21300000, guid: 9ce596fca27b1be4f8282f379f212c18, type: 3}
  - m_RefCount: 1
    m_Data: {fileID: 21300000, guid: c8050f1fb70e9c3469ac006eb0a345b1, type: 3}
  - m_RefCount: 1
    m_Data: {fileID: 21300000, guid: a44fd68e4bb1b2e4699685f4cbc745c2, type: 3}
  - m_RefCount: 1
    m_Data: {fileID: 21300000, guid: 47c97de8e7fe475489ccf5c45c9c0201, type: 3}
  - m_RefCount: 1
    m_Data: {fileID: 21300000, guid: 26d12b9a516068a43b53bba5942ef976, type: 3}
  - m_RefCount: 1
    m_Data: {fileID: 21300000, guid: f4413e51c52aaab4cb4e0dfa0fcc5c6c, type: 3}
  - m_RefCount: 1
    m_Data: {fileID: 21300000, guid: 4bd1f4d5d47a1e24f8f6ec1d073609c5, type: 3}
  - m_RefCount: 1
    m_Data: {fileID: 21300000, guid: 1b0044484e9697e42b16185648acab96, type: 3}
  - m_RefCount: 1
    m_Data: {fileID: 21300000, guid: e45aa7beed2b21f48aa95682c461ae41, type: 3}
  - m_RefCount: 1
    m_Data: {fileID: 21300000, guid: e31e387a3de20f545a22cf96d552e521, type: 3}
  - m_RefCount: 1
    m_Data: {fileID: 21300000, guid: e034b8a9e13c14a4093fb8d80e347133, type: 3}
  - m_RefCount: 1
    m_Data: {fileID: 21300000, guid: e4eac0d7030359b42968696cab30dcc2, type: 3}
  - m_RefCount: 1
    m_Data: {fileID: 21300000, guid: e8e5e2b54edc2fc42b386b5ead30848e, type: 3}
  - m_RefCount: 1
    m_Data: {fileID: 21300000, guid: 583c58acf116cee4990879e1bd451f17, type: 3}
  - m_RefCount: 1
    m_Data: {fileID: 21300000, guid: d2b041b730a0b154badef269d6768211, type: 3}
  - m_RefCount: 1
    m_Data: {fileID: 21300000, guid: 46e6053ca52accc42be232ff422ab5ee, type: 3}
  - m_RefCount: 1
    m_Data: {fileID: 21300000, guid: 5421940ab26142c48bad4116ce1b159b, type: 3}
  - m_RefCount: 1
    m_Data: {fileID: 21300000, guid: a7de69a9f00e7514a96d3c20a68ea007, type: 3}
  - m_RefCount: 1
    m_Data: {fileID: 21300000, guid: cd9f75aead343984788d24c36113db8a, type: 3}
  - m_RefCount: 1
    m_Data: {fileID: 21300000, guid: 88ef15e0f293372428f8a9ceeeedd200, type: 3}
  - m_RefCount: 1
    m_Data: {fileID: 21300000, guid: d423367fc9e86c046a0b671fb33567c4, type: 3}
  - m_RefCount: 1
    m_Data: {fileID: 21300000, guid: 09ba595b3bfafe44185658afc7c0382b, type: 3}
  m_TileMatrixArray:
  - m_RefCount: 51
    m_Data:
      e00: 1
      e01: 0
      e02: 0
      e03: 0
      e10: 0
      e11: 1
      e12: 0
      e13: 0
      e20: 0
      e21: 0
      e22: 1
      e23: 0
      e30: 0
      e31: 0
      e32: 0
      e33: 1
  m_TileColorArray:
  - m_RefCount: 18
    m_Data: {r: 1, g: 1, b: 1, a: 1}
  - m_RefCount: 1
    m_Data: {r: 0.3443396, g: 1, b: 0.40636146, a: 1}
  - m_RefCount: 1
    m_Data: {r: 1, g: 0.96657693, b: 0, a: 1}
  - m_RefCount: 1
    m_Data: {r: 1, g: 0.8564266, b: 0, a: 1}
  - m_RefCount: 1
    m_Data: {r: 0.8867924, g: 0.80121356, b: 0.29699183, a: 1}
  - m_RefCount: 1
    m_Data: {r: 0.8207547, g: 0.68002635, b: 0.05032932, a: 1}
  - m_RefCount: 1
    m_Data: {r: 0.19023676, g: 0.8962264, b: 0.22151485, a: 1}
  - m_RefCount: 1
    m_Data: {r: 0.24256852, g: 0.745283, b: 0.28490242, a: 1}
  - m_RefCount: 1
    m_Data: {r: 0.16642934, g: 0.6415094, b: 0.17840347, a: 1}
  - m_RefCount: 1
    m_Data: {r: 0.13171947, g: 0.22644418, b: 0.754717, a: 1}
  - m_RefCount: 1
    m_Data: {r: 0, g: 0.045587063, b: 1, a: 1}
  - m_RefCount: 1
    m_Data: {r: 0.2783019, g: 0.45080537, b: 1, a: 1}
  - m_RefCount: 1
    m_Data: {r: 0.2971698, g: 0.6334261, b: 1, a: 1}
  - m_RefCount: 1
    m_Data: {r: 0.7169812, g: 0.050729793, b: 0.050729793, a: 1}
  - m_RefCount: 1
    m_Data: {r: 1, g: 0, b: 0, a: 1}
  - m_RefCount: 1
    m_Data: {r: 0.9622642, g: 0.32226774, b: 0.32226774, a: 1}
  - m_RefCount: 1
    m_Data: {r: 1, g: 0.504717, b: 0.504717, a: 1}
  - m_RefCount: 1
    m_Data: {r: 0.55408716, g: 0, b: 1, a: 1}
  - m_RefCount: 1
    m_Data: {r: 0.99884444, g: 0.995283, b: 1, a: 1}
  - m_RefCount: 1
    m_Data: {r: 0.9023585, g: 0.6179246, b: 1, a: 1}
  - m_RefCount: 1
    m_Data: {r: 0.7735849, g: 0.4481132, b: 1, a: 1}
  - m_RefCount: 1
    m_Data: {r: 0.6498419, g: 0.24056602, b: 1, a: 1}
  - m_RefCount: 1
    m_Data: {r: 0, g: 0.68444157, b: 0.6981132, a: 1}
  - m_RefCount: 1
    m_Data: {r: 0.17030083, g: 0.8396226, b: 0.81216323, a: 1}
  - m_RefCount: 1
    m_Data: {r: 0.06474723, g: 0.9150943, b: 0.8984209, a: 1}
  - m_RefCount: 1
    m_Data: {r: 0.2688679, g: 1, b: 0.88751805, a: 1}
  - m_RefCount: 1
    m_Data: {r: 1, g: 0.42438906, b: 0, a: 1}
  - m_RefCount: 1
    m_Data: {r: 1, g: 0.5527181, b: 0.16509432, a: 1}
  - m_RefCount: 1
    m_Data: {r: 0.990566, g: 0.7258221, b: 0.36912602, a: 1}
  - m_RefCount: 1
    m_Data: {r: 1, g: 0.8706076, b: 0.6933962, a: 1}
  - m_RefCount: 1
    m_Data: {r: 0.3207547, g: 0.3192417, b: 0.3192417, a: 1}
  - m_RefCount: 1
    m_Data: {r: 0.46226418, g: 0.46226418, b: 0.46226418, a: 1}
  - m_RefCount: 1
    m_Data: {r: 0.6981132, g: 0.6981132, b: 0.6981132, a: 1}
  - m_RefCount: 1
    m_Data: {r: 0.8113208, g: 0.8113208, b: 0.8113208, a: 1}
  m_AnimationFrameRate: 1
  m_Color: {r: 1, g: 1, b: 1, a: 1}
  m_Origin: {x: -4, y: -4, z: 0}
  m_Size: {x: 20, y: 9, z: 1}
  m_TileAnchor: {x: 0.5, y: 0.5, z: 0}
  m_TileOrientation: 0
  m_TileOrientationMatrix:
    e00: 1
    e01: 0
    e02: 0
    e03: 0
    e10: 0
    e11: 1
    e12: 0
    e13: 0
    e20: 0
    e21: 0
    e22: 1
    e23: 0
    e30: 0
    e31: 0
    e32: 0
    e33: 1
--- !u!483693784 &216525724863171504
TilemapRenderer:
  m_ObjectHideFlags: 0
  m_CorrespondingSourceObject: {fileID: 0}
  m_PrefabInstance: {fileID: 0}
  m_PrefabAsset: {fileID: 0}
  m_GameObject: {fileID: 385324829485595882}
  m_Enabled: 0
  m_CastShadows: 0
  m_ReceiveShadows: 0
  m_DynamicOccludee: 0
  m_MotionVectors: 1
  m_LightProbeUsage: 0
  m_ReflectionProbeUsage: 0
  m_RenderingLayerMask: 1
  m_RendererPriority: 0
  m_Materials:
  - {fileID: 10754, guid: 0000000000000000f000000000000000, type: 0}
  m_StaticBatchInfo:
    firstSubMesh: 0
    subMeshCount: 0
  m_StaticBatchRoot: {fileID: 0}
  m_ProbeAnchor: {fileID: 0}
  m_LightProbeVolumeOverride: {fileID: 0}
  m_ScaleInLightmap: 1
  m_ReceiveGI: 1
  m_PreserveUVs: 0
  m_IgnoreNormalsForChartDetection: 0
  m_ImportantGI: 0
  m_StitchLightmapSeams: 1
  m_SelectedEditorRenderState: 0
  m_MinimumChartSize: 4
  m_AutoUVMaxDistance: 0.5
  m_AutoUVMaxAngle: 89
  m_LightmapParameters: {fileID: 0}
  m_SortingLayerID: 0
  m_SortingLayer: 0
  m_SortingOrder: 0
  m_ChunkSize: {x: 32, y: 32, z: 32}
  m_ChunkCullingBounds: {x: 0, y: 0, z: 0}
  m_MaxChunkCount: 16
  m_MaxFrameAge: 16
  m_SortOrder: 0
  m_Mode: 0
  m_DetectChunkCullingBounds: 0
  m_MaskInteraction: 0
--- !u!1 &3414726523100251346
GameObject:
  m_ObjectHideFlags: 0
  m_CorrespondingSourceObject: {fileID: 0}
  m_PrefabInstance: {fileID: 0}
  m_PrefabAsset: {fileID: 0}
  serializedVersion: 6
  m_Component:
  - component: {fileID: 2162564182526088134}
  - component: {fileID: 4359070460493077620}
  m_Layer: 31
  m_Name: Rooms
  m_TagString: Untagged
  m_Icon: {fileID: 0}
  m_NavMeshLayer: 0
  m_StaticEditorFlags: 0
  m_IsActive: 1
--- !u!4 &2162564182526088134
Transform:
  m_ObjectHideFlags: 0
  m_CorrespondingSourceObject: {fileID: 0}
  m_PrefabInstance: {fileID: 0}
  m_PrefabAsset: {fileID: 0}
  m_GameObject: {fileID: 3414726523100251346}
  m_LocalRotation: {x: 0, y: 0, z: 0, w: 1}
  m_LocalPosition: {x: 0, y: 0, z: 0}
  m_LocalScale: {x: 1, y: 1, z: 1}
  m_Children:
  - {fileID: 6389856822662010545}
  m_Father: {fileID: 0}
  m_RootOrder: 0
  m_LocalEulerAnglesHint: {x: 0, y: 0, z: 0}
--- !u!156049354 &4359070460493077620
Grid:
  m_ObjectHideFlags: 0
  m_CorrespondingSourceObject: {fileID: 0}
  m_PrefabInstance: {fileID: 0}
  m_PrefabAsset: {fileID: 0}
  m_GameObject: {fileID: 3414726523100251346}
  m_Enabled: 1
  m_CellSize: {x: 1, y: 1, z: 0}
  m_CellGap: {x: 0, y: 0, z: 0}
  m_CellLayout: 0
  m_CellSwizzle: 0
--- !u!114 &3248426960631928389
MonoBehaviour:
  m_ObjectHideFlags: 0
  m_CorrespondingSourceObject: {fileID: 0}
  m_PrefabInstance: {fileID: 0}
  m_PrefabAsset: {fileID: 0}
  m_GameObject: {fileID: 0}
  m_Enabled: 1
  m_EditorHideFlags: 0
  m_Script: {fileID: 12395, guid: 0000000000000000e000000000000000, type: 0}
  m_Name: Palette Settings
  m_EditorClassIdentifier: 
  cellSizing: 0
