%YAML 1.1
%TAG !u! tag:unity3d.com,2011:
--- !u!21 &2100000
Material:
  serializedVersion: 6
  m_ObjectHideFlags: 0
  m_CorrespondingSourceObject: {fileID: 0}
  m_PrefabInstance: {fileID: 0}
  m_PrefabAsset: {fileID: 0}
  m_Name: M_Door
  m_Shader: {fileID: -6465566751694194690, guid: b7f939f7f1a1f4e4d9006fcd1ee7e2fc,
    type: 3}
  m_ShaderKeywords: _METALLICSPECGLOSSMAP _NORMALMAP
  m_LightmapFlags: 4
  m_EnableInstancingVariants: 0
  m_DoubleSidedGI: 0
  m_CustomRenderQueue: -1
  stringTagMap: {}
  disabledShaderPasses: []
  m_SavedProperties:
    serializedVersion: 3
    m_TexEnvs:
    - Texture2D_1C13F636:
        m_Texture: {fileID: 2800000, guid: b9e6ed4093138f241b34787cf6fe05bd, type: 3}
        m_Scale: {x: 1, y: 1}
        m_Offset: {x: 0, y: 0}
    - Texture2D_261E714C:
        m_Texture: {fileID: 0}
        m_Scale: {x: 1, y: 1}
        m_Offset: {x: 0, y: 0}
    - Texture2D_2C85C8AD:
        m_Texture: {fileID: 0}
        m_Scale: {x: 1, y: 1}
        m_Offset: {x: 0, y: 0}
    - Texture2D_2FD9BD95:
        m_Texture: {fileID: 2800000, guid: 2af0545bf0949ce488e3d3265f0a0a06, type: 3}
        m_Scale: {x: 1, y: 1}
        m_Offset: {x: 0, y: 0}
    - Texture2D_3718F003:
        m_Texture: {fileID: 2800000, guid: b5f56ff8a93da384983c698a38878173, type: 3}
        m_Scale: {x: 1, y: 1}
        m_Offset: {x: 0, y: 0}
    - Texture2D_387680B7:
        m_Texture: {fileID: 0}
        m_Scale: {x: 1, y: 1}
        m_Offset: {x: 0, y: 0}
    - Texture2D_BA0314B7:
        m_Texture: {fileID: 2800000, guid: 5835d8c3036c47d44b7cec36948d3fe5, type: 3}
        m_Scale: {x: 1, y: 1}
        m_Offset: {x: 0, y: 0}
    - _BaseMap:
        m_Texture: {fileID: 2800000, guid: a759dcc80d5904d4fac56f0436729159, type: 3}
        m_Scale: {x: 1, y: 1}
        m_Offset: {x: 0, y: 0}
    - _BumpMap:
        m_Texture: {fileID: 2800000, guid: 5835d8c3036c47d44b7cec36948d3fe5, type: 3}
        m_Scale: {x: 1, y: 1}
        m_Offset: {x: 0, y: 0}
    - _EmissionMap:
        m_Texture: {fileID: 0}
        m_Scale: {x: 1, y: 1}
        m_Offset: {x: 0, y: 0}
    - _MainTex:
        m_Texture: {fileID: 2800000, guid: a759dcc80d5904d4fac56f0436729159, type: 3}
        m_Scale: {x: 1, y: 1}
        m_Offset: {x: 0, y: 0}
    - _MetallicGlossMap:
        m_Texture: {fileID: 2800000, guid: 2af0545bf0949ce488e3d3265f0a0a06, type: 3}
        m_Scale: {x: 1, y: 1}
        m_Offset: {x: 0, y: 0}
    - _OcclusionMap:
        m_Texture: {fileID: 0}
        m_Scale: {x: 1, y: 1}
        m_Offset: {x: 0, y: 0}
    - _SampleTexture2D_FA23B24A_Texture_1:
        m_Texture: {fileID: 2800000, guid: b5f56ff8a93da384983c698a38878173, type: 3}
        m_Scale: {x: 1, y: 1}
        m_Offset: {x: 0, y: 0}
    - _SpecGlossMap:
        m_Texture: {fileID: 0}
        m_Scale: {x: 1, y: 1}
        m_Offset: {x: 0, y: 0}
    m_Floats:
    - Vector1_13AC9A3B: -1
    - Vector1_1AFB16D9: 0.95
    - Vector1_1FD77E3E: 1
    - Vector1_2FA6AB36: 1
    - Vector1_5C606FF7: 18.99
    - Vector1_5FABF272: 1
    - Vector1_64528CBA: 0
    - Vector1_6658981E: 2
    - Vector1_850A8B81: 0.2
    - Vector1_9EDACBA5: 1
    - Vector1_B46AB542: 0
    - Vector1_C0849F61: 0
    - Vector1_C27E0651: 0
    - Vector1_C923F2A0: 0.2
    - Vector1_FA17A299: 1
    - _Alpha: 1
    - _AlphaClip: 0
    - _Blend: 0
    - _BumpScale: 1
    - _Cracks: 0
    - _Cull: 2
    - _Cutoff: 0.5
    - _DstBlend: 0
    - _EnvironmentReflections: 1
    - _GlossMapScale: 0
    - _Glossiness: 0
    - _GlossyReflections: 0
    - _Metallic: 0
    - _OcclusionStrength: 1
    - _QueueOffset: 0
    - _RandomEffect: 40
    - _ReceiveShadows: 1
    - _Smoothness: 0.31
    - _SmoothnessTextureChannel: 0
    - _SpecularHighlights: 1
    - _SrcBlend: 1
    - _Surface: 0
    - _WorkflowMode: 1
    - _ZWrite: 1
    m_Colors:
    - Color_4672BC7C: {r: 1, g: 1, b: 1, a: 0}
    - Color_B782FA6B: {r: 0.7169812, g: 0.7169812, b: 0.7169812, a: 0}
    - Color_B845369: {r: 0.49056602, g: 0.15769638, b: 0.030081892, a: 0}
    - Color_E3C484B5: {r: 1, g: 1, b: 1, a: 0}
    - Color_FE556063: {r: 0.4156863, g: 0.4156863, b: 0.4156863, a: 0}
    - Vector2_5625D11D: {r: 1, g: 1, b: 0, a: 0}
    - Vector2_CD60AAB5: {r: 0, g: 0, b: 0, a: 0}
    - _BaseColor: {r: 1, g: 1, b: 1, a: 1}
    - _Color: {r: 0.5, g: 0.5, b: 0.5, a: 1}
    - _EmissionColor: {r: 0, g: 0, b: 0, a: 1}
    - _SpecColor: {r: 0.2, g: 0.2, b: 0.2, a: 1}
--- !u!114 &7222094486758172632
MonoBehaviour:
  m_ObjectHideFlags: 11
  m_CorrespondingSourceObject: {fileID: 0}
  m_PrefabInstance: {fileID: 0}
  m_PrefabAsset: {fileID: 0}
  m_GameObject: {fileID: 0}
  m_Enabled: 1
  m_EditorHideFlags: 0
  m_Script: {fileID: 11500000, guid: d0353a89b1f911e48b9e16bdc9f2e058, type: 3}
  m_Name: 
  m_EditorClassIdentifier: 
  version: 1
