%YAML 1.1
%TAG !u! tag:unity3d.com,2011:
--- !u!21 &2100000
Material:
  serializedVersion: 6
  m_ObjectHideFlags: 0
  m_CorrespondingSourceObject: {fileID: 0}
  m_PrefabInstance: {fileID: 0}
  m_PrefabAsset: {fileID: 0}
  m_Name: Shader Graphs_New Shader Graph
  m_Shader: {fileID: -6465566751694194690, guid: 28a3086a236176e40a89f78c4eb5a4ee,
    type: 3}
  m_ShaderKeywords: 
  m_LightmapFlags: 4
  m_EnableInstancingVariants: 0
  m_DoubleSidedGI: 0
  m_CustomRenderQueue: -1
  stringTagMap: {}
  disabledShaderPasses: []
  m_SavedProperties:
    serializedVersion: 3
    m_TexEnvs:
    - Texture2D_9F8B7276:
        m_Texture: {fileID: 2800000, guid: 0960b5599522fdb4dba29bd44700d014, type: 3}
        m_Scale: {x: 1, y: 1}
        m_Offset: {x: 0, y: 0}
    m_Floats:
    - Vector1_36CF9716: 0.57
    - Vector1_4FD33413: 0
    - Vector1_7AEA84A1: 0
    - Vector1_9AB0B9DC: 0
    m_Colors:
    - Color_70B76A56: {r: 0.31764707, g: 0.9019608, b: 1, a: 0}
