%YAML 1.1
%TAG !u! tag:unity3d.com,2011:
--- !u!1 &2177808781826817501
GameObject:
  m_ObjectHideFlags: 0
  m_CorrespondingSourceObject: {fileID: 0}
  m_PrefabInstance: {fileID: 0}
  m_PrefabAsset: {fileID: 0}
  serializedVersion: 6
  m_Component:
  - component: {fileID: 2910020613589798862}
  m_Layer: 0
  m_Name: PF_Forge
  m_TagString: Untagged
  m_Icon: {fileID: 0}
  m_NavMeshLayer: 0
  m_StaticEditorFlags: 0
  m_IsActive: 1
--- !u!4 &2910020613589798862
Transform:
  m_ObjectHideFlags: 0
  m_CorrespondingSourceObject: {fileID: 0}
  m_PrefabInstance: {fileID: 0}
  m_PrefabAsset: {fileID: 0}
  m_GameObject: {fileID: 2177808781826817501}
  m_LocalRotation: {x: 0, y: -0, z: -0, w: 1}
  m_LocalPosition: {x: 0, y: 0, z: 0}
  m_LocalScale: {x: 1, y: 1, z: 1}
  m_Children:
  - {fileID: 8033891629198004486}
  m_Father: {fileID: 0}
  m_RootOrder: 0
  m_LocalEulerAnglesHint: {x: 0, y: 0, z: 0}
--- !u!1001 &3027730742459071004
PrefabInstance:
  m_ObjectHideFlags: 0
  serializedVersion: 2
  m_Modification:
    m_TransformParent: {fileID: 2910020613589798862}
    m_Modifications:
    - target: {fileID: -4216859302048453862, guid: 10f29c6fba9a38f479fc58f26639894c,
        type: 3}
      propertyPath: m_LocalPosition.x
      value: 0
      objectReference: {fileID: 0}
    - target: {fileID: -4216859302048453862, guid: 10f29c6fba9a38f479fc58f26639894c,
        type: 3}
      propertyPath: m_LocalPosition.y
      value: 0
      objectReference: {fileID: 0}
    - target: {fileID: -4216859302048453862, guid: 10f29c6fba9a38f479fc58f26639894c,
        type: 3}
      propertyPath: m_LocalPosition.z
      value: 0
      objectReference: {fileID: 0}
    - target: {fileID: -4216859302048453862, guid: 10f29c6fba9a38f479fc58f26639894c,
        type: 3}
      propertyPath: m_LocalRotation.x
      value: 0
      objectReference: {fileID: 0}
    - target: {fileID: -4216859302048453862, guid: 10f29c6fba9a38f479fc58f26639894c,
        type: 3}
      propertyPath: m_LocalRotation.y
      value: 0
      objectReference: {fileID: 0}
    - target: {fileID: -4216859302048453862, guid: 10f29c6fba9a38f479fc58f26639894c,
        type: 3}
      propertyPath: m_LocalRotation.z
      value: 0
      objectReference: {fileID: 0}
    - target: {fileID: -4216859302048453862, guid: 10f29c6fba9a38f479fc58f26639894c,
        type: 3}
      propertyPath: m_LocalRotation.w
      value: 1
      objectReference: {fileID: 0}
    - target: {fileID: -4216859302048453862, guid: 10f29c6fba9a38f479fc58f26639894c,
        type: 3}
      propertyPath: m_RootOrder
      value: 0
      objectReference: {fileID: 0}
    - target: {fileID: -4216859302048453862, guid: 10f29c6fba9a38f479fc58f26639894c,
        type: 3}
      propertyPath: m_LocalEulerAnglesHint.x
      value: 0
      objectReference: {fileID: 0}
    - target: {fileID: -4216859302048453862, guid: 10f29c6fba9a38f479fc58f26639894c,
        type: 3}
      propertyPath: m_LocalEulerAnglesHint.y
      value: 0
      objectReference: {fileID: 0}
    - target: {fileID: -4216859302048453862, guid: 10f29c6fba9a38f479fc58f26639894c,
        type: 3}
      propertyPath: m_LocalEulerAnglesHint.z
      value: 0
      objectReference: {fileID: 0}
    - target: {fileID: -927199367670048503, guid: 10f29c6fba9a38f479fc58f26639894c,
        type: 3}
      propertyPath: m_Name
      value: SK_Forge
      objectReference: {fileID: 0}
    - target: {fileID: -6057140222963153312, guid: 10f29c6fba9a38f479fc58f26639894c,
        type: 3}
      propertyPath: m_Controller
      value: 
      objectReference: {fileID: 9100000, guid: 3a3fe1d31987ce34fa1d6982b0004d77, type: 2}
    - target: {fileID: -4925599262941040045, guid: 10f29c6fba9a38f479fc58f26639894c,
        type: 3}
      propertyPath: m_Materials.Array.data[0]
      value: 
      objectReference: {fileID: 2100000, guid: 8e809384f16331d4a8d9b2e5a822ffb2, type: 2}
    - target: {fileID: 6090993573466098030, guid: 10f29c6fba9a38f479fc58f26639894c,
        type: 3}
      propertyPath: m_Materials.Array.data[0]
      value: 
      objectReference: {fileID: 2100000, guid: 8e809384f16331d4a8d9b2e5a822ffb2, type: 2}
    m_RemovedComponents: []
  m_SourcePrefab: {fileID: 100100000, guid: 10f29c6fba9a38f479fc58f26639894c, type: 3}
--- !u!4 &8033891629198004486 stripped
Transform:
  m_CorrespondingSourceObject: {fileID: -4216859302048453862, guid: 10f29c6fba9a38f479fc58f26639894c,
    type: 3}
  m_PrefabInstance: {fileID: 3027730742459071004}
  m_PrefabAsset: {fileID: 0}
