%YAML 1.1
%TAG !u! tag:unity3d.com,2011:
--- !u!114 &11400000
MonoBehaviour:
  m_ObjectHideFlags: 0
  m_CorrespondingSourceObject: {fileID: 0}
  m_PrefabInstance: {fileID: 0}
  m_PrefabAsset: {fileID: 0}
  m_GameObject: {fileID: 0}
  m_Enabled: 1
  m_EditorHideFlags: 0
  m_Script: {fileID: 11500000, guid: 152fce8a510ee9d4db329037ee74a3c2, type: 3}
  m_Name: SetFire_3x3_P0.5_F0.5_B0
  m_EditorClassIdentifier: 
  Range: {x: 3, y: 3}
  ActionDescription: New flames are rising! Keep an eye out!
  PiloteRate: 0.5
  FlameRate: 0.5
  BlazeRate: 0
