%YAML 1.1
%TAG !u! tag:unity3d.com,2011:
--- !u!21 &2100000
Material:
  serializedVersion: 6
  m_ObjectHideFlags: 0
  m_CorrespondingSourceObject: {fileID: 0}
  m_PrefabInstance: {fileID: 0}
  m_PrefabAsset: {fileID: 0}
  m_Name: M_Final 1
  m_Shader: {fileID: -6465566751694194690, guid: b7f939f7f1a1f4e4d9006fcd1ee7e2fc,
    type: 3}
  m_ShaderKeywords: 
  m_LightmapFlags: 4
  m_EnableInstancingVariants: 0
  m_DoubleSidedGI: 0
  m_CustomRenderQueue: -1
  stringTagMap: {}
  disabledShaderPasses: []
  m_SavedProperties:
    serializedVersion: 3
    m_TexEnvs:
    - Texture2D_1C13F636:
        m_Texture: {fileID: 0}
        m_Scale: {x: 1, y: 1}
        m_Offset: {x: 0, y: 0}
    - Texture2D_261E714C:
        m_Texture: {fileID: 0}
        m_Scale: {x: 1, y: 1}
        m_Offset: {x: 0, y: 0}
    - Texture2D_2FD9BD95:
        m_Texture: {fileID: 0}
        m_Scale: {x: 1, y: 1}
        m_Offset: {x: 0, y: 0}
    - Texture2D_BA0314B7:
        m_Texture: {fileID: 2800000, guid: f45177906ac8a2547b71f705eadf0346, type: 3}
        m_Scale: {x: 1, y: 1}
        m_Offset: {x: 0, y: 0}
    - _SampleTexture2D_134EC921_Texture_1:
        m_Texture: {fileID: 2800000, guid: 9c6317e6b8d57b04cb37f569cf877a42, type: 3}
        m_Scale: {x: 1, y: 1}
        m_Offset: {x: 0, y: 0}
    - _SampleTexture2D_4A4C143D_Texture_1:
        m_Texture: {fileID: 0}
        m_Scale: {x: 1, y: 1}
        m_Offset: {x: 0, y: 0}
    - _SampleTexture2D_91A5C576_Texture_1:
        m_Texture: {fileID: 0}
        m_Scale: {x: 1, y: 1}
        m_Offset: {x: 0, y: 0}
    - _SampleTexture2D_CA64AEBC_Texture_1:
        m_Texture: {fileID: 0}
        m_Scale: {x: 1, y: 1}
        m_Offset: {x: 0, y: 0}
    - _Texture2DAsset_FCC03CC8_Out_0:
        m_Texture: {fileID: 0}
        m_Scale: {x: 1, y: 1}
        m_Offset: {x: 0, y: 0}
    m_Floats:
    - Vector1_13AC9A3B: 0.33
    - Vector1_64528CBA: 0
    - Vector1_850A8B81: 0
    - Vector1_C0849F61: 0.337
    - Vector1_C923F2A0: 0
    - Vector1_F51247EC: 0
    m_Colors:
    - Color_B782FA6B: {r: 0.3302927, g: 0, b: 1, a: 0}
    - Color_E3C484B5: {r: 1, g: 1, b: 1, a: 0}
    - Color_FE556063: {r: 0.41509432, g: 0.41509432, b: 0.41509432, a: 0}
    - Vector2_5625D11D: {r: 1, g: 1, b: 0, a: 0}
    - Vector2_CD60AAB5: {r: 0, g: 0, b: 0, a: 0}
