%YAML 1.1
%TAG !u! tag:unity3d.com,2011:
--- !u!1 &1144334952637397891
GameObject:
  m_ObjectHideFlags: 0
  m_CorrespondingSourceObject: {fileID: 0}
  m_PrefabInstance: {fileID: 0}
  m_PrefabAsset: {fileID: 0}
  serializedVersion: 6
  m_Component:
  - component: {fileID: 4159680410979469712}
  - component: {fileID: 6282561658887972074}
  m_Layer: 0
  m_Name: PF_Shusui_Hub
  m_TagString: Untagged
  m_Icon: {fileID: 0}
  m_NavMeshLayer: 0
  m_StaticEditorFlags: 0
  m_IsActive: 1
--- !u!4 &4159680410979469712
Transform:
  m_ObjectHideFlags: 0
  m_CorrespondingSourceObject: {fileID: 0}
  m_PrefabInstance: {fileID: 0}
  m_PrefabAsset: {fileID: 0}
  m_GameObject: {fileID: 1144334952637397891}
  m_LocalRotation: {x: -0, y: 0.000000119209275, z: -0, w: 1}
  m_LocalPosition: {x: 0, y: 0, z: -0.095}
  m_LocalScale: {x: 1, y: 1, z: 1}
  m_Children:
  - {fileID: 2151859351327554332}
  m_Father: {fileID: 0}
  m_RootOrder: 0
  m_LocalEulerAnglesHint: {x: 0, y: 0, z: 0}
--- !u!95 &6282561658887972074
Animator:
  serializedVersion: 3
  m_ObjectHideFlags: 0
  m_CorrespondingSourceObject: {fileID: 0}
  m_PrefabInstance: {fileID: 0}
  m_PrefabAsset: {fileID: 0}
  m_GameObject: {fileID: 1144334952637397891}
  m_Enabled: 1
  m_Avatar: {fileID: 9000000, guid: 520b3ba1754d0a949b6b412a58eac71e, type: 3}
  m_Controller: {fileID: 9100000, guid: 722c73b0f76c13a4aa7d7d81192f6d98, type: 2}
  m_CullingMode: 1
  m_UpdateMode: 0
  m_ApplyRootMotion: 0
  m_LinearVelocityBlending: 0
  m_WarningMessage: 
  m_HasTransformHierarchy: 1
  m_AllowConstantClipSamplingOptimization: 1
  m_KeepAnimatorControllerStateOnDisable: 0
--- !u!1001 &6387868314871435270
PrefabInstance:
  m_ObjectHideFlags: 0
  serializedVersion: 2
  m_Modification:
    m_TransformParent: {fileID: 4159680410979469712}
    m_Modifications:
    - target: {fileID: -927199367670048503, guid: 43c98b5b62738a24b867a57bcd678166,
        type: 3}
      propertyPath: m_Name
      value: SK_Shusui
      objectReference: {fileID: 0}
    - target: {fileID: -6057140222963153312, guid: 43c98b5b62738a24b867a57bcd678166,
        type: 3}
      propertyPath: m_Controller
      value: 
      objectReference: {fileID: 9100000, guid: 0c975d3577761a64982e9251ae2b0949, type: 2}
    - target: {fileID: -4216859302048453862, guid: 43c98b5b62738a24b867a57bcd678166,
        type: 3}
      propertyPath: m_LocalPosition.x
      value: 0
      objectReference: {fileID: 0}
    - target: {fileID: -4216859302048453862, guid: 43c98b5b62738a24b867a57bcd678166,
        type: 3}
      propertyPath: m_LocalPosition.y
      value: 0
      objectReference: {fileID: 0}
    - target: {fileID: -4216859302048453862, guid: 43c98b5b62738a24b867a57bcd678166,
        type: 3}
      propertyPath: m_LocalPosition.z
      value: 0
      objectReference: {fileID: 0}
    - target: {fileID: -4216859302048453862, guid: 43c98b5b62738a24b867a57bcd678166,
        type: 3}
      propertyPath: m_LocalRotation.x
      value: 0
      objectReference: {fileID: 0}
    - target: {fileID: -4216859302048453862, guid: 43c98b5b62738a24b867a57bcd678166,
        type: 3}
      propertyPath: m_LocalRotation.y
      value: 0
      objectReference: {fileID: 0}
    - target: {fileID: -4216859302048453862, guid: 43c98b5b62738a24b867a57bcd678166,
        type: 3}
      propertyPath: m_LocalRotation.z
      value: 0
      objectReference: {fileID: 0}
    - target: {fileID: -4216859302048453862, guid: 43c98b5b62738a24b867a57bcd678166,
        type: 3}
      propertyPath: m_LocalRotation.w
      value: 1
      objectReference: {fileID: 0}
    - target: {fileID: -4216859302048453862, guid: 43c98b5b62738a24b867a57bcd678166,
        type: 3}
      propertyPath: m_RootOrder
      value: 0
      objectReference: {fileID: 0}
    - target: {fileID: -4216859302048453862, guid: 43c98b5b62738a24b867a57bcd678166,
        type: 3}
      propertyPath: m_LocalEulerAnglesHint.x
      value: 0
      objectReference: {fileID: 0}
    - target: {fileID: -4216859302048453862, guid: 43c98b5b62738a24b867a57bcd678166,
        type: 3}
      propertyPath: m_LocalEulerAnglesHint.y
      value: 0
      objectReference: {fileID: 0}
    - target: {fileID: -4216859302048453862, guid: 43c98b5b62738a24b867a57bcd678166,
        type: 3}
      propertyPath: m_LocalEulerAnglesHint.z
      value: 0
      objectReference: {fileID: 0}
    - target: {fileID: 5986619384620838194, guid: 43c98b5b62738a24b867a57bcd678166,
        type: 3}
      propertyPath: m_Materials.Array.data[0]
      value: 
      objectReference: {fileID: 2100000, guid: 7e188c618a9b86a41b8a8ecab6311d96, type: 2}
    m_RemovedComponents: []
  m_SourcePrefab: {fileID: 100100000, guid: 43c98b5b62738a24b867a57bcd678166, type: 3}
--- !u!4 &2151859351327554332 stripped
Transform:
  m_CorrespondingSourceObject: {fileID: -4216859302048453862, guid: 43c98b5b62738a24b867a57bcd678166,
    type: 3}
  m_PrefabInstance: {fileID: 6387868314871435270}
  m_PrefabAsset: {fileID: 0}
