%YAML 1.1
%TAG !u! tag:unity3d.com,2011:
--- !u!1 &2128957381413006209
GameObject:
  m_ObjectHideFlags: 0
  m_CorrespondingSourceObject: {fileID: 0}
  m_PrefabInstance: {fileID: 0}
  m_PrefabAsset: {fileID: 0}
  serializedVersion: 6
  m_Component:
  - component: {fileID: 1394752117726233873}
  - component: {fileID: 8787806788218957823}
  m_Layer: 0
  m_Name: SoundCube_StretchInOneDir
  m_TagString: Untagged
  m_Icon: {fileID: 0}
  m_NavMeshLayer: 0
  m_StaticEditorFlags: 0
  m_IsActive: 1
--- !u!4 &1394752117726233873
Transform:
  m_ObjectHideFlags: 0
  m_CorrespondingSourceObject: {fileID: 0}
  m_PrefabInstance: {fileID: 0}
  m_PrefabAsset: {fileID: 0}
  m_GameObject: {fileID: 2128957381413006209}
  m_LocalRotation: {x: 0, y: 0, z: 0, w: 1}
  m_LocalPosition: {x: 0, y: 0, z: 0}
  m_LocalScale: {x: 5, y: 5, z: 5}
  m_Children:
  - {fileID: 2412538791086782785}
  m_Father: {fileID: 0}
  m_RootOrder: 0
  m_LocalEulerAnglesHint: {x: 0, y: 0, z: 0}
--- !u!114 &8787806788218957823
MonoBehaviour:
  m_ObjectHideFlags: 0
  m_CorrespondingSourceObject: {fileID: 0}
  m_PrefabInstance: {fileID: 0}
  m_PrefabAsset: {fileID: 0}
  m_GameObject: {fileID: 2128957381413006209}
  m_Enabled: 1
  m_EditorHideFlags: 0
  m_Script: {fileID: 11500000, guid: 842f7aa58d9b32e4f8b2f086538dca1c, type: 3}
  m_Name: 
  m_EditorClassIdentifier: 
  _band: 7
  _startScale: 1
  _scaleMultiplier: 20
  _useBuffer: 1
  _stretchOneDirOnly: 1
--- !u!1001 &3173933967175215938
PrefabInstance:
  m_ObjectHideFlags: 0
  serializedVersion: 2
  m_Modification:
    m_TransformParent: {fileID: 1394752117726233873}
    m_Modifications:
    - target: {fileID: 3805486088482251672, guid: 766e636ac73417c469d5b77d0d64c453,
        type: 3}
      propertyPath: m_Name
      value: SoundCube
      objectReference: {fileID: 0}
    - target: {fileID: 970274068699124227, guid: 766e636ac73417c469d5b77d0d64c453,
        type: 3}
      propertyPath: m_LocalPosition.x
      value: 0
      objectReference: {fileID: 0}
    - target: {fileID: 970274068699124227, guid: 766e636ac73417c469d5b77d0d64c453,
        type: 3}
      propertyPath: m_LocalPosition.y
      value: 0.5
      objectReference: {fileID: 0}
    - target: {fileID: 970274068699124227, guid: 766e636ac73417c469d5b77d0d64c453,
        type: 3}
      propertyPath: m_LocalPosition.z
      value: 0
      objectReference: {fileID: 0}
    - target: {fileID: 970274068699124227, guid: 766e636ac73417c469d5b77d0d64c453,
        type: 3}
      propertyPath: m_LocalRotation.x
      value: -0
      objectReference: {fileID: 0}
    - target: {fileID: 970274068699124227, guid: 766e636ac73417c469d5b77d0d64c453,
        type: 3}
      propertyPath: m_LocalRotation.y
      value: -0
      objectReference: {fileID: 0}
    - target: {fileID: 970274068699124227, guid: 766e636ac73417c469d5b77d0d64c453,
        type: 3}
      propertyPath: m_LocalRotation.z
      value: -0
      objectReference: {fileID: 0}
    - target: {fileID: 970274068699124227, guid: 766e636ac73417c469d5b77d0d64c453,
        type: 3}
      propertyPath: m_LocalRotation.w
      value: 1
      objectReference: {fileID: 0}
    - target: {fileID: 970274068699124227, guid: 766e636ac73417c469d5b77d0d64c453,
        type: 3}
      propertyPath: m_RootOrder
      value: 0
      objectReference: {fileID: 0}
    - target: {fileID: 970274068699124227, guid: 766e636ac73417c469d5b77d0d64c453,
        type: 3}
      propertyPath: m_LocalEulerAnglesHint.x
      value: 0
      objectReference: {fileID: 0}
    - target: {fileID: 970274068699124227, guid: 766e636ac73417c469d5b77d0d64c453,
        type: 3}
      propertyPath: m_LocalEulerAnglesHint.y
      value: 0
      objectReference: {fileID: 0}
    - target: {fileID: 970274068699124227, guid: 766e636ac73417c469d5b77d0d64c453,
        type: 3}
      propertyPath: m_LocalEulerAnglesHint.z
      value: 0
      objectReference: {fileID: 0}
    - target: {fileID: 970274068699124227, guid: 766e636ac73417c469d5b77d0d64c453,
        type: 3}
      propertyPath: m_LocalScale.x
      value: 1
      objectReference: {fileID: 0}
    - target: {fileID: 970274068699124227, guid: 766e636ac73417c469d5b77d0d64c453,
        type: 3}
      propertyPath: m_LocalScale.y
      value: 1
      objectReference: {fileID: 0}
    - target: {fileID: 970274068699124227, guid: 766e636ac73417c469d5b77d0d64c453,
        type: 3}
      propertyPath: m_LocalScale.z
      value: 1
      objectReference: {fileID: 0}
    - target: {fileID: 1356499631501331689, guid: 766e636ac73417c469d5b77d0d64c453,
        type: 3}
      propertyPath: m_Materials.Array.data[0]
      value: 
      objectReference: {fileID: 2100000, guid: 88760806b12ea6e4ba42647eb05a43fe, type: 2}
    - target: {fileID: 7466965640711871570, guid: 766e636ac73417c469d5b77d0d64c453,
        type: 3}
      propertyPath: m_Enabled
      value: 0
      objectReference: {fileID: 0}
    m_RemovedComponents:
    - {fileID: 7466965640711871570, guid: 766e636ac73417c469d5b77d0d64c453, type: 3}
  m_SourcePrefab: {fileID: 100100000, guid: 766e636ac73417c469d5b77d0d64c453, type: 3}
--- !u!4 &2412538791086782785 stripped
Transform:
  m_CorrespondingSourceObject: {fileID: 970274068699124227, guid: 766e636ac73417c469d5b77d0d64c453,
    type: 3}
  m_PrefabInstance: {fileID: 3173933967175215938}
  m_PrefabAsset: {fileID: 0}
