EESchema Schematic File Version 4
LIBS:kicad-cache
EELAYER 26 0
EELAYER END
$Descr A4 11693 8268
encoding utf-8
Sheet 1 1
Title "Circuito exemplo SECOMP UFSCar 2019"
Date "12/09/2019"
Rev ""
Comp ""
Comment1 "Por Alessandra Oliveira"
Comment2 "Ministrador do curso Álvaro A. Volpato"
Comment3 ""
Comment4 ""
$EndDescr
$Comp
L MCU_Microchip_ATmega:ATmega32U4-AU U1
U 1 1 5D7A3890
P 4150 4150
F 0 "U1" H 4150 2264 50  0000 C CNN
F 1 "ATmega32U4-AU" H 4150 2173 50  0000 C CNN
F 2 "Package_QFP:LQFP-44_10x10mm_P0.8mm" H 4150 4150 50  0001 C CIN
F 3 "http://ww1.microchip.com/downloads/en/DeviceDoc/Atmel-7766-8-bit-AVR-ATmega16U4-32U4_Datasheet.pdf" H 4150 4150 50  0001 C CNN
	1    4150 4150
	1    0    0    -1  
$EndComp
$Comp
L power:+5V #PWR03
U 1 1 5D7A43D1
P 2700 3350
F 0 "#PWR03" H 2700 3200 50  0001 C CNN
F 1 "+5V" H 2715 3523 50  0000 C CNN
F 2 "" H 2700 3350 50  0001 C CNN
F 3 "" H 2700 3350 50  0001 C CNN
	1    2700 3350
	1    0    0    -1  
$EndComp
$Comp
L Connector:USB_B_Micro J1
U 1 1 5D7A4201
P 2200 3650
F 0 "J1" H 2255 4117 50  0000 C CNN
F 1 "USB_B_Micro" H 2255 4026 50  0000 C CNN
F 2 "Connector_USB:USB_Mini-B_AdamTech_MUSB-B5-S-VT-TSMT-1_SMD_Vertical" H 2350 3600 50  0001 C CNN
F 3 "~" H 2350 3600 50  0001 C CNN
	1    2200 3650
	1    0    0    -1  
$EndComp
Wire Wire Line
	2500 3650 2600 3650
$Comp
L Device:R R1
U 1 1 5D7A57EA
P 2750 3650
F 0 "R1" V 2957 3650 50  0000 C CNN
F 1 "22R" V 2866 3650 50  0000 C CNN
F 2 "Resistor_SMD:R_1206_3216Metric_Pad1.42x1.75mm_HandSolder" V 2680 3650 50  0001 C CNN
F 3 "~" H 2750 3650 50  0001 C CNN
	1    2750 3650
	0    -1   -1   0   
$EndComp
$Comp
L Device:R R2
U 1 1 5D7A5842
P 2750 3750
F 0 "R2" H 2500 3800 50  0000 C CNN
F 1 "22R" V 2634 3750 50  0000 C CNN
F 2 "Resistor_SMD:R_1206_3216Metric_Pad1.42x1.75mm_HandSolder" V 2680 3750 50  0001 C CNN
F 3 "~" H 2750 3750 50  0001 C CNN
	1    2750 3750
	0    1    1    0   
$EndComp
Wire Wire Line
	2500 3450 2700 3450
Wire Wire Line
	2700 3450 2700 3350
Wire Wire Line
	2500 3750 2600 3750
Wire Wire Line
	2900 3650 3550 3650
Wire Wire Line
	2900 3750 3550 3750
$Comp
L power:GND #PWR02
U 1 1 5D7A5F17
P 2200 4200
F 0 "#PWR02" H 2200 3950 50  0001 C CNN
F 1 "GND" H 2205 4027 50  0000 C CNN
F 2 "" H 2200 4200 50  0001 C CNN
F 3 "" H 2200 4200 50  0001 C CNN
	1    2200 4200
	1    0    0    -1  
$EndComp
$Comp
L power:+5V #PWR011
U 1 1 5D7A6250
P 4150 2200
F 0 "#PWR011" H 4150 2050 50  0001 C CNN
F 1 "+5V" H 4165 2373 50  0000 C CNN
F 2 "" H 4150 2200 50  0001 C CNN
F 3 "" H 4150 2200 50  0001 C CNN
	1    4150 2200
	1    0    0    -1  
$EndComp
Wire Wire Line
	4050 2350 4050 2200
Wire Wire Line
	4050 2200 4150 2200
Wire Wire Line
	4250 2350 4250 2200
Wire Wire Line
	4250 2200 4150 2200
Connection ~ 4150 2200
Wire Wire Line
	4150 2350 4150 2200
$Comp
L power:GND #PWR010
U 1 1 5D7A6629
P 4100 6050
F 0 "#PWR010" H 4100 5800 50  0001 C CNN
F 1 "GND" H 4105 5877 50  0000 C CNN
F 2 "" H 4100 6050 50  0001 C CNN
F 3 "" H 4100 6050 50  0001 C CNN
	1    4100 6050
	1    0    0    -1  
$EndComp
Wire Wire Line
	4050 5950 4050 6050
Wire Wire Line
	4050 6050 4100 6050
Wire Wire Line
	4150 5950 4150 6050
Wire Wire Line
	4150 6050 4100 6050
Connection ~ 4100 6050
$Comp
L Device:Crystal Y1
U 1 1 5D7A695C
P 3150 2950
F 0 "Y1" V 3104 3081 50  0000 L CNN
F 1 "Crystal" V 3195 3081 50  0000 L CNN
F 2 "Crystal:Crystal_SMD_5032-2Pin_5.0x3.2mm_HandSoldering" H 3150 2950 50  0001 C CNN
F 3 "~" H 3150 2950 50  0001 C CNN
	1    3150 2950
	0    1    1    0   
$EndComp
Wire Wire Line
	3150 2800 3550 2800
Wire Wire Line
	3550 2800 3550 2850
Wire Wire Line
	3150 3100 3550 3100
Wire Wire Line
	3550 3100 3550 3050
$Comp
L Device:C C2
U 1 1 5D7A7AD2
P 3150 2650
F 0 "C2" H 3265 2696 50  0000 L CNN
F 1 "15p" H 3265 2605 50  0000 L CNN
F 2 "Capacitor_SMD:C_0805_2012Metric_Pad1.15x1.40mm_HandSolder" H 3188 2500 50  0001 C CNN
F 3 "~" H 3150 2650 50  0001 C CNN
	1    3150 2650
	1    0    0    -1  
$EndComp
Connection ~ 3150 2800
$Comp
L Device:C C3
U 1 1 5D7A7B6A
P 3150 3250
F 0 "C3" H 3265 3296 50  0000 L CNN
F 1 "15p" H 3265 3205 50  0000 L CNN
F 2 "Capacitor_SMD:C_0805_2012Metric_Pad1.15x1.40mm_HandSolder" H 3188 3100 50  0001 C CNN
F 3 "~" H 3150 3250 50  0001 C CNN
	1    3150 3250
	1    0    0    -1  
$EndComp
Connection ~ 3150 3100
$Comp
L power:GND #PWR06
U 1 1 5D7A878F
P 3150 2450
F 0 "#PWR06" H 3150 2200 50  0001 C CNN
F 1 "GND" H 3155 2277 50  0000 C CNN
F 2 "" H 3150 2450 50  0001 C CNN
F 3 "" H 3150 2450 50  0001 C CNN
	1    3150 2450
	-1   0    0    1   
$EndComp
$Comp
L power:+5V #PWR09
U 1 1 5D7A9108
P 3550 3450
F 0 "#PWR09" H 3550 3300 50  0001 C CNN
F 1 "+5V" H 3565 3623 50  0000 C CNN
F 2 "" H 3550 3450 50  0001 C CNN
F 3 "" H 3550 3450 50  0001 C CNN
	1    3550 3450
	0    -1   -1   0   
$EndComp
$Comp
L Device:C C4
U 1 1 5D7A91EE
P 3400 3950
F 0 "C4" V 3148 3950 50  0000 C CNN
F 1 "1u" V 3239 3950 50  0000 C CNN
F 2 "Capacitor_SMD:C_0805_2012Metric_Pad1.15x1.40mm_HandSolder" H 3438 3800 50  0001 C CNN
F 3 "~" H 3400 3950 50  0001 C CNN
	1    3400 3950
	0    1    1    0   
$EndComp
$Comp
L power:GND #PWR08
U 1 1 5D7A9399
P 3150 3950
F 0 "#PWR08" H 3150 3700 50  0001 C CNN
F 1 "GND" V 3155 3822 50  0000 R CNN
F 2 "" H 3150 3950 50  0001 C CNN
F 3 "" H 3150 3950 50  0001 C CNN
	1    3150 3950
	0    1    1    0   
$EndComp
$Comp
L Device:C C5
U 1 1 5D7A948E
P 4800 2150
F 0 "C5" H 4915 2196 50  0000 L CNN
F 1 "1u" H 4915 2105 50  0000 L CNN
F 2 "Capacitor_SMD:C_0805_2012Metric_Pad1.15x1.40mm_HandSolder" H 4838 2000 50  0001 C CNN
F 3 "~" H 4800 2150 50  0001 C CNN
	1    4800 2150
	1    0    0    -1  
$EndComp
$Comp
L Device:C C6
U 1 1 5D7A94FC
P 5200 2150
F 0 "C6" H 5315 2196 50  0000 L CNN
F 1 "100n" H 5315 2105 50  0000 L CNN
F 2 "Capacitor_SMD:C_0805_2012Metric_Pad1.15x1.40mm_HandSolder" H 5238 2000 50  0001 C CNN
F 3 "~" H 5200 2150 50  0001 C CNN
	1    5200 2150
	1    0    0    -1  
$EndComp
$Comp
L Device:C C7
U 1 1 5D7A952C
P 5600 2150
F 0 "C7" H 5715 2196 50  0000 L CNN
F 1 "100n" H 5715 2105 50  0000 L CNN
F 2 "Capacitor_SMD:C_0805_2012Metric_Pad1.15x1.40mm_HandSolder" H 5638 2000 50  0001 C CNN
F 3 "~" H 5600 2150 50  0001 C CNN
	1    5600 2150
	1    0    0    -1  
$EndComp
$Comp
L power:+5V #PWR012
U 1 1 5D7A956A
P 4800 2000
F 0 "#PWR012" H 4800 1850 50  0001 C CNN
F 1 "+5V" H 4815 2173 50  0000 C CNN
F 2 "" H 4800 2000 50  0001 C CNN
F 3 "" H 4800 2000 50  0001 C CNN
	1    4800 2000
	1    0    0    -1  
$EndComp
$Comp
L power:+5V #PWR014
U 1 1 5D7A958B
P 5200 2000
F 0 "#PWR014" H 5200 1850 50  0001 C CNN
F 1 "+5V" H 5215 2173 50  0000 C CNN
F 2 "" H 5200 2000 50  0001 C CNN
F 3 "" H 5200 2000 50  0001 C CNN
	1    5200 2000
	1    0    0    -1  
$EndComp
$Comp
L power:+5V #PWR016
U 1 1 5D7A95AC
P 5600 2000
F 0 "#PWR016" H 5600 1850 50  0001 C CNN
F 1 "+5V" H 5615 2173 50  0000 C CNN
F 2 "" H 5600 2000 50  0001 C CNN
F 3 "" H 5600 2000 50  0001 C CNN
	1    5600 2000
	1    0    0    -1  
$EndComp
$Comp
L Switch:SW_Push SW1
U 1 1 5D7A997B
P 2550 1700
F 0 "SW1" H 2550 1985 50  0000 C CNN
F 1 "SW_Push" H 2550 1894 50  0000 C CNN
F 2 "Button_Switch_THT:SW_PUSH_6mm" H 2550 1900 50  0001 C CNN
F 3 "" H 2550 1900 50  0001 C CNN
	1    2550 1700
	1    0    0    -1  
$EndComp
$Comp
L power:GND #PWR01
U 1 1 5D7A9FCE
P 2150 1700
F 0 "#PWR01" H 2150 1450 50  0001 C CNN
F 1 "GND" V 2155 1572 50  0000 R CNN
F 2 "" H 2150 1700 50  0001 C CNN
F 3 "" H 2150 1700 50  0001 C CNN
	1    2150 1700
	0    1    1    0   
$EndComp
Wire Wire Line
	2150 1700 2350 1700
Wire Wire Line
	3550 2650 3300 2650
Wire Wire Line
	3300 1700 3300 2650
Wire Wire Line
	2750 1700 2800 1700
$Comp
L Device:C C1
U 1 1 5D7B1ADD
P 2800 1850
F 0 "C1" H 2915 1896 50  0000 L CNN
F 1 "100n" H 2915 1805 50  0000 L CNN
F 2 "Capacitor_SMD:C_0805_2012Metric_Pad1.15x1.40mm_HandSolder" H 2838 1700 50  0001 C CNN
F 3 "~" H 2800 1850 50  0001 C CNN
	1    2800 1850
	1    0    0    -1  
$EndComp
Connection ~ 2800 1700
Wire Wire Line
	2800 1700 3300 1700
$Comp
L Device:R R3
U 1 1 5D7B1B71
P 2800 1550
F 0 "R3" V 3007 1550 50  0000 C CNN
F 1 "10k" V 2916 1550 50  0000 C CNN
F 2 "Resistor_SMD:R_1206_3216Metric_Pad1.42x1.75mm_HandSolder" V 2730 1550 50  0001 C CNN
F 3 "~" H 2800 1550 50  0001 C CNN
	1    2800 1550
	1    0    0    -1  
$EndComp
$Comp
L power:GND #PWR04
U 1 1 5D7B2183
P 2800 1300
F 0 "#PWR04" H 2800 1050 50  0001 C CNN
F 1 "GND" V 2805 1172 50  0000 R CNN
F 2 "" H 2800 1300 50  0001 C CNN
F 3 "" H 2800 1300 50  0001 C CNN
	1    2800 1300
	-1   0    0    1   
$EndComp
$Comp
L power:GND #PWR05
U 1 1 5D7B222C
P 2800 2100
F 0 "#PWR05" H 2800 1850 50  0001 C CNN
F 1 "GND" H 2805 1927 50  0000 C CNN
F 2 "" H 2800 2100 50  0001 C CNN
F 3 "" H 2800 2100 50  0001 C CNN
	1    2800 2100
	1    0    0    -1  
$EndComp
$Comp
L power:GND #PWR07
U 1 1 5D7B23AF
P 3150 3500
F 0 "#PWR07" H 3150 3250 50  0001 C CNN
F 1 "GND" H 3155 3327 50  0000 C CNN
F 2 "" H 3150 3500 50  0001 C CNN
F 3 "" H 3150 3500 50  0001 C CNN
	1    3150 3500
	1    0    0    -1  
$EndComp
$Comp
L power:GND #PWR013
U 1 1 5D7B240E
P 4800 2400
F 0 "#PWR013" H 4800 2150 50  0001 C CNN
F 1 "GND" V 4805 2227 50  0000 C CNN
F 2 "" H 4800 2400 50  0001 C CNN
F 3 "" H 4800 2400 50  0001 C CNN
	1    4800 2400
	1    0    0    -1  
$EndComp
$Comp
L power:GND #PWR015
U 1 1 5D7B2435
P 5200 2400
F 0 "#PWR015" H 5200 2150 50  0001 C CNN
F 1 "GND" H 5205 2227 50  0000 C CNN
F 2 "" H 5200 2400 50  0001 C CNN
F 3 "" H 5200 2400 50  0001 C CNN
	1    5200 2400
	1    0    0    -1  
$EndComp
$Comp
L power:GND #PWR017
U 1 1 5D7B245C
P 5600 2400
F 0 "#PWR017" H 5600 2150 50  0001 C CNN
F 1 "GND" H 5605 2227 50  0000 C CNN
F 2 "" H 5600 2400 50  0001 C CNN
F 3 "" H 5600 2400 50  0001 C CNN
	1    5600 2400
	1    0    0    -1  
$EndComp
$Comp
L Connector_Generic:Conn_01x10 J2
U 1 1 5D7B268F
P 5950 3100
F 0 "J2" H 6030 3092 50  0000 L CNN
F 1 "Conn_01x10" H 6030 3001 50  0000 L CNN
F 2 "Connector_PinHeader_2.54mm:PinHeader_1x10_P2.54mm_Vertical" H 5950 3100 50  0001 C CNN
F 3 "~" H 5950 3100 50  0001 C CNN
	1    5950 3100
	1    0    0    -1  
$EndComp
$Comp
L Connector_Generic:Conn_01x10 J3
U 1 1 5D7B2791
P 5100 4200
F 0 "J3" H 5180 4192 50  0000 L CNN
F 1 "Conn_01x10" H 5180 4101 50  0000 L CNN
F 2 "Connector_PinHeader_2.54mm:PinHeader_1x10_P2.54mm_Vertical" H 5100 4200 50  0001 C CNN
F 3 "~" H 5100 4200 50  0001 C CNN
	1    5100 4200
	1    0    0    -1  
$EndComp
$Comp
L Connector_Generic:Conn_01x06 J4
U 1 1 5D7B295D
P 5100 5250
F 0 "J4" H 5180 5242 50  0000 L CNN
F 1 "Conn_01x06" H 5180 5151 50  0000 L CNN
F 2 "Connector_PinHeader_2.54mm:PinHeader_1x06_P2.54mm_Vertical" H 5100 5250 50  0001 C CNN
F 3 "~" H 5100 5250 50  0001 C CNN
	1    5100 5250
	1    0    0    -1  
$EndComp
Wire Wire Line
	4750 3850 4750 3800
Wire Wire Line
	4750 3800 4900 3800
Wire Wire Line
	4750 3950 4900 3950
Wire Wire Line
	4900 3950 4900 3900
Wire Wire Line
	4750 4050 4900 4050
Wire Wire Line
	4900 4050 4900 4000
Wire Wire Line
	4750 4150 4900 4150
Wire Wire Line
	4900 4150 4900 4100
Wire Wire Line
	4750 4250 4900 4250
Wire Wire Line
	4900 4250 4900 4200
Wire Wire Line
	4750 4350 4900 4350
Wire Wire Line
	4900 4350 4900 4300
Wire Wire Line
	4750 4450 4900 4450
Wire Wire Line
	4900 4450 4900 4400
Wire Wire Line
	4750 4550 4900 4550
Wire Wire Line
	4900 4550 4900 4500
Wire Wire Line
	4900 4600 4750 4600
Wire Wire Line
	4750 4600 4750 4750
Wire Wire Line
	4750 4850 4900 4850
Wire Wire Line
	4900 4850 4900 4700
Wire Wire Line
	4750 5050 4900 5050
Wire Wire Line
	4750 5150 4900 5150
Wire Wire Line
	4750 5250 4900 5250
Wire Wire Line
	4750 5350 4900 5350
Wire Wire Line
	4750 5450 4900 5450
Wire Wire Line
	4750 5550 4900 5550
Text GLabel 5750 3000 0    50   Input ~ 0
Pino8
Text GLabel 5750 2900 0    50   Input ~ 0
Pino9
Text GLabel 4750 2950 2    50   Input ~ 0
Pino11
Text GLabel 4750 2850 2    50   Input ~ 0
Pino10
Text GLabel 4750 2750 2    50   Input ~ 0
Pino9
Text GLabel 4750 2650 2    50   Input ~ 0
Pino8
Text GLabel 5750 2800 0    50   Input ~ 0
Pino10
Text GLabel 5750 2700 0    50   Input ~ 0
Pino11
Wire Wire Line
	5600 2400 5600 2300
Wire Wire Line
	5200 2400 5200 2300
Wire Wire Line
	4800 2400 4800 2300
Wire Wire Line
	3250 3950 3150 3950
Wire Wire Line
	2200 4200 2200 4050
Wire Wire Line
	3150 3500 3150 3400
Wire Wire Line
	3150 2500 3150 2450
Wire Wire Line
	2800 2100 2800 2000
Wire Wire Line
	2800 1400 2800 1300
Text GLabel 4750 3050 2    50   Input ~ 0
Pino28
Text GLabel 4750 3150 2    50   Input ~ 0
Pino29
Text GLabel 4750 3250 2    50   Input ~ 0
Pino30
Text GLabel 4750 3350 2    50   Input ~ 0
Pino12
Text GLabel 5750 3100 0    50   Input ~ 0
Pino28
Text GLabel 5750 3200 0    50   Input ~ 0
Pino29
Text GLabel 5750 3300 0    50   Input ~ 0
Pino30
Text GLabel 5750 3400 0    50   Input ~ 0
Pino12
Text GLabel 4750 3550 2    50   Input ~ 0
Pino31
Text GLabel 4750 3650 2    50   Input ~ 0
Pino32
Text GLabel 5750 3500 0    50   Input ~ 0
Pino31
Text GLabel 5750 3600 0    50   Input ~ 0
Pino32
$EndSCHEMATC
