%!PS-Adobe-3.0
%%Creator: PCBNEW
%%CreationDate: Thu Sep 12 15:15:31 2019
%%Title: /home/secomp2019/Documentos/kcad/kicad/gerbers/kicad-PTH-drl_map.ps
%%Pages: 1
%%PageOrder: Ascend
%%BoundingBox: 0 0 596 842
%%DocumentMedia: A4 595 842 0 () ()
%%Orientation: Landscape
%%EndComments
%%BeginProlog
/line { newpath moveto lineto stroke } bind def
/cir0 { newpath 0 360 arc stroke } bind def
/cir1 { newpath 0 360 arc gsave fill grestore stroke } bind def
/cir2 { newpath 0 360 arc gsave fill grestore stroke } bind def
/arc0 { newpath arc stroke } bind def
/arc1 { newpath 4 index 4 index moveto arc closepath gsave fill
    grestore stroke } bind def
/arc2 { newpath 4 index 4 index moveto arc closepath gsave fill
    grestore stroke } bind def
/poly0 { stroke } bind def
/poly1 { closepath gsave fill grestore stroke } bind def
/poly2 { closepath gsave fill grestore stroke } bind def
/rect0 { rectstroke } bind def
/rect1 { rectfill } bind def
/rect2 { rectfill } bind def
/linemode0 { 0 setlinecap 0 setlinejoin 0 setlinewidth } bind def
/linemode1 { 1 setlinecap 1 setlinejoin } bind def
/dashedline { [200] 100 setdash } bind def
/solidline { [] 0 setdash } bind def
/phantomshow { moveto
    /KicadFont findfont 0.000001 scalefont setfont
    show } bind def
/textshow { gsave
    findfont exch scalefont setfont concat 1 scale 0 0 moveto show
    } bind def
/reencodefont {
  findfont dup length dict begin
  { 1 index /FID ne
    { def }
    { pop pop } ifelse
  } forall
  /Encoding ISOLatin1Encoding def
  currentdict
  end } bind def
/KicadFont /Helvetica reencodefont definefont pop
/KicadFont-Bold /Helvetica-Bold reencodefont definefont pop
/KicadFont-Oblique /Helvetica-Oblique reencodefont definefont pop
/KicadFont-BoldOblique /Helvetica-BoldOblique reencodefont definefont pop
%%EndProlog
%%Page: 1 1
%%BeginPageSetup
gsave
0.0072 0.0072 scale
linemode1
82680 0 translate 90 rotate
150 setlinewidth
%%EndPageSetup
0 0 0 setrgbcolor
177.165 setlinewidth
newpath
28937.4 37206.7 moveto
28937.4 78545.3 lineto
stroke
0 0 0 setrgbcolor
newpath
87992.6 37206.7 moveto
28937.4 37206.7 lineto
stroke
0 0 0 setrgbcolor
newpath
87992.6 78545.3 moveto
87992.6 37206.7 lineto
stroke
0 0 0 setrgbcolor
newpath
28937.4 78545.3 moveto
87992.6 78545.3 lineto
stroke
78.7394 setlinewidth
newpath
46063.4 73230.3 moveto
47244.5 72049.2 lineto
stroke
newpath
47244.5 73230.3 moveto
46063.4 72049.2 lineto
stroke
newpath
49063.4 73230.3 moveto
50244.5 72049.2 lineto
stroke
newpath
50244.5 73230.3 moveto
49063.4 72049.2 lineto
stroke
newpath
52063.4 73230.3 moveto
53244.5 72049.2 lineto
stroke
newpath
53244.5 73230.3 moveto
52063.4 72049.2 lineto
stroke
newpath
55063.4 73230.3 moveto
56244.5 72049.2 lineto
stroke
newpath
56244.5 73230.3 moveto
55063.4 72049.2 lineto
stroke
newpath
58063.4 73230.3 moveto
59244.5 72049.2 lineto
stroke
newpath
59244.5 73230.3 moveto
58063.4 72049.2 lineto
stroke
newpath
61063.4 73230.3 moveto
62244.5 72049.2 lineto
stroke
newpath
62244.5 73230.3 moveto
61063.4 72049.2 lineto
stroke
newpath
64063.4 73230.3 moveto
65244.5 72049.2 lineto
stroke
newpath
65244.5 73230.3 moveto
64063.4 72049.2 lineto
stroke
newpath
67063.4 73230.3 moveto
68244.5 72049.2 lineto
stroke
newpath
68244.5 73230.3 moveto
67063.4 72049.2 lineto
stroke
newpath
70063.4 73230.3 moveto
71244.5 72049.2 lineto
stroke
newpath
71244.5 73230.3 moveto
70063.4 72049.2 lineto
stroke
newpath
73063.4 73230.3 moveto
74244.5 72049.2 lineto
stroke
newpath
74244.5 73230.3 moveto
73063.4 72049.2 lineto
stroke
newpath
51968.9 43702.8 moveto
53150 42521.7 lineto
stroke
newpath
53150 43702.8 moveto
51968.9 42521.7 lineto
stroke
newpath
54968.9 43702.8 moveto
56150 42521.7 lineto
stroke
newpath
56150 43702.8 moveto
54968.9 42521.7 lineto
stroke
newpath
57968.9 43702.8 moveto
59150 42521.7 lineto
stroke
newpath
59150 43702.8 moveto
57968.9 42521.7 lineto
stroke
newpath
60968.9 43702.8 moveto
62150 42521.7 lineto
stroke
newpath
62150 43702.8 moveto
60968.9 42521.7 lineto
stroke
newpath
63968.9 43702.8 moveto
65150 42521.7 lineto
stroke
newpath
65150 43702.8 moveto
63968.9 42521.7 lineto
stroke
newpath
66968.9 43702.8 moveto
68150 42521.7 lineto
stroke
newpath
68150 43702.8 moveto
66968.9 42521.7 lineto
stroke
newpath
34252.4 70702.8 moveto
35433.5 69521.7 lineto
stroke
newpath
35433.5 70702.8 moveto
34252.4 69521.7 lineto
stroke
newpath
34252.4 67702.8 moveto
35433.5 66521.7 lineto
stroke
newpath
35433.5 67702.8 moveto
34252.4 66521.7 lineto
stroke
newpath
34252.4 64702.8 moveto
35433.5 63521.7 lineto
stroke
newpath
35433.5 64702.8 moveto
34252.4 63521.7 lineto
stroke
newpath
34252.4 61702.8 moveto
35433.5 60521.7 lineto
stroke
newpath
35433.5 61702.8 moveto
34252.4 60521.7 lineto
stroke
newpath
34252.4 58702.8 moveto
35433.5 57521.7 lineto
stroke
newpath
35433.5 58702.8 moveto
34252.4 57521.7 lineto
stroke
newpath
34252.4 55702.8 moveto
35433.5 54521.7 lineto
stroke
newpath
35433.5 55702.8 moveto
34252.4 54521.7 lineto
stroke
newpath
34252.4 52702.8 moveto
35433.5 51521.7 lineto
stroke
newpath
35433.5 52702.8 moveto
34252.4 51521.7 lineto
stroke
newpath
34252.4 49702.8 moveto
35433.5 48521.7 lineto
stroke
newpath
35433.5 49702.8 moveto
34252.4 48521.7 lineto
stroke
newpath
34252.4 46702.8 moveto
35433.5 45521.7 lineto
stroke
newpath
35433.5 46702.8 moveto
34252.4 45521.7 lineto
stroke
newpath
34252.4 43702.8 moveto
35433.5 42521.7 lineto
stroke
newpath
35433.5 43702.8 moveto
34252.4 42521.7 lineto
stroke
40748.5 49017.7 649.606 cir0
40748.5 43702.8 649.606 cir0
48425.6 49017.7 649.606 cir0
48425.6 43702.8 649.606 cir0
118.11 setlinewidth
0 0 0 setrgbcolor
0 0 0 setrgbcolor
newpath
29976.5 35284.6 moveto
29976.5 36465.7 lineto
30257.7 36465.7 lineto
30426.5 36409.5 lineto
30539 36297 lineto
30595.2 36184.5 lineto
30651.4 35959.5 lineto
30651.4 35790.8 lineto
30595.2 35565.8 lineto
30539 35453.3 lineto
30426.5 35340.8 lineto
30257.7 35284.6 lineto
29976.5 35284.6 lineto
stroke
newpath
31157.6 35284.6 moveto
31157.6 36072 lineto
stroke
newpath
31157.6 35847 moveto
31213.9 35959.5 lineto
31270.1 36015.8 lineto
31382.6 36072 lineto
31495.1 36072 lineto
stroke
newpath
31888.8 35284.6 moveto
31888.8 36072 lineto
stroke
newpath
31888.8 36465.7 moveto
31832.5 36409.5 lineto
31888.8 36353.2 lineto
31945 36409.5 lineto
31888.8 36465.7 lineto
31888.8 36353.2 lineto
stroke
newpath
32619.9 35284.6 moveto
32507.5 35340.8 lineto
32451.2 35453.3 lineto
32451.2 36465.7 lineto
stroke
newpath
33238.6 35284.6 moveto
33126.1 35340.8 lineto
33069.9 35453.3 lineto
33069.9 36465.7 lineto
stroke
newpath
34588.5 35284.6 moveto
34588.5 36465.7 lineto
34982.2 35622.1 lineto
35375.9 36465.7 lineto
35375.9 35284.6 lineto
stroke
newpath
36444.5 35284.6 moveto
36444.5 35903.3 lineto
36388.2 36015.8 lineto
36275.7 36072 lineto
36050.8 36072 lineto
35938.3 36015.8 lineto
stroke
newpath
36444.5 35340.8 moveto
36332 35284.6 lineto
36050.8 35284.6 lineto
35938.3 35340.8 lineto
35882 35453.3 lineto
35882 35565.8 lineto
35938.3 35678.3 lineto
36050.8 35734.5 lineto
36332 35734.5 lineto
36444.5 35790.8 lineto
stroke
newpath
37006.9 36072 moveto
37006.9 34890.9 lineto
stroke
newpath
37006.9 36015.8 moveto
37119.4 36072 lineto
37344.4 36072 lineto
37456.8 36015.8 lineto
37513.1 35959.5 lineto
37569.3 35847 lineto
37569.3 35509.6 lineto
37513.1 35397.1 lineto
37456.8 35340.8 lineto
37344.4 35284.6 lineto
37119.4 35284.6 lineto
37006.9 35340.8 lineto
stroke
newpath
38075.5 35397.1 moveto
38131.8 35340.8 lineto
38075.5 35284.6 lineto
38019.3 35340.8 lineto
38075.5 35397.1 lineto
38075.5 35284.6 lineto
stroke
newpath
38075.5 36015.8 moveto
38131.8 35959.5 lineto
38075.5 35903.3 lineto
38019.3 35959.5 lineto
38075.5 36015.8 lineto
38075.5 35903.3 lineto
stroke
newpath
27667.8 33929.1 moveto
28848.9 32748 lineto
stroke
newpath
28848.9 33929.1 moveto
27667.8 32748 lineto
stroke
0 0 0 setrgbcolor
0 0 0 setrgbcolor
newpath
30595.2 32804.3 moveto
29920.3 32804.3 lineto
stroke
newpath
30257.7 32804.3 moveto
30257.7 33985.4 lineto
30145.3 33816.7 lineto
30032.8 33704.2 lineto
29920.3 33647.9 lineto
stroke
newpath
31101.4 32916.8 moveto
31157.6 32860.5 lineto
31101.4 32804.3 lineto
31045.1 32860.5 lineto
31101.4 32916.8 lineto
31101.4 32804.3 lineto
stroke
newpath
31888.8 33985.4 moveto
32001.3 33985.4 lineto
32113.8 33929.1 lineto
32170 33872.9 lineto
32226.2 33760.4 lineto
32282.5 33535.4 lineto
32282.5 33254.2 lineto
32226.2 33029.3 lineto
32170 32916.8 lineto
32113.8 32860.5 lineto
32001.3 32804.3 lineto
31888.8 32804.3 lineto
31776.3 32860.5 lineto
31720.1 32916.8 lineto
31663.8 33029.3 lineto
31607.6 33254.2 lineto
31607.6 33535.4 lineto
31663.8 33760.4 lineto
31720.1 33872.9 lineto
31776.3 33929.1 lineto
31888.8 33985.4 lineto
stroke
newpath
33013.6 33985.4 moveto
33126.1 33985.4 lineto
33238.6 33929.1 lineto
33294.9 33872.9 lineto
33351.1 33760.4 lineto
33407.4 33535.4 lineto
33407.4 33254.2 lineto
33351.1 33029.3 lineto
33294.9 32916.8 lineto
33238.6 32860.5 lineto
33126.1 32804.3 lineto
33013.6 32804.3 lineto
32901.2 32860.5 lineto
32844.9 32916.8 lineto
32788.7 33029.3 lineto
32732.4 33254.2 lineto
32732.4 33535.4 lineto
32788.7 33760.4 lineto
32844.9 33872.9 lineto
32901.2 33929.1 lineto
33013.6 33985.4 lineto
stroke
newpath
33913.5 32804.3 moveto
33913.5 33591.7 lineto
stroke
newpath
33913.5 33479.2 moveto
33969.8 33535.4 lineto
34082.3 33591.7 lineto
34251 33591.7 lineto
34363.5 33535.4 lineto
34419.7 33423 lineto
34419.7 32804.3 lineto
stroke
newpath
34419.7 33423 moveto
34476 33535.4 lineto
34588.5 33591.7 lineto
34757.2 33591.7 lineto
34869.7 33535.4 lineto
34925.9 33423 lineto
34925.9 32804.3 lineto
stroke
newpath
35488.3 32804.3 moveto
35488.3 33591.7 lineto
stroke
newpath
35488.3 33479.2 moveto
35544.6 33535.4 lineto
35657.1 33591.7 lineto
35825.8 33591.7 lineto
35938.3 33535.4 lineto
35994.5 33423 lineto
35994.5 32804.3 lineto
stroke
newpath
35994.5 33423 moveto
36050.8 33535.4 lineto
36163.3 33591.7 lineto
36332 33591.7 lineto
36444.5 33535.4 lineto
36500.7 33423 lineto
36500.7 32804.3 lineto
stroke
newpath
38806.7 34041.6 moveto
37794.3 32523.1 lineto
stroke
newpath
40325.2 33985.4 moveto
40437.7 33985.4 lineto
40550.2 33929.1 lineto
40606.5 33872.9 lineto
40662.7 33760.4 lineto
40718.9 33535.4 lineto
40718.9 33254.2 lineto
40662.7 33029.3 lineto
40606.5 32916.8 lineto
40550.2 32860.5 lineto
40437.7 32804.3 lineto
40325.2 32804.3 lineto
40212.7 32860.5 lineto
40156.5 32916.8 lineto
40100.3 33029.3 lineto
40044 33254.2 lineto
40044 33535.4 lineto
40100.3 33760.4 lineto
40156.5 33872.9 lineto
40212.7 33929.1 lineto
40325.2 33985.4 lineto
stroke
newpath
41225.1 32916.8 moveto
41281.4 32860.5 lineto
41225.1 32804.3 lineto
41168.9 32860.5 lineto
41225.1 32916.8 lineto
41225.1 32804.3 lineto
stroke
newpath
42012.5 33985.4 moveto
42125 33985.4 lineto
42237.5 33929.1 lineto
42293.7 33872.9 lineto
42350 33760.4 lineto
42406.2 33535.4 lineto
42406.2 33254.2 lineto
42350 33029.3 lineto
42293.7 32916.8 lineto
42237.5 32860.5 lineto
42125 32804.3 lineto
42012.5 32804.3 lineto
41900 32860.5 lineto
41843.8 32916.8 lineto
41787.6 33029.3 lineto
41731.3 33254.2 lineto
41731.3 33535.4 lineto
41787.6 33760.4 lineto
41843.8 33872.9 lineto
41900 33929.1 lineto
42012.5 33985.4 lineto
stroke
newpath
42799.9 33985.4 moveto
43531.1 33985.4 lineto
43137.4 33535.4 lineto
43306.1 33535.4 lineto
43418.6 33479.2 lineto
43474.8 33423 lineto
43531.1 33310.5 lineto
43531.1 33029.3 lineto
43474.8 32916.8 lineto
43418.6 32860.5 lineto
43306.1 32804.3 lineto
42968.7 32804.3 lineto
42856.2 32860.5 lineto
42799.9 32916.8 lineto
stroke
newpath
44093.5 32804.3 moveto
44318.5 32804.3 lineto
44431 32860.5 lineto
44487.2 32916.8 lineto
44599.7 33085.5 lineto
44655.9 33310.5 lineto
44655.9 33760.4 lineto
44599.7 33872.9 lineto
44543.5 33929.1 lineto
44431 33985.4 lineto
44206 33985.4 lineto
44093.5 33929.1 lineto
44037.3 33872.9 lineto
43981 33760.4 lineto
43981 33479.2 lineto
44037.3 33366.7 lineto
44093.5 33310.5 lineto
44206 33254.2 lineto
44431 33254.2 lineto
44543.5 33310.5 lineto
44599.7 33366.7 lineto
44655.9 33479.2 lineto
stroke
newpath
45105.9 33985.4 moveto
45105.9 33760.4 lineto
stroke
newpath
45555.8 33985.4 moveto
45555.8 33760.4 lineto
stroke
newpath
47299.4 32354.3 moveto
47243.1 32410.6 lineto
47130.6 32579.3 lineto
47074.4 32691.8 lineto
47018.1 32860.5 lineto
46961.9 33141.7 lineto
46961.9 33366.7 lineto
47018.1 33647.9 lineto
47074.4 33816.7 lineto
47130.6 33929.1 lineto
47243.1 34097.9 lineto
47299.4 34154.1 lineto
stroke
newpath
47693.1 33872.9 moveto
47749.3 33929.1 lineto
47861.8 33985.4 lineto
48143 33985.4 lineto
48255.5 33929.1 lineto
48311.7 33872.9 lineto
48368 33760.4 lineto
48368 33647.9 lineto
48311.7 33479.2 lineto
47636.8 32804.3 lineto
48368 32804.3 lineto
stroke
newpath
49380.4 33985.4 moveto
49155.4 33985.4 lineto
49042.9 33929.1 lineto
48986.7 33872.9 lineto
48874.2 33704.2 lineto
48817.9 33479.2 lineto
48817.9 33029.3 lineto
48874.2 32916.8 lineto
48930.4 32860.5 lineto
49042.9 32804.3 lineto
49267.9 32804.3 lineto
49380.4 32860.5 lineto
49436.6 32916.8 lineto
49492.8 33029.3 lineto
49492.8 33310.5 lineto
49436.6 33423 lineto
49380.4 33479.2 lineto
49267.9 33535.4 lineto
49042.9 33535.4 lineto
48930.4 33479.2 lineto
48874.2 33423 lineto
48817.9 33310.5 lineto
stroke
newpath
50898.9 32804.3 moveto
50898.9 33985.4 lineto
stroke
newpath
51405.1 32804.3 moveto
51405.1 33423 lineto
51348.9 33535.4 lineto
51236.4 33591.7 lineto
51067.6 33591.7 lineto
50955.2 33535.4 lineto
50898.9 33479.2 lineto
stroke
newpath
52136.3 32804.3 moveto
52023.8 32860.5 lineto
51967.5 32916.8 lineto
51911.3 33029.3 lineto
51911.3 33366.7 lineto
51967.5 33479.2 lineto
52023.8 33535.4 lineto
52136.3 33591.7 lineto
52305 33591.7 lineto
52417.5 33535.4 lineto
52473.7 33479.2 lineto
52530 33366.7 lineto
52530 33029.3 lineto
52473.7 32916.8 lineto
52417.5 32860.5 lineto
52305 32804.3 lineto
52136.3 32804.3 lineto
stroke
newpath
53204.9 32804.3 moveto
53092.4 32860.5 lineto
53036.1 32973 lineto
53036.1 33985.4 lineto
stroke
newpath
54104.8 32860.5 moveto
53992.3 32804.3 lineto
53767.3 32804.3 lineto
53654.8 32860.5 lineto
53598.6 32973 lineto
53598.6 33423 lineto
53654.8 33535.4 lineto
53767.3 33591.7 lineto
53992.3 33591.7 lineto
54104.8 33535.4 lineto
54161 33423 lineto
54161 33310.5 lineto
53598.6 33198 lineto
stroke
newpath
54610.9 32860.5 moveto
54723.4 32804.3 lineto
54948.4 32804.3 lineto
55060.9 32860.5 lineto
55117.1 32973 lineto
55117.1 33029.3 lineto
55060.9 33141.7 lineto
54948.4 33198 lineto
54779.7 33198 lineto
54667.2 33254.2 lineto
54610.9 33366.7 lineto
54610.9 33423 lineto
54667.2 33535.4 lineto
54779.7 33591.7 lineto
54948.4 33591.7 lineto
55060.9 33535.4 lineto
stroke
newpath
55510.8 32354.3 moveto
55567.1 32410.6 lineto
55679.6 32579.3 lineto
55735.8 32691.8 lineto
55792.1 32860.5 lineto
55848.3 33141.7 lineto
55848.3 33366.7 lineto
55792.1 33647.9 lineto
55735.8 33816.7 lineto
55679.6 33929.1 lineto
55567.1 34097.9 lineto
55510.8 34154.1 lineto
stroke
28199.3 31645.7 649.606 cir0
0 0 0 setrgbcolor
0 0 0 setrgbcolor
newpath
30595.2 31111.4 moveto
29920.3 31111.4 lineto
stroke
newpath
30257.7 31111.4 moveto
30257.7 32292.5 lineto
30145.3 32123.7 lineto
30032.8 32011.3 lineto
29920.3 31955 lineto
stroke
newpath
31101.4 31223.9 moveto
31157.6 31167.6 lineto
31101.4 31111.4 lineto
31045.1 31167.6 lineto
31101.4 31223.9 lineto
31101.4 31111.4 lineto
stroke
newpath
32282.5 31111.4 moveto
31607.6 31111.4 lineto
stroke
newpath
31945 31111.4 moveto
31945 32292.5 lineto
31832.5 32123.7 lineto
31720.1 32011.3 lineto
31607.6 31955 lineto
stroke
newpath
33013.6 32292.5 moveto
33126.1 32292.5 lineto
33238.6 32236.2 lineto
33294.9 32180 lineto
33351.1 32067.5 lineto
33407.4 31842.5 lineto
33407.4 31561.3 lineto
33351.1 31336.3 lineto
33294.9 31223.9 lineto
33238.6 31167.6 lineto
33126.1 31111.4 lineto
33013.6 31111.4 lineto
32901.2 31167.6 lineto
32844.9 31223.9 lineto
32788.7 31336.3 lineto
32732.4 31561.3 lineto
32732.4 31842.5 lineto
32788.7 32067.5 lineto
32844.9 32180 lineto
32901.2 32236.2 lineto
33013.6 32292.5 lineto
stroke
newpath
33913.5 31111.4 moveto
33913.5 31898.8 lineto
stroke
newpath
33913.5 31786.3 moveto
33969.8 31842.5 lineto
34082.3 31898.8 lineto
34251 31898.8 lineto
34363.5 31842.5 lineto
34419.7 31730 lineto
34419.7 31111.4 lineto
stroke
newpath
34419.7 31730 moveto
34476 31842.5 lineto
34588.5 31898.8 lineto
34757.2 31898.8 lineto
34869.7 31842.5 lineto
34925.9 31730 lineto
34925.9 31111.4 lineto
stroke
newpath
35488.3 31111.4 moveto
35488.3 31898.8 lineto
stroke
newpath
35488.3 31786.3 moveto
35544.6 31842.5 lineto
35657.1 31898.8 lineto
35825.8 31898.8 lineto
35938.3 31842.5 lineto
35994.5 31730 lineto
35994.5 31111.4 lineto
stroke
newpath
35994.5 31730 moveto
36050.8 31842.5 lineto
36163.3 31898.8 lineto
36332 31898.8 lineto
36444.5 31842.5 lineto
36500.7 31730 lineto
36500.7 31111.4 lineto
stroke
newpath
38806.7 32348.7 moveto
37794.3 30830.2 lineto
stroke
newpath
40325.2 32292.5 moveto
40437.7 32292.5 lineto
40550.2 32236.2 lineto
40606.5 32180 lineto
40662.7 32067.5 lineto
40718.9 31842.5 lineto
40718.9 31561.3 lineto
40662.7 31336.3 lineto
40606.5 31223.9 lineto
40550.2 31167.6 lineto
40437.7 31111.4 lineto
40325.2 31111.4 lineto
40212.7 31167.6 lineto
40156.5 31223.9 lineto
40100.3 31336.3 lineto
40044 31561.3 lineto
40044 31842.5 lineto
40100.3 32067.5 lineto
40156.5 32180 lineto
40212.7 32236.2 lineto
40325.2 32292.5 lineto
stroke
newpath
41225.1 31223.9 moveto
41281.4 31167.6 lineto
41225.1 31111.4 lineto
41168.9 31167.6 lineto
41225.1 31223.9 lineto
41225.1 31111.4 lineto
stroke
newpath
42012.5 32292.5 moveto
42125 32292.5 lineto
42237.5 32236.2 lineto
42293.7 32180 lineto
42350 32067.5 lineto
42406.2 31842.5 lineto
42406.2 31561.3 lineto
42350 31336.3 lineto
42293.7 31223.9 lineto
42237.5 31167.6 lineto
42125 31111.4 lineto
42012.5 31111.4 lineto
41900 31167.6 lineto
41843.8 31223.9 lineto
41787.6 31336.3 lineto
41731.3 31561.3 lineto
41731.3 31842.5 lineto
41787.6 32067.5 lineto
41843.8 32180 lineto
41900 32236.2 lineto
42012.5 32292.5 lineto
stroke
newpath
43418.6 31898.8 moveto
43418.6 31111.4 lineto
stroke
newpath
43137.4 32348.7 moveto
42856.2 31505.1 lineto
43587.3 31505.1 lineto
stroke
newpath
43924.8 32292.5 moveto
44655.9 32292.5 lineto
44262.2 31842.5 lineto
44431 31842.5 lineto
44543.5 31786.3 lineto
44599.7 31730 lineto
44655.9 31617.6 lineto
44655.9 31336.3 lineto
44599.7 31223.9 lineto
44543.5 31167.6 lineto
44431 31111.4 lineto
44093.5 31111.4 lineto
43981 31167.6 lineto
43924.8 31223.9 lineto
stroke
newpath
45105.9 32292.5 moveto
45105.9 32067.5 lineto
stroke
newpath
45555.8 32292.5 moveto
45555.8 32067.5 lineto
stroke
newpath
47299.4 30661.4 moveto
47243.1 30717.7 lineto
47130.6 30886.4 lineto
47074.4 30998.9 lineto
47018.1 31167.6 lineto
46961.9 31448.8 lineto
46961.9 31673.8 lineto
47018.1 31955 lineto
47074.4 32123.7 lineto
47130.6 32236.2 lineto
47243.1 32405 lineto
47299.4 32461.2 lineto
stroke
newpath
48255.5 31898.8 moveto
48255.5 31111.4 lineto
stroke
newpath
47974.3 32348.7 moveto
47693.1 31505.1 lineto
48424.2 31505.1 lineto
stroke
newpath
49774.1 31111.4 moveto
49774.1 32292.5 lineto
stroke
newpath
50280.2 31111.4 moveto
50280.2 31730 lineto
50224 31842.5 lineto
50111.5 31898.8 lineto
49942.8 31898.8 lineto
49830.3 31842.5 lineto
49774.1 31786.3 lineto
stroke
newpath
51011.4 31111.4 moveto
50898.9 31167.6 lineto
50842.7 31223.9 lineto
50786.4 31336.3 lineto
50786.4 31673.8 lineto
50842.7 31786.3 lineto
50898.9 31842.5 lineto
51011.4 31898.8 lineto
51180.1 31898.8 lineto
51292.6 31842.5 lineto
51348.9 31786.3 lineto
51405.1 31673.8 lineto
51405.1 31336.3 lineto
51348.9 31223.9 lineto
51292.6 31167.6 lineto
51180.1 31111.4 lineto
51011.4 31111.4 lineto
stroke
newpath
52080 31111.4 moveto
51967.5 31167.6 lineto
51911.3 31280.1 lineto
51911.3 32292.5 lineto
stroke
newpath
52979.9 31167.6 moveto
52867.4 31111.4 lineto
52642.4 31111.4 lineto
52530 31167.6 lineto
52473.7 31280.1 lineto
52473.7 31730 lineto
52530 31842.5 lineto
52642.4 31898.8 lineto
52867.4 31898.8 lineto
52979.9 31842.5 lineto
53036.1 31730 lineto
53036.1 31617.6 lineto
52473.7 31505.1 lineto
stroke
newpath
53486.1 31167.6 moveto
53598.6 31111.4 lineto
53823.5 31111.4 lineto
53936 31167.6 lineto
53992.3 31280.1 lineto
53992.3 31336.3 lineto
53936 31448.8 lineto
53823.5 31505.1 lineto
53654.8 31505.1 lineto
53542.3 31561.3 lineto
53486.1 31673.8 lineto
53486.1 31730 lineto
53542.3 31842.5 lineto
53654.8 31898.8 lineto
53823.5 31898.8 lineto
53936 31842.5 lineto
stroke
newpath
54386 30661.4 moveto
54442.2 30717.7 lineto
54554.7 30886.4 lineto
54610.9 30998.9 lineto
54667.2 31167.6 lineto
54723.4 31448.8 lineto
54723.4 31673.8 lineto
54667.2 31955 lineto
54610.9 32123.7 lineto
54554.7 32236.2 lineto
54442.2 32405 lineto
54386 32461.2 lineto
stroke
showpage
grestore
%%EOF
