%!PS-Adobe-3.0
%%Creator: PCBNEW
%%CreationDate: Thu Sep 12 15:15:31 2019
%%Title: /home/secomp2019/Documentos/kcad/kicad/gerbers/kicad-NPTH-drl_map.ps
%%Pages: 1
%%PageOrder: Ascend
%%BoundingBox: 0 0 596 842
%%DocumentMedia: A4 595 842 0 () ()
%%Orientation: Landscape
%%EndComments
%%BeginProlog
/line { newpath moveto lineto stroke } bind def
/cir0 { newpath 0 360 arc stroke } bind def
/cir1 { newpath 0 360 arc gsave fill grestore stroke } bind def
/cir2 { newpath 0 360 arc gsave fill grestore stroke } bind def
/arc0 { newpath arc stroke } bind def
/arc1 { newpath 4 index 4 index moveto arc closepath gsave fill
    grestore stroke } bind def
/arc2 { newpath 4 index 4 index moveto arc closepath gsave fill
    grestore stroke } bind def
/poly0 { stroke } bind def
/poly1 { closepath gsave fill grestore stroke } bind def
/poly2 { closepath gsave fill grestore stroke } bind def
/rect0 { rectstroke } bind def
/rect1 { rectfill } bind def
/rect2 { rectfill } bind def
/linemode0 { 0 setlinecap 0 setlinejoin 0 setlinewidth } bind def
/linemode1 { 1 setlinecap 1 setlinejoin } bind def
/dashedline { [200] 100 setdash } bind def
/solidline { [] 0 setdash } bind def
/phantomshow { moveto
    /KicadFont findfont 0.000001 scalefont setfont
    show } bind def
/textshow { gsave
    findfont exch scalefont setfont concat 1 scale 0 0 moveto show
    } bind def
/reencodefont {
  findfont dup length dict begin
  { 1 index /FID ne
    { def }
    { pop pop } ifelse
  } forall
  /Encoding ISOLatin1Encoding def
  currentdict
  end } bind def
/KicadFont /Helvetica reencodefont definefont pop
/KicadFont-Bold /Helvetica-Bold reencodefont definefont pop
/KicadFont-Oblique /Helvetica-Oblique reencodefont definefont pop
/KicadFont-BoldOblique /Helvetica-BoldOblique reencodefont definefont pop
%%EndProlog
%%Page: 1 1
%%BeginPageSetup
gsave
0.0072 0.0072 scale
linemode1
82680 0 translate 90 rotate
150 setlinewidth
%%EndPageSetup
0 0 0 setrgbcolor
177.165 setlinewidth
newpath
28937.4 37206.7 moveto
28937.4 78545.3 lineto
stroke
0 0 0 setrgbcolor
newpath
87992.6 37206.7 moveto
28937.4 37206.7 lineto
stroke
0 0 0 setrgbcolor
newpath
87992.6 78545.3 moveto
87992.6 37206.7 lineto
stroke
0 0 0 setrgbcolor
newpath
28937.4 78545.3 moveto
87992.6 78545.3 lineto
stroke
78.7394 setlinewidth
newpath
79311.5 53151.6 moveto
80492.6 51970.5 lineto
stroke
newpath
80492.6 53151.6 moveto
79311.5 51970.5 lineto
stroke
newpath
79311.5 46065 moveto
80492.6 44883.9 lineto
stroke
newpath
80492.6 46065 moveto
79311.5 44883.9 lineto
stroke
118.11 setlinewidth
0 0 0 setrgbcolor
0 0 0 setrgbcolor
newpath
29976.5 35284.6 moveto
29976.5 36465.7 lineto
30257.7 36465.7 lineto
30426.5 36409.5 lineto
30539 36297 lineto
30595.2 36184.5 lineto
30651.4 35959.5 lineto
30651.4 35790.8 lineto
30595.2 35565.8 lineto
30539 35453.3 lineto
30426.5 35340.8 lineto
30257.7 35284.6 lineto
29976.5 35284.6 lineto
stroke
newpath
31157.6 35284.6 moveto
31157.6 36072 lineto
stroke
newpath
31157.6 35847 moveto
31213.9 35959.5 lineto
31270.1 36015.8 lineto
31382.6 36072 lineto
31495.1 36072 lineto
stroke
newpath
31888.8 35284.6 moveto
31888.8 36072 lineto
stroke
newpath
31888.8 36465.7 moveto
31832.5 36409.5 lineto
31888.8 36353.2 lineto
31945 36409.5 lineto
31888.8 36465.7 lineto
31888.8 36353.2 lineto
stroke
newpath
32619.9 35284.6 moveto
32507.5 35340.8 lineto
32451.2 35453.3 lineto
32451.2 36465.7 lineto
stroke
newpath
33238.6 35284.6 moveto
33126.1 35340.8 lineto
33069.9 35453.3 lineto
33069.9 36465.7 lineto
stroke
newpath
34588.5 35284.6 moveto
34588.5 36465.7 lineto
34982.2 35622.1 lineto
35375.9 36465.7 lineto
35375.9 35284.6 lineto
stroke
newpath
36444.5 35284.6 moveto
36444.5 35903.3 lineto
36388.2 36015.8 lineto
36275.7 36072 lineto
36050.8 36072 lineto
35938.3 36015.8 lineto
stroke
newpath
36444.5 35340.8 moveto
36332 35284.6 lineto
36050.8 35284.6 lineto
35938.3 35340.8 lineto
35882 35453.3 lineto
35882 35565.8 lineto
35938.3 35678.3 lineto
36050.8 35734.5 lineto
36332 35734.5 lineto
36444.5 35790.8 lineto
stroke
newpath
37006.9 36072 moveto
37006.9 34890.9 lineto
stroke
newpath
37006.9 36015.8 moveto
37119.4 36072 lineto
37344.4 36072 lineto
37456.8 36015.8 lineto
37513.1 35959.5 lineto
37569.3 35847 lineto
37569.3 35509.6 lineto
37513.1 35397.1 lineto
37456.8 35340.8 lineto
37344.4 35284.6 lineto
37119.4 35284.6 lineto
37006.9 35340.8 lineto
stroke
newpath
38075.5 35397.1 moveto
38131.8 35340.8 lineto
38075.5 35284.6 lineto
38019.3 35340.8 lineto
38075.5 35397.1 lineto
38075.5 35284.6 lineto
stroke
newpath
38075.5 36015.8 moveto
38131.8 35959.5 lineto
38075.5 35903.3 lineto
38019.3 35959.5 lineto
38075.5 36015.8 lineto
38075.5 35903.3 lineto
stroke
newpath
27667.8 33929.1 moveto
28848.9 32748 lineto
stroke
newpath
28848.9 33929.1 moveto
27667.8 32748 lineto
stroke
0 0 0 setrgbcolor
0 0 0 setrgbcolor
newpath
30595.2 32804.3 moveto
29920.3 32804.3 lineto
stroke
newpath
30257.7 32804.3 moveto
30257.7 33985.4 lineto
30145.3 33816.7 lineto
30032.8 33704.2 lineto
29920.3 33647.9 lineto
stroke
newpath
31101.4 32916.8 moveto
31157.6 32860.5 lineto
31101.4 32804.3 lineto
31045.1 32860.5 lineto
31101.4 32916.8 lineto
31101.4 32804.3 lineto
stroke
newpath
31888.8 33985.4 moveto
32001.3 33985.4 lineto
32113.8 33929.1 lineto
32170 33872.9 lineto
32226.2 33760.4 lineto
32282.5 33535.4 lineto
32282.5 33254.2 lineto
32226.2 33029.3 lineto
32170 32916.8 lineto
32113.8 32860.5 lineto
32001.3 32804.3 lineto
31888.8 32804.3 lineto
31776.3 32860.5 lineto
31720.1 32916.8 lineto
31663.8 33029.3 lineto
31607.6 33254.2 lineto
31607.6 33535.4 lineto
31663.8 33760.4 lineto
31720.1 33872.9 lineto
31776.3 33929.1 lineto
31888.8 33985.4 lineto
stroke
newpath
33013.6 33985.4 moveto
33126.1 33985.4 lineto
33238.6 33929.1 lineto
33294.9 33872.9 lineto
33351.1 33760.4 lineto
33407.4 33535.4 lineto
33407.4 33254.2 lineto
33351.1 33029.3 lineto
33294.9 32916.8 lineto
33238.6 32860.5 lineto
33126.1 32804.3 lineto
33013.6 32804.3 lineto
32901.2 32860.5 lineto
32844.9 32916.8 lineto
32788.7 33029.3 lineto
32732.4 33254.2 lineto
32732.4 33535.4 lineto
32788.7 33760.4 lineto
32844.9 33872.9 lineto
32901.2 33929.1 lineto
33013.6 33985.4 lineto
stroke
newpath
33913.5 32804.3 moveto
33913.5 33591.7 lineto
stroke
newpath
33913.5 33479.2 moveto
33969.8 33535.4 lineto
34082.3 33591.7 lineto
34251 33591.7 lineto
34363.5 33535.4 lineto
34419.7 33423 lineto
34419.7 32804.3 lineto
stroke
newpath
34419.7 33423 moveto
34476 33535.4 lineto
34588.5 33591.7 lineto
34757.2 33591.7 lineto
34869.7 33535.4 lineto
34925.9 33423 lineto
34925.9 32804.3 lineto
stroke
newpath
35488.3 32804.3 moveto
35488.3 33591.7 lineto
stroke
newpath
35488.3 33479.2 moveto
35544.6 33535.4 lineto
35657.1 33591.7 lineto
35825.8 33591.7 lineto
35938.3 33535.4 lineto
35994.5 33423 lineto
35994.5 32804.3 lineto
stroke
newpath
35994.5 33423 moveto
36050.8 33535.4 lineto
36163.3 33591.7 lineto
36332 33591.7 lineto
36444.5 33535.4 lineto
36500.7 33423 lineto
36500.7 32804.3 lineto
stroke
newpath
38806.7 34041.6 moveto
37794.3 32523.1 lineto
stroke
newpath
40325.2 33985.4 moveto
40437.7 33985.4 lineto
40550.2 33929.1 lineto
40606.5 33872.9 lineto
40662.7 33760.4 lineto
40718.9 33535.4 lineto
40718.9 33254.2 lineto
40662.7 33029.3 lineto
40606.5 32916.8 lineto
40550.2 32860.5 lineto
40437.7 32804.3 lineto
40325.2 32804.3 lineto
40212.7 32860.5 lineto
40156.5 32916.8 lineto
40100.3 33029.3 lineto
40044 33254.2 lineto
40044 33535.4 lineto
40100.3 33760.4 lineto
40156.5 33872.9 lineto
40212.7 33929.1 lineto
40325.2 33985.4 lineto
stroke
newpath
41225.1 32916.8 moveto
41281.4 32860.5 lineto
41225.1 32804.3 lineto
41168.9 32860.5 lineto
41225.1 32916.8 lineto
41225.1 32804.3 lineto
stroke
newpath
42012.5 33985.4 moveto
42125 33985.4 lineto
42237.5 33929.1 lineto
42293.7 33872.9 lineto
42350 33760.4 lineto
42406.2 33535.4 lineto
42406.2 33254.2 lineto
42350 33029.3 lineto
42293.7 32916.8 lineto
42237.5 32860.5 lineto
42125 32804.3 lineto
42012.5 32804.3 lineto
41900 32860.5 lineto
41843.8 32916.8 lineto
41787.6 33029.3 lineto
41731.3 33254.2 lineto
41731.3 33535.4 lineto
41787.6 33760.4 lineto
41843.8 33872.9 lineto
41900 33929.1 lineto
42012.5 33985.4 lineto
stroke
newpath
42799.9 33985.4 moveto
43531.1 33985.4 lineto
43137.4 33535.4 lineto
43306.1 33535.4 lineto
43418.6 33479.2 lineto
43474.8 33423 lineto
43531.1 33310.5 lineto
43531.1 33029.3 lineto
43474.8 32916.8 lineto
43418.6 32860.5 lineto
43306.1 32804.3 lineto
42968.7 32804.3 lineto
42856.2 32860.5 lineto
42799.9 32916.8 lineto
stroke
newpath
44093.5 32804.3 moveto
44318.5 32804.3 lineto
44431 32860.5 lineto
44487.2 32916.8 lineto
44599.7 33085.5 lineto
44655.9 33310.5 lineto
44655.9 33760.4 lineto
44599.7 33872.9 lineto
44543.5 33929.1 lineto
44431 33985.4 lineto
44206 33985.4 lineto
44093.5 33929.1 lineto
44037.3 33872.9 lineto
43981 33760.4 lineto
43981 33479.2 lineto
44037.3 33366.7 lineto
44093.5 33310.5 lineto
44206 33254.2 lineto
44431 33254.2 lineto
44543.5 33310.5 lineto
44599.7 33366.7 lineto
44655.9 33479.2 lineto
stroke
newpath
45105.9 33985.4 moveto
45105.9 33760.4 lineto
stroke
newpath
45555.8 33985.4 moveto
45555.8 33760.4 lineto
stroke
newpath
47299.4 32354.3 moveto
47243.1 32410.6 lineto
47130.6 32579.3 lineto
47074.4 32691.8 lineto
47018.1 32860.5 lineto
46961.9 33141.7 lineto
46961.9 33366.7 lineto
47018.1 33647.9 lineto
47074.4 33816.7 lineto
47130.6 33929.1 lineto
47243.1 34097.9 lineto
47299.4 34154.1 lineto
stroke
newpath
47693.1 33872.9 moveto
47749.3 33929.1 lineto
47861.8 33985.4 lineto
48143 33985.4 lineto
48255.5 33929.1 lineto
48311.7 33872.9 lineto
48368 33760.4 lineto
48368 33647.9 lineto
48311.7 33479.2 lineto
47636.8 32804.3 lineto
48368 32804.3 lineto
stroke
newpath
49774.1 32804.3 moveto
49774.1 33985.4 lineto
stroke
newpath
50280.2 32804.3 moveto
50280.2 33423 lineto
50224 33535.4 lineto
50111.5 33591.7 lineto
49942.8 33591.7 lineto
49830.3 33535.4 lineto
49774.1 33479.2 lineto
stroke
newpath
51011.4 32804.3 moveto
50898.9 32860.5 lineto
50842.7 32916.8 lineto
50786.4 33029.3 lineto
50786.4 33366.7 lineto
50842.7 33479.2 lineto
50898.9 33535.4 lineto
51011.4 33591.7 lineto
51180.1 33591.7 lineto
51292.6 33535.4 lineto
51348.9 33479.2 lineto
51405.1 33366.7 lineto
51405.1 33029.3 lineto
51348.9 32916.8 lineto
51292.6 32860.5 lineto
51180.1 32804.3 lineto
51011.4 32804.3 lineto
stroke
newpath
52080 32804.3 moveto
51967.5 32860.5 lineto
51911.3 32973 lineto
51911.3 33985.4 lineto
stroke
newpath
52979.9 32860.5 moveto
52867.4 32804.3 lineto
52642.4 32804.3 lineto
52530 32860.5 lineto
52473.7 32973 lineto
52473.7 33423 lineto
52530 33535.4 lineto
52642.4 33591.7 lineto
52867.4 33591.7 lineto
52979.9 33535.4 lineto
53036.1 33423 lineto
53036.1 33310.5 lineto
52473.7 33198 lineto
stroke
newpath
53486.1 32860.5 moveto
53598.6 32804.3 lineto
53823.5 32804.3 lineto
53936 32860.5 lineto
53992.3 32973 lineto
53992.3 33029.3 lineto
53936 33141.7 lineto
53823.5 33198 lineto
53654.8 33198 lineto
53542.3 33254.2 lineto
53486.1 33366.7 lineto
53486.1 33423 lineto
53542.3 33535.4 lineto
53654.8 33591.7 lineto
53823.5 33591.7 lineto
53936 33535.4 lineto
stroke
newpath
54386 32354.3 moveto
54442.2 32410.6 lineto
54554.7 32579.3 lineto
54610.9 32691.8 lineto
54667.2 32860.5 lineto
54723.4 33141.7 lineto
54723.4 33366.7 lineto
54667.2 33647.9 lineto
54610.9 33816.7 lineto
54554.7 33929.1 lineto
54442.2 34097.9 lineto
54386 34154.1 lineto
stroke
newpath
56523.2 32354.3 moveto
56467 32410.6 lineto
56354.5 32579.3 lineto
56298.2 32691.8 lineto
56242 32860.5 lineto
56185.8 33141.7 lineto
56185.8 33366.7 lineto
56242 33647.9 lineto
56298.2 33816.7 lineto
56354.5 33929.1 lineto
56467 34097.9 lineto
56523.2 34154.1 lineto
stroke
newpath
56973.2 33591.7 moveto
56973.2 32804.3 lineto
stroke
newpath
56973.2 33479.2 moveto
57029.4 33535.4 lineto
57141.9 33591.7 lineto
57310.6 33591.7 lineto
57423.1 33535.4 lineto
57479.3 33423 lineto
57479.3 32804.3 lineto
stroke
newpath
58210.5 32804.3 moveto
58098 32860.5 lineto
58041.8 32916.8 lineto
57985.5 33029.3 lineto
57985.5 33366.7 lineto
58041.8 33479.2 lineto
58098 33535.4 lineto
58210.5 33591.7 lineto
58379.2 33591.7 lineto
58491.7 33535.4 lineto
58548 33479.2 lineto
58604.2 33366.7 lineto
58604.2 33029.3 lineto
58548 32916.8 lineto
58491.7 32860.5 lineto
58379.2 32804.3 lineto
58210.5 32804.3 lineto
stroke
newpath
58941.7 33591.7 moveto
59391.6 33591.7 lineto
stroke
newpath
59110.4 33985.4 moveto
59110.4 32973 lineto
59166.6 32860.5 lineto
59279.1 32804.3 lineto
59391.6 32804.3 lineto
stroke
newpath
60685.2 33591.7 moveto
60685.2 32410.6 lineto
stroke
newpath
60685.2 33535.4 moveto
60797.7 33591.7 lineto
61022.6 33591.7 lineto
61135.1 33535.4 lineto
61191.4 33479.2 lineto
61247.6 33366.7 lineto
61247.6 33029.3 lineto
61191.4 32916.8 lineto
61135.1 32860.5 lineto
61022.6 32804.3 lineto
60797.7 32804.3 lineto
60685.2 32860.5 lineto
stroke
newpath
61922.5 32804.3 moveto
61810 32860.5 lineto
61753.8 32973 lineto
61753.8 33985.4 lineto
stroke
newpath
62878.7 32804.3 moveto
62878.7 33423 lineto
62822.4 33535.4 lineto
62709.9 33591.7 lineto
62485 33591.7 lineto
62372.5 33535.4 lineto
stroke
newpath
62878.7 32860.5 moveto
62766.2 32804.3 lineto
62485 32804.3 lineto
62372.5 32860.5 lineto
62316.2 32973 lineto
62316.2 33085.5 lineto
62372.5 33198 lineto
62485 33254.2 lineto
62766.2 33254.2 lineto
62878.7 33310.5 lineto
stroke
newpath
63272.4 33591.7 moveto
63722.3 33591.7 lineto
stroke
newpath
63441.1 33985.4 moveto
63441.1 32973 lineto
63497.3 32860.5 lineto
63609.8 32804.3 lineto
63722.3 32804.3 lineto
stroke
newpath
64566 32860.5 moveto
64453.5 32804.3 lineto
64228.5 32804.3 lineto
64116 32860.5 lineto
64059.8 32973 lineto
64059.8 33423 lineto
64116 33535.4 lineto
64228.5 33591.7 lineto
64453.5 33591.7 lineto
64566 33535.4 lineto
64622.2 33423 lineto
64622.2 33310.5 lineto
64059.8 33198 lineto
stroke
newpath
65634.6 32804.3 moveto
65634.6 33985.4 lineto
stroke
newpath
65634.6 32860.5 moveto
65522.1 32804.3 lineto
65297.1 32804.3 lineto
65184.6 32860.5 lineto
65128.4 32916.8 lineto
65072.1 33029.3 lineto
65072.1 33366.7 lineto
65128.4 33479.2 lineto
65184.6 33535.4 lineto
65297.1 33591.7 lineto
65522.1 33591.7 lineto
65634.6 33535.4 lineto
stroke
newpath
66084.5 32354.3 moveto
66140.8 32410.6 lineto
66253.2 32579.3 lineto
66309.5 32691.8 lineto
66365.7 32860.5 lineto
66422 33141.7 lineto
66422 33366.7 lineto
66365.7 33647.9 lineto
66309.5 33816.7 lineto
66253.2 33929.1 lineto
66140.8 34097.9 lineto
66084.5 34154.1 lineto
stroke
showpage
grestore
%%EOF
