Identifier,DepartureAirport,ArrivalAirport,AircraftModel,Price,Hours
FL123,JFK,LAX,Boeing 747-8F,350,6
FL456,LAX,ORD,Airbus A320,280,4
FL789,ORD,ATL,Gulfstream G650,200,2
FL205,JFK,BOS,Airbus A320,400,5.5