<svg width="30" height="37" viewBox="0 0 30 37" fill="none" xmlns="http://www.w3.org/2000/svg">
<path d="M27.146 15.6564C27.1975 15.7586 27.2473 15.8594 27.295 15.9597L27.3451 16.0677C28.1676 17.844 28.6297 19.8208 28.6297 21.9076C28.6297 29.5947 22.398 35.8263 14.7109 35.8263C10.203 35.8263 7.09289 33.8726 5.09615 31.9099C4.09505 30.9259 3.37613 29.941 2.90856 29.2037C2.6751 28.8356 2.50526 28.5307 2.39503 28.3206C2.33994 28.2156 2.29982 28.1344 2.27417 28.0811C2.26134 28.0544 2.25214 28.0347 2.24649 28.0224L2.24111 28.0107C0.308743 23.4909 1.44784 18.554 4.73484 14.8891L4.21544 14.4233L4.73484 14.8891C4.76811 14.852 4.80174 14.8145 4.83572 14.7767C6.1715 13.2877 8.04629 11.198 9.60194 8.76797C11.068 6.47789 12.2904 3.82608 12.4867 1.02845C15.0741 2.18289 22.5855 6.21037 27.1407 15.6457L27.1406 15.6458L27.146 15.6564ZM6.178 29.8978L6.17796 29.8979L6.18138 29.9056L6.81939 29.6232C6.18138 29.9056 6.18152 29.9059 6.18167 29.9062L6.18201 29.907L6.18286 29.9089L6.18517 29.9141L6.19235 29.9298C6.19826 29.9426 6.20645 29.9601 6.21696 29.982C6.23798 30.0257 6.26829 30.0868 6.30826 30.163C6.38814 30.3153 6.50689 30.528 6.66733 30.781C6.98759 31.286 7.47779 31.9576 8.16191 32.63C9.53559 33.9802 11.7002 35.3393 14.8096 35.3393C20.1154 35.3393 24.4166 31.0381 24.4166 25.7324C24.4166 24.4847 24.1769 23.2926 23.7433 22.1986L23.7564 22.1878L23.5302 21.7C23.5264 21.6917 23.523 21.6846 23.5203 21.6793L23.5145 21.6675L23.5139 21.6662C23.4745 21.582 23.4342 21.5004 23.3948 21.422C20.1819 14.7697 16.2631 11.7174 15.5007 11.1663C14.9687 10.7817 14.2916 11.193 14.2855 11.7812C14.2779 12.5111 14.018 13.3106 13.5594 14.1564C13.1028 14.9987 12.4711 15.8468 11.7721 16.6637C11.0744 17.4789 10.3237 18.2468 9.63633 18.933C9.48741 19.0816 9.34025 19.2276 9.19673 19.37C8.68939 19.8732 8.2274 20.3315 7.89285 20.7046C5.63975 23.2167 4.80217 26.6843 6.178 29.8978ZM13.9007 24.7177C14.4806 24.0592 15.0901 23.2602 15.4213 22.4083C16.2298 23.1844 17.4912 24.6326 18.5988 26.9269L18.5987 26.9269L18.6041 26.9377C18.6236 26.9762 18.6412 27.0121 18.6575 27.0469L18.6575 27.0469L18.6648 27.0622L18.6668 27.0662C18.9112 27.5962 19.0483 28.1861 19.0483 28.8093C19.0483 31.1116 17.1819 32.978 14.8796 32.978C13.5286 32.978 12.6046 32.3972 12.0047 31.8076C11.702 31.5101 11.4842 31.2117 11.3431 30.9892C11.2729 30.8785 11.2227 30.7881 11.1912 30.7282C11.1755 30.6983 11.1646 30.6761 11.1583 30.663L11.1532 30.6523C10.5945 29.3386 10.9148 27.887 11.9046 26.7833C12.0642 26.6053 12.2864 26.3848 12.561 26.1123C12.6222 26.0517 12.6859 25.9884 12.7521 25.9225C13.1055 25.5707 13.5107 25.1606 13.9007 24.7177ZM18.6692 27.0711C18.6701 27.0728 18.6695 27.0717 18.6688 27.0701L18.6692 27.0711Z" stroke="#F5ECEC" stroke-width="1.3954"/>
</svg>
