<svg width="18" height="18" viewBox="0 0 18 18" fill="none" xmlns="http://www.w3.org/2000/svg">
<path d="M5.40405 11.8516H15.3221C16.4467 11.8516 17.3641 10.9342 17.3641 9.8096V5.6367C17.3641 5.633 17.3641 5.6256 17.3641 5.62191C17.3641 5.61081 17.3641 5.60341 17.3641 5.59231C17.3641 5.58491 17.3641 5.57751 17.3604 5.57011C17.3604 5.56272 17.3567 5.55162 17.3567 5.54422C17.3567 5.53682 17.353 5.52942 17.353 5.52202C17.3493 5.51462 17.3493 5.50723 17.3456 5.49613C17.3419 5.48873 17.3419 5.48133 17.3382 5.47393C17.3345 5.46653 17.3345 5.45913 17.3308 5.45173C17.3271 5.44434 17.3234 5.43694 17.3197 5.42584C17.316 5.41844 17.3123 5.41104 17.3086 5.40734C17.3049 5.39994 17.3012 5.39254 17.2975 5.38515C17.2938 5.37775 17.2901 5.37405 17.2864 5.36665C17.2827 5.35925 17.2753 5.35185 17.2716 5.34445C17.2679 5.33705 17.2642 5.33335 17.2568 5.32596C17.2531 5.31856 17.2457 5.31486 17.242 5.30746C17.2383 5.30006 17.2309 5.29636 17.2272 5.28896C17.2235 5.28156 17.2162 5.27786 17.2125 5.27416C17.2051 5.26677 17.2014 5.26307 17.194 5.25567C17.1866 5.25197 17.1829 5.24457 17.1755 5.24087C17.1681 5.23717 17.1607 5.22977 17.1533 5.22607C17.1459 5.22237 17.1422 5.21867 17.1348 5.21497C17.1274 5.21127 17.12 5.20758 17.1126 5.20018C17.1052 5.19648 17.0978 5.19278 17.0904 5.18908C17.083 5.18538 17.0756 5.18168 17.0682 5.17798C17.0608 5.17428 17.0534 5.17058 17.046 5.16688C17.0386 5.16318 17.0312 5.16318 17.0238 5.15948C17.0164 5.15578 17.0053 5.15208 16.9979 5.15208C16.9905 5.15208 16.9831 5.14839 16.9794 5.14839C16.9683 5.14469 16.9609 5.14469 16.9498 5.14469C16.9461 5.14469 16.9424 5.14099 16.935 5.14099L4.36453 3.40598V1.65248C4.36453 1.63398 4.36453 1.61548 4.36083 1.60069C4.36083 1.59699 4.36083 1.59329 4.35713 1.58589C4.35713 1.57479 4.35343 1.56369 4.35343 1.5526C4.34973 1.5415 4.34973 1.5341 4.34603 1.523C4.34603 1.5156 4.34233 1.5119 4.34233 1.5045C4.33863 1.49341 4.33494 1.48231 4.33124 1.47121C4.33124 1.46751 4.32754 1.46011 4.32754 1.45641C4.32384 1.44531 4.32014 1.43791 4.31274 1.42682C4.30904 1.42312 4.30904 1.41572 4.30534 1.41202C4.30164 1.40462 4.29794 1.39722 4.29054 1.38982C4.28684 1.38242 4.28314 1.37873 4.27944 1.37133C4.27575 1.36393 4.27205 1.36023 4.26835 1.35283C4.26465 1.34543 4.25725 1.33803 4.25355 1.33063C4.24985 1.32693 4.24615 1.32323 4.24245 1.31954C4.23505 1.31214 4.22765 1.30474 4.22025 1.29734C4.21656 1.29364 4.21286 1.28994 4.20916 1.28624C4.20176 1.27884 4.19436 1.27144 4.18326 1.26404C4.17956 1.26035 4.17216 1.25665 4.16846 1.25295C4.16106 1.24555 4.15367 1.24185 4.14627 1.23445C4.13517 1.22705 4.12407 1.21965 4.11667 1.21595C4.11297 1.21225 4.10927 1.21225 4.10557 1.20855C4.09078 1.20116 4.07228 1.19376 4.05748 1.18636L1.33104 0.0395523C1.07579 -0.0677295 0.783538 0.0506504 0.676256 0.305907C0.568974 0.561164 0.687354 0.853414 0.942611 0.960696L3.362 1.98172V4.24574V4.60458V7.35691V9.81699V12.9245C3.362 13.9603 4.13887 14.8185 5.1414 14.948C4.96013 15.2514 4.85285 15.6065 4.85285 15.9838C4.85285 17.0974 5.75919 18 6.86901 18C7.97882 18 8.88516 17.0937 8.88516 15.9838C8.88516 15.6139 8.78528 15.2625 8.60771 14.9665H13.0987C12.9212 15.2662 12.8213 15.6139 12.8213 15.9838C12.8213 17.0974 13.7276 18 14.8375 18C15.9473 18 16.8536 17.0937 16.8536 15.9838C16.8536 14.874 15.9473 13.9677 14.8375 13.9677H5.40405C4.82695 13.9677 4.36083 13.4979 4.36083 12.9245V11.5705C4.66418 11.7481 5.02302 11.8516 5.40405 11.8516ZM7.89003 15.9801C7.89003 16.5425 7.43131 16.9975 6.8727 16.9975C6.3141 16.9975 5.85538 16.5388 5.85538 15.9801C5.85538 15.4215 6.3141 14.9628 6.8727 14.9628C7.43131 14.9628 7.89003 15.4178 7.89003 15.9801ZM15.8585 15.9801C15.8585 16.5425 15.3998 16.9975 14.8412 16.9975C14.2825 16.9975 13.8238 16.5388 13.8238 15.9801C13.8238 15.4215 14.2825 14.9628 14.8412 14.9628C15.3998 14.9628 15.8585 15.4178 15.8585 15.9801ZM15.3221 10.8528H5.40405C4.82695 10.8528 4.36083 10.383 4.36083 9.8096V7.34951V4.59718V4.41221L16.3653 6.06583V9.8059C16.3653 10.3867 15.8955 10.8528 15.3221 10.8528Z" fill="white"/>
</svg>
