<svg width="26" height="26" viewBox="0 0 26 26" fill="none" xmlns="http://www.w3.org/2000/svg">
<path d="M24.8659 24.3418H24.0499V8.44098C24.0499 7.56575 23.3379 6.85379 22.4627 6.85379H19.8561V1.56472C19.8561 1.32705 19.6975 1.11832 19.4681 1.05477C14.3782 -0.354684 9.88556 -0.351584 5.73521 1.06407C5.52105 1.13692 5.37691 1.33842 5.37691 1.56472L5.37678 6.85379H2.77034C1.89512 6.85379 1.18316 7.56575 1.18316 8.44098V24.3418H0.529062C0.23689 24.3418 0 24.5784 0 24.8708C0 25.1633 0.23689 25.3999 0.529062 25.3999H1.71222H10.0307H15.5118H23.5208H24.8659C25.1581 25.3999 25.395 25.1633 25.395 24.8708C25.395 24.5784 25.1581 24.3418 24.8659 24.3418ZM6.43503 1.94756C10.1726 0.75614 14.2255 0.76389 18.798 1.96978V11.7042H14.4425H10.7905H6.43477L6.43503 1.94756ZM13.9135 12.7623V13.6567H11.3196V12.7623H13.9135ZM14.9827 19.2521V23.4485V24.3418H10.5598V18.3588H14.9827V19.2521ZM22.9917 24.3418H16.0408V23.9775H17.3185C17.6107 23.9775 17.8476 23.7409 17.8476 23.4485V19.2521C17.8476 18.9597 17.6107 18.7231 17.3185 18.7231H16.0408V17.8298C16.0408 17.5373 15.8039 17.3007 15.5118 17.3007H10.0307C9.73857 17.3007 9.50168 17.5373 9.50168 17.8298V24.3418H2.24128V8.44098C2.24128 8.14906 2.47869 7.91191 2.77034 7.91191H5.37674L5.37665 12.2333C5.37665 12.3738 5.43245 12.5081 5.53165 12.6073C5.63085 12.7065 5.76544 12.7623 5.90571 12.7623H10.2614V14.1857C10.2614 14.4782 10.4983 14.7148 10.7905 14.7148H12.0873H13.1454H14.4425C14.7347 14.7148 14.9716 14.4782 14.9716 14.1857V12.7623H19.327C19.6192 12.7623 19.8561 12.5257 19.8561 12.2333V7.91191H22.4627C22.7543 7.91191 22.9917 8.14906 22.9917 8.44098V24.3418ZM16.0408 22.9194V19.7812H16.7895V22.9194H16.0408Z" fill="#F5ECEC"/>
</svg>
