<svg width="30" height="30" viewBox="0 0 30 30" fill="none" xmlns="http://www.w3.org/2000/svg">
<path d="M15.2001 0.100098C7.22417 0.100098 0.600098 6.58899 0.600098 14.7001C0.600098 22.676 7.08899 29.3001 15.2001 29.3001C23.2436 29.3001 29.8001 22.8112 29.8001 14.7001C29.8001 6.65658 23.2436 0.100098 15.2001 0.100098ZM25.001 23.5547L23.5816 22.1353C23.3112 21.8649 22.9057 21.8649 22.6353 22.1353C22.3649 22.4057 22.3649 22.8112 22.6353 23.0816L24.0547 24.501C21.689 26.5964 18.5797 27.9482 15.2001 27.9482C11.8205 27.9482 8.71121 26.664 6.34547 24.501L7.76491 23.0816C8.03528 22.8112 8.03528 22.4057 7.76491 22.1353C7.49454 21.8649 7.08899 21.8649 6.81862 22.1353L5.39917 23.5547C3.43899 21.3918 2.15473 18.4853 2.01954 15.376H4.04732C4.38528 15.376 4.72325 15.1057 4.72325 14.7001C4.72325 14.3621 4.38528 14.0242 4.04732 14.0242H2.01954C2.15473 10.9149 3.43899 8.07602 5.39917 5.84547L6.81862 7.26491C6.9538 7.4001 7.15658 7.46769 7.29176 7.46769C7.49454 7.46769 7.62973 7.4001 7.76491 7.26491C8.03528 6.99454 8.03528 6.58899 7.76491 6.31862L6.34547 4.89917C8.50843 2.93899 11.4149 1.65473 14.5242 1.51954V3.54732C14.5242 3.95288 14.8621 4.22325 15.2001 4.22325C15.6057 4.22325 15.876 3.95288 15.876 3.54732V1.45195C19.0529 1.58713 21.8918 2.87139 24.0547 4.83158L22.6353 6.31862C22.3649 6.58899 22.3649 6.99454 22.6353 7.26491C22.7705 7.4001 22.9732 7.46769 23.1084 7.46769C23.3112 7.46769 23.4464 7.4001 23.5816 7.26491L25.001 5.84547C26.9612 8.00843 28.2455 10.9149 28.3807 14.0242H26.3529C26.0149 14.0242 25.677 14.3621 25.677 14.7001C25.677 15.1057 26.0149 15.376 26.3529 15.376H28.3807C28.2455 18.4853 26.9612 21.3242 25.001 23.5547Z" fill="#F5ECEC"/>
<path d="M23.7844 14.8353C23.7844 15.1057 23.5816 15.376 23.3112 15.5112C16.214 17.4038 16.1464 17.4038 16.0788 17.4038C14.1186 18.0121 12.3612 16.4575 12.4288 14.6325C12.4288 12.7399 14.3214 11.3205 16.214 11.9964L23.3112 14.1594C23.5816 14.227 23.7844 14.4973 23.7844 14.8353Z" fill="#F5ECEC"/>
</svg>
