<svg width="28" height="28" viewBox="0 0 28 28" fill="none" xmlns="http://www.w3.org/2000/svg">
<path fill-rule="evenodd" clip-rule="evenodd" d="M18.6663 2.3335H9.33301C5.46701 2.3335 2.33301 5.4675 2.33301 9.3335V18.6668C2.33301 22.5328 5.46701 25.6668 9.33301 25.6668H18.6663C22.5323 25.6668 25.6663 22.5328 25.6663 18.6668V9.3335C25.6663 5.4675 22.5323 2.3335 18.6663 2.3335ZM4.66634 9.3335C4.66634 6.75617 6.75568 4.66683 9.33301 4.66683H18.6663C21.2437 4.66683 23.333 6.75617 23.333 9.3335V18.6668C23.333 21.2442 21.2437 23.3335 18.6663 23.3335H9.33301C6.75568 23.3335 4.66634 21.2442 4.66634 18.6668V9.3335ZM13.9997 19.8335C10.778 19.8335 8.16634 17.2218 8.16634 14.0002C8.16634 10.7785 10.778 8.16683 13.9997 8.16683C17.2213 8.16683 19.833 10.7785 19.833 14.0002C19.833 17.2218 17.2213 19.8335 13.9997 19.8335ZM13.9997 17.5002C15.9327 17.5002 17.4997 15.9332 17.4997 14.0002C17.4997 12.0672 15.9327 10.5002 13.9997 10.5002C12.0667 10.5002 10.4997 12.0672 10.4997 14.0002C10.4997 15.9332 12.0667 17.5002 13.9997 17.5002ZM20.9997 8.16683C20.9997 8.81116 20.4773 9.3335 19.833 9.3335C19.1887 9.3335 18.6663 8.81116 18.6663 8.16683C18.6663 7.5225 19.1887 7.00016 19.833 7.00016C20.4773 7.00016 20.9997 7.5225 20.9997 8.16683Z" fill="#676363"/>
</svg>
