<svg width="23" height="25" viewBox="0 0 23 25" fill="none" xmlns="http://www.w3.org/2000/svg">
<path d="M22.2031 19.2335L18.9902 12.9054C18.7363 12.4073 18.1309 12.212 17.6328 12.461C17.1348 12.715 16.9395 13.3204 17.1885 13.8185L20.377 20.1026H16.1973L16.9492 19.3507C17.3447 18.9552 17.3447 18.3204 16.9492 17.9249C16.5537 17.5294 15.9189 17.5294 15.5234 17.9249L13.1113 20.337C12.9209 20.5275 12.8135 20.7814 12.8135 21.0499C12.8135 21.3185 12.9209 21.5724 13.1113 21.7628L15.5234 24.1749C15.7188 24.3702 15.9775 24.4728 16.2363 24.4728C16.4951 24.4728 16.7539 24.3751 16.9492 24.1749C17.3447 23.7794 17.3447 23.1446 16.9492 22.7491L16.3291 22.1192H20.4307C21.1289 22.1192 21.7588 21.7628 22.125 21.172C22.4912 20.5763 22.5205 19.8536 22.2031 19.2335Z" fill="white"/>
<path d="M5.1913 15.0246L5.54775 15.9718C5.74306 16.4943 6.32412 16.758 6.84658 16.5627C7.36904 16.3673 7.63271 15.7863 7.4374 15.2638L6.24111 12.0754C6.14833 11.8263 5.95791 11.6212 5.71376 11.5089C5.46962 11.3966 5.1913 11.3869 4.94228 11.4845L1.7538 12.6808C1.49501 12.7785 1.29482 12.9738 1.1874 13.2082C1.07997 13.4425 1.06533 13.7209 1.16298 13.9796C1.35829 14.5021 1.93935 14.7658 2.46181 14.5705L3.32607 14.2433L0.796771 19.2336C0.484271 19.8537 0.513568 20.5812 0.874896 21.172C1.23622 21.7628 1.87099 22.1193 2.56435 22.1193H8.3749C8.93154 22.1193 9.38564 21.6701 9.38564 21.1086C9.38564 20.5519 8.93642 20.0978 8.3749 20.0978H2.61806L5.1913 15.0246Z" fill="white"/>
<path d="M16.3777 9.89275C16.6219 9.78044 16.8074 9.57536 16.8953 9.32146L18.0477 6.11345C18.1404 5.84978 18.1209 5.57634 18.0086 5.34196C17.8963 5.10759 17.701 4.91716 17.4373 4.82439C16.9148 4.63396 16.3338 4.90739 16.1482 5.43474L15.7576 6.52849L13.2869 1.66032C12.9451 0.991378 12.2713 0.547042 11.5193 0.542159C10.7576 0.532393 10.0691 0.952315 9.72735 1.63103L7.05645 6.88982C6.80255 7.38786 7.00274 7.99333 7.50079 8.24724C7.99884 8.50114 8.6043 8.30095 8.85821 7.8029L11.4998 2.59294L13.8094 7.14372L13.1063 6.88982C12.5936 6.70427 12.0076 6.94841 11.8074 7.45622C11.5926 7.98845 11.866 8.58903 12.4031 8.77946L15.6111 9.93181C15.8602 10.0246 16.1385 10.0099 16.3777 9.89275Z" fill="white"/>
</svg>
