<mxfile host="app.diagrams.net" modified="2024-05-04T03:47:28.472Z" agent="Mozilla/5.0 (Windows NT 10.0; Win64; x64) AppleWebKit/537.36 (KHTML, like Gecko) Chrome/122.0.0.0 YaBrowser/24.4.0.0 Safari/537.36" etag="eOHtVwBm0a29BABoFiBM" version="24.3.1" type="device">
  <diagram name="Страница — 1" id="WD0EqGmSM7q34nrM-0NG">
    <mxGraphModel dx="968" dy="679" grid="1" gridSize="10" guides="1" tooltips="1" connect="1" arrows="1" fold="1" page="1" pageScale="1" pageWidth="1169" pageHeight="1654" math="0" shadow="0">
      <root>
        <mxCell id="0" />
        <mxCell id="1" parent="0" />
        <mxCell id="T8Tm5t0BXGkMNSYD7VGg-135" value="" style="rounded=0;whiteSpace=wrap;html=1;" vertex="1" parent="1">
          <mxGeometry x="130" y="570" width="240" height="330" as="geometry" />
        </mxCell>
        <mxCell id="T8Tm5t0BXGkMNSYD7VGg-136" value="" style="endArrow=none;html=1;rounded=0;exitX=0;exitY=0.133;exitDx=0;exitDy=0;entryX=1;entryY=0.133;entryDx=0;entryDy=0;exitPerimeter=0;entryPerimeter=0;" edge="1" parent="1" source="T8Tm5t0BXGkMNSYD7VGg-135" target="T8Tm5t0BXGkMNSYD7VGg-135">
          <mxGeometry width="50" height="50" relative="1" as="geometry">
            <mxPoint x="580" y="490" as="sourcePoint" />
            <mxPoint x="630" y="440" as="targetPoint" />
          </mxGeometry>
        </mxCell>
        <mxCell id="T8Tm5t0BXGkMNSYD7VGg-137" value="User" style="text;html=1;align=left;verticalAlign=middle;whiteSpace=wrap;rounded=0;fontStyle=1" vertex="1" parent="1">
          <mxGeometry x="140" y="576" width="60" height="30" as="geometry" />
        </mxCell>
        <mxCell id="T8Tm5t0BXGkMNSYD7VGg-272" value="" style="endArrow=none;html=1;rounded=0;exitX=0;exitY=0.25;exitDx=0;exitDy=0;entryX=1;entryY=0.25;entryDx=0;entryDy=0;" edge="1" parent="1" source="T8Tm5t0BXGkMNSYD7VGg-135" target="T8Tm5t0BXGkMNSYD7VGg-135">
          <mxGeometry width="50" height="50" relative="1" as="geometry">
            <mxPoint x="140" y="633" as="sourcePoint" />
            <mxPoint x="380" y="633" as="targetPoint" />
          </mxGeometry>
        </mxCell>
        <mxCell id="T8Tm5t0BXGkMNSYD7VGg-273" value="id (PK)" style="text;html=1;align=left;verticalAlign=middle;whiteSpace=wrap;rounded=0;" vertex="1" parent="1">
          <mxGeometry x="140" y="612" width="60" height="30" as="geometry" />
        </mxCell>
        <mxCell id="T8Tm5t0BXGkMNSYD7VGg-274" value="&lt;span style=&quot;color: rgb(0, 0, 0); font-family: Helvetica; font-size: 12px; font-style: normal; font-variant-ligatures: normal; font-variant-caps: normal; font-weight: 400; letter-spacing: normal; orphans: 2; text-align: left; text-indent: 0px; text-transform: none; widows: 2; word-spacing: 0px; -webkit-text-stroke-width: 0px; white-space: normal; background-color: rgb(251, 251, 251); text-decoration-thickness: initial; text-decoration-style: initial; text-decoration-color: initial; display: inline !important; float: none;&quot;&gt;surname&lt;span&gt;&amp;nbsp;&lt;/span&gt;&lt;/span&gt;" style="text;whiteSpace=wrap;html=1;" vertex="1" parent="1">
          <mxGeometry x="140" y="655" width="80" height="30" as="geometry" />
        </mxCell>
        <mxCell id="T8Tm5t0BXGkMNSYD7VGg-275" value="&lt;span style=&quot;color: rgb(0, 0, 0); font-family: Helvetica; font-size: 12px; font-style: normal; font-variant-ligatures: normal; font-variant-caps: normal; font-weight: 400; letter-spacing: normal; orphans: 2; text-align: left; text-indent: 0px; text-transform: none; widows: 2; word-spacing: 0px; -webkit-text-stroke-width: 0px; white-space: normal; background-color: rgb(251, 251, 251); text-decoration-thickness: initial; text-decoration-style: initial; text-decoration-color: initial; display: inline !important; float: none;&quot;&gt;name&lt;span&gt;&amp;nbsp;&lt;/span&gt;&lt;/span&gt;" style="text;whiteSpace=wrap;html=1;" vertex="1" parent="1">
          <mxGeometry x="140" y="685" width="70" height="30" as="geometry" />
        </mxCell>
        <mxCell id="T8Tm5t0BXGkMNSYD7VGg-276" value="&lt;span style=&quot;color: rgb(0, 0, 0); font-family: Helvetica; font-size: 12px; font-style: normal; font-variant-ligatures: normal; font-variant-caps: normal; font-weight: 400; letter-spacing: normal; orphans: 2; text-align: left; text-indent: 0px; text-transform: none; widows: 2; word-spacing: 0px; -webkit-text-stroke-width: 0px; white-space: normal; background-color: rgb(251, 251, 251); text-decoration-thickness: initial; text-decoration-style: initial; text-decoration-color: initial; display: inline !important; float: none;&quot;&gt;patronymic&lt;span&gt;&amp;nbsp;&lt;/span&gt;&lt;/span&gt;" style="text;whiteSpace=wrap;html=1;" vertex="1" parent="1">
          <mxGeometry x="140" y="715" width="100" height="30" as="geometry" />
        </mxCell>
        <mxCell id="T8Tm5t0BXGkMNSYD7VGg-277" value="&lt;span style=&quot;color: rgb(0, 0, 0); font-family: Helvetica; font-size: 12px; font-style: normal; font-variant-ligatures: normal; font-variant-caps: normal; font-weight: 400; letter-spacing: normal; orphans: 2; text-align: left; text-indent: 0px; text-transform: none; widows: 2; word-spacing: 0px; -webkit-text-stroke-width: 0px; white-space: normal; background-color: rgb(251, 251, 251); text-decoration-thickness: initial; text-decoration-style: initial; text-decoration-color: initial; display: inline !important; float: none;&quot;&gt;email&lt;span&gt;&amp;nbsp;&lt;/span&gt;&lt;/span&gt;" style="text;whiteSpace=wrap;html=1;" vertex="1" parent="1">
          <mxGeometry x="140" y="775" width="70" height="30" as="geometry" />
        </mxCell>
        <mxCell id="T8Tm5t0BXGkMNSYD7VGg-278" value="&lt;span style=&quot;color: rgb(0, 0, 0); font-family: Helvetica; font-size: 12px; font-style: normal; font-variant-ligatures: normal; font-variant-caps: normal; font-weight: 400; letter-spacing: normal; orphans: 2; text-align: left; text-indent: 0px; text-transform: none; widows: 2; word-spacing: 0px; -webkit-text-stroke-width: 0px; white-space: normal; background-color: rgb(251, 251, 251); text-decoration-thickness: initial; text-decoration-style: initial; text-decoration-color: initial; display: inline !important; float: none;&quot;&gt;phone&lt;span&gt;&amp;nbsp;&lt;/span&gt;&lt;/span&gt;" style="text;whiteSpace=wrap;html=1;" vertex="1" parent="1">
          <mxGeometry x="140" y="745" width="70" height="30" as="geometry" />
        </mxCell>
        <mxCell id="T8Tm5t0BXGkMNSYD7VGg-279" value="&lt;span style=&quot;color: rgb(0, 0, 0); font-family: Helvetica; font-size: 12px; font-style: normal; font-variant-ligatures: normal; font-variant-caps: normal; font-weight: 400; letter-spacing: normal; orphans: 2; text-align: left; text-indent: 0px; text-transform: none; widows: 2; word-spacing: 0px; -webkit-text-stroke-width: 0px; white-space: normal; background-color: rgb(251, 251, 251); text-decoration-thickness: initial; text-decoration-style: initial; text-decoration-color: initial; display: inline !important; float: none;&quot;&gt;avatar&lt;span&gt;&amp;nbsp;&lt;/span&gt;&lt;/span&gt;" style="text;whiteSpace=wrap;html=1;" vertex="1" parent="1">
          <mxGeometry x="140" y="802" width="70" height="30" as="geometry" />
        </mxCell>
        <mxCell id="T8Tm5t0BXGkMNSYD7VGg-280" value="&lt;span style=&quot;color: rgb(0, 0, 0); font-family: Helvetica; font-size: 12px; font-style: normal; font-variant-ligatures: normal; font-variant-caps: normal; font-weight: 400; letter-spacing: normal; orphans: 2; text-align: left; text-indent: 0px; text-transform: none; widows: 2; word-spacing: 0px; -webkit-text-stroke-width: 0px; white-space: normal; background-color: rgb(251, 251, 251); text-decoration-thickness: initial; text-decoration-style: initial; text-decoration-color: initial; display: inline !important; float: none;&quot;&gt;role&lt;span&gt;&amp;nbsp;&lt;/span&gt;&lt;/span&gt;" style="text;whiteSpace=wrap;html=1;" vertex="1" parent="1">
          <mxGeometry x="140" y="862" width="60" height="30" as="geometry" />
        </mxCell>
        <mxCell id="T8Tm5t0BXGkMNSYD7VGg-281" value="&lt;span style=&quot;color: rgb(0, 0, 0); font-family: Helvetica; font-size: 12px; font-style: normal; font-variant-ligatures: normal; font-variant-caps: normal; font-weight: 400; letter-spacing: normal; orphans: 2; text-align: left; text-indent: 0px; text-transform: none; widows: 2; word-spacing: 0px; -webkit-text-stroke-width: 0px; white-space: normal; background-color: rgb(251, 251, 251); text-decoration-thickness: initial; text-decoration-style: initial; text-decoration-color: initial; display: inline !important; float: none;&quot;&gt;password&lt;span&gt;&amp;nbsp;&lt;/span&gt;&lt;/span&gt;" style="text;whiteSpace=wrap;html=1;" vertex="1" parent="1">
          <mxGeometry x="140" y="832" width="90" height="30" as="geometry" />
        </mxCell>
        <mxCell id="T8Tm5t0BXGkMNSYD7VGg-282" value="" style="rounded=0;whiteSpace=wrap;html=1;" vertex="1" parent="1">
          <mxGeometry x="490" y="576" width="240" height="354" as="geometry" />
        </mxCell>
        <mxCell id="T8Tm5t0BXGkMNSYD7VGg-283" value="" style="endArrow=none;html=1;rounded=0;exitX=0;exitY=0.133;exitDx=0;exitDy=0;entryX=1;entryY=0.133;entryDx=0;entryDy=0;exitPerimeter=0;entryPerimeter=0;" edge="1" parent="1" source="T8Tm5t0BXGkMNSYD7VGg-282" target="T8Tm5t0BXGkMNSYD7VGg-282">
          <mxGeometry width="50" height="50" relative="1" as="geometry">
            <mxPoint x="940" y="496" as="sourcePoint" />
            <mxPoint x="990" y="446" as="targetPoint" />
          </mxGeometry>
        </mxCell>
        <mxCell id="T8Tm5t0BXGkMNSYD7VGg-284" value="Room" style="text;html=1;align=left;verticalAlign=middle;whiteSpace=wrap;rounded=0;fontStyle=1" vertex="1" parent="1">
          <mxGeometry x="500" y="582" width="60" height="30" as="geometry" />
        </mxCell>
        <mxCell id="T8Tm5t0BXGkMNSYD7VGg-285" value="" style="endArrow=none;html=1;rounded=0;exitX=-0.001;exitY=0.407;exitDx=0;exitDy=0;entryX=0.999;entryY=0.406;entryDx=0;entryDy=0;exitPerimeter=0;entryPerimeter=0;" edge="1" parent="1" source="T8Tm5t0BXGkMNSYD7VGg-282" target="T8Tm5t0BXGkMNSYD7VGg-282">
          <mxGeometry width="50" height="50" relative="1" as="geometry">
            <mxPoint x="500" y="639" as="sourcePoint" />
            <mxPoint x="740" y="639" as="targetPoint" />
          </mxGeometry>
        </mxCell>
        <mxCell id="T8Tm5t0BXGkMNSYD7VGg-286" value="id (PK)" style="text;html=1;align=left;verticalAlign=middle;whiteSpace=wrap;rounded=0;" vertex="1" parent="1">
          <mxGeometry x="500" y="618" width="60" height="30" as="geometry" />
        </mxCell>
        <mxCell id="T8Tm5t0BXGkMNSYD7VGg-289" value="number" style="text;whiteSpace=wrap;html=1;" vertex="1" parent="1">
          <mxGeometry x="500" y="721" width="100" height="30" as="geometry" />
        </mxCell>
        <mxCell id="T8Tm5t0BXGkMNSYD7VGg-290" value="title" style="text;whiteSpace=wrap;html=1;" vertex="1" parent="1">
          <mxGeometry x="500" y="781" width="70" height="30" as="geometry" />
        </mxCell>
        <mxCell id="T8Tm5t0BXGkMNSYD7VGg-291" value="count_guest" style="text;whiteSpace=wrap;html=1;" vertex="1" parent="1">
          <mxGeometry x="500" y="751" width="70" height="30" as="geometry" />
        </mxCell>
        <mxCell id="T8Tm5t0BXGkMNSYD7VGg-292" value="description" style="text;whiteSpace=wrap;html=1;" vertex="1" parent="1">
          <mxGeometry x="500" y="808" width="70" height="30" as="geometry" />
        </mxCell>
        <mxCell id="T8Tm5t0BXGkMNSYD7VGg-293" value="gallery" style="text;whiteSpace=wrap;html=1;" vertex="1" parent="1">
          <mxGeometry x="500" y="868" width="60" height="30" as="geometry" />
        </mxCell>
        <mxCell id="T8Tm5t0BXGkMNSYD7VGg-294" value="status" style="text;whiteSpace=wrap;html=1;" vertex="1" parent="1">
          <mxGeometry x="500" y="838" width="90" height="30" as="geometry" />
        </mxCell>
        <mxCell id="T8Tm5t0BXGkMNSYD7VGg-296" value="hotel_id&amp;nbsp;&lt;span style=&quot;background-color: initial;&quot;&gt;(FK)&lt;/span&gt;" style="text;html=1;align=left;verticalAlign=middle;whiteSpace=wrap;rounded=0;" vertex="1" parent="1">
          <mxGeometry x="500" y="637" width="60" height="30" as="geometry" />
        </mxCell>
        <mxCell id="T8Tm5t0BXGkMNSYD7VGg-297" value="room_type_id&amp;nbsp;&lt;span style=&quot;background-color: initial;&quot;&gt;(FK)&lt;/span&gt;" style="text;html=1;align=left;verticalAlign=middle;whiteSpace=wrap;rounded=0;" vertex="1" parent="1">
          <mxGeometry x="500" y="659" width="60" height="30" as="geometry" />
        </mxCell>
        <mxCell id="T8Tm5t0BXGkMNSYD7VGg-298" value="options&amp;nbsp;&lt;span style=&quot;background-color: initial;&quot;&gt;(FK)&lt;/span&gt;" style="text;html=1;align=left;verticalAlign=middle;whiteSpace=wrap;rounded=0;" vertex="1" parent="1">
          <mxGeometry x="500" y="681" width="60" height="30" as="geometry" />
        </mxCell>
        <mxCell id="T8Tm5t0BXGkMNSYD7VGg-299" value="booked_dates" style="text;whiteSpace=wrap;html=1;" vertex="1" parent="1">
          <mxGeometry x="500" y="892" width="60" height="30" as="geometry" />
        </mxCell>
        <mxCell id="T8Tm5t0BXGkMNSYD7VGg-300" value="booking" style="html=1;verticalAlign=bottom;startArrow=oval;startFill=1;endArrow=none;startSize=8;curved=0;rounded=0;endFill=0;entryX=1;entryY=0.75;entryDx=0;entryDy=0;exitX=0.004;exitY=0.684;exitDx=0;exitDy=0;exitPerimeter=0;" edge="1" parent="1" source="T8Tm5t0BXGkMNSYD7VGg-282" target="T8Tm5t0BXGkMNSYD7VGg-135">
          <mxGeometry width="60" relative="1" as="geometry">
            <mxPoint x="400" y="667" as="sourcePoint" />
            <mxPoint x="460" y="667" as="targetPoint" />
          </mxGeometry>
        </mxCell>
        <mxCell id="T8Tm5t0BXGkMNSYD7VGg-301" value="" style="rounded=0;whiteSpace=wrap;html=1;" vertex="1" parent="1">
          <mxGeometry x="785" y="570" width="240" height="130" as="geometry" />
        </mxCell>
        <mxCell id="T8Tm5t0BXGkMNSYD7VGg-302" value="" style="endArrow=none;html=1;rounded=0;exitX=0;exitY=0.25;exitDx=0;exitDy=0;entryX=1;entryY=0.25;entryDx=0;entryDy=0;" edge="1" parent="1" source="T8Tm5t0BXGkMNSYD7VGg-301" target="T8Tm5t0BXGkMNSYD7VGg-301">
          <mxGeometry width="50" height="50" relative="1" as="geometry">
            <mxPoint x="1235" y="490" as="sourcePoint" />
            <mxPoint x="1285" y="440" as="targetPoint" />
          </mxGeometry>
        </mxCell>
        <mxCell id="T8Tm5t0BXGkMNSYD7VGg-303" value="options" style="text;html=1;align=left;verticalAlign=middle;whiteSpace=wrap;rounded=0;fontStyle=1" vertex="1" parent="1">
          <mxGeometry x="795" y="576" width="60" height="30" as="geometry" />
        </mxCell>
        <mxCell id="T8Tm5t0BXGkMNSYD7VGg-304" value="" style="endArrow=none;html=1;rounded=0;entryX=1.002;entryY=0.61;entryDx=0;entryDy=0;entryPerimeter=0;exitX=-0.001;exitY=0.613;exitDx=0;exitDy=0;exitPerimeter=0;" edge="1" parent="1" source="T8Tm5t0BXGkMNSYD7VGg-301" target="T8Tm5t0BXGkMNSYD7VGg-301">
          <mxGeometry width="50" height="50" relative="1" as="geometry">
            <mxPoint x="790" y="650" as="sourcePoint" />
            <mxPoint x="1035" y="633" as="targetPoint" />
          </mxGeometry>
        </mxCell>
        <mxCell id="T8Tm5t0BXGkMNSYD7VGg-305" value="id (PK)" style="text;html=1;align=left;verticalAlign=middle;whiteSpace=wrap;rounded=0;" vertex="1" parent="1">
          <mxGeometry x="795" y="612" width="60" height="30" as="geometry" />
        </mxCell>
        <mxCell id="T8Tm5t0BXGkMNSYD7VGg-306" value="name" style="text;whiteSpace=wrap;html=1;" vertex="1" parent="1">
          <mxGeometry x="795" y="659" width="100" height="30" as="geometry" />
        </mxCell>
        <mxCell id="T8Tm5t0BXGkMNSYD7VGg-316" value="has" style="html=1;verticalAlign=bottom;startArrow=oval;startFill=1;endArrow=none;startSize=8;curved=0;rounded=0;endFill=0;exitX=1;exitY=0.238;exitDx=0;exitDy=0;entryX=-0.003;entryY=0.614;entryDx=0;entryDy=0;entryPerimeter=0;exitPerimeter=0;" edge="1" parent="1" source="T8Tm5t0BXGkMNSYD7VGg-282" target="T8Tm5t0BXGkMNSYD7VGg-301">
          <mxGeometry width="60" relative="1" as="geometry">
            <mxPoint x="906" y="822.44" as="sourcePoint" />
            <mxPoint x="780" y="650" as="targetPoint" />
            <Array as="points">
              <mxPoint x="750" y="660" />
              <mxPoint x="750" y="650" />
            </Array>
          </mxGeometry>
        </mxCell>
        <mxCell id="T8Tm5t0BXGkMNSYD7VGg-317" value="" style="rounded=0;whiteSpace=wrap;html=1;" vertex="1" parent="1">
          <mxGeometry x="784.52" y="721" width="240" height="199" as="geometry" />
        </mxCell>
        <mxCell id="T8Tm5t0BXGkMNSYD7VGg-318" value="" style="endArrow=none;html=1;rounded=0;exitX=-0.001;exitY=0.196;exitDx=0;exitDy=0;entryX=1;entryY=0.196;entryDx=0;entryDy=0;exitPerimeter=0;entryPerimeter=0;" edge="1" parent="1" source="T8Tm5t0BXGkMNSYD7VGg-317" target="T8Tm5t0BXGkMNSYD7VGg-317">
          <mxGeometry width="50" height="50" relative="1" as="geometry">
            <mxPoint x="1234.52" y="641" as="sourcePoint" />
            <mxPoint x="1284.52" y="591" as="targetPoint" />
          </mxGeometry>
        </mxCell>
        <mxCell id="T8Tm5t0BXGkMNSYD7VGg-319" value="hotels" style="text;html=1;align=left;verticalAlign=middle;whiteSpace=wrap;rounded=0;fontStyle=1" vertex="1" parent="1">
          <mxGeometry x="794.52" y="727" width="60" height="30" as="geometry" />
        </mxCell>
        <mxCell id="T8Tm5t0BXGkMNSYD7VGg-320" value="" style="endArrow=none;html=1;rounded=0;entryX=1.001;entryY=0.397;entryDx=0;entryDy=0;entryPerimeter=0;exitX=-0.003;exitY=0.4;exitDx=0;exitDy=0;exitPerimeter=0;" edge="1" parent="1" source="T8Tm5t0BXGkMNSYD7VGg-317" target="T8Tm5t0BXGkMNSYD7VGg-317">
          <mxGeometry width="50" height="50" relative="1" as="geometry">
            <mxPoint x="789.52" y="801" as="sourcePoint" />
            <mxPoint x="1034.52" y="784" as="targetPoint" />
          </mxGeometry>
        </mxCell>
        <mxCell id="T8Tm5t0BXGkMNSYD7VGg-321" value="id (PK)" style="text;html=1;align=left;verticalAlign=middle;whiteSpace=wrap;rounded=0;" vertex="1" parent="1">
          <mxGeometry x="794.52" y="763" width="60" height="30" as="geometry" />
        </mxCell>
        <mxCell id="T8Tm5t0BXGkMNSYD7VGg-322" value="name" style="text;whiteSpace=wrap;html=1;" vertex="1" parent="1">
          <mxGeometry x="794.52" y="810" width="100" height="30" as="geometry" />
        </mxCell>
        <mxCell id="T8Tm5t0BXGkMNSYD7VGg-323" value="description" style="text;whiteSpace=wrap;html=1;" vertex="1" parent="1">
          <mxGeometry x="794.52" y="870" width="100" height="30" as="geometry" />
        </mxCell>
        <mxCell id="T8Tm5t0BXGkMNSYD7VGg-325" value="address" style="text;whiteSpace=wrap;html=1;" vertex="1" parent="1">
          <mxGeometry x="794.52" y="840" width="100" height="30" as="geometry" />
        </mxCell>
        <mxCell id="T8Tm5t0BXGkMNSYD7VGg-326" value="has" style="html=1;verticalAlign=bottom;startArrow=oval;startFill=1;endArrow=none;startSize=8;curved=0;rounded=0;endFill=0;exitX=1.003;exitY=0.635;exitDx=0;exitDy=0;exitPerimeter=0;entryX=0;entryY=0.401;entryDx=0;entryDy=0;entryPerimeter=0;" edge="1" parent="1" source="T8Tm5t0BXGkMNSYD7VGg-282" target="T8Tm5t0BXGkMNSYD7VGg-317">
          <mxGeometry width="60" relative="1" as="geometry">
            <mxPoint x="740" y="670" as="sourcePoint" />
            <mxPoint x="790" y="800" as="targetPoint" />
            <Array as="points" />
          </mxGeometry>
        </mxCell>
        <mxCell id="T8Tm5t0BXGkMNSYD7VGg-328" value="" style="rounded=0;whiteSpace=wrap;html=1;" vertex="1" parent="1">
          <mxGeometry x="784.28" y="940" width="240" height="199" as="geometry" />
        </mxCell>
        <mxCell id="T8Tm5t0BXGkMNSYD7VGg-329" value="" style="endArrow=none;html=1;rounded=0;exitX=-0.001;exitY=0.196;exitDx=0;exitDy=0;entryX=1;entryY=0.196;entryDx=0;entryDy=0;exitPerimeter=0;entryPerimeter=0;" edge="1" parent="1" source="T8Tm5t0BXGkMNSYD7VGg-328" target="T8Tm5t0BXGkMNSYD7VGg-328">
          <mxGeometry width="50" height="50" relative="1" as="geometry">
            <mxPoint x="1234.28" y="860" as="sourcePoint" />
            <mxPoint x="1284.28" y="810" as="targetPoint" />
          </mxGeometry>
        </mxCell>
        <mxCell id="T8Tm5t0BXGkMNSYD7VGg-330" value="room_type" style="text;html=1;align=left;verticalAlign=middle;whiteSpace=wrap;rounded=0;fontStyle=1" vertex="1" parent="1">
          <mxGeometry x="794.28" y="946" width="60" height="30" as="geometry" />
        </mxCell>
        <mxCell id="T8Tm5t0BXGkMNSYD7VGg-331" value="" style="endArrow=none;html=1;rounded=0;entryX=1.001;entryY=0.397;entryDx=0;entryDy=0;entryPerimeter=0;exitX=-0.003;exitY=0.4;exitDx=0;exitDy=0;exitPerimeter=0;" edge="1" parent="1" source="T8Tm5t0BXGkMNSYD7VGg-328" target="T8Tm5t0BXGkMNSYD7VGg-328">
          <mxGeometry width="50" height="50" relative="1" as="geometry">
            <mxPoint x="789.28" y="1020" as="sourcePoint" />
            <mxPoint x="1034.28" y="1003" as="targetPoint" />
          </mxGeometry>
        </mxCell>
        <mxCell id="T8Tm5t0BXGkMNSYD7VGg-332" value="id (PK)" style="text;html=1;align=left;verticalAlign=middle;whiteSpace=wrap;rounded=0;" vertex="1" parent="1">
          <mxGeometry x="794.28" y="982" width="60" height="30" as="geometry" />
        </mxCell>
        <mxCell id="T8Tm5t0BXGkMNSYD7VGg-333" value="name" style="text;whiteSpace=wrap;html=1;" vertex="1" parent="1">
          <mxGeometry x="794.28" y="1029" width="100" height="30" as="geometry" />
        </mxCell>
        <mxCell id="T8Tm5t0BXGkMNSYD7VGg-334" value="description" style="text;whiteSpace=wrap;html=1;" vertex="1" parent="1">
          <mxGeometry x="794.28" y="1089" width="100" height="30" as="geometry" />
        </mxCell>
        <mxCell id="T8Tm5t0BXGkMNSYD7VGg-335" value="price" style="text;whiteSpace=wrap;html=1;" vertex="1" parent="1">
          <mxGeometry x="794.28" y="1059" width="100" height="30" as="geometry" />
        </mxCell>
        <mxCell id="T8Tm5t0BXGkMNSYD7VGg-336" value="has" style="html=1;verticalAlign=bottom;startArrow=oval;startFill=1;endArrow=none;startSize=8;curved=0;rounded=0;endFill=0;exitX=1.006;exitY=0.86;exitDx=0;exitDy=0;exitPerimeter=0;entryX=0;entryY=0.5;entryDx=0;entryDy=0;" edge="1" parent="1" source="T8Tm5t0BXGkMNSYD7VGg-282" target="T8Tm5t0BXGkMNSYD7VGg-328">
          <mxGeometry width="60" relative="1" as="geometry">
            <mxPoint x="741" y="811" as="sourcePoint" />
            <mxPoint x="795" y="811" as="targetPoint" />
            <Array as="points">
              <mxPoint x="760" y="880" />
              <mxPoint x="760" y="1040" />
            </Array>
          </mxGeometry>
        </mxCell>
      </root>
    </mxGraphModel>
  </diagram>
</mxfile>
