micropython: f7225d1c9

141 jobs for master in 9 minutes and 43 seconds (queued for 4 seconds)
latest
Status Job ID Name Coverage
  Prep
passed #879581425
prep

00:03:04

 
  Unix
failed #879581428
arm

00:02:41

failed #879581430
arm64

00:02:42

failed #879581429
armhf

00:02:54

passed #879581426
linux_x86_64

00:01:34

failed #879581427
osx

00:02:46

passed #879581431
win_i386

00:02:19

passed #879581432
win_x86_64

00:02:18

 
  Stm32
passed #879581433
ADAFRUIT_F405_EXPRESS

00:03:07

failed #879581434
allowed to fail
ADAFRUIT_F405_EXPRESS_mboot

00:02:02

passed #879581435
B_L072Z_LRWAN1

00:02:42

failed #879581436
allowed to fail
B_L072Z_LRWAN1_mboot

00:01:47

passed #879581437
B_L475E_IOT01A

00:03:04

failed #879581439
allowed to fail
B_L475E_IOT01A_mboot

00:01:50

passed #879581440
CERB40

00:03:03

failed #879581441
allowed to fail
CERB40_mboot

00:01:49

passed #879581443
ESPRUINO_PICO

00:02:56

passed #879581445
ESPRUINO_PICO_mboot

00:02:55

passed #879581447
HYDRABUS

00:02:53

passed #879581449
HYDRABUS_mboot

00:02:54

passed #879581450
LIMIFROG

00:03:02

failed #879581452
allowed to fail
LIMIFROG_mboot

00:01:53

passed #879581454
MIKROE_CLICKER2_STM32

00:02:59

passed #879581456
MIKROE_CLICKER2_STM32_mboot

00:03:17

passed #879581457
NADHAT_PYBF405

00:02:53

passed #879581458
NADHAT_PYBF405_mboot

00:03:11

passed #879581459
NETDUINO_PLUS_2

00:02:57

passed #879581460
NETDUINO_PLUS_2_mboot

00:02:54

passed #879581461
NUCLEO_F091RC

00:03:00

failed #879581462
allowed to fail
NUCLEO_F091RC_mboot

00:01:51

passed #879581463
NUCLEO_F401RE

00:03:00

failed #879581464
allowed to fail
NUCLEO_F401RE_mboot

00:01:55

passed #879581466
NUCLEO_F411RE

00:02:53

failed #879581468
allowed to fail
NUCLEO_F411RE_mboot

00:01:57

passed #879581469
NUCLEO_F412ZG

00:03:08

passed #879581470
NUCLEO_F412ZG_mboot

00:03:00

passed #879581471
NUCLEO_F413ZH

00:02:55

passed #879581472
NUCLEO_F413ZH_mboot

00:03:05

passed #879581473
NUCLEO_F429ZI

00:03:20

passed #879581474
NUCLEO_F429ZI_mboot

00:03:20

passed #879581475
NUCLEO_F446RE

00:03:08

failed #879581476
allowed to fail
NUCLEO_F446RE_mboot

00:01:55

passed #879581477
NUCLEO_F722ZE

00:03:02

passed #879581478
NUCLEO_F722ZE_mboot

00:03:02

passed #879581479
NUCLEO_F746ZG

00:03:19

failed #879581480
allowed to fail
NUCLEO_F746ZG_mboot

00:01:50

passed #879581481
NUCLEO_F767ZI

00:03:18

passed #879581482
NUCLEO_F767ZI_mboot

00:03:27

passed #879581484
NUCLEO_H743ZI

00:03:42

passed #879581485
NUCLEO_H743ZI_mboot

00:03:38

passed #879581486
NUCLEO_L073RZ

00:02:44

failed #879581488
allowed to fail
NUCLEO_L073RZ_mboot

00:01:53

passed #879581489
NUCLEO_L432KC

00:03:06

failed #879581490
allowed to fail
NUCLEO_L432KC_mboot

00:01:51

passed #879581491
NUCLEO_L452RE

00:03:00

failed #879581492
allowed to fail
NUCLEO_L452RE_mboot

00:01:52

passed #879581493
NUCLEO_L476RG

00:03:10

failed #879581494
allowed to fail
NUCLEO_L476RG_mboot

00:01:49

passed #879581495
NUCLEO_WB55

00:03:30

passed #879581496
NUCLEO_WB55_mboot

00:03:53

passed #879581497
OLIMEX_E407

00:02:50

failed #879581498
allowed to fail
OLIMEX_E407_mboot

00:01:53

passed #879581499
PYBD_SF2

00:03:53

passed #879581500
PYBD_SF2_mboot

00:04:05

passed #879581501
PYBD_SF3

00:04:05

passed #879581502
PYBD_SF3_mboot

00:03:49

passed #879581503
PYBD_SF6

00:03:47

passed #879581504
PYBD_SF6_mboot

00:03:47

passed #879581505
PYBLITEV10

00:02:52

passed #879581506
PYBLITEV10_mboot

00:03:01

passed #879581507
PYBV10

00:03:00

passed #879581508
PYBV10_mboot

00:03:03

passed #879581509
PYBV11

00:02:56

passed #879581510
PYBV11_mboot

00:03:04

passed #879581511
PYBV3

00:02:51

passed #879581512
PYBV3_mboot

00:03:01

passed #879581513
PYBV4

00:02:57

passed #879581514
PYBV4_mboot

00:03:05

passed #879581515
STM32F411DISC

00:02:51

passed #879581516
STM32F411DISC_mboot

00:02:59

passed #879581517
STM32F429DISC

00:02:57

passed #879581518
STM32F429DISC_mboot

00:03:03

passed #879581519
STM32F439

00:03:07

failed #879581520
allowed to fail
STM32F439_mboot

00:01:47

passed #879581521
STM32F4DISC

00:03:00

passed #879581522
STM32F4DISC_mboot

00:03:00

passed #879581523
STM32F769DISC

00:03:21

passed #879581524
STM32F769DISC_mboot

00:03:30

passed #879581525
STM32F7DISC

00:03:14

failed #879581526
allowed to fail
STM32F7DISC_mboot

00:01:54

passed #879581527
STM32L476DISC

00:03:12

failed #879581528
allowed to fail
STM32L476DISC_mboot

00:01:51

passed #879581529
STM32L496GDISC

00:03:08

failed #879581530
allowed to fail
STM32L496GDISC_mboot

00:01:56

passed #879581531
USBDONGLE_WB55

00:03:29

passed #879581532
USBDONGLE_WB55_mboot

00:03:45

 
  Nrf
failed #879581533
allowed to fail
actinius_icarus

00:02:13

passed #879581534
arduino_primo

00:02:25

passed #879581537
blueio_tag_evim

00:02:24

passed #879581538
dvk_bl652

00:02:23

passed #879581539
evk_nina_b1

00:02:20

passed #879581540
feather52

00:02:25

passed #879581541
ibk_blyst_nano

00:02:27

passed #879581542
idk_blyst_nano

00:02:22

passed #879581543
microbit

00:02:18

passed #879581544
nrf52840-mdk-usb-dongle

00:02:26

passed #879581545
particle_xenon

00:02:20

passed #879581546
pca10000

00:02:09

passed #879581547
pca10001

00:02:14

passed #879581548
pca10028

00:02:15

passed #879581549
pca10031

00:02:15

passed #879581550
pca10040

00:02:19

passed #879581552
pca10056

00:02:23

passed #879581554
pca10059

00:02:23

passed #879581556
pca10090

00:02:19

passed #879581558
wt51822_s4at

00:02:17

 
  Esp
passed #879581559
ESP32_GENERIC_IDF3

00:04:04

passed #879581562
ESP32_GENERIC_IDF4

00:04:24

passed #879581561
ESP32_GENERIC_SPIRAM_IDF3

00:04:14

passed #879581564
ESP32_GENERIC_SPIRAM_IDF4

00:04:39

passed #879581560
ESP32_TINYPICO_IDF3

00:04:13

passed #879581563
ESP32_TINYPICO_IDF4

00:04:37

passed #879581565
ESP8266

00:01:21

passed #879581567
ESP8266_512K

00:01:12

passed #879581568
ESP8266_512K_LFS

00:01:12

passed #879581566
ESP8266_LFS

00:01:17

 
  Teensy
passed #879581569
teensy

00:02:16

 
  Samd
passed #879581570
ADAFRUIT_FEATHER_M0_EXPRESS

00:02:05

passed #879581571
ADAFRUIT_ITSYBITSY_M4_EXPRESS

00:02:10

passed #879581572
ADAFRUIT_TRINKET_M0

00:02:06

passed #879581573
MINISAM_M4

00:02:12

passed #879581574
SAMD21_XPLAINED_PRO

00:02:12

 
  Javascript
passed #879581575
javascript

00:01:46

 
  Test
passed #879581581
qemu

00:02:17

passed #879581582
qemu:test

00:02:51

passed #879581579
unix:coverage

00:03:41

failed #879581577
allowed to fail
unix:nanbox

00:01:12

passed #879581578
unix:stackless

00:01:52

passed #879581576
unix:test

00:01:49

 
  Release
passed #879581583
pages

00:01:46

 
  Deploy
passed pages:deploy

00:00:00

 
Name Stage Failure
failed
armhf Unix
../../py/vmentrytable.h:120:5: error: initialized field overwritten [-Werror=override-init]
../../py/vmentrytable.h:120:5: error: (near initialization for 'entry_table[248]') [-Werror=override-init]
../../py/vmentrytable.h:120:5: error: initialized field overwritten [-Werror=override-init]
../../py/vmentrytable.h:120:5: error: (near initialization for 'entry_table[249]') [-Werror=override-init]
cc1: all warnings being treated as errors
../../py/mkrules.mk:77: recipe for target 'build-standard/py/vm.o' failed
make: *** [build-standard/py/vm.o] Error 1
Cleaning up file based variables
ERROR: Job failed: exit code 1
failed
osx Unix
CC ../../py/compile.c
../../py/compile.c:3492:31: error: missing field 'is_repl' initializer [-Werror,-Wmissing-field-initializers]
compiler_t comp_state = {0};
^
1 error generated.
../../py/mkrules.mk:77: recipe for target 'build-standard/py/compile.o' failed
make: *** [build-standard/py/compile.o] Error 1
Cleaning up file based variables
ERROR: Job failed: exit code 1
failed
arm64 Unix
../../py/vmentrytable.h:120:5: error: initialized field overwritten [-Werror=override-init]
../../py/vmentrytable.h:120:5: error: (near initialization for 'entry_table[248]') [-Werror=override-init]
../../py/vmentrytable.h:120:5: error: initialized field overwritten [-Werror=override-init]
../../py/vmentrytable.h:120:5: error: (near initialization for 'entry_table[249]') [-Werror=override-init]
cc1: all warnings being treated as errors
../../py/mkrules.mk:77: recipe for target 'build-standard/py/vm.o' failed
make: *** [build-standard/py/vm.o] Error 1
Cleaning up file based variables
ERROR: Job failed: exit code 1
failed
arm Unix
../../py/vmentrytable.h:120:5: error: initialized field overwritten [-Werror=override-init]
../../py/vmentrytable.h:120:5: error: (near initialization for 'entry_table[248]') [-Werror=override-init]
../../py/vmentrytable.h:120:5: error: initialized field overwritten [-Werror=override-init]
../../py/vmentrytable.h:120:5: error: (near initialization for 'entry_table[249]') [-Werror=override-init]
cc1: all warnings being treated as errors
../../py/mkrules.mk:77: recipe for target 'build-standard/py/vm.o' failed
make: *** [build-standard/py/vm.o] Error 1
Cleaning up file based variables
ERROR: Job failed: exit code 1
failed
actinius_icarus Nrf
CC /builds/alelec/micropython_ci/micropython_nrf_actinius_icarus_f7225d1c/pins_gen.c
LINK /builds/alelec/micropython_ci/micropython_nrf_actinius_icarus_f7225d1c/firmware.elf
/gcc-arm-none-eabi-9-2019-q4-major/bin/../lib/gcc/arm-none-eabi/9.2.1/../../../../arm-none-eabi/bin/ld: /tmp/firmware.elf.zgYgfW.ltrans0.ltrans.o: in function `os_sync.lto_priv.0':
/builds/alelec/micropython_ci/micropython/ports/nrf/modules/uos/moduos.c:90: undefined reference to `disk_ioctl'
/gcc-arm-none-eabi-9-2019-q4-major/bin/../lib/gcc/arm-none-eabi/9.2.1/../../../../arm-none-eabi/bin/ld: /tmp/firmware.elf.zgYgfW.ltrans1.ltrans.o:(.rodata+0xdc8): undefined reference to `mp_fat_vfs_type'
collect2: error: ld returned 1 exit status
make: *** [Makefile:448: /builds/alelec/micropython_ci/micropython_nrf_actinius_icarus_f7225d1c/firmware.elf] Error 1
Cleaning up file based variables
ERROR: Job failed: exit code 1
failed
STM32L496GDISC_mboot Stm32
main.c: In function 'stm32_main':
main.c:1352:57: error: expected expression before ';' token
1352 | uint32_t msp = *(volatile uint32_t*)APPLICATION_ADDR;
| ^
cc1: all warnings being treated as errors
make: *** [Makefile:244: /builds/alelec/micropython_ci/micropython/ports/stm32/build/main.o] Error 1
make: Leaving directory '/builds/alelec/micropython_ci/micropython/ports/stm32/mboot'
Cleaning up file based variables
ERROR: Job failed: exit code 1
failed
ADAFRUIT_F405_EXPRESS_mboot Stm32
      |                                                     MICROPY_HW_UART3_RTS
main.c:437:1: error: control reaches end of non-void function [-Werror=return-type]
437 | }
| ^
cc1: all warnings being treated as errors
make: *** [Makefile:244: /builds/alelec/micropython_ci/micropython/ports/stm32/build/main.o] Error 1
make: Leaving directory '/builds/alelec/micropython_ci/micropython/ports/stm32/mboot'
Cleaning up file based variables
ERROR: Job failed: exit code 1
failed
STM32F7DISC_mboot Stm32
      |               ^~~~
main.c: In function 'pyb_usbdd_StrDescriptor':
main.c:1060:38: error: 'FLASH_LAYOUT_STR' undeclared (first use in this function)
1060 | USBD_GetString((uint8_t*)FLASH_LAYOUT_STR, str_desc, length);
| ^~~~~~~~~~~~~~~~
make: *** [Makefile:244: /builds/alelec/micropython_ci/micropython/ports/stm32/build/main.o] Error 1
make: Leaving directory '/builds/alelec/micropython_ci/micropython/ports/stm32/mboot'
Cleaning up file based variables
ERROR: Job failed: exit code 1
failed
NUCLEO_F411RE_mboot Stm32
      |            MICROPY_HW_USB_HID
main.c:1191:1: error: control reaches end of non-void function [-Werror=return-type]
1191 | }
| ^
cc1: all warnings being treated as errors
make: *** [Makefile:244: /builds/alelec/micropython_ci/micropython/ports/stm32/build/main.o] Error 1
make: Leaving directory '/builds/alelec/micropython_ci/micropython/ports/stm32/mboot'
Cleaning up file based variables
ERROR: Job failed: exit code 1
failed
NUCLEO_F446RE_mboot Stm32
      |            MICROPY_HW_USB_HID
main.c:1191:1: error: control reaches end of non-void function [-Werror=return-type]
1191 | }
| ^
cc1: all warnings being treated as errors
make: *** [Makefile:244: /builds/alelec/micropython_ci/micropython/ports/stm32/build/main.o] Error 1
make: Leaving directory '/builds/alelec/micropython_ci/micropython/ports/stm32/mboot'
Cleaning up file based variables
ERROR: Job failed: exit code 1
failed
STM32L476DISC_mboot Stm32
main.c: In function 'stm32_main':
main.c:1352:57: error: expected expression before ';' token
1352 | uint32_t msp = *(volatile uint32_t*)APPLICATION_ADDR;
| ^
cc1: all warnings being treated as errors
make: *** [Makefile:244: /builds/alelec/micropython_ci/micropython/ports/stm32/build/main.o] Error 1
make: Leaving directory '/builds/alelec/micropython_ci/micropython/ports/stm32/mboot'
Cleaning up file based variables
ERROR: Job failed: exit code 1
failed
NUCLEO_F401RE_mboot Stm32
      |            MICROPY_HW_USB_HID
main.c:1191:1: error: control reaches end of non-void function [-Werror=return-type]
1191 | }
| ^
cc1: all warnings being treated as errors
make: *** [Makefile:244: /builds/alelec/micropython_ci/micropython/ports/stm32/build/main.o] Error 1
make: Leaving directory '/builds/alelec/micropython_ci/micropython/ports/stm32/mboot'
Cleaning up file based variables
ERROR: Job failed: exit code 1
failed
OLIMEX_E407_mboot Stm32
  358 | #define LED1 MICROPY_HW_LED2
| ^~~~~~~~~~~~~~~
main.c:401:15: note: in expansion of macro 'LED1'
401 | led_state(LED1, mask & 2);
| ^~~~
make: *** [Makefile:244: /builds/alelec/micropython_ci/micropython/ports/stm32/build/main.o] Error 1
make: Leaving directory '/builds/alelec/micropython_ci/micropython/ports/stm32/mboot'
Cleaning up file based variables
ERROR: Job failed: exit code 1
failed
NUCLEO_L073RZ_mboot Stm32
main.c: In function 'pyb_usbdd_detect_port':
main.c:1191:1: error: control reaches end of non-void function [-Werror=return-type]
1191 | }
| ^
cc1: all warnings being treated as errors
make: *** [Makefile:244: /builds/alelec/micropython_ci/micropython/ports/stm32/build/main.o] Error 1
make: Leaving directory '/builds/alelec/micropython_ci/micropython/ports/stm32/mboot'
Cleaning up file based variables
ERROR: Job failed: exit code 1
failed
NUCLEO_L452RE_mboot Stm32
main.c: In function 'pyb_usbdd_detect_port':
main.c:1191:1: error: control reaches end of non-void function [-Werror=return-type]
1191 | }
| ^
cc1: all warnings being treated as errors
make: *** [Makefile:244: /builds/alelec/micropython_ci/micropython/ports/stm32/build/main.o] Error 1
make: Leaving directory '/builds/alelec/micropython_ci/micropython/ports/stm32/mboot'
Cleaning up file based variables
ERROR: Job failed: exit code 1
failed
NUCLEO_L432KC_mboot Stm32
main.c: In function 'pyb_usbdd_detect_port':
main.c:1191:1: error: control reaches end of non-void function [-Werror=return-type]
1191 | }
| ^
cc1: all warnings being treated as errors
make: *** [Makefile:244: /builds/alelec/micropython_ci/micropython/ports/stm32/build/main.o] Error 1
make: Leaving directory '/builds/alelec/micropython_ci/micropython/ports/stm32/mboot'
Cleaning up file based variables
ERROR: Job failed: exit code 1
failed
NUCLEO_F746ZG_mboot Stm32
main.c: In function 'pyb_usbdd_StrDescriptor':
main.c:1060:38: error: 'FLASH_LAYOUT_STR' undeclared (first use in this function)
1060 | USBD_GetString((uint8_t*)FLASH_LAYOUT_STR, str_desc, length);
| ^~~~~~~~~~~~~~~~
main.c:1060:38: note: each undeclared identifier is reported only once for each function it appears in
make: *** [Makefile:244: /builds/alelec/micropython_ci/micropython/ports/stm32/build/main.o] Error 1
make: Leaving directory '/builds/alelec/micropython_ci/micropython/ports/stm32/mboot'
Cleaning up file based variables
ERROR: Job failed: exit code 1
failed
NUCLEO_L476RG_mboot Stm32
main.c: In function 'stm32_main':
main.c:1352:57: error: expected expression before ';' token
1352 | uint32_t msp = *(volatile uint32_t*)APPLICATION_ADDR;
| ^
cc1: all warnings being treated as errors
make: *** [Makefile:244: /builds/alelec/micropython_ci/micropython/ports/stm32/build/main.o] Error 1
make: Leaving directory '/builds/alelec/micropython_ci/micropython/ports/stm32/mboot'
Cleaning up file based variables
ERROR: Job failed: exit code 1
failed
LIMIFROG_mboot Stm32
main.c: In function 'stm32_main':
main.c:1352:57: error: expected expression before ';' token
1352 | uint32_t msp = *(volatile uint32_t*)APPLICATION_ADDR;
| ^
cc1: all warnings being treated as errors
make: *** [Makefile:244: /builds/alelec/micropython_ci/micropython/ports/stm32/build/main.o] Error 1
make: Leaving directory '/builds/alelec/micropython_ci/micropython/ports/stm32/mboot'
Cleaning up file based variables
ERROR: Job failed: exit code 1
failed
NUCLEO_F091RC_mboot Stm32
main.c: In function 'pyb_usbdd_detect_port':
main.c:1191:1: error: control reaches end of non-void function [-Werror=return-type]
1191 | }
| ^
cc1: all warnings being treated as errors
make: *** [Makefile:244: /builds/alelec/micropython_ci/micropython/ports/stm32/build/main.o] Error 1
make: Leaving directory '/builds/alelec/micropython_ci/micropython/ports/stm32/mboot'
Cleaning up file based variables
ERROR: Job failed: exit code 1
failed
STM32F439_mboot Stm32
      |              ^~~~~~~~~~~~~~~
main.c:424:19: note: in expansion of macro 'LED0'
424 | led_state(LED0, (led0_cur_state & (led0_toggle_count == 0 ? 1 : 2)));
| ^~~~
cc1: all warnings being treated as errors
make: *** [Makefile:244: /builds/alelec/micropython_ci/micropython/ports/stm32/build/main.o] Error 1
make: Leaving directory '/builds/alelec/micropython_ci/micropython/ports/stm32/mboot'
Cleaning up file based variables
ERROR: Job failed: exit code 1
failed
B_L475E_IOT01A_mboot Stm32
main.c: In function 'stm32_main':
main.c:1352:57: error: expected expression before ';' token
1352 | uint32_t msp = *(volatile uint32_t*)APPLICATION_ADDR;
| ^
cc1: all warnings being treated as errors
make: *** [Makefile:244: /builds/alelec/micropython_ci/micropython/ports/stm32/build/main.o] Error 1
make: Leaving directory '/builds/alelec/micropython_ci/micropython/ports/stm32/mboot'
Cleaning up file based variables
ERROR: Job failed: exit code 1
failed
CERB40_mboot Stm32
      |                                                     MICROPY_HW_UART3_RTS
main.c:437:1: error: control reaches end of non-void function [-Werror=return-type]
437 | }
| ^
cc1: all warnings being treated as errors
make: *** [Makefile:244: /builds/alelec/micropython_ci/micropython/ports/stm32/build/main.o] Error 1
make: Leaving directory '/builds/alelec/micropython_ci/micropython/ports/stm32/mboot'
Cleaning up file based variables
ERROR: Job failed: exit code 1
failed
B_L072Z_LRWAN1_mboot Stm32
      |     ^~~~~~~~~~~~~~~~~~~~~~~~
main.c:1352:57: error: expected expression before ';' token
1352 | uint32_t msp = *(volatile uint32_t*)APPLICATION_ADDR;
| ^
cc1: all warnings being treated as errors
make: *** [Makefile:244: /builds/alelec/micropython_ci/micropython/ports/stm32/build/main.o] Error 1
make: Leaving directory '/builds/alelec/micropython_ci/micropython/ports/stm32/mboot'
Cleaning up file based variables
ERROR: Job failed: exit code 1
failed
unix:nanbox Test
  File "/usr/lib/python3.5/subprocess.py", line 398, in run
output=stdout, stderr=stderr)
subprocess.CalledProcessError: Command '['gcc', '-m32', '-E', '-I../../lib/berkeley-db-1.xx/PORT/include', '-I.', '-I../..', '-Ibuild-nanbox', '-I../../lib/mp-readline', '-Wall', '-Werror', '-Wextra', '-Wno-unused-parameter', '-Wpointer-arith', '-Wdouble-promotion', '-Wfloat-conversion', '-std=gnu99', '-DUNIX', '-DFFCONF_H="lib/oofatfs/ffconf.h"', '-DMICROPY_PY_USSL=1', '-DMICROPY_SSL_AXTLS=1', '-I../../lib/axtls/ssl', '-I../../lib/axtls/crypto', '-I../../extmod/axtls-include', '-DMICROPY_PY_BTREE=1', '-I/usr/include/i686-linux-gnu', '-DMICROPY_USE_READLINE=1', '-DMICROPY_PY_TERMIOS=1', '-DMICROPY_PY_SOCKET=1', '-DMICROPY_PY_THREAD=1', '-DMICROPY_PY_THREAD_GIL=0', '-DMICROPY_PY_FFI=1', '-Os', '-DNDEBUG', '-fdata-sections', '-ffunction-sections', '-Ivariants/nanbox', '-g', '-U', '_FORTIFY_SOURCE', '-DMICROPY_QSTR_EXTRA_POOL=mp_qstr_frozen_const_pool', '-DMICROPY_MODULE_FROZEN_MPY', '-DMPZ_DIG_SIZE=16', '-DMICROPY_MODULE_FROZEN_STR', '-DNO_QSTR', '-Ibuild-nanbox/tmp', '../../lib/axtls/ssl/asn1.c', '../../lib/axtls/ssl/loader.c', '../../lib/axtls/ssl/tls1.c', '../../lib/axtls/ssl/tls1_svr.c', '../../lib/axtls/ssl/tls1_clnt.c', '../../lib/axtls/ssl/x509.c', '../../lib/axtls/crypto/aes.c', '../../lib/axtls/crypto/bigint.c', '../../lib/axtls/crypto/crypto_misc.c', '../../lib/axtls/crypto/hmac.c', '../../lib/axtls/crypto/md5.c', '../../lib/axtls/crypto/rsa.c', '../../lib/axtls/crypto/sha1.c', '../../extmod/modbtree.c', '../../lib/berkeley-db-1.xx/btree/bt_close.c', '../../lib/berkeley-db-1.xx/btree/bt_conv.c', '../../lib/berkeley-db-1.xx/btree/bt_debug.c', '../../lib/berkeley-db-1.xx/btree/bt_delete.c', '../../lib/berkeley-db-1.xx/btree/bt_get.c', '../../lib/berkeley-db-1.xx/btree/bt_open.c', '../../lib/berkeley-db-1.xx/btree/bt_overflow.c', '../../lib/berkeley-db-1.xx/btree/bt_page.c', '../../lib/berkeley-db-1.xx/btree/bt_put.c', '../../lib/berkeley-db-1.xx/btree/bt_search.c', '../../lib/berkeley-db-1.xx/btree/bt_seq.c', '../../lib/berkeley-db-1.xx/btree/bt_split.c', '../../lib/berkeley-db-1.xx/btree/bt_utils.c', '../../lib/berkeley-db-1.xx/mpool/mpool.c', 'modtermios.c', 'modusocket.c', 'modffi.c', '../../py/mpstate.c', '../../py/malloc.c', '../../py/gc.c', '../../py/pystack.c', '../../py/qstr.c', '../../py/vstr.c', '../../py/mpprint.c', '../../py/unicode.c', '../../py/mpz.c', '../../py/reader.c', '../../py/lexer.c', '../../py/parse.c', '../../py/scope.c', '../../py/compile.c', '../../py/emitcommon.c', '../../py/emitbc.c', '../../py/asmbase.c', '../../py/asmx64.c', '../../py/emitnx64.c', '../../py/asmx86.c', '../../py/emitnx86.c', '../../py/asmthumb.c', '../../py/emitnthumb.c', '../../py/emitinlinethumb.c', '../../py/asmarm.c', '../../py/emitnarm.c', '../../py/asmxtensa.c', '../../py/emitnxtensa.c', '../../py/emitinlinextensa.c', '../../py/emitnxtensawin.c', '../../py/formatfloat.c', '../../py/parsenumbase.c', '../../py/parsenum.c', '../../py/emitglue.c', '../../py/persistentcode.c', '../../py/runtime.c', '../../py/runtime_utils.c', '../../py/scheduler.c', '../../py/nativeglue.c', '../../py/pairheap.c', '../../py/ringbuf.c', '../../py/stackctrl.c', '../../py/argcheck.c', '../../py/warning.c', '../../py/profile.c', '../../py/map.c', '../../py/obj.c', '../../py/objarray.c', '../../py/objattrtuple.c', '../../py/objbool.c', '../../py/objboundmeth.c', '../../py/objcell.c', '../../py/objclosure.c', '../../py/objcomplex.c', '../../py/objdeque.c', '../../py/objdict.c', '../../py/objenumerate.c', '../../py/objexcept.c', '../../py/objfilter.c', '../../py/objfloat.c', '../../py/objfun.c', '../../py/objgenerator.c', '../../py/objgetitemiter.c', '../../py/objint.c', '../../py/objint_longlong.c', '../../py/objint_mpz.c', '../../py/objlist.c', '../../py/objmap.c', '../../py/objmodule.c', '../../py/objobject.c', '../../py/objpolyiter.c', '../../py/objproperty.c', '../../py/objnone.c', '../../py/objnamedtuple.c', '../../py/objrange.c', '../../py/objreversed.c', '../../py/objset.c', '../../py/objsingleton.c', '../../py/objslice.c', '../../py/objstr.c', '../../py/objstrunicode.c', '../../py/objstringio.c', '../../py/objtuple.c', '../../py/objtype.c', '../../py/objzip.c', '../../py/opmethods.c', '../../py/sequence.c', '../../py/stream.c', '../../py/binary.c', '../../py/builtinimport.c', '../../py/builtinevex.c', '../../py/builtinhelp.c', '../../py/modarray.c', '../../py/modbuiltins.c', '../../py/modcollections.c', '../../py/modgc.c', '../../py/modio.c', '../../py/modmath.c', '../../py/modcmath.c', '../../py/modmicropython.c', '../../py/modstruct.c', '../../py/modsys.c', '../../py/moduerrno.c', '../../py/modthread.c', '../../py/vm.c', '../../py/bc.c', '../../py/showbc.c', '../../py/repl.c', '../../py/smallint.c', '../../py/frozenmod.c', '../../extmod/moduasyncio.c', '../../extmod/moductypes.c', '../../extmod/modujson.c', '../../extmod/modure.c', '../../extmod/moduzlib.c', '../../extmod/moduheapq.c', '../../extmod/modutimeq.c', '../../extmod/moduhashlib.c', '../../extmod/moducryptolib.c', '../../extmod/modubinascii.c', '../../extmod/virtpin.c', '../../extmod/machine_mem.c', '../../extmod/machine_pinbase.c', '../../extmod/machine_signal.c', '../../extmod/machine_pulse.c', '../../extmod/machine_i2c.c', '../../extmod/machine_spi.c', '../../extmod/modbluetooth.c', '../../extmod/modussl_axtls.c', '../../extmod/modussl_mbedtls.c', '../../extmod/modurandom.c', '../../extmod/moduselect.c', '../../extmod/moduwebsocket.c', '../../extmod/modwebrepl.c', '../../extmod/modframebuf.c', '../../extmod/vfs.c', '../../extmod/vfs_blockdev.c', '../../extmod/vfs_reader.c', '../../extmod/vfs_posix.c', '../../extmod/vfs_posix_file.c', '../../extmod/vfs_fat.c', '../../extmod/vfs_fat_diskio.c', '../../extmod/vfs_fat_file.c', '../../extmod/vfs_lfs.c', '../../extmod/utime_mphal.c', '../../extmod/uos_dupterm.c', '../../lib/embed/abort_.c', '../../lib/utils/printf.c', 'build-nanbox/genhdr/moduledefs.h', 'main.c', 'gccollect.c', 'unix_mphal.c', 'mpthreadport.c', 'input.c', 'modmachine.c', 'modos.c', 'moduos_vfs.c', 'modtime.c', 'moduselect.c', 'alloc.c', 'fatfs_port.c', 'mpbthciport.c', 'mpbtstackport_common.c', 'mpbtstackport_h4.c', 'mpbtstackport_usb.c', 'mpnimbleport.c', '../../lib/mp-readline/readline.c', '../../lib/timeutils/timeutils.c', '../../lib/utils/gchelper_generic.c', 'variants/nanbox/mpconfigvariant.h', '../../py/mpconfig.h', 'mpconfigport.h']' returned non-zero exit status 1
../../py/mkrules.mk:106: recipe for target 'build-nanbox/genhdr/qstr.i.last' failed
make: *** [build-nanbox/genhdr/qstr.i.last] Error 1
make: *** Deleting file 'build-nanbox/genhdr/qstr.i.last'
make: Leaving directory '/builds/alelec/micropython_ci/micropython/ports/unix'
Cleaning up file based variables
ERROR: Job failed: exit code 1