<?xml version="1.0" encoding="UTF-8"?>
<svg width="40px" height="40px" viewBox="0 0 80 80" version="1.1" xmlns="http://www.w3.org/2000/svg" xmlns:xlink="http://www.w3.org/1999/xlink">
  <defs>
    <linearGradient x1="0%" y1="0%" x2="100%" y2="100%" id="1198197337505">
      <stop stop-color="rgb(0, 255, 51)" offset="0%"></stop>
      <stop stop-color="rgb(51, 0, 255)" offset="100%"></stop>
    </linearGradient>
  </defs>
  <g stroke="none" stroke-width="1" fill="none" fill-rule="evenodd">
    <rect id="Rectangle" fill="url(#1198197337505)" x="0" y="0" width="80" height="80"></rect>
  </g>
</svg>