%!PS-Adobe-3.0 EPSF-3.0
%%Creator: (MATLAB, The Mathworks, Inc. Version 8.5.0.197613 \(R2015a\). Operating System: Windows 7)
%%Title: C:/Users/Shurshurik/Desktop/matlab_student/4/figure5.eps
%%CreationDate: 2018-11-26T15:33:04
%%Pages: (atend)
%%BoundingBox: 0 0 800 358
%%LanguageLevel: 2
%%EndComments
%%BeginProlog
%%BeginResource: procset (Apache XML Graphics Std ProcSet) 1.2 0
%%Version: 1.2 0
%%Copyright: (Copyright 2001-2003,2010 The Apache Software Foundation. License terms: http://www.apache.org/licenses/LICENSE-2.0)
/bd{bind def}bind def
/ld{load def}bd
/GR/grestore ld
/M/moveto ld
/LJ/setlinejoin ld
/C/curveto ld
/f/fill ld
/LW/setlinewidth ld
/GC/setgray ld
/t/show ld
/N/newpath ld
/CT/concat ld
/cp/closepath ld
/S/stroke ld
/L/lineto ld
/CC/setcmykcolor ld
/A/ashow ld
/GS/gsave ld
/RC/setrgbcolor ld
/RM/rmoveto ld
/ML/setmiterlimit ld
/re {4 2 roll M
1 index 0 rlineto
0 exch rlineto
neg 0 rlineto
cp } bd
/_ctm matrix def
/_tm matrix def
/BT { _ctm currentmatrix pop matrix _tm copy pop 0 0 moveto } bd
/ET { _ctm setmatrix } bd
/iTm { _ctm setmatrix _tm concat } bd
/Tm { _tm astore pop iTm 0 0 moveto } bd
/ux 0.0 def
/uy 0.0 def
/F {
  /Tp exch def
  /Tf exch def
  Tf findfont Tp scalefont setfont
  /cf Tf def  /cs Tp def
} bd
/ULS {currentpoint /uy exch def /ux exch def} bd
/ULE {
  /Tcx currentpoint pop def
  gsave
  newpath
  cf findfont cs scalefont dup
  /FontMatrix get 0 get /Ts exch def /FontInfo get dup
  /UnderlinePosition get Ts mul /To exch def
  /UnderlineThickness get Ts mul /Tt exch def
  ux uy To add moveto  Tcx uy To add lineto
  Tt setlinewidth stroke
  grestore
} bd
/OLE {
  /Tcx currentpoint pop def
  gsave
  newpath
  cf findfont cs scalefont dup
  /FontMatrix get 0 get /Ts exch def /FontInfo get dup
  /UnderlinePosition get Ts mul /To exch def
  /UnderlineThickness get Ts mul /Tt exch def
  ux uy To add cs add moveto Tcx uy To add cs add lineto
  Tt setlinewidth stroke
  grestore
} bd
/SOE {
  /Tcx currentpoint pop def
  gsave
  newpath
  cf findfont cs scalefont dup
  /FontMatrix get 0 get /Ts exch def /FontInfo get dup
  /UnderlinePosition get Ts mul /To exch def
  /UnderlineThickness get Ts mul /Tt exch def
  ux uy To add cs 10 mul 26 idiv add moveto Tcx uy To add cs 10 mul 26 idiv add lineto
  Tt setlinewidth stroke
  grestore
} bd
/QT {
/Y22 exch store
/X22 exch store
/Y21 exch store
/X21 exch store
currentpoint
/Y21 load 2 mul add 3 div exch
/X21 load 2 mul add 3 div exch
/X21 load 2 mul /X22 load add 3 div
/Y21 load 2 mul /Y22 load add 3 div
/X22 load /Y22 load curveto
} bd
/SSPD {
dup length /d exch dict def
{
/v exch def
/k exch def
currentpagedevice k known {
/cpdv currentpagedevice k get def
v cpdv ne {
/upd false def
/nullv v type /nulltype eq def
/nullcpdv cpdv type /nulltype eq def
nullv nullcpdv or
{
/upd true def
} {
/sametype v type cpdv type eq def
sametype {
v type /arraytype eq {
/vlen v length def
/cpdvlen cpdv length def
vlen cpdvlen eq {
0 1 vlen 1 sub {
/i exch def
/obj v i get def
/cpdobj cpdv i get def
obj cpdobj ne {
/upd true def
exit
} if
} for
} {
/upd true def
} ifelse
} {
v type /dicttype eq {
v {
/dv exch def
/dk exch def
/cpddv cpdv dk get def
dv cpddv ne {
/upd true def
exit
} if
} forall
} {
/upd true def
} ifelse
} ifelse
} if
} ifelse
upd true eq {
d k v put
} if
} if
} if
} forall
d length 0 gt {
d setpagedevice
} if
} bd
%%EndResource
%%BeginResource: procset (Apache XML Graphics EPS ProcSet) 1.0 0
%%Version: 1.0 0
%%Copyright: (Copyright 2002-2003 The Apache Software Foundation. License terms: http://www.apache.org/licenses/LICENSE-2.0)
/BeginEPSF { %def
/b4_Inc_state save def         % Save state for cleanup
/dict_count countdictstack def % Count objects on dict stack
/op_count count 1 sub def      % Count objects on operand stack
userdict begin                 % Push userdict on dict stack
/showpage { } def              % Redefine showpage, { } = null proc
0 setgray 0 setlinecap         % Prepare graphics state
1 setlinewidth 0 setlinejoin
10 setmiterlimit [ ] 0 setdash newpath
/languagelevel where           % If level not equal to 1 then
{pop languagelevel             % set strokeadjust and
1 ne                           % overprint to their defaults.
{false setstrokeadjust false setoverprint
} if
} if
} bd
/EndEPSF { %def
count op_count sub {pop} repeat            % Clean up stacks
countdictstack dict_count sub {end} repeat
b4_Inc_state restore
} bd
%%EndResource
%FOPBeginFontDict
%%IncludeResource: font Courier-Bold
%%IncludeResource: font Helvetica
%%IncludeResource: font Courier-BoldOblique
%%IncludeResource: font Courier-Oblique
%%IncludeResource: font Times-Roman
%%IncludeResource: font Helvetica-BoldOblique
%%IncludeResource: font Helvetica-Bold
%%IncludeResource: font Helvetica-Oblique
%%IncludeResource: font Times-BoldItalic
%%IncludeResource: font Courier
%%IncludeResource: font Times-Italic
%%IncludeResource: font Times-Bold
%%IncludeResource: font Symbol
%%IncludeResource: font ZapfDingbats
%FOPEndFontDict
%%BeginResource: encoding WinAnsiEncoding
/WinAnsiEncoding [
/.notdef /.notdef /.notdef /.notdef /.notdef
/.notdef /.notdef /.notdef /.notdef /.notdef
/.notdef /.notdef /.notdef /.notdef /.notdef
/.notdef /.notdef /.notdef /.notdef /.notdef
/.notdef /.notdef /.notdef /.notdef /.notdef
/.notdef /.notdef /.notdef /.notdef /.notdef
/.notdef /.notdef /space /exclam /quotedbl
/numbersign /dollar /percent /ampersand /quotesingle
/parenleft /parenright /asterisk /plus /comma
/hyphen /period /slash /zero /one
/two /three /four /five /six
/seven /eight /nine /colon /semicolon
/less /equal /greater /question /at
/A /B /C /D /E
/F /G /H /I /J
/K /L /M /N /O
/P /Q /R /S /T
/U /V /W /X /Y
/Z /bracketleft /backslash /bracketright /asciicircum
/underscore /quoteleft /a /b /c
/d /e /f /g /h
/i /j /k /l /m
/n /o /p /q /r
/s /t /u /v /w
/x /y /z /braceleft /bar
/braceright /asciitilde /bullet /Euro /bullet
/quotesinglbase /florin /quotedblbase /ellipsis /dagger
/daggerdbl /circumflex /perthousand /Scaron /guilsinglleft
/OE /bullet /Zcaron /bullet /bullet
/quoteleft /quoteright /quotedblleft /quotedblright /bullet
/endash /emdash /asciitilde /trademark /scaron
/guilsinglright /oe /bullet /zcaron /Ydieresis
/space /exclamdown /cent /sterling /currency
/yen /brokenbar /section /dieresis /copyright
/ordfeminine /guillemotleft /logicalnot /sfthyphen /registered
/macron /degree /plusminus /twosuperior /threesuperior
/acute /mu /paragraph /middot /cedilla
/onesuperior /ordmasculine /guillemotright /onequarter /onehalf
/threequarters /questiondown /Agrave /Aacute /Acircumflex
/Atilde /Adieresis /Aring /AE /Ccedilla
/Egrave /Eacute /Ecircumflex /Edieresis /Igrave
/Iacute /Icircumflex /Idieresis /Eth /Ntilde
/Ograve /Oacute /Ocircumflex /Otilde /Odieresis
/multiply /Oslash /Ugrave /Uacute /Ucircumflex
/Udieresis /Yacute /Thorn /germandbls /agrave
/aacute /acircumflex /atilde /adieresis /aring
/ae /ccedilla /egrave /eacute /ecircumflex
/edieresis /igrave /iacute /icircumflex /idieresis
/eth /ntilde /ograve /oacute /ocircumflex
/otilde /odieresis /divide /oslash /ugrave
/uacute /ucircumflex /udieresis /yacute /thorn
/ydieresis
] def
%%EndResource
%FOPBeginFontReencode
/Courier-Bold findfont
dup length dict begin
  {1 index /FID ne {def} {pop pop} ifelse} forall
  /Encoding WinAnsiEncoding def
  currentdict
end
/Courier-Bold exch definefont pop
/Helvetica findfont
dup length dict begin
  {1 index /FID ne {def} {pop pop} ifelse} forall
  /Encoding WinAnsiEncoding def
  currentdict
end
/Helvetica exch definefont pop
/Courier-BoldOblique findfont
dup length dict begin
  {1 index /FID ne {def} {pop pop} ifelse} forall
  /Encoding WinAnsiEncoding def
  currentdict
end
/Courier-BoldOblique exch definefont pop
/Courier-Oblique findfont
dup length dict begin
  {1 index /FID ne {def} {pop pop} ifelse} forall
  /Encoding WinAnsiEncoding def
  currentdict
end
/Courier-Oblique exch definefont pop
/Times-Roman findfont
dup length dict begin
  {1 index /FID ne {def} {pop pop} ifelse} forall
  /Encoding WinAnsiEncoding def
  currentdict
end
/Times-Roman exch definefont pop
/Helvetica-BoldOblique findfont
dup length dict begin
  {1 index /FID ne {def} {pop pop} ifelse} forall
  /Encoding WinAnsiEncoding def
  currentdict
end
/Helvetica-BoldOblique exch definefont pop
/Helvetica-Bold findfont
dup length dict begin
  {1 index /FID ne {def} {pop pop} ifelse} forall
  /Encoding WinAnsiEncoding def
  currentdict
end
/Helvetica-Bold exch definefont pop
/Helvetica-Oblique findfont
dup length dict begin
  {1 index /FID ne {def} {pop pop} ifelse} forall
  /Encoding WinAnsiEncoding def
  currentdict
end
/Helvetica-Oblique exch definefont pop
/Times-BoldItalic findfont
dup length dict begin
  {1 index /FID ne {def} {pop pop} ifelse} forall
  /Encoding WinAnsiEncoding def
  currentdict
end
/Times-BoldItalic exch definefont pop
/Courier findfont
dup length dict begin
  {1 index /FID ne {def} {pop pop} ifelse} forall
  /Encoding WinAnsiEncoding def
  currentdict
end
/Courier exch definefont pop
/Times-Italic findfont
dup length dict begin
  {1 index /FID ne {def} {pop pop} ifelse} forall
  /Encoding WinAnsiEncoding def
  currentdict
end
/Times-Italic exch definefont pop
/Times-Bold findfont
dup length dict begin
  {1 index /FID ne {def} {pop pop} ifelse} forall
  /Encoding WinAnsiEncoding def
  currentdict
end
/Times-Bold exch definefont pop
%FOPEndFontReencode
%%EndProlog
%%Page: 1 1
%%PageBoundingBox: 0 0 800 358
%%BeginPageSetup
[1 0 0 -1 0 358] CT
%%EndPageSetup
GS
[0.55814 0 0 0.55814 0 0.23254] CT
N
0 0 M
1433 0 L
1433 641 L
0 641 L
0 0 L
cp
clip
1 GC
N
0 0 1433 641 re
f
GR
GS
[0.55814 0 0 0.55814 0 0.23254] CT
1 GC
N
0 0 1433 641 re
f
GR
GS
[0.55814 0 0 0.55814 0 0.23254] CT
1 GC
N
186 570 M
492 570 L
492 48 L
186 48 L
cp
f
GR
GS
[0.55814 0 0 0.55814 0 0.23254] CT
0.873 GC
2 setlinecap
10.0 ML
N
186 570 M
186 48 L
S
GR
GS
[0.55814 0 0 0.55814 0 0.23254] CT
0.873 GC
2 setlinecap
10.0 ML
N
262.5 570 M
262.5 48 L
S
GR
GS
[0.55814 0 0 0.55814 0 0.23254] CT
0.873 GC
2 setlinecap
10.0 ML
N
339 570 M
339 48 L
S
GR
GS
[0.55814 0 0 0.55814 0 0.23254] CT
0.873 GC
2 setlinecap
10.0 ML
N
415.5 570 M
415.5 48 L
S
GR
GS
[0.55814 0 0 0.55814 0 0.23254] CT
0.873 GC
2 setlinecap
10.0 ML
N
492 570 M
492 48 L
S
GR
GS
[0.55814 0 0 0.55814 0 0.23254] CT
0.873 GC
2 setlinecap
10.0 ML
N
492 570 M
186 570 L
S
GR
GS
[0.55814 0 0 0.55814 0 0.23254] CT
0.873 GC
2 setlinecap
10.0 ML
N
492 483 M
186 483 L
S
GR
GS
[0.55814 0 0 0.55814 0 0.23254] CT
0.873 GC
2 setlinecap
10.0 ML
N
492 396 M
186 396 L
S
GR
GS
[0.55814 0 0 0.55814 0 0.23254] CT
0.873 GC
2 setlinecap
10.0 ML
N
492 309 M
186 309 L
S
GR
GS
[0.55814 0 0 0.55814 0 0.23254] CT
0.873 GC
2 setlinecap
10.0 ML
N
492 222 M
186 222 L
S
GR
GS
[0.55814 0 0 0.55814 0 0.23254] CT
0.873 GC
2 setlinecap
10.0 ML
N
492 135 M
186 135 L
S
GR
GS
[0.55814 0 0 0.55814 0 0.23254] CT
0.873 GC
2 setlinecap
10.0 ML
N
492 48 M
186 48 L
S
GR
GS
[0.55814 0 0 0.55814 0 0.23254] CT
0.149 GC
2 setlinecap
10.0 ML
N
186 570 M
492 570 L
S
GR
GS
[0.55814 0 0 0.55814 0 0.23254] CT
0.149 GC
2 setlinecap
10.0 ML
N
186 48 M
492 48 L
S
GR
GS
[0.55814 0 0 0.55814 0 0.23254] CT
0.149 GC
2 setlinecap
10.0 ML
N
186 570 M
186 564.78 L
S
GR
GS
[0.55814 0 0 0.55814 0 0.23254] CT
0.149 GC
2 setlinecap
10.0 ML
N
262.5 570 M
262.5 564.78 L
S
GR
GS
[0.55814 0 0 0.55814 0 0.23254] CT
0.149 GC
2 setlinecap
10.0 ML
N
339 570 M
339 564.78 L
S
GR
GS
[0.55814 0 0 0.55814 0 0.23254] CT
0.149 GC
2 setlinecap
10.0 ML
N
415.5 570 M
415.5 564.78 L
S
GR
GS
[0.55814 0 0 0.55814 0 0.23254] CT
0.149 GC
2 setlinecap
10.0 ML
N
492 570 M
492 564.78 L
S
GR
GS
[0.55814 0 0 0.55814 0 0.23254] CT
0.149 GC
2 setlinecap
10.0 ML
N
186 48 M
186 53.22 L
S
GR
GS
[0.55814 0 0 0.55814 0 0.23254] CT
0.149 GC
2 setlinecap
10.0 ML
N
262.5 48 M
262.5 53.22 L
S
GR
GS
[0.55814 0 0 0.55814 0 0.23254] CT
0.149 GC
2 setlinecap
10.0 ML
N
339 48 M
339 53.22 L
S
GR
GS
[0.55814 0 0 0.55814 0 0.23254] CT
0.149 GC
2 setlinecap
10.0 ML
N
415.5 48 M
415.5 53.22 L
S
GR
GS
[0.55814 0 0 0.55814 0 0.23254] CT
0.149 GC
2 setlinecap
10.0 ML
N
492 48 M
492 53.22 L
S
GR
GS
[0.55814 0 0 0.55814 103.81395 322.3721] CT
0.149 GC
/Helvetica 18 F
GS
[1 0 0 1 0 0] CT
-15.5 19 moveto 
1 -1 scale
(300) t 
GR
GR
GS
[0.55814 0 0 0.55814 146.51163 322.3721] CT
0.149 GC
/Helvetica 18 F
GS
[1 0 0 1 0 0] CT
-15.5 19 moveto 
1 -1 scale
(400) t 
GR
GR
GS
[0.55814 0 0 0.55814 189.20931 322.3721] CT
0.149 GC
/Helvetica 18 F
GS
[1 0 0 1 0 0] CT
-15.5 19 moveto 
1 -1 scale
(500) t 
GR
GR
GS
[0.55814 0 0 0.55814 231.90698 322.3721] CT
0.149 GC
/Helvetica 18 F
GS
[1 0 0 1 0 0] CT
-15.5 19 moveto 
1 -1 scale
(600) t 
GR
GR
GS
[0.55814 0 0 0.55814 274.60466 322.3721] CT
0.149 GC
/Helvetica 18 F
GS
[1 0 0 1 0 0] CT
-15.5 19 moveto 
1 -1 scale
(700) t 
GR
GR
GS
[0.55814 0 0 0.55814 0 0.23254] CT
0.149 GC
2 setlinecap
10.0 ML
N
186 570 M
186 48 L
S
GR
GS
[0.55814 0 0 0.55814 0 0.23254] CT
0.149 GC
2 setlinecap
10.0 ML
N
492 570 M
492 48 L
S
GR
GS
[0.55814 0 0 0.55814 0 0.23254] CT
0.149 GC
2 setlinecap
10.0 ML
N
186 570 M
191.22 570 L
S
GR
GS
[0.55814 0 0 0.55814 0 0.23254] CT
0.149 GC
2 setlinecap
10.0 ML
N
186 483 M
191.22 483 L
S
GR
GS
[0.55814 0 0 0.55814 0 0.23254] CT
0.149 GC
2 setlinecap
10.0 ML
N
186 396 M
191.22 396 L
S
GR
GS
[0.55814 0 0 0.55814 0 0.23254] CT
0.149 GC
2 setlinecap
10.0 ML
N
186 309 M
191.22 309 L
S
GR
GS
[0.55814 0 0 0.55814 0 0.23254] CT
0.149 GC
2 setlinecap
10.0 ML
N
186 222 M
191.22 222 L
S
GR
GS
[0.55814 0 0 0.55814 0 0.23254] CT
0.149 GC
2 setlinecap
10.0 ML
N
186 135 M
191.22 135 L
S
GR
GS
[0.55814 0 0 0.55814 0 0.23254] CT
0.149 GC
2 setlinecap
10.0 ML
N
186 48 M
191.22 48 L
S
GR
GS
[0.55814 0 0 0.55814 0 0.23254] CT
0.149 GC
2 setlinecap
10.0 ML
N
492 570 M
486.78 570 L
S
GR
GS
[0.55814 0 0 0.55814 0 0.23254] CT
0.149 GC
2 setlinecap
10.0 ML
N
492 483 M
486.78 483 L
S
GR
GS
[0.55814 0 0 0.55814 0 0.23254] CT
0.149 GC
2 setlinecap
10.0 ML
N
492 396 M
486.78 396 L
S
GR
GS
[0.55814 0 0 0.55814 0 0.23254] CT
0.149 GC
2 setlinecap
10.0 ML
N
492 309 M
486.78 309 L
S
GR
GS
[0.55814 0 0 0.55814 0 0.23254] CT
0.149 GC
2 setlinecap
10.0 ML
N
492 222 M
486.78 222 L
S
GR
GS
[0.55814 0 0 0.55814 0 0.23254] CT
0.149 GC
2 setlinecap
10.0 ML
N
492 135 M
486.78 135 L
S
GR
GS
[0.55814 0 0 0.55814 0 0.23254] CT
0.149 GC
2 setlinecap
10.0 ML
N
492 48 M
486.78 48 L
S
GR
GS
[0.55814 0 0 0.55814 99.81395 318.37209] CT
0.149 GC
/Helvetica 18 F
GS
[1 0 0 1 0 0] CT
-31 7.5 moveto 
1 -1 scale
(250) t 
GR
GR
GS
[0.55814 0 0 0.55814 99.81395 269.81395] CT
0.149 GC
/Helvetica 18 F
GS
[1 0 0 1 0 0] CT
-31 7.5 moveto 
1 -1 scale
(300) t 
GR
GR
GS
[0.55814 0 0 0.55814 99.81395 221.25581] CT
0.149 GC
/Helvetica 18 F
GS
[1 0 0 1 0 0] CT
-31 7.5 moveto 
1 -1 scale
(350) t 
GR
GR
GS
[0.55814 0 0 0.55814 99.81395 172.69767] CT
0.149 GC
/Helvetica 18 F
GS
[1 0 0 1 0 0] CT
-31 7.5 moveto 
1 -1 scale
(400) t 
GR
GR
GS
[0.55814 0 0 0.55814 99.81395 124.13953] CT
0.149 GC
/Helvetica 18 F
GS
[1 0 0 1 0 0] CT
-31 7.5 moveto 
1 -1 scale
(450) t 
GR
GR
GS
[0.55814 0 0 0.55814 99.81395 75.58138] CT
0.149 GC
/Helvetica 18 F
GS
[1 0 0 1 0 0] CT
-31 7.5 moveto 
1 -1 scale
(500) t 
GR
GR
GS
[0.55814 0 0 0.55814 99.81395 27.02324] CT
0.149 GC
/Helvetica 18 F
GS
[1 0 0 1 0 0] CT
-31 7.5 moveto 
1 -1 scale
(550) t 
GR
GR
GS
[0.55814 0 0 0.55814 0 0.23254] CT
0 0.447 0.741 RC
2 LJ
N
339 91.5 M
329.563 92.634 L
320.474 96.035 L
311.806 101.595 L
303.601 109.107 L
295.899 118.366 L
288.74 129.168 L
282.186 141.391 L
276.249 154.859 L
270.924 169.359 L
266.205 184.679 L
262.091 200.61 L
258.607 217.001 L
255.742 233.707 L
253.476 250.577 L
251.787 267.46 L
250.67 284.208 L
250.133 300.711 L
250.156 316.886 L
250.717 332.651 L
251.795 347.923 L
253.379 362.613 L
255.483 376.643 L
258.088 389.978 L
261.172 402.588 L
264.715 414.441 L
268.696 425.504 L
273.108 435.735 L
277.971 445.071 L
283.261 453.5 L
288.948 461.015 L
295.003 467.606 L
301.397 473.265 L
308.1 477.984 L
315.093 481.744 L
322.388 484.473 L
329.944 486.156 L
337.707 486.785 L
345.626 486.352 L
353.648 484.852 L
361.721 482.276 L
369.807 478.579 L
377.862 473.69 L
385.808 467.611 L
393.562 460.352 L
401.045 451.917 L
408.176 442.314 L
414.874 431.475 L
421.057 419.39 L
426.64 406.126 L
S
GR
GS
[0.55814 0 0 0.55814 0 0.23254] CT
0 0.447 0.741 RC
2 LJ
N
426.64 406.126 M
431.537 391.755 L
435.664 376.343 L
438.917 359.898 L
441.214 342.463 L
442.527 324.228 L
442.824 305.385 L
442.077 286.123 L
440.239 266.612 L
437.279 247.018 L
433.263 227.611 L
428.263 208.663 L
422.345 190.446 L
415.545 173.243 L
407.962 157.285 L
399.734 142.789 L
390.994 129.971 L
381.856 119.104 L
372.428 110.338 L
362.842 103.71 L
353.227 99.255 L
343.712 97.039 L
334.395 97.139 L
325.349 99.43 L
316.647 103.772 L
308.364 110.029 L
300.586 118.153 L
293.345 127.975 L
286.653 139.277 L
280.524 151.84 L
274.97 165.446 L
270.03 179.946 L
265.71 195.19 L
261.994 210.998 L
258.868 227.193 L
256.324 243.599 L
254.377 260.079 L
253.014 276.522 L
252.212 292.815 L
251.952 308.848 L
252.22 324.504 L
253.028 339.691 L
254.36 354.352 L
256.195 368.436 L
258.511 381.89 L
261.289 394.661 L
264.541 406.673 L
268.266 417.884 L
272.44 428.281 L
277.038 437.845 L
S
GR
GS
[0.55814 0 0 0.55814 0 0.23254] CT
0 0.447 0.741 RC
2 LJ
N
277.038 437.845 M
282.037 446.562 L
287.412 454.416 L
293.142 461.389 L
299.247 467.418 L
305.708 472.478 L
312.486 476.561 L
319.54 479.661 L
326.832 481.771 L
334.321 482.884 L
341.969 482.991 L
349.769 482.014 L
357.672 479.927 L
365.611 476.725 L
373.517 472.407 L
381.323 466.971 L
388.962 460.414 L
396.377 452.663 L
403.493 443.69 L
410.225 433.53 L
416.489 422.218 L
422.198 409.791 L
427.261 396.247 L
431.586 381.553 L
435.112 365.829 L
437.779 349.207 L
439.527 331.816 L
440.284 313.765 L
439.967 295.125 L
438.593 276.123 L
436.189 257.004 L
432.782 238.01 L
428.389 219.384 L
423.014 201.349 L
416.757 184.148 L
409.729 168.027 L
402.042 153.237 L
393.77 140.067 L
385.031 128.673 L
375.959 119.167 L
366.693 111.66 L
357.356 106.31 L
348.044 103.204 L
338.852 102.268 L
329.875 103.426 L
321.212 106.625 L
312.947 111.863 L
305.121 118.967 L
297.769 127.742 L
290.924 137.992 L
S
GR
GS
[0.55814 0 0 0.55814 0 0.23254] CT
0 0.447 0.741 RC
2 LJ
N
290.924 137.992 M
284.635 149.559 L
278.938 162.321 L
273.829 176.082 L
269.301 190.645 L
265.349 205.814 L
261.988 221.419 L
259.227 237.336 L
257.049 253.426 L
255.432 269.552 L
254.361 285.577 L
253.843 301.373 L
253.874 316.86 L
254.433 331.961 L
255.499 346.604 L
257.051 360.713 L
259.093 374.202 L
261.628 387.014 L
264.636 399.122 L
268.094 410.497 L
271.981 421.111 L
276.276 430.936 L
280.977 439.926 L
286.099 448.025 L
291.613 455.224 L
297.487 461.515 L
303.69 466.889 L
310.19 471.337 L
316.956 474.852 L
323.967 477.409 L
331.229 478.938 L
338.692 479.425 L
346.301 478.868 L
354.002 477.26 L
361.739 474.597 L
369.457 470.874 L
377.118 466.022 L
384.665 460 L
392.017 452.823 L
399.096 444.508 L
405.822 435.07 L
412.116 424.516 L
417.896 412.771 L
423.085 399.884 L
427.609 385.941 L
431.394 371.028 L
434.365 355.229 L
436.414 338.536 L
437.497 321.073 L
437.605 303.044 L
S
GR
GS
[0.55814 0 0 0.55814 0 0.23254] CT
0 0.447 0.741 RC
2 LJ
N
437.605 303.044 M
436.732 284.656 L
434.867 266.113 L
431.986 247.602 L
428.082 229.304 L
423.237 211.471 L
417.535 194.353 L
411.057 178.204 L
403.85 163.298 L
396.024 149.82 L
387.708 137.937 L
379.034 127.813 L
370.114 119.666 L
361.046 113.608 L
351.94 109.625 L
342.907 107.703 L
334.059 107.854 L
325.484 110.122 L
317.238 114.37 L
309.376 120.436 L
301.952 128.16 L
295.035 137.449 L
288.663 148.175 L
282.838 160.137 L
277.565 173.132 L
272.847 186.957 L
268.704 201.444 L
265.156 216.471 L
262.188 231.889 L
259.784 247.544 L
257.928 263.284 L
256.63 278.973 L
255.888 294.513 L
255.683 309.815 L
255.994 324.79 L
256.801 339.348 L
258.108 353.391 L
259.916 366.858 L
262.206 379.711 L
264.956 391.91 L
268.147 403.417 L
271.757 414.192 L
275.803 424.168 L
280.283 433.307 L
285.167 441.601 L
290.427 449.036 L
296.036 455.602 L
301.965 461.287 L
308.186 466.08 L
314.699 469.937 L
S
GR
GS
[0.55814 0 0 0.55814 0 0.23254] CT
0 0.447 0.741 RC
2 LJ
N
314.699 469.937 M
321.5 472.806 L
328.542 474.68 L
335.777 475.555 L
343.157 475.426 L
350.634 474.286 L
358.162 472.13 L
365.716 468.881 L
373.241 464.511 L
380.665 459.027 L
387.915 452.438 L
394.919 444.754 L
401.603 435.978 L
407.897 426.033 L
413.726 414.938 L
419.014 402.759 L
423.682 389.56 L
427.655 375.407 L
430.837 360.294 L
433.158 344.271 L
434.589 327.509 L
435.104 310.183 L
434.674 292.462 L
433.258 274.502 L
430.817 256.441 L
427.404 238.512 L
423.082 220.96 L
417.912 204.027 L
411.927 187.962 L
405.191 172.984 L
397.826 159.282 L
389.951 147.047 L
381.679 136.491 L
373.095 127.828 L
364.313 121.099 L
355.45 116.329 L
346.623 113.547 L
337.936 112.85 L
329.463 114.21 L
321.268 117.495 L
313.416 122.576 L
305.98 129.346 L
299.028 137.757 L
292.578 147.628 L
286.641 158.761 L
281.229 170.958 L
276.355 184.027 L
272.058 197.846 L
268.336 212.276 L
265.178 227.16 L
S
GR
GS
[0.55814 0 0 0.55814 0 0.23254] CT
0 0.447 0.741 RC
2 LJ
N
265.178 227.16 M
262.57 242.337 L
260.504 257.652 L
258.999 272.985 L
258.042 288.237 L
257.612 303.311 L
257.69 318.106 L
258.262 332.522 L
259.344 346.468 L
260.919 359.892 L
262.97 372.75 L
265.474 384.993 L
268.412 396.577 L
271.781 407.442 L
275.597 417.527 L
279.836 426.815 L
284.471 435.292 L
289.476 442.943 L
294.825 449.755 L
300.492 455.714 L
306.463 460.789 L
312.753 464.919 L
319.324 468.091 L
326.132 470.301 L
333.134 471.542 L
340.286 471.81 L
347.545 471.098 L
354.88 469.372 L
362.264 466.559 L
369.632 462.665 L
376.916 457.694 L
384.048 451.654 L
390.96 444.551 L
397.586 436.357 L
403.861 427.008 L
409.711 416.552 L
415.059 405.045 L
419.83 392.539 L
423.946 379.082 L
427.312 364.634 L
429.876 349.299 L
431.604 333.229 L
432.459 316.577 L
432.405 299.494 L
431.378 282.09 L
429.365 264.52 L
426.414 247.015 L
422.573 229.805 L
417.889 213.121 L
412.377 197.194 L
S
GR
GS
[0.55814 0 0 0.55814 0 0.23254] CT
0 0.447 0.741 RC
2 LJ
N
412.377 197.194 M
406.11 182.227 L
399.198 168.415 L
391.754 155.953 L
383.876 145.066 L
375.645 135.953 L
367.173 128.662 L
358.579 123.237 L
349.978 119.723 L
341.471 118.233 L
333.131 118.749 L
325.026 121.157 L
317.225 125.345 L
309.803 131.221 L
302.829 138.752 L
296.324 147.766 L
290.304 158.073 L
284.787 169.485 L
279.791 181.82 L
275.355 194.967 L
271.481 208.785 L
268.155 223.113 L
265.369 237.793 L
263.116 252.667 L
261.416 267.62 L
260.258 282.549 L
259.621 297.354 L
259.488 311.931 L
259.845 326.177 L
260.707 340 L
262.061 353.345 L
263.886 366.165 L
266.162 378.408 L
268.869 390.024 L
272.006 400.951 L
275.587 411.13 L
279.587 420.543 L
283.981 429.174 L
288.743 437.006 L
293.849 444.024 L
299.272 450.21 L
305.01 455.523 L
311.069 459.911 L
317.408 463.366 L
323.987 465.882 L
330.764 467.455 L
337.698 468.079 L
344.747 467.747 L
351.888 466.412 L
359.093 464.017 L
S
GR
GS
[0.55814 0 0 0.55814 0 0.23254] CT
0 0.447 0.741 RC
2 LJ
N
359.093 464.017 M
366.295 460.569 L
373.432 456.072 L
380.437 450.532 L
387.247 443.955 L
393.801 436.308 L
400.037 427.534 L
405.881 417.678 L
411.26 406.792 L
416.101 394.925 L
420.329 382.12 L
423.852 368.335 L
426.619 353.664 L
428.592 338.25 L
429.734 322.234 L
430.005 305.759 L
429.342 288.927 L
427.723 271.872 L
425.189 254.816 L
421.782 237.979 L
417.546 221.582 L
412.492 205.843 L
406.674 190.96 L
400.196 177.125 L
393.165 164.528 L
385.679 153.376 L
377.807 143.894 L
369.658 136.146 L
361.345 130.179 L
352.98 126.04 L
344.669 123.819 L
336.486 123.568 L
328.5 125.185 L
320.779 128.564 L
313.391 133.603 L
306.416 140.283 L
299.886 148.472 L
293.818 157.991 L
288.229 168.657 L
283.137 180.289 L
278.579 192.759 L
274.57 205.952 L
271.101 219.711 L
268.162 233.881 L
265.744 248.306 L
263.862 262.856 L
262.517 277.432 L
261.692 291.934 L
261.369 306.26 L
261.529 320.312 L
S
GR
GS
[0.55814 0 0 0.55814 0 0.23254] CT
0 0.447 0.741 RC
2 LJ
N
261.529 320.312 M
262.179 333.987 L
263.321 347.22 L
264.934 359.961 L
266.999 372.161 L
269.496 383.772 L
272.408 394.739 L
275.756 404.991 L
279.526 414.499 L
283.692 423.245 L
288.23 431.214 L
293.114 438.388 L
298.317 444.751 L
303.819 450.281 L
309.637 454.914 L
315.745 458.629 L
322.1 461.421 L
328.662 463.286 L
335.389 464.217 L
342.24 464.209 L
349.179 463.248 L
356.19 461.256 L
363.218 458.223 L
370.201 454.157 L
377.075 449.067 L
383.776 442.959 L
390.242 435.836 L
396.415 427.62 L
402.228 418.328 L
407.61 408.014 L
412.491 396.729 L
416.801 384.528 L
420.459 371.416 L
423.39 357.394 L
425.559 342.601 L
426.932 327.181 L
427.478 311.279 L
427.157 295.029 L
425.907 278.523 L
423.75 261.945 L
420.731 245.51 L
416.895 229.429 L
412.281 213.918 L
406.9 199.185 L
400.839 185.408 L
394.201 172.766 L
387.09 161.435 L
379.589 151.634 L
371.776 143.515 L
363.758 137.112 L
S
GR
GS
[0.55814 0 0 0.55814 0 0.23254] CT
0 0.447 0.741 RC
2 LJ
N
363.758 137.112 M
355.642 132.461 L
347.535 129.599 L
339.528 128.632 L
331.687 129.53 L
324.074 132.183 L
316.754 136.481 L
309.792 142.336 L
303.257 149.72 L
297.169 158.476 L
291.542 168.429 L
286.392 179.403 L
281.733 191.222 L
277.602 203.776 L
274.008 216.947 L
270.94 230.588 L
268.387 244.552 L
266.341 258.693 L
264.819 272.893 L
263.819 287.058 L
263.322 301.097 L
263.311 314.916 L
263.767 328.422 L
264.701 341.521 L
266.11 354.151 L
267.976 366.269 L
270.279 377.828 L
272.998 388.786 L
276.115 399.094 L
279.651 408.681 L
283.594 417.517 L
287.919 425.585 L
292.597 432.871 L
297.603 439.361 L
302.907 445.04 L
308.484 449.892 L
314.341 453.864 L
320.465 456.915 L
326.812 459.044 L
333.34 460.245 L
340.003 460.515 L
346.758 459.85 L
353.564 458.243 L
360.4 455.622 L
367.215 451.965 L
373.947 447.286 L
380.53 441.598 L
386.902 434.913 L
392.998 427.242 L
398.756 418.517 L
S
GR
GS
[0.55814 0 0 0.55814 0 0.23254] CT
0 0.447 0.741 RC
2 LJ
N
398.756 418.517 M
404.112 408.749 L
409 398.003 L
413.356 386.341 L
417.115 373.828 L
420.199 360.493 L
422.531 346.332 L
424.086 331.489 L
424.845 316.122 L
424.787 300.386 L
423.891 284.436 L
422.107 268.387 L
419.447 252.401 L
415.968 236.685 L
411.725 221.444 L
406.773 206.888 L
401.131 193.23 L
394.88 180.636 L
388.123 169.254 L
380.965 159.235 L
373.5 150.757 L
365.8 143.983 L
357.959 138.927 L
350.076 135.593 L
342.247 133.989 L
334.564 134.177 L
327.089 136.152 L
319.874 139.79 L
312.972 144.967 L
306.435 151.564 L
300.334 159.54 L
294.692 168.773 L
289.518 179.092 L
284.818 190.327 L
280.602 202.307 L
276.884 214.88 L
273.694 227.959 L
271.024 241.418 L
268.86 255.127 L
267.192 268.954 L
266.016 282.772 L
265.348 296.488 L
265.175 310.024 L
265.477 323.299 L
266.237 336.235 L
267.44 348.752 L
269.102 360.768 L
271.212 372.24 L
273.749 383.131 L
276.693 393.406 L
S
GR
GS
[0.55814 0 0 0.55814 0 0.23254] CT
0 0.447 0.741 RC
2 LJ
N
276.693 393.406 M
280.023 403.029 L
283.72 411.963 L
287.803 420.141 L
292.262 427.534 L
297.065 434.13 L
302.183 439.918 L
307.584 444.887 L
313.24 449.027 L
319.119 452.326 L
325.218 454.735 L
331.525 456.208 L
337.992 456.743 L
344.57 456.339 L
351.212 454.997 L
357.869 452.715 L
364.494 449.486 L
371.056 445.236 L
377.5 439.957 L
383.761 433.673 L
389.773 426.407 L
395.472 418.182 L
400.791 409.009 L
405.661 398.826 L
410.025 387.687 L
413.826 375.677 L
417.009 362.882 L
419.517 349.385 L
421.27 335.215 L
422.213 320.426 L
422.347 305.193 L
421.674 289.691 L
420.199 274.098 L
417.922 258.589 L
414.815 243.306 L
410.916 228.419 L
406.299 214.119 L
401.036 200.597 L
395.197 188.052 L
388.82 176.694 L
381.997 166.642 L
374.833 157.995 L
367.431 150.856 L
359.887 145.358 L
352.272 141.615 L
344.664 139.589 L
337.146 139.238 L
329.798 140.517 L
322.701 143.453 L
315.906 147.994 L
S
GR
GS
[0.55814 0 0 0.55814 0 0.23254] CT
0 0.447 0.741 RC
2 LJ
N
315.906 147.994 M
309.447 153.996 L
303.361 161.315 L
297.681 169.806 L
292.46 179.382 L
287.721 189.943 L
283.464 201.33 L
279.689 213.388 L
276.396 225.961 L
273.597 238.909 L
271.313 252.142 L
269.532 265.548 L
268.238 279.017 L
267.42 292.436 L
267.071 305.694 L
267.208 318.708 L
267.815 331.415 L
268.872 343.751 L
270.363 355.655 L
272.269 367.063 L
274.602 377.898 L
277.359 388.119 L
280.518 397.699 L
284.056 406.612 L
287.949 414.832 L
292.176 422.335 L
296.726 429.083 L
301.615 435.015 L
306.813 440.118 L
312.286 444.386 L
317.999 447.81 L
323.917 450.384 L
330.005 452.1 L
336.234 452.942 L
342.6 452.836 L
349.058 451.775 L
355.555 449.762 L
362.036 446.805 L
368.449 442.906 L
374.739 438.071 L
380.861 432.243 L
386.763 425.397 L
392.381 417.573 L
397.651 408.809 L
402.509 399.146 L
406.891 388.616 L
410.719 377.173 L
413.944 364.882 L
416.526 351.854 L
418.425 338.204 L
S
GR
GS
[0.55814 0 0 0.55814 0 0.23254] CT
0 0.447 0.741 RC
2 LJ
N
418.425 338.204 M
419.601 324.044 L
420 309.459 L
419.568 294.52 L
418.328 279.402 L
416.306 264.292 L
413.527 249.372 L
410.013 234.826 L
405.756 220.821 L
400.826 207.522 L
395.307 195.095 L
389.284 183.709 L
382.828 173.555 L
375.994 164.807 L
368.878 157.523 L
361.579 151.753 L
354.194 147.549 L
346.814 145 L
339.502 144.17 L
332.323 144.982 L
325.338 147.352 L
318.613 151.197 L
312.218 156.5 L
306.194 163.194 L
300.562 171.126 L
295.341 180.14 L
290.552 190.084 L
286.22 200.823 L
282.381 212.282 L
279.031 224.326 L
276.162 236.82 L
273.768 249.625 L
271.848 262.607 L
270.425 275.674 L
269.488 288.736 L
269.022 301.703 L
269.01 314.484 L
269.439 326.988 L
270.324 339.129 L
271.658 350.852 L
273.421 362.112 L
275.594 372.862 L
278.158 383.058 L
281.099 392.648 L
284.435 401.564 L
288.153 409.779 L
292.225 417.277 L
296.624 424.041 L
301.324 430.056 L
306.297 435.305 L
S
GR
GS
[0.55814 0 0 0.55814 0 0.23254] CT
0 0.447 0.741 RC
2 LJ
N
306.297 435.305 M
311.52 439.77 L
317.004 443.387 L
322.725 446.132 L
328.642 448.004 L
334.713 448.999 L
340.896 449.114 L
347.149 448.348 L
353.433 446.689 L
359.73 444.064 L
365.988 440.469 L
372.149 435.919 L
378.155 430.431 L
383.947 424.023 L
389.466 416.706 L
394.654 408.416 L
399.455 399.175 L
403.813 389.051 L
407.67 378.109 L
410.971 366.417 L
413.651 354.014 L
415.633 340.891 L
416.899 327.18 L
417.44 313.031 L
417.243 298.593 L
416.298 284.015 L
414.576 269.427 L
412.061 254.948 L
408.807 240.754 L
404.87 227.027 L
400.306 213.947 L
395.153 201.706 L
389.449 190.47 L
383.287 180.355 L
376.762 171.475 L
369.967 163.946 L
362.975 157.937 L
355.854 153.514 L
348.687 150.658 L
341.554 149.354 L
334.54 149.587 L
327.716 151.416 L
321.132 154.78 L
314.826 159.558 L
308.84 165.626 L
303.217 172.865 L
298.012 181.227 L
293.246 190.603 L
288.923 200.846 L
285.046 211.806 L
S
GR
GS
[0.55814 0 0 0.55814 0 0.23254] CT
0 0.447 0.741 RC
2 LJ
N
285.046 211.806 M
281.62 223.333 L
278.658 235.293 L
276.186 247.608 L
274.195 260.17 L
272.674 272.869 L
271.61 285.594 L
270.997 298.234 L
270.853 310.704 L
271.166 322.938 L
271.92 334.87 L
273.098 346.437 L
274.68 357.572 L
276.672 368.204 L
279.08 378.278 L
281.882 387.766 L
285.057 396.639 L
288.582 404.87 L
292.435 412.431 L
296.601 419.286 L
301.097 425.373 L
305.902 430.674 L
310.98 435.18 L
316.299 438.883 L
321.824 441.777 L
327.522 443.852 L
333.361 445.099 L
339.338 445.451 L
345.42 444.887 L
351.555 443.413 L
357.694 441.035 L
363.785 437.758 L
369.779 433.589 L
375.629 428.503 L
381.293 422.441 L
386.712 415.438 L
391.828 407.534 L
396.581 398.77 L
400.913 389.184 L
404.755 378.765 L
408.049 367.51 L
410.758 355.525 L
412.846 342.918 L
414.278 329.797 L
415.018 316.268 L
414.998 302.38 L
414.213 288.257 L
412.688 274.067 L
410.448 259.983 L
407.52 246.172 L
S
GR
GS
[0.55814 0 0 0.55814 0 0.23254] CT
0 0.447 0.741 RC
2 LJ
N
407.52 246.172 M
403.91 232.803 L
399.63 220.024 L
394.76 207.984 L
389.376 196.834 L
383.558 186.723 L
377.361 177.842 L
370.846 170.31 L
364.101 164.167 L
357.218 159.452 L
350.286 156.202 L
343.384 154.502 L
336.569 154.391 L
329.896 155.788 L
323.423 158.609 L
317.207 162.771 L
311.312 168.251 L
305.777 174.993 L
300.62 182.852 L
295.855 191.684 L
291.501 201.345 L
287.577 211.701 L
284.118 222.681 L
281.126 234.174 L
278.593 246.057 L
276.512 258.204 L
274.878 270.492 L
273.711 282.824 L
273.008 295.122 L
272.756 307.305 L
272.939 319.294 L
273.541 331.008 L
274.562 342.364 L
276.013 353.299 L
277.876 363.772 L
280.132 373.743 L
282.76 383.172 L
285.741 392.02 L
289.071 400.234 L
292.766 407.753 L
296.801 414.563 L
301.146 420.651 L
305.773 426.002 L
310.651 430.605 L
315.753 434.445 L
321.051 437.507 L
326.553 439.726 L
332.231 441.081 L
338.042 441.575 L
343.942 441.207 L
S
GR
GS
[0.55814 0 0 0.55814 0 0.23254] CT
0 0.447 0.741 RC
2 LJ
N
343.942 441.207 M
349.886 439.98 L
355.83 437.895 L
361.734 434.937 L
367.572 431.036 L
373.289 426.205 L
378.829 420.47 L
384.136 413.858 L
389.153 406.396 L
393.823 398.096 L
398.085 388.902 L
401.891 378.872 L
405.197 368.091 L
407.957 356.639 L
410.126 344.6 L
411.645 332.023 L
412.454 318.937 L
412.556 305.488 L
411.958 291.83 L
410.667 278.118 L
408.691 264.506 L
406.015 251.13 L
402.646 238.121 L
398.649 225.635 L
394.09 213.827 L
389.033 202.854 L
383.52 192.899 L
377.602 184.093 L
371.368 176.505 L
364.904 170.205 L
358.299 165.262 L
351.627 161.795 L
344.943 159.853 L
338.313 159.383 L
331.803 160.332 L
325.476 162.648 L
319.401 166.34 L
313.618 171.365 L
308.153 177.593 L
303.033 184.894 L
298.284 193.138 L
293.939 202.217 L
290.034 212.073 L
286.568 222.581 L
283.54 233.611 L
280.947 245.035 L
278.789 256.724 L
277.091 268.589 L
275.852 280.548 L
275.058 292.511 L
S
GR
GS
[0.55814 0 0 0.55814 0 0.23254] CT
0 0.447 0.741 RC
2 LJ
N
275.058 292.511 M
274.696 304.388 L
274.752 316.091 L
275.232 327.531 L
276.144 338.645 L
277.469 349.386 L
279.191 359.705 L
281.289 369.553 L
283.747 378.882 L
286.572 387.628 L
289.768 395.745 L
293.308 403.215 L
297.168 410.019 L
301.321 416.14 L
305.742 421.558 L
310.405 426.255 L
315.31 430.182 L
320.453 433.297 L
325.795 435.596 L
331.296 437.079 L
336.918 437.742 L
342.621 437.584 L
348.366 436.603 L
354.131 434.748 L
359.885 431.982 L
365.575 428.323 L
371.147 423.789 L
376.55 418.399 L
381.73 412.171 L
386.635 405.092 L
391.212 397.116 L
395.414 388.301 L
399.191 378.714 L
402.495 368.42 L
405.277 357.483 L
407.468 345.916 L
409.017 333.746 L
409.917 321.108 L
410.163 308.14 L
409.747 294.979 L
408.664 281.765 L
406.891 268.613 L
404.416 255.631 L
401.292 242.973 L
397.571 230.795 L
393.308 219.252 L
388.54 208.511 L
383.295 198.724 L
377.655 189.98 L
371.703 182.368 L
S
GR
GS
[0.55814 0 0 0.55814 0 0.23254] CT
0 0.447 0.741 RC
2 LJ
N
371.703 182.368 M
365.522 175.976 L
359.185 170.923 L
352.746 167.312 L
346.274 165.118 L
339.836 164.313 L
333.503 164.865 L
327.343 166.778 L
321.408 170.072 L
315.732 174.64 L
310.346 180.366 L
305.283 187.133 L
300.58 194.837 L
296.281 203.437 L
292.395 212.821 L
288.924 222.859 L
285.87 233.422 L
283.233 244.379 L
281.023 255.624 L
279.249 267.086 L
S
GR
GS
[0.55814 0 0 0.55814 189.20949 25.48837] CT
/Helvetica-Bold 20 F
GS
[1 0 0 1 0 0] CT
-62.5 -5 moveto 
1 -1 scale
(Solver ode23) t 
GR
GR
GS
[0.55814 0 0 0.55814 0 0.23254] CT
1 GC
N
589 570 M
894 570 L
894 48 L
589 48 L
cp
f
GR
GS
[0.55814 0 0 0.55814 0 0.23254] CT
0.873 GC
2 LJ
N
589 570 M
589 48 L
S
GR
GS
[0.55814 0 0 0.55814 0 0.23254] CT
0.873 GC
2 LJ
N
665.25 570 M
665.25 48 L
S
GR
GS
[0.55814 0 0 0.55814 0 0.23254] CT
0.873 GC
2 LJ
N
741.5 570 M
741.5 48 L
S
GR
GS
[0.55814 0 0 0.55814 0 0.23254] CT
0.873 GC
2 LJ
N
817.75 570 M
817.75 48 L
S
GR
GS
[0.55814 0 0 0.55814 0 0.23254] CT
0.873 GC
2 LJ
N
894 570 M
894 48 L
S
GR
GS
[0.55814 0 0 0.55814 0 0.23254] CT
0.873 GC
2 LJ
N
894 570 M
589 570 L
S
GR
GS
[0.55814 0 0 0.55814 0 0.23254] CT
0.873 GC
2 LJ
N
894 483 M
589 483 L
S
GR
GS
[0.55814 0 0 0.55814 0 0.23254] CT
0.873 GC
2 LJ
N
894 396 M
589 396 L
S
GR
GS
[0.55814 0 0 0.55814 0 0.23254] CT
0.873 GC
2 LJ
N
894 309 M
589 309 L
S
GR
GS
[0.55814 0 0 0.55814 0 0.23254] CT
0.873 GC
2 LJ
N
894 222 M
589 222 L
S
GR
GS
[0.55814 0 0 0.55814 0 0.23254] CT
0.873 GC
2 LJ
N
894 135 M
589 135 L
S
GR
GS
[0.55814 0 0 0.55814 0 0.23254] CT
0.873 GC
2 LJ
N
894 48 M
589 48 L
S
GR
GS
[0.55814 0 0 0.55814 0 0.23254] CT
0.149 GC
2 LJ
N
589 570 M
894 570 L
S
GR
GS
[0.55814 0 0 0.55814 0 0.23254] CT
0.149 GC
2 LJ
N
589 48 M
894 48 L
S
GR
GS
[0.55814 0 0 0.55814 0 0.23254] CT
0.149 GC
2 LJ
N
589 570 M
589 564.78 L
S
GR
GS
[0.55814 0 0 0.55814 0 0.23254] CT
0.149 GC
2 LJ
N
665.25 570 M
665.25 564.78 L
S
GR
GS
[0.55814 0 0 0.55814 0 0.23254] CT
0.149 GC
2 LJ
N
741.5 570 M
741.5 564.78 L
S
GR
GS
[0.55814 0 0 0.55814 0 0.23254] CT
0.149 GC
2 LJ
N
817.75 570 M
817.75 564.78 L
S
GR
GS
[0.55814 0 0 0.55814 0 0.23254] CT
0.149 GC
2 LJ
N
894 570 M
894 564.78 L
S
GR
GS
[0.55814 0 0 0.55814 0 0.23254] CT
0.149 GC
2 LJ
N
589 48 M
589 53.22 L
S
GR
GS
[0.55814 0 0 0.55814 0 0.23254] CT
0.149 GC
2 LJ
N
665.25 48 M
665.25 53.22 L
S
GR
GS
[0.55814 0 0 0.55814 0 0.23254] CT
0.149 GC
2 LJ
N
741.5 48 M
741.5 53.22 L
S
GR
GS
[0.55814 0 0 0.55814 0 0.23254] CT
0.149 GC
2 LJ
N
817.75 48 M
817.75 53.22 L
S
GR
GS
[0.55814 0 0 0.55814 0 0.23254] CT
0.149 GC
2 LJ
N
894 48 M
894 53.22 L
S
GR
GS
[0.55814 0 0 0.55814 328.74419 322.3721] CT
0.149 GC
/Helvetica 18 F
GS
[1 0 0 1 0 0] CT
-15.5 19 moveto 
1 -1 scale
(300) t 
GR
GR
GS
[0.55814 0 0 0.55814 371.30233 322.3721] CT
0.149 GC
/Helvetica 18 F
GS
[1 0 0 1 0 0] CT
-15.5 19 moveto 
1 -1 scale
(400) t 
GR
GR
GS
[0.55814 0 0 0.55814 413.86047 322.3721] CT
0.149 GC
/Helvetica 18 F
GS
[1 0 0 1 0 0] CT
-15.5 19 moveto 
1 -1 scale
(500) t 
GR
GR
GS
[0.55814 0 0 0.55814 456.41861 322.3721] CT
0.149 GC
/Helvetica 18 F
GS
[1 0 0 1 0 0] CT
-15.5 19 moveto 
1 -1 scale
(600) t 
GR
GR
GS
[0.55814 0 0 0.55814 498.97675 322.3721] CT
0.149 GC
/Helvetica 18 F
GS
[1 0 0 1 0 0] CT
-15.5 19 moveto 
1 -1 scale
(700) t 
GR
GR
GS
[0.55814 0 0 0.55814 0 0.23254] CT
0.149 GC
2 setlinecap
10.0 ML
N
589 570 M
589 48 L
S
GR
GS
[0.55814 0 0 0.55814 0 0.23254] CT
0.149 GC
2 setlinecap
10.0 ML
N
894 570 M
894 48 L
S
GR
GS
[0.55814 0 0 0.55814 0 0.23254] CT
0.149 GC
2 setlinecap
10.0 ML
N
589 570 M
594.22 570 L
S
GR
GS
[0.55814 0 0 0.55814 0 0.23254] CT
0.149 GC
2 setlinecap
10.0 ML
N
589 483 M
594.22 483 L
S
GR
GS
[0.55814 0 0 0.55814 0 0.23254] CT
0.149 GC
2 setlinecap
10.0 ML
N
589 396 M
594.22 396 L
S
GR
GS
[0.55814 0 0 0.55814 0 0.23254] CT
0.149 GC
2 setlinecap
10.0 ML
N
589 309 M
594.22 309 L
S
GR
GS
[0.55814 0 0 0.55814 0 0.23254] CT
0.149 GC
2 setlinecap
10.0 ML
N
589 222 M
594.22 222 L
S
GR
GS
[0.55814 0 0 0.55814 0 0.23254] CT
0.149 GC
2 setlinecap
10.0 ML
N
589 135 M
594.22 135 L
S
GR
GS
[0.55814 0 0 0.55814 0 0.23254] CT
0.149 GC
2 setlinecap
10.0 ML
N
589 48 M
594.22 48 L
S
GR
GS
[0.55814 0 0 0.55814 0 0.23254] CT
0.149 GC
2 setlinecap
10.0 ML
N
894 570 M
888.78 570 L
S
GR
GS
[0.55814 0 0 0.55814 0 0.23254] CT
0.149 GC
2 setlinecap
10.0 ML
N
894 483 M
888.78 483 L
S
GR
GS
[0.55814 0 0 0.55814 0 0.23254] CT
0.149 GC
2 setlinecap
10.0 ML
N
894 396 M
888.78 396 L
S
GR
GS
[0.55814 0 0 0.55814 0 0.23254] CT
0.149 GC
2 setlinecap
10.0 ML
N
894 309 M
888.78 309 L
S
GR
GS
[0.55814 0 0 0.55814 0 0.23254] CT
0.149 GC
2 setlinecap
10.0 ML
N
894 222 M
888.78 222 L
S
GR
GS
[0.55814 0 0 0.55814 0 0.23254] CT
0.149 GC
2 setlinecap
10.0 ML
N
894 135 M
888.78 135 L
S
GR
GS
[0.55814 0 0 0.55814 0 0.23254] CT
0.149 GC
2 setlinecap
10.0 ML
N
894 48 M
888.78 48 L
S
GR
GS
[0.55814 0 0 0.55814 324.74418 318.37209] CT
0.149 GC
/Helvetica 18 F
GS
[1 0 0 1 0 0] CT
-31 7.5 moveto 
1 -1 scale
(250) t 
GR
GR
GS
[0.55814 0 0 0.55814 324.74418 269.81395] CT
0.149 GC
/Helvetica 18 F
GS
[1 0 0 1 0 0] CT
-31 7.5 moveto 
1 -1 scale
(300) t 
GR
GR
GS
[0.55814 0 0 0.55814 324.74418 221.25581] CT
0.149 GC
/Helvetica 18 F
GS
[1 0 0 1 0 0] CT
-31 7.5 moveto 
1 -1 scale
(350) t 
GR
GR
GS
[0.55814 0 0 0.55814 324.74418 172.69767] CT
0.149 GC
/Helvetica 18 F
GS
[1 0 0 1 0 0] CT
-31 7.5 moveto 
1 -1 scale
(400) t 
GR
GR
GS
[0.55814 0 0 0.55814 324.74418 124.13953] CT
0.149 GC
/Helvetica 18 F
GS
[1 0 0 1 0 0] CT
-31 7.5 moveto 
1 -1 scale
(450) t 
GR
GR
GS
[0.55814 0 0 0.55814 324.74418 75.58138] CT
0.149 GC
/Helvetica 18 F
GS
[1 0 0 1 0 0] CT
-31 7.5 moveto 
1 -1 scale
(500) t 
GR
GR
GS
[0.55814 0 0 0.55814 324.74418 27.02324] CT
0.149 GC
/Helvetica 18 F
GS
[1 0 0 1 0 0] CT
-31 7.5 moveto 
1 -1 scale
(550) t 
GR
GR
GS
[0.55814 0 0 0.55814 0 0.23254] CT
0 0.447 0.741 RC
2 LJ
N
741.5 91.5 M
732.094 92.633 L
723.013 95.976 L
714.333 101.417 L
706.117 108.814 L
698.416 118.009 L
691.267 128.821 L
684.692 141.056 L
678.706 154.517 L
673.332 169.013 L
668.584 184.358 L
664.47 200.372 L
660.99 216.881 L
658.14 233.719 L
655.906 250.722 L
654.271 267.737 L
653.208 284.613 L
652.686 301.208 L
652.694 317.446 L
653.239 333.274 L
654.31 348.606 L
655.898 363.367 L
657.992 377.489 L
660.579 390.913 L
663.648 403.589 L
667.185 415.475 L
671.174 426.539 L
675.603 436.756 L
680.453 446.111 L
685.71 454.597 L
691.353 462.208 L
697.366 468.915 L
703.733 474.685 L
710.434 479.491 L
717.445 483.306 L
724.738 486.104 L
732.28 487.864 L
740.032 488.564 L
747.954 488.186 L
755.999 486.712 L
764.117 484.127 L
772.252 480.419 L
780.345 475.576 L
788.339 469.599 L
796.187 462.492 L
803.788 454.194 L
811.043 444.661 L
817.856 433.867 L
824.136 421.813 L
829.798 408.52 L
S
GR
GS
[0.55814 0 0 0.55814 0 0.23254] CT
0 0.447 0.741 RC
2 LJ
N
829.798 408.52 M
834.76 394.032 L
838.947 378.414 L
842.286 361.756 L
844.711 344.169 L
846.16 325.786 L
846.575 306.764 L
845.898 287.23 L
844.084 267.217 L
841.172 247.073 L
837.216 227.156 L
832.276 207.791 L
826.422 189.272 L
819.731 171.863 L
812.288 155.794 L
804.187 141.268 L
795.528 128.452 L
786.421 117.487 L
776.982 108.478 L
767.336 101.502 L
757.616 96.604 L
747.952 93.921 L
738.451 93.52 L
729.204 95.329 L
720.294 99.26 L
711.793 105.204 L
703.763 113.036 L
696.253 122.611 L
689.305 133.768 L
682.949 146.324 L
677.204 160.082 L
672.079 174.823 L
667.573 190.318 L
663.678 206.402 L
660.39 222.91 L
657.708 239.679 L
655.627 256.561 L
654.137 273.417 L
653.23 290.122 L
652.891 306.561 L
653.104 322.632 L
653.853 338.245 L
655.115 353.321 L
656.87 367.801 L
659.114 381.652 L
661.84 394.817 L
665.039 407.246 L
668.702 418.892 L
672.817 429.714 L
677.368 439.676 L
S
GR
GS
[0.55814 0 0 0.55814 0 0.23254] CT
0 0.447 0.741 RC
2 LJ
N
677.368 439.676 M
682.342 448.749 L
687.721 456.909 L
693.487 464.136 L
699.617 470.419 L
706.091 475.749 L
712.885 480.126 L
719.971 483.551 L
727.324 486.015 L
734.91 487.475 L
742.693 487.889 L
750.629 487.224 L
758.672 485.447 L
766.768 482.533 L
774.862 478.461 L
782.891 473.214 L
790.787 466.779 L
798.48 459.15 L
805.892 450.324 L
812.941 440.303 L
819.542 429.094 L
825.638 416.72 L
831.143 403.193 L
835.938 388.531 L
839.92 372.776 L
843.002 356.001 L
845.113 338.304 L
846.202 319.811 L
846.228 300.676 L
845.173 281.079 L
843.031 261.229 L
839.813 241.363 L
835.548 221.742 L
830.28 202.659 L
824.072 184.37 L
817.017 167.106 L
809.223 151.151 L
800.799 136.753 L
791.858 124.129 L
782.516 113.458 L
772.89 104.882 L
763.103 98.513 L
753.279 94.423 L
743.545 92.65 L
734.03 93.198 L
724.867 96.036 L
716.123 101.03 L
707.803 107.976 L
699.975 116.727 L
692.693 127.127 L
S
GR
GS
[0.55814 0 0 0.55814 0 0.23254] CT
0 0.447 0.741 RC
2 LJ
N
692.693 127.127 M
686.001 139.009 L
679.93 152.201 L
674.5 166.52 L
669.72 181.774 L
665.587 197.764 L
662.086 214.281 L
659.19 231.109 L
656.861 248.02 L
655.074 264.849 L
653.859 281.59 L
653.208 298.132 L
653.112 314.365 L
653.558 330.193 L
654.536 345.53 L
656.032 360.301 L
658.034 374.441 L
660.527 387.899 L
663.498 400.633 L
666.929 412.613 L
670.806 423.817 L
675.116 434.214 L
679.851 443.767 L
685 452.445 L
690.546 460.218 L
696.473 467.058 L
702.76 472.943 L
709.384 477.852 L
716.317 481.766 L
723.53 484.671 L
730.991 486.555 L
738.664 487.409 L
746.511 487.227 L
754.493 486.008 L
762.57 483.74 L
770.679 480.364 L
778.754 475.832 L
786.724 470.106 L
794.517 463.159 L
802.059 454.976 L
809.272 445.555 L
816.078 434.905 L
822.396 423.045 L
828.141 410.009 L
833.227 395.839 L
837.567 380.591 L
841.073 364.317 L
843.683 347.019 L
845.33 328.856 L
845.958 310.025 L
S
GR
GS
[0.55814 0 0 0.55814 0 0.23254] CT
0 0.447 0.741 RC
2 LJ
N
845.958 310.025 M
845.531 290.724 L
844.028 271.161 L
841.449 251.546 L
837.81 232.097 L
833.144 213.036 L
827.505 194.592 L
820.962 177 L
813.603 160.499 L
805.534 145.335 L
796.878 131.759 L
787.785 120.056 L
778.385 110.398 L
768.783 102.864 L
759.085 97.506 L
749.39 94.356 L
739.799 93.418 L
730.406 94.675 L
721.305 98.083 L
712.586 103.578 L
704.337 111.066 L
696.643 120.435 L
689.586 131.543 L
683.141 144.092 L
677.281 157.814 L
672.033 172.525 L
667.416 188.05 L
663.44 204.217 L
660.109 220.856 L
657.42 237.804 L
655.361 254.901 L
653.913 271.992 L
653.052 288.926 L
652.743 305.555 L
652.945 321.738 L
653.64 337.395 L
654.852 352.542 L
656.574 367.107 L
658.795 381.028 L
661.506 394.246 L
664.693 406.711 L
668.344 418.381 L
672.445 429.222 L
676.981 439.205 L
681.937 448.31 L
687.295 456.525 L
693.038 463.844 L
699.146 470.265 L
705.598 475.761 L
712.374 480.3 L
S
GR
GS
[0.55814 0 0 0.55814 0 0.23254] CT
0 0.447 0.741 RC
2 LJ
N
712.374 480.3 M
719.451 483.85 L
726.799 486.384 L
734.387 487.876 L
742.175 488.303 L
750.122 487.644 L
758.179 485.878 L
766.294 482.991 L
774.411 478.966 L
782.467 473.791 L
790.395 467.457 L
798.132 459.963 L
805.63 451.324 L
812.782 441.49 L
819.481 430.424 L
825.625 418.115 L
831.121 404.576 L
835.884 389.847 L
839.839 373.992 L
842.916 357.102 L
845.055 339.295 L
846.203 320.711 L
846.315 301.517 L
845.354 281.908 L
843.29 262.069 L
840.104 242.08 L
835.857 222.282 L
830.622 203.031 L
824.479 184.643 L
817.516 167.405 L
809.824 151.565 L
801.505 137.34 L
792.666 124.91 L
783.419 114.422 L
773.884 105.987 L
764.189 99.682 L
754.465 95.55 L
744.846 93.619 L
735.421 93.951 L
726.278 96.476 L
717.498 101.092 L
709.151 107.681 L
701.296 116.107 L
693.981 126.22 L
687.243 137.852 L
681.106 150.82 L
675.586 164.923 L
670.685 179.946 L
666.396 195.657 L
662.707 211.858 L
S
GR
GS
[0.55814 0 0 0.55814 0 0.23254] CT
0 0.447 0.741 RC
2 LJ
N
662.707 211.858 M
659.623 228.43 L
657.137 245.215 L
655.246 262.068 L
653.939 278.853 L
653.207 295.45 L
653.037 311.749 L
653.416 327.652 L
654.328 343.073 L
655.754 357.941 L
657.674 372.194 L
660.075 385.795 L
662.951 398.701 L
666.295 410.863 L
670.096 422.236 L
674.344 432.78 L
679.024 442.461 L
684.121 451.248 L
689.617 459.117 L
695.494 466.049 L
701.73 472.028 L
708.301 477.045 L
715.183 481.094 L
722.349 484.176 L
729.771 486.293 L
737.415 487.412 L
745.243 487.488 L
753.208 486.483 L
761.263 484.361 L
769.353 481.095 L
777.418 476.662 L
785.396 471.044 L
793.219 464.232 L
800.812 456.217 L
808.1 447.002 L
814.999 436.591 L
821.423 424.997 L
827.293 412.236 L
832.552 398.332 L
837.088 383.317 L
840.794 367.247 L
843.585 350.203 L
845.39 332.292 L
846.158 313.646 L
845.853 294.424 L
844.46 274.808 L
841.978 255.008 L
838.426 235.258 L
833.84 215.818 L
828.274 196.973 L
S
GR
GS
[0.55814 0 0 0.55814 0 0.23254] CT
0 0.447 0.741 RC
2 LJ
N
828.274 196.973 M
821.799 179.025 L
814.511 162.206 L
806.521 146.769 L
797.94 132.948 L
788.88 120.942 L
779.458 110.92 L
769.791 103.013 L
759.997 97.322 L
750.197 93.909 L
740.514 92.807 L
731.073 94.013 L
721.998 97.488 L
713.393 103.133 L
705.235 110.691 L
697.577 119.994 L
690.472 130.882 L
683.963 143.189 L
678.081 156.741 L
672.846 171.358 L
668.267 186.854 L
664.341 203.035 L
661.054 219.699 L
658.38 236.641 L
656.283 253.645 L
654.716 270.494 L
653.694 287.153 L
653.23 303.579 L
653.314 319.668 L
653.936 335.326 L
655.084 350.47 L
656.745 365.028 L
658.907 378.937 L
661.557 392.147 L
664.681 404.615 L
668.263 416.313 L
672.289 427.218 L
676.742 437.312 L
681.612 446.561 L
686.887 454.932 L
692.553 462.396 L
698.593 468.926 L
704.986 474.498 L
711.708 479.088 L
718.731 482.679 L
726.024 485.252 L
733.555 486.794 L
741.284 487.293 L
749.171 486.739 L
757.172 485.127 L
S
GR
GS
[0.55814 0 0 0.55814 0 0.23254] CT
0 0.447 0.741 RC
2 LJ
N
757.172 485.127 M
765.249 482.459 L
773.349 478.705 L
781.398 473.804 L
789.32 467.711 L
797.039 460.393 L
804.476 451.832 L
811.553 442.025 L
818.19 430.981 L
824.306 418.724 L
829.82 405.292 L
834.648 390.737 L
838.707 375.125 L
841.911 358.535 L
844.179 340.996 L
845.456 322.563 L
845.703 303.48 L
844.893 283.989 L
843.019 264.327 L
840.088 244.731 L
836.124 225.43 L
831.166 206.653 L
825.269 188.622 L
818.505 171.559 L
810.96 155.678 L
802.739 141.192 L
793.96 128.31 L
784.76 117.243 L
775.294 108.261 L
765.68 101.463 L
756.019 96.876 L
746.409 94.502 L
736.941 94.324 L
727.706 96.303 L
718.785 100.376 L
710.258 106.462 L
702.2 114.455 L
694.681 124.229 L
687.765 135.635 L
681.508 148.497 L
675.866 162.51 L
670.829 177.45 L
666.411 193.134 L
662.621 209.389 L
659.46 226.048 L
656.925 242.954 L
655.008 259.956 L
653.692 276.911 L
652.959 293.684 L
652.783 310.147 L
S
GR
GS
[0.55814 0 0 0.55814 0 0.23254] CT
0 0.447 0.741 RC
2 LJ
N
652.783 310.147 M
653.131 326.18 L
653.977 341.693 L
655.332 356.674 L
657.192 371.061 L
659.548 384.792 L
662.39 397.809 L
665.705 410.064 L
669.482 421.514 L
673.706 432.123 L
678.361 441.863 L
683.433 450.712 L
688.904 458.655 L
694.753 465.685 L
700.963 471.801 L
707.511 477.001 L
714.373 481.254 L
721.525 484.524 L
728.939 486.78 L
736.58 487.991 L
744.411 488.133 L
752.387 487.18 L
760.46 485.113 L
768.577 481.912 L
776.678 477.562 L
784.7 472.051 L
792.575 465.368 L
800.229 457.506 L
807.595 448.47 L
814.62 438.277 L
821.189 426.887 L
827.188 414.279 L
832.517 400.462 L
837.085 385.472 L
840.813 369.372 L
843.632 352.253 L
845.485 334.233 L
846.325 315.46 L
846.118 296.106 L
844.839 276.374 L
842.474 256.492 L
839.018 236.68 L
834.493 217.077 L
828.979 198.025 L
822.565 179.856 L
815.345 162.867 L
807.42 147.32 L
798.896 133.439 L
789.884 121.413 L
780.5 111.393 L
S
GR
GS
[0.55814 0 0 0.55814 0 0.23254] CT
0 0.447 0.741 RC
2 LJ
N
780.5 111.393 M
770.866 103.498 L
761.11 97.806 L
751.365 94.363 L
741.77 93.176 L
732.418 94.234 L
723.372 97.466 L
714.711 102.758 L
706.504 109.981 L
698.81 118.992 L
691.673 129.635 L
685.128 141.739 L
679.198 155.119 L
673.893 169.577 L
669.213 184.9 L
665.147 200.862 L
661.67 217.227 L
658.785 233.874 L
656.495 250.688 L
654.792 267.525 L
653.668 284.256 L
653.113 300.763 L
653.114 316.938 L
653.66 332.69 L
654.734 347.935 L
656.323 362.605 L
658.408 376.643 L
660.971 390.004 L
664.001 402.659 L
667.493 414.561 L
671.436 425.669 L
675.82 435.944 L
680.632 445.351 L
685.856 453.861 L
691.475 461.448 L
697.469 468.092 L
703.815 473.775 L
710.49 478.485 L
717.468 482.214 L
724.72 484.957 L
732.215 486.716 L
739.922 487.485 L
747.802 487.219 L
755.805 485.873 L
763.881 483.407 L
771.971 479.789 L
780.015 474.994 L
787.949 469.004 L
795.701 461.807 L
803.199 453.399 L
S
GR
GS
[0.55814 0 0 0.55814 0 0.23254] CT
0 0.447 0.741 RC
2 LJ
N
803.199 453.399 M
810.365 443.783 L
817.116 432.969 L
823.366 420.973 L
829.023 407.819 L
834.025 393.525 L
838.291 378.132 L
841.717 361.714 L
844.213 344.369 L
845.711 326.217 L
846.16 307.401 L
845.529 288.085 L
843.804 268.454 L
840.99 248.716 L
837.112 229.103 L
832.21 209.866 L
826.347 191.28 L
819.602 173.641 L
812.076 157.244 L
803.888 142.319 L
795.151 129.077 L
785.978 117.7 L
776.482 108.336 L
766.779 101.103 L
756.983 96.087 L
747.21 93.34 L
737.576 92.885 L
728.198 94.712 L
719.194 98.777 L
710.682 105.007 L
702.688 113.183 L
695.194 123.041 L
688.255 134.417 L
681.913 147.145 L
676.201 161.051 L
671.14 175.96 L
666.74 191.691 L
663.001 208.059 L
659.911 224.873 L
657.448 241.941 L
655.58 259.062 L
654.263 276.035 L
653.45 292.669 L
653.172 308.991 L
653.437 324.948 L
654.234 340.45 L
655.552 355.418 L
657.379 369.78 L
659.703 383.477 L
662.511 396.457 L
S
GR
GS
[0.55814 0 0 0.55814 0 0.23254] CT
0 0.447 0.741 RC
2 LJ
N
662.511 396.457 M
665.789 408.678 L
669.524 420.108 L
673.701 430.725 L
678.304 440.514 L
683.316 449.459 L
688.723 457.528 L
694.514 464.69 L
700.671 470.917 L
707.174 476.184 L
713.998 480.467 L
721.116 483.743 L
728.496 485.994 L
736.102 487.203 L
743.894 487.353 L
751.83 486.434 L
759.863 484.433 L
767.942 481.342 L
776.025 477.169 L
784.053 471.884 L
791.94 465.423 L
799.599 457.743 L
806.948 448.816 L
813.903 438.634 L
820.382 427.203 L
826.303 414.548 L
831.586 400.712 L
836.153 385.754 L
839.924 369.751 L
842.824 352.797 L
844.775 335.004 L
845.697 316.394 L
845.547 297.054 L
844.324 277.301 L
842.042 257.437 L
838.725 237.745 L
834.409 218.491 L
829.143 199.923 L
822.989 182.273 L
816.019 165.753 L
808.319 150.558 L
799.987 136.866 L
791.131 124.837 L
781.874 114.612 L
772.35 106.318 L
762.706 100.179 L
753.065 96.306 L
743.525 94.679 L
734.178 95.255 L
725.11 97.973 L
S
GR
GS
[0.55814 0 0 0.55814 0 0.23254] CT
0 0.447 0.741 RC
2 LJ
N
725.11 97.973 M
716.395 102.749 L
708.102 109.478 L
700.291 118.035 L
693.015 128.273 L
686.317 140.027 L
680.234 153.108 L
674.791 167.304 L
669.96 182.382 L
665.74 198.147 L
662.135 214.426 L
659.144 231.054 L
656.764 247.876 L
654.987 264.748 L
653.802 281.536 L
653.193 298.117 L
653.14 314.378 L
653.62 330.216 L
654.606 345.539 L
656.091 360.314 L
658.074 374.49 L
660.547 388.004 L
663.5 400.801 L
666.924 412.83 L
670.806 424.048 L
675.133 434.419 L
679.888 443.912 L
685.057 452.503 L
690.619 460.174 L
696.555 466.916 L
702.844 472.722 L
709.463 477.594 L
716.387 481.537 L
723.591 484.519 L
731.044 486.498 L
738.713 487.44 L
746.557 487.312 L
754.533 486.087 L
762.59 483.74 L
770.674 480.251 L
778.725 475.602 L
786.679 469.782 L
794.466 462.781 L
802.013 454.594 L
809.238 445.218 L
816.067 434.661 L
822.449 422.948 L
828.27 410.066 L
833.416 396.017 L
837.785 380.834 L
S
GR
GS
[0.55814 0 0 0.55814 0 0.23254] CT
0 0.447 0.741 RC
2 LJ
N
837.785 380.834 M
841.293 364.579 L
843.868 347.339 L
845.453 329.232 L
846.006 310.402 L
845.497 291.023 L
843.913 271.297 L
841.255 251.453 L
837.536 231.749 L
832.785 212.459 L
827.054 193.765 L
820.434 175.962 L
813.027 159.351 L
804.94 144.196 L
796.28 130.726 L
787.162 119.133 L
777.703 109.576 L
768.024 102.174 L
758.251 97.013 L
748.512 94.142 L
738.942 93.575 L
729.676 95.286 L
720.758 99.16 L
712.236 105.052 L
704.18 112.824 L
696.647 122.328 L
689.683 133.403 L
683.322 145.879 L
677.588 159.576 L
672.491 174.3 L
668.03 189.85 L
664.193 206.01 L
660.957 222.558 L
658.286 239.26 L
656.186 256.03 L
654.666 272.788 L
653.717 289.408 L
653.329 305.774 L
653.49 321.783 L
654.189 337.346 L
655.414 352.382 L
657.149 366.823 L
659.381 380.614 L
662.093 393.709 L
665.269 406.077 L
668.896 417.691 L
672.965 428.51 L
677.468 438.499 L
682.391 447.623 L
687.721 455.851 L
S
GR
GS
[0.55814 0 0 0.55814 0 0.23254] CT
0 0.447 0.741 RC
2 LJ
N
687.721 455.851 M
693.441 463.157 L
699.529 469.517 L
705.964 474.912 L
712.721 479.324 L
719.771 482.742 L
727.084 485.155 L
734.628 486.557 L
742.367 486.947 L
750.267 486.323 L
758.282 484.644 L
766.353 481.857 L
774.421 477.921 L
782.419 472.802 L
790.28 466.479 L
797.934 458.936 L
805.304 450.169 L
812.315 440.184 L
818.885 428.996 L
824.929 416.628 L
830.36 403.115 L
835.087 388.499 L
839.038 372.797 L
842.146 356.065 L
844.323 338.441 L
845.505 320.076 L
845.642 301.136 L
844.705 281.8 L
842.683 262.262 L
839.584 242.727 L
835.435 223.418 L
830.281 204.567 L
824.185 186.422 L
817.232 169.246 L
809.522 153.312 L
801.178 138.912 L
792.338 126.291 L
783.114 115.595 L
773.617 106.941 L
763.955 100.419 L
754.234 96.089 L
744.561 93.986 L
735.041 94.115 L
725.776 96.455 L
716.869 100.957 L
708.42 107.546 L
700.53 116.116 L
693.237 126.458 L
686.483 138.242 L
680.309 151.295 L
S
GR
GS
[0.55814 0 0 0.55814 0 0.23254] CT
0 0.447 0.741 RC
2 LJ
N
680.309 151.295 M
674.749 165.446 L
669.828 180.525 L
665.563 196.364 L
661.958 212.789 L
659.011 229.63 L
656.709 246.714 L
655.03 263.868 L
653.941 280.919 L
653.401 297.691 L
653.36 314.009 L
653.797 329.794 L
654.756 345.103 L
656.229 359.867 L
658.206 374.017 L
660.674 387.492 L
663.623 400.241 L
667.039 412.22 L
670.908 423.39 L
675.217 433.725 L
679.949 443.203 L
685.089 451.811 L
690.621 459.545 L
696.523 466.389 L
702.778 472.312 L
709.367 477.283 L
716.269 481.274 L
723.455 484.26 L
730.894 486.216 L
738.549 487.121 L
746.38 486.954 L
754.341 485.699 L
762.383 483.34 L
770.451 479.863 L
778.487 475.257 L
786.428 469.512 L
794.228 462.645 L
801.813 454.627 L
809.079 445.403 L
815.925 434.94 L
822.26 423.229 L
827.995 410.285 L
833.047 396.145 L
837.341 380.869 L
840.806 364.539 L
843.375 347.264 L
844.99 329.171 L
845.596 310.415 L
845.144 291.169 L
843.58 271.492 L
S
GR
GS
[0.55814 0 0 0.55814 0 0.23254] CT
0 0.447 0.741 RC
2 LJ
N
843.58 271.492 M
840.908 251.57 L
837.182 231.775 L
832.465 212.442 L
826.826 193.877 L
820.34 176.356 L
813.093 160.12 L
805.177 145.38 L
796.689 132.314 L
787.738 121.071 L
778.438 111.766 L
768.91 104.481 L
759.284 99.27 L
749.691 96.194 L
740.239 95.377 L
731.02 96.764 L
722.119 100.269 L
713.61 105.788 L
705.555 113.2 L
698.008 122.365 L
691.01 133.127 L
684.593 145.311 L
678.778 158.726 L
673.577 173.163 L
668.988 188.393 L
665.006 204.225 L
661.626 220.512 L
658.847 237.093 L
656.664 253.816 L
655.07 270.542 L
654.056 287.144 L
653.61 303.507 L
653.717 319.527 L
654.361 335.112 L
655.523 350.182 L
657.18 364.669 L
659.322 378.536 L
661.943 391.736 L
665.037 404.218 L
668.592 415.933 L
672.598 426.839 L
677.042 436.899 L
681.909 446.081 L
687.182 454.361 L
692.842 461.716 L
698.869 468.131 L
705.24 473.597 L
711.933 478.109 L
718.92 481.667 L
726.176 484.273 L
S
GR
GS
[0.55814 0 0 0.55814 0 0.23254] CT
0 0.447 0.741 RC
2 LJ
N
726.176 484.273 M
733.668 485.894 L
741.362 486.488 L
749.214 486.016 L
757.178 484.445 L
765.203 481.746 L
773.232 477.899 L
781.206 472.883 L
789.059 466.688 L
796.72 459.305 L
804.114 450.732 L
811.162 440.971 L
817.779 430.031 L
823.888 417.927 L
829.435 404.682 L
834.306 390.314 L
838.392 374.864 L
841.603 358.4 L
843.867 341.013 L
845.124 322.825 L
845.336 303.981 L
844.478 284.653 L
842.543 265.041 L
839.54 245.369 L
835.495 225.888 L
830.451 206.876 L
824.466 188.626 L
817.627 171.357 L
810.037 155.331 L
801.804 140.799 L
793.04 127.98 L
783.857 117.056 L
774.372 108.176 L
764.703 101.454 L
754.969 96.969 L
745.295 94.769 L
735.806 94.864 L
726.63 97.231 L
717.88 101.797 L
709.55 108.338 L
701.69 116.691 L
694.358 126.701 L
687.599 138.209 L
681.45 151.045 L
675.934 165.032 L
671.062 179.986 L
666.837 195.713 L
663.247 212.014 L
660.271 228.681 L
657.876 245.496 L
S
GR
GS
[0.55814 0 0 0.55814 0 0.23254] CT
0 0.447 0.741 RC
2 LJ
N
657.876 245.496 M
656.018 262.24 L
654.71 278.865 L
653.965 295.316 L
653.771 311.485 L
654.119 327.272 L
654.997 342.59 L
656.394 357.361 L
658.295 371.519 L
660.689 385.008 L
663.561 397.783 L
666.896 409.811 L
670.678 421.067 L
674.891 431.53 L
679.526 441.164 L
684.573 449.938 L
690.017 457.818 L
695.843 464.779 L
702.029 470.794 L
708.554 475.842 L
715.391 479.902 L
722.511 482.959 L
729.882 484.998 L
737.468 486.008 L
745.232 485.982 L
753.13 484.913 L
761.127 482.804 L
769.172 479.622 L
777.194 475.309 L
785.124 469.821 L
792.887 463.124 L
800.409 455.2 L
807.614 446.043 L
814.423 435.658 L
820.757 424.063 L
826.535 411.291 L
831.674 397.385 L
836.088 382.402 L
839.691 366.412 L
842.406 349.438 L
844.174 331.538 L
844.942 312.923 L
844.674 293.811 L
843.35 274.418 L
840.967 254.963 L
837.539 235.667 L
833.096 216.749 L
827.687 198.433 L
821.375 180.942 L
814.241 164.5 L
S
GR
GS
[0.55814 0 0 0.55814 0 0.23254] CT
0 0.447 0.741 RC
2 LJ
N
814.241 164.5 M
806.384 149.333 L
797.917 135.667 L
788.975 123.738 L
779.711 113.817 L
770.238 106.008 L
760.658 100.355 L
751.07 96.883 L
741.569 95.593 L
732.246 96.464 L
723.191 99.454 L
714.487 104.497 L
706.218 111.507 L
698.461 120.373 L
691.292 130.966 L
684.778 143.121 L
678.885 156.531 L
673.601 170.955 L
668.932 186.205 L
664.879 202.096 L
S
GR
GS
[0.55814 0 0 0.55814 413.86085 25.48837] CT
/Helvetica-Bold 20 F
GS
[1 0 0 1 0 0] CT
-62.5 -5 moveto 
1 -1 scale
(Solver ode45) t 
GR
GR
GS
[0.55814 0 0 0.55814 0 0.23254] CT
1 GC
N
991 570 M
1297 570 L
1297 48 L
991 48 L
cp
f
GR
GS
[0.55814 0 0 0.55814 0 0.23254] CT
0.873 GC
2 LJ
N
991 570 M
991 48 L
S
GR
GS
[0.55814 0 0 0.55814 0 0.23254] CT
0.873 GC
2 LJ
N
1067.5 570 M
1067.5 48 L
S
GR
GS
[0.55814 0 0 0.55814 0 0.23254] CT
0.873 GC
2 LJ
N
1144 570 M
1144 48 L
S
GR
GS
[0.55814 0 0 0.55814 0 0.23254] CT
0.873 GC
2 LJ
N
1220.5 570 M
1220.5 48 L
S
GR
GS
[0.55814 0 0 0.55814 0 0.23254] CT
0.873 GC
2 LJ
N
1297 570 M
1297 48 L
S
GR
GS
[0.55814 0 0 0.55814 0 0.23254] CT
0.873 GC
2 LJ
N
1297 570 M
991 570 L
S
GR
GS
[0.55814 0 0 0.55814 0 0.23254] CT
0.873 GC
2 LJ
N
1297 483 M
991 483 L
S
GR
GS
[0.55814 0 0 0.55814 0 0.23254] CT
0.873 GC
2 LJ
N
1297 396 M
991 396 L
S
GR
GS
[0.55814 0 0 0.55814 0 0.23254] CT
0.873 GC
2 LJ
N
1297 309 M
991 309 L
S
GR
GS
[0.55814 0 0 0.55814 0 0.23254] CT
0.873 GC
2 LJ
N
1297 222 M
991 222 L
S
GR
GS
[0.55814 0 0 0.55814 0 0.23254] CT
0.873 GC
2 LJ
N
1297 135 M
991 135 L
S
GR
GS
[0.55814 0 0 0.55814 0 0.23254] CT
0.873 GC
2 LJ
N
1297 48 M
991 48 L
S
GR
GS
[0.55814 0 0 0.55814 0 0.23254] CT
0.149 GC
2 LJ
N
991 570 M
1297 570 L
S
GR
GS
[0.55814 0 0 0.55814 0 0.23254] CT
0.149 GC
2 LJ
N
991 48 M
1297 48 L
S
GR
GS
[0.55814 0 0 0.55814 0 0.23254] CT
0.149 GC
2 LJ
N
991 570 M
991 564.78 L
S
GR
GS
[0.55814 0 0 0.55814 0 0.23254] CT
0.149 GC
2 LJ
N
1067.5 570 M
1067.5 564.78 L
S
GR
GS
[0.55814 0 0 0.55814 0 0.23254] CT
0.149 GC
2 LJ
N
1144 570 M
1144 564.78 L
S
GR
GS
[0.55814 0 0 0.55814 0 0.23254] CT
0.149 GC
2 LJ
N
1220.5 570 M
1220.5 564.78 L
S
GR
GS
[0.55814 0 0 0.55814 0 0.23254] CT
0.149 GC
2 LJ
N
1297 570 M
1297 564.78 L
S
GR
GS
[0.55814 0 0 0.55814 0 0.23254] CT
0.149 GC
2 LJ
N
991 48 M
991 53.22 L
S
GR
GS
[0.55814 0 0 0.55814 0 0.23254] CT
0.149 GC
2 LJ
N
1067.5 48 M
1067.5 53.22 L
S
GR
GS
[0.55814 0 0 0.55814 0 0.23254] CT
0.149 GC
2 LJ
N
1144 48 M
1144 53.22 L
S
GR
GS
[0.55814 0 0 0.55814 0 0.23254] CT
0.149 GC
2 LJ
N
1220.5 48 M
1220.5 53.22 L
S
GR
GS
[0.55814 0 0 0.55814 0 0.23254] CT
0.149 GC
2 LJ
N
1297 48 M
1297 53.22 L
S
GR
GS
[0.55814 0 0 0.55814 553.11629 322.3721] CT
0.149 GC
/Helvetica 18 F
GS
[1 0 0 1 0 0] CT
-15.5 19 moveto 
1 -1 scale
(300) t 
GR
GR
GS
[0.55814 0 0 0.55814 595.81396 322.3721] CT
0.149 GC
/Helvetica 18 F
GS
[1 0 0 1 0 0] CT
-15.5 19 moveto 
1 -1 scale
(400) t 
GR
GR
GS
[0.55814 0 0 0.55814 638.51164 322.3721] CT
0.149 GC
/Helvetica 18 F
GS
[1 0 0 1 0 0] CT
-15.5 19 moveto 
1 -1 scale
(500) t 
GR
GR
GS
[0.55814 0 0 0.55814 681.20931 322.3721] CT
0.149 GC
/Helvetica 18 F
GS
[1 0 0 1 0 0] CT
-15.5 19 moveto 
1 -1 scale
(600) t 
GR
GR
GS
[0.55814 0 0 0.55814 723.90699 322.3721] CT
0.149 GC
/Helvetica 18 F
GS
[1 0 0 1 0 0] CT
-15.5 19 moveto 
1 -1 scale
(700) t 
GR
GR
GS
[0.55814 0 0 0.55814 0 0.23254] CT
0.149 GC
2 setlinecap
10.0 ML
N
991 570 M
991 48 L
S
GR
GS
[0.55814 0 0 0.55814 0 0.23254] CT
0.149 GC
2 setlinecap
10.0 ML
N
1297 570 M
1297 48 L
S
GR
GS
[0.55814 0 0 0.55814 0 0.23254] CT
0.149 GC
2 setlinecap
10.0 ML
N
991 570 M
996.22 570 L
S
GR
GS
[0.55814 0 0 0.55814 0 0.23254] CT
0.149 GC
2 setlinecap
10.0 ML
N
991 483 M
996.22 483 L
S
GR
GS
[0.55814 0 0 0.55814 0 0.23254] CT
0.149 GC
2 setlinecap
10.0 ML
N
991 396 M
996.22 396 L
S
GR
GS
[0.55814 0 0 0.55814 0 0.23254] CT
0.149 GC
2 setlinecap
10.0 ML
N
991 309 M
996.22 309 L
S
GR
GS
[0.55814 0 0 0.55814 0 0.23254] CT
0.149 GC
2 setlinecap
10.0 ML
N
991 222 M
996.22 222 L
S
GR
GS
[0.55814 0 0 0.55814 0 0.23254] CT
0.149 GC
2 setlinecap
10.0 ML
N
991 135 M
996.22 135 L
S
GR
GS
[0.55814 0 0 0.55814 0 0.23254] CT
0.149 GC
2 setlinecap
10.0 ML
N
991 48 M
996.22 48 L
S
GR
GS
[0.55814 0 0 0.55814 0 0.23254] CT
0.149 GC
2 setlinecap
10.0 ML
N
1297 570 M
1291.78 570 L
S
GR
GS
[0.55814 0 0 0.55814 0 0.23254] CT
0.149 GC
2 setlinecap
10.0 ML
N
1297 483 M
1291.78 483 L
S
GR
GS
[0.55814 0 0 0.55814 0 0.23254] CT
0.149 GC
2 setlinecap
10.0 ML
N
1297 396 M
1291.78 396 L
S
GR
GS
[0.55814 0 0 0.55814 0 0.23254] CT
0.149 GC
2 setlinecap
10.0 ML
N
1297 309 M
1291.78 309 L
S
GR
GS
[0.55814 0 0 0.55814 0 0.23254] CT
0.149 GC
2 setlinecap
10.0 ML
N
1297 222 M
1291.78 222 L
S
GR
GS
[0.55814 0 0 0.55814 0 0.23254] CT
0.149 GC
2 setlinecap
10.0 ML
N
1297 135 M
1291.78 135 L
S
GR
GS
[0.55814 0 0 0.55814 0 0.23254] CT
0.149 GC
2 setlinecap
10.0 ML
N
1297 48 M
1291.78 48 L
S
GR
GS
[0.55814 0 0 0.55814 549.11628 318.37209] CT
0.149 GC
/Helvetica 18 F
GS
[1 0 0 1 0 0] CT
-31 7.5 moveto 
1 -1 scale
(250) t 
GR
GR
GS
[0.55814 0 0 0.55814 549.11628 269.81395] CT
0.149 GC
/Helvetica 18 F
GS
[1 0 0 1 0 0] CT
-31 7.5 moveto 
1 -1 scale
(300) t 
GR
GR
GS
[0.55814 0 0 0.55814 549.11628 221.25581] CT
0.149 GC
/Helvetica 18 F
GS
[1 0 0 1 0 0] CT
-31 7.5 moveto 
1 -1 scale
(350) t 
GR
GR
GS
[0.55814 0 0 0.55814 549.11628 172.69767] CT
0.149 GC
/Helvetica 18 F
GS
[1 0 0 1 0 0] CT
-31 7.5 moveto 
1 -1 scale
(400) t 
GR
GR
GS
[0.55814 0 0 0.55814 549.11628 124.13953] CT
0.149 GC
/Helvetica 18 F
GS
[1 0 0 1 0 0] CT
-31 7.5 moveto 
1 -1 scale
(450) t 
GR
GR
GS
[0.55814 0 0 0.55814 549.11628 75.58138] CT
0.149 GC
/Helvetica 18 F
GS
[1 0 0 1 0 0] CT
-31 7.5 moveto 
1 -1 scale
(500) t 
GR
GR
GS
[0.55814 0 0 0.55814 549.11628 27.02324] CT
0.149 GC
/Helvetica 18 F
GS
[1 0 0 1 0 0] CT
-31 7.5 moveto 
1 -1 scale
(550) t 
GR
GR
GS
[0.55814 0 0 0.55814 0 0.23254] CT
0 0.447 0.741 RC
2 LJ
N
1144 91.5 M
1134.567 92.63 L
1125.453 96.035 L
1116.811 101.363 L
1108.641 108.614 L
1100.94 117.83 L
1093.783 128.636 L
1087.222 140.664 L
1081.255 153.916 L
1075.892 168.456 L
1071.149 183.802 L
1067.01 199.576 L
1063.475 215.779 L
1060.544 232.411 L
1058.235 249.443 L
1056.493 266.314 L
1055.31 282.98 L
1054.688 299.44 L
1054.635 315.72 L
1055.128 331.611 L
1056.126 346.907 L
1057.63 361.608 L
1059.638 375.714 L
1062.161 389.233 L
1065.149 401.994 L
1068.588 413.954 L
1072.476 425.112 L
1076.814 435.469 L
1081.606 445.015 L
1086.784 453.655 L
1092.343 461.385 L
1098.283 468.204 L
1104.611 474.114 L
1111.292 479.075 L
1118.24 483.041 L
1125.457 486.012 L
1132.942 487.987 L
1140.718 488.965 L
1148.651 488.876 L
1156.651 487.693 L
1164.718 485.417 L
1172.852 482.046 L
1181.091 477.568 L
1189.179 471.912 L
1197.001 465.069 L
1204.557 457.039 L
1211.849 447.821 L
1218.9 437.374 L
1225.409 425.723 L
1231.236 412.922 L
S
GR
GS
[0.55814 0 0 0.55814 0 0.23254] CT
0 0.447 0.741 RC
2 LJ
N
1231.236 412.922 M
1236.383 398.972 L
1240.849 383.871 L
1244.589 367.596 L
1247.346 350.477 L
1249.102 332.548 L
1249.856 313.81 L
1249.574 294.325 L
1248.196 274.698 L
1245.72 254.956 L
1242.133 235.063 L
1237.488 215.423 L
1231.933 196.648 L
1225.468 178.74 L
1218.046 161.644 L
1209.932 145.969 L
1201.369 132.15 L
1192.359 120.185 L
1182.885 110.071 L
1173.094 102.012 L
1163.375 96.257 L
1153.728 92.808 L
1144.153 91.663 L
1134.705 92.813 L
1125.667 96.025 L
1117.045 101.293 L
1108.835 108.647 L
1101.115 117.819 L
1093.972 128.401 L
1087.405 140.392 L
1081.421 153.85 L
1076.048 168.321 L
1071.285 183.413 L
1067.131 199.126 L
1063.588 215.466 L
1060.672 232.33 L
1058.331 249.131 L
1056.563 265.87 L
1055.368 282.545 L
1054.76 299.187 L
1054.7 315.469 L
1055.16 331.238 L
1056.138 346.493 L
1057.635 361.235 L
1059.661 375.455 L
1062.158 388.935 L
1065.119 401.654 L
1068.544 413.615 L
1072.438 424.819 L
1076.787 435.227 L
S
GR
GS
[0.55814 0 0 0.55814 0 0.23254] CT
0 0.447 0.741 RC
2 LJ
N
1076.787 435.227 M
1081.538 444.748 L
1086.691 453.383 L
1092.245 461.132 L
1098.21 467.996 L
1104.53 473.92 L
1111.153 478.872 L
1118.081 482.851 L
1125.311 485.857 L
1132.862 487.882 L
1140.585 488.854 L
1148.438 488.76 L
1156.421 487.6 L
1164.535 485.374 L
1172.799 482.056 L
1180.935 477.573 L
1188.904 471.923 L
1196.708 465.105 L
1204.346 457.12 L
1211.836 447.912 L
1218.796 437.514 L
1225.173 425.937 L
1230.967 413.182 L
1236.178 399.25 L
1240.772 384.089 L
1244.453 367.962 L
1247.188 350.92 L
1248.976 332.965 L
1249.796 314.093 L
1249.531 294.836 L
1248.168 275.282 L
1245.705 255.432 L
1242.132 235.423 L
1237.579 216.036 L
1232.049 197.285 L
1225.517 179.126 L
1218.123 162.003 L
1210.16 146.539 L
1201.629 132.732 L
1192.515 120.577 L
1182.932 110.293 L
1173.317 102.279 L
1163.673 96.533 L
1153.998 93.058 L
1144.311 91.876 L
1134.941 92.867 L
1125.931 96.009 L
1117.283 101.301 L
1109.032 108.678 L
1101.332 117.633 L
S
GR
GS
[0.55814 0 0 0.55814 0 0.23254] CT
0 0.447 0.741 RC
2 LJ
N
1101.332 117.633 M
1094.187 128.151 L
1087.598 140.261 L
1081.601 153.712 L
1076.214 167.951 L
1071.437 182.978 L
1067.27 198.794 L
1063.736 215.336 L
1060.787 231.957 L
1058.422 248.644 L
1056.641 265.396 L
1055.456 282.249 L
1054.834 298.859 L
1054.743 315.033 L
1055.182 330.77 L
1056.153 346.07 L
1057.664 360.928 L
1059.659 375.092 L
1062.13 388.537 L
1065.078 401.262 L
1068.504 413.271 L
1072.401 424.522 L
1076.713 434.908 L
1081.442 444.429 L
1086.587 453.084 L
1092.156 460.877 L
1098.105 467.757 L
1104.383 473.681 L
1110.988 478.651 L
1117.922 482.665 L
1125.199 485.718 L
1132.694 487.742 L
1140.363 488.72 L
1148.206 488.654 L
1156.224 487.543 L
1164.435 485.365 L
1172.589 482.045 L
1180.649 477.575 L
1188.616 471.958 L
1196.489 465.191 L
1204.292 457.23 L
1211.646 448.069 L
1218.507 437.717 L
1224.875 426.174 L
1230.748 413.438 L
1236.106 399.451 L
1240.631 384.406 L
1244.274 368.361 L
1247.035 351.314 L
1248.907 333.235 L
S
GR
GS
[0.55814 0 0 0.55814 0 0.23254] CT
0 0.447 0.741 RC
2 LJ
N
1248.907 333.235 M
1249.733 314.542 L
1249.474 295.387 L
1248.129 275.769 L
1245.677 255.722 L
1242.185 235.99 L
1237.664 216.669 L
1232.115 197.759 L
1225.553 179.443 L
1218.311 162.571 L
1210.39 147.144 L
1201.788 133.16 L
1192.529 120.775 L
1183.139 110.594 L
1173.62 102.617 L
1163.972 96.845 L
1154.177 93.299 L
1144.546 91.995 L
1135.22 92.905 L
1126.201 96.03 L
1117.49 101.388 L
1109.264 108.557 L
1101.569 117.414 L
1094.406 127.959 L
1087.794 140.172 L
1081.787 153.388 L
1076.387 167.535 L
1071.596 182.614 L
1067.432 198.644 L
1063.869 214.963 L
1060.897 231.462 L
1058.516 248.142 L
1056.734 265.032 L
1055.541 281.899 L
1054.889 298.4 L
1054.777 314.535 L
1055.205 330.304 L
1056.185 345.723 L
1057.669 360.534 L
1059.639 374.663 L
1062.095 388.109 L
1065.036 400.874 L
1068.467 412.943 L
1072.331 424.175 L
1076.621 434.561 L
1081.34 444.101 L
1086.49 452.798 L
1092.053 460.619 L
1097.964 467.499 L
1104.222 473.44 L
S
GR
GS
[0.55814 0 0 0.55814 0 0.23254] CT
0 0.447 0.741 RC
2 LJ
N
1104.222 473.44 M
1110.828 478.441 L
1117.795 482.501 L
1125.033 485.56 L
1132.48 487.593 L
1140.136 488.598 L
1148 488.576 L
1156.099 487.516 L
1164.223 485.339 L
1172.312 482.031 L
1180.366 477.594 L
1188.385 472.027 L
1196.403 465.298 L
1204.084 457.369 L
1211.352 448.244 L
1218.205 437.923 L
1224.644 426.407 L
1230.668 413.638 L
1235.959 399.738 L
1240.434 384.773 L
1244.094 368.744 L
1246.943 351.615 L
1248.829 333.639 L
1249.651 315.066 L
1249.41 295.896 L
1248.093 276.091 L
1245.698 256.248 L
1242.241 236.62 L
1237.723 217.209 L
1232.121 198.047 L
1225.702 180.001 L
1218.514 163.197 L
1210.555 147.634 L
1201.792 133.364 L
1192.735 121.134 L
1183.446 111.016 L
1173.925 103.01 L
1164.15 97.125 L
1154.357 93.476 L
1144.803 92.094 L
1135.489 92.977 L
1126.402 96.155 L
1117.698 101.373 L
1109.494 108.408 L
1101.79 117.258 L
1094.592 127.96 L
1087.977 139.954 L
1081.964 153.035 L
1076.552 167.202 L
1071.756 182.514 L
S
GR
GS
[0.55814 0 0 0.55814 0 0.23254] CT
0 0.447 0.741 RC
2 LJ
N
1071.756 182.514 M
1067.573 198.36 L
1063.989 214.516 L
1061.001 230.981 L
1058.612 247.757 L
1056.837 264.763 L
1055.612 281.485 L
1054.937 297.923 L
1054.812 314.077 L
1055.248 329.972 L
1056.211 345.366 L
1057.668 360.122 L
1059.62 374.241 L
1062.068 387.721 L
1065.02 400.564 L
1068.42 412.608 L
1072.26 423.829 L
1076.539 434.228 L
1081.257 443.804 L
1086.415 452.542 L
1091.938 460.356 L
1097.828 467.247 L
1104.082 473.213 L
1110.713 478.258 L
1117.66 482.33 L
1124.848 485.392 L
1132.277 487.446 L
1139.947 488.49 L
1147.882 488.52 L
1155.918 487.46 L
1163.973 485.291 L
1172.048 482.011 L
1180.144 477.621 L
1188.298 472.1 L
1196.218 465.39 L
1203.803 457.486 L
1211.054 448.391 L
1217.97 438.103 L
1224.567 426.574 L
1230.532 413.867 L
1235.752 400.046 L
1240.228 385.111 L
1243.963 369.054 L
1246.859 351.935 L
1248.723 334.101 L
1249.555 315.551 L
1249.353 296.253 L
1248.077 276.527 L
1245.717 256.836 L
1242.273 237.18 L
S
GR
GS
[0.55814 0 0 0.55814 0 0.23254] CT
0 0.447 0.741 RC
2 LJ
N
1242.273 237.18 M
1237.718 217.514 L
1232.215 198.549 L
1225.864 180.623 L
1218.665 163.736 L
1210.566 147.865 L
1201.971 133.756 L
1193.027 121.627 L
1183.733 111.48 L
1174.066 103.314 L
1164.247 97.322 L
1154.577 93.628 L
1145.057 92.23 L
1135.676 93.145 L
1126.564 96.249 L
1117.907 101.305 L
1109.705 108.314 L
1101.959 117.319 L
1094.759 127.868 L
1088.148 139.683 L
1082.125 152.766 L
1076.704 167.178 L
1071.897 182.337 L
1067.694 197.971 L
1064.096 214.082 L
1061.103 230.676 L
1058.729 247.639 L
1056.919 264.433 L
1055.671 281.057 L
1054.985 297.511 L
1054.873 313.822 L
1055.298 329.7 L
1056.23 345.003 L
1057.67 359.732 L
1059.617 373.888 L
1062.081 387.464 L
1065.004 400.27 L
1068.38 412.286 L
1072.208 423.513 L
1076.491 433.951 L
1081.221 443.573 L
1086.337 452.291 L
1091.838 460.106 L
1097.724 467.017 L
1104.005 473.027 L
1110.621 478.081 L
1117.514 482.147 L
1124.682 485.224 L
1132.127 487.314 L
1139.868 488.407 L
S
GR
GS
[0.55814 0 0 0.55814 0 0.23254] CT
0 0.447 0.741 RC
2 LJ
N
1139.868 488.407 M
1147.744 488.431 L
1155.702 487.369 L
1163.742 485.222 L
1171.864 481.989 L
1180.096 477.648 L
1188.145 472.13 L
1195.952 465.431 L
1203.518 457.552 L
1210.844 448.493 L
1217.941 438.2 L
1224.457 426.723 L
1230.317 414.091 L
1235.522 400.306 L
1240.071 385.367 L
1243.894 369.257 L
1246.736 352.305 L
1248.593 334.521 L
1249.464 315.904 L
1249.307 296.55 L
1248.055 277.036 L
1245.708 257.365 L
1242.249 237.491 L
1237.75 217.909 L
1232.326 199.137 L
1225.98 181.174 L
1218.662 163.972 L
1210.675 148.221 L
1202.213 134.275 L
1193.275 122.132 L
1183.834 111.787 L
1174.12 103.513 L
1164.453 97.529 L
1154.835 93.835 L
1145.261 92.433 L
1135.815 93.305 L
1126.77 96.25 L
1118.127 101.266 L
1109.881 108.388 L
1102.125 117.304 L
1094.939 127.66 L
1088.322 139.457 L
1082.283 152.753 L
1076.851 167.035 L
1072.028 181.975 L
1067.813 197.574 L
1064.21 213.858 L
1061.228 230.61 L
1058.821 247.329 L
1056.989 264.014 L
S
GR
GS
[0.55814 0 0 0.55814 0 0.23254] CT
0 0.447 0.741 RC
2 LJ
N
1056.989 264.014 M
1055.731 280.665 L
1055.062 297.307 L
1054.936 313.571 L
1055.331 329.34 L
1056.246 344.614 L
1057.682 359.393 L
1059.647 373.655 L
1062.08 387.174 L
1064.98 399.944 L
1068.345 411.965 L
1072.183 423.243 L
1076.469 433.719 L
1081.16 443.314 L
1086.254 452.028 L
1091.752 459.862 L
1097.664 466.818 L
1103.925 472.833 L
1110.493 477.88 L
1117.37 481.961 L
1124.554 485.073 L
1132.06 487.207 L
1139.732 488.289 L
1147.544 488.311 L
1155.494 487.273 L
1163.583 485.176 L
1171.821 481.986 L
1179.927 477.637 L
1187.881 472.126 L
1195.685 465.454 L
1203.338 457.621 L
1210.792 448.557 L
1217.747 438.291 L
1224.188 426.828 L
1230.115 414.17 L
1235.505 400.288 L
1240.06 385.365 L
1243.755 369.423 L
1246.59 352.461 L
1248.539 334.477 L
1249.429 315.919 L
1249.243 296.848 L
1247.983 277.263 L
1245.624 257.293 L
1242.226 237.648 L
1237.788 218.338 L
1232.285 199.315 L
1225.852 181.081 L
1218.706 164.211 L
1210.846 148.705 L
S
GR
GS
[0.55814 0 0 0.55814 0 0.23254] CT
0 0.447 0.741 RC
2 LJ
N
1210.846 148.705 M
1202.225 134.524 L
1193.082 122.087 L
1183.777 111.819 L
1174.31 103.722 L
1164.682 97.795 L
1154.888 94.071 L
1145.286 92.583 L
1135.971 93.32 L
1126.943 96.281 L
1118.214 101.466 L
1109.977 108.445 L
1102.261 117.142 L
1095.067 127.558 L
1088.423 139.626 L
1082.383 152.689 L
1076.948 166.723 L
1072.117 181.728 L
1067.915 197.681 L
1064.309 213.892 L
1061.295 230.317 L
1058.873 246.957 L
1057.054 263.85 L
1055.815 280.662 L
1055.118 297.13 L
1054.963 313.254 L
1055.35 329.034 L
1056.291 344.473 L
1057.73 359.286 L
1059.657 373.43 L
1062.071 386.904 L
1064.974 399.711 L
1068.364 411.815 L
1072.183 423.082 L
1076.433 433.51 L
1081.113 443.1 L
1086.229 451.856 L
1091.747 459.726 L
1097.616 466.661 L
1103.836 472.661 L
1110.408 477.727 L
1117.345 481.855 L
1124.538 484.978 L
1131.949 487.079 L
1139.575 488.16 L
1147.418 488.219 L
1155.494 487.238 L
1163.58 485.14 L
1171.644 481.918 L
1179.687 477.573 L
S
GR
GS
[0.55814 0 0 0.55814 0 0.23254] CT
0 0.447 0.741 RC
2 LJ
N
1179.687 477.573 M
1187.708 472.104 L
1195.726 465.47 L
1203.385 457.641 L
1210.649 448.619 L
1217.519 438.405 L
1223.996 426.997 L
1230.057 414.333 L
1235.364 400.557 L
1239.875 385.707 L
1243.589 369.783 L
1246.508 352.746 L
1248.452 334.898 L
1249.343 316.425 L
1249.18 297.329 L
1247.949 277.587 L
1245.643 257.833 L
1242.273 238.251 L
1237.838 218.842 L
1232.326 199.686 L
1226.001 181.651 L
1218.89 164.807 L
1210.992 149.155 L
1202.297 134.798 L
1193.319 122.491 L
1184.082 112.261 L
1174.584 104.109 L
1164.804 98.053 L
1155.057 94.237 L
1145.527 92.691 L
1136.214 93.414 L
1127.11 96.434 L
1118.405 101.455 L
1110.189 108.321 L
1102.462 117.032 L
1095.235 127.601 L
1088.593 139.424 L
1082.548 152.375 L
1077.1 166.453 L
1072.27 181.693 L
1068.047 197.412 L
1064.422 213.476 L
1061.395 229.886 L
1058.972 246.668 L
1057.151 263.602 L
1055.883 280.276 L
1055.166 296.69 L
1055.001 312.844 L
1055.401 328.758 L
1056.319 344.142 L
S
GR
GS
[0.55814 0 0 0.55814 0 0.23254] CT
0 0.447 0.741 RC
2 LJ
N
1056.319 344.142 M
1057.734 358.903 L
1059.646 373.04 L
1062.055 386.553 L
1064.968 399.43 L
1068.325 411.502 L
1072.124 422.759 L
1076.365 433.201 L
1081.05 442.831 L
1086.163 451.613 L
1091.645 459.476 L
1097.496 466.421 L
1103.716 472.447 L
1110.317 477.555 L
1117.219 481.685 L
1124.369 484.812 L
1131.767 486.935 L
1139.412 488.054 L
1147.326 488.158 L
1155.32 487.171 L
1163.346 485.08 L
1171.405 481.886 L
1179.497 477.589 L
1187.648 472.158 L
1195.539 465.539 L
1203.114 457.732 L
1210.373 448.737 L
1217.317 438.555 L
1223.946 427.125 L
1229.916 414.537 L
1235.16 400.829 L
1239.678 386.002 L
1243.479 370.032 L
1246.421 353.044 L
1248.343 335.319 L
1249.244 316.858 L
1249.121 297.62 L
1247.928 277.999 L
1245.65 258.377 L
1242.289 238.753 L
1237.818 219.096 L
1232.411 200.169 L
1226.142 182.235 L
1219.013 165.294 L
1210.979 149.348 L
1202.47 135.189 L
1193.587 122.973 L
1184.33 112.7 L
1174.672 104.377 L
1164.906 98.241 L
S
GR
GS
[0.55814 0 0 0.55814 0 0.23254] CT
0 0.447 0.741 RC
2 LJ
N
1164.906 98.241 M
1155.269 94.396 L
1145.762 92.843 L
1136.371 93.602 L
1127.266 96.517 L
1118.604 101.403 L
1110.387 108.26 L
1102.616 117.126 L
1095.394 127.504 L
1088.756 139.18 L
1082.701 152.153 L
1077.246 166.473 L
1072.402 181.501 L
1068.161 197.039 L
1064.525 213.087 L
1061.499 229.675 L
1059.082 246.553 L
1057.229 263.287 L
1055.941 279.877 L
1055.216 296.323 L
1055.068 312.644 L
1055.45 328.501 L
1056.341 343.8 L
1057.741 358.541 L
1059.65 372.724 L
1062.075 386.327 L
1064.957 399.154 L
1068.293 411.199 L
1072.083 422.464 L
1076.333 432.952 L
1081.02 442.612 L
1086.095 451.374 L
1091.557 459.238 L
1097.408 466.204 L
1103.658 472.272 L
1110.232 477.38 L
1117.086 481.505 L
1124.222 484.647 L
1131.64 486.806 L
1139.353 487.968 L
1147.189 488.06 L
1155.118 487.072 L
1163.138 485.005 L
1171.25 481.859 L
1179.469 477.6 L
1187.488 472.168 L
1195.282 465.56 L
1202.851 457.777 L
1210.196 448.82 L
1217.312 438.625 L
S
GR
GS
[0.55814 0 0 0.55814 0 0.23254] CT
0 0.447 0.741 RC
2 LJ
N
1217.312 438.625 M
1223.826 427.258 L
1229.701 414.736 L
1234.938 401.059 L
1239.538 386.222 L
1243.404 370.227 L
1246.295 353.387 L
1248.213 335.701 L
1249.156 317.158 L
1249.073 297.91 L
1247.898 278.478 L
1245.631 258.863 L
1242.254 239.014 L
1237.846 219.485 L
1232.507 200.728 L
1226.237 182.744 L
1218.99 165.492 L
1211.089 149.709 L
1202.694 135.695 L
1193.807 123.451 L
1184.392 112.97 L
1174.734 104.573 L
1165.107 98.453 L
1155.512 94.612 L
1145.942 93.055 L
1136.507 93.752 L
1127.464 96.529 L
1118.813 101.385 L
1110.55 108.358 L
1102.776 117.108 L
1095.567 127.317 L
1088.923 138.985 L
1082.852 152.17 L
1077.387 166.326 L
1072.529 181.163 L
1068.278 196.681 L
1064.64 212.916 L
1061.618 229.589 L
1059.171 246.247 L
1057.299 262.889 L
1056.003 279.517 L
1055.296 296.148 L
1055.129 312.392 L
1055.484 328.152 L
1056.36 343.43 L
1057.758 358.225 L
1059.684 372.505 L
1062.077 386.043 L
1064.938 398.839 L
1068.265 410.892 L
S
GR
GS
[0.55814 0 0 0.55814 0 0.23254] CT
0 0.447 0.741 RC
2 LJ
N
1068.265 410.892 M
1072.066 422.21 L
1076.312 432.722 L
1080.963 442.358 L
1086.02 451.118 L
1091.481 459.002 L
1097.357 466.01 L
1103.579 472.078 L
1110.111 477.182 L
1116.953 481.322 L
1124.106 484.499 L
1131.579 486.697 L
1139.218 487.846 L
1147 487.939 L
1154.925 486.976 L
1162.995 484.957 L
1171.211 481.847 L
1179.294 477.58 L
1187.235 472.156 L
1195.034 465.575 L
1202.691 457.837 L
1210.146 448.87 L
1217.106 438.704 L
1223.562 427.345 L
1229.515 414.792 L
1234.936 401.018 L
1239.526 386.206 L
1243.265 370.369 L
1246.154 353.509 L
1248.163 335.626 L
1249.119 317.165 L
1249.004 298.178 L
1247.821 278.666 L
1245.545 258.76 L
1242.228 239.164 L
1237.872 219.882 L
1232.451 200.864 L
1226.102 182.627 L
1219.031 165.728 L
1211.241 150.168 L
1202.678 135.906 L
1193.594 123.377 L
1184.34 113.004 L
1174.916 104.785 L
1165.322 98.721 L
1155.552 94.844 L
1145.962 93.199 L
1136.654 93.775 L
1127.627 96.572 L
1118.891 101.593 L
S
GR
GS
[0.55814 0 0 0.55814 0 0.23254] CT
0 0.447 0.741 RC
2 LJ
N
1118.891 101.593 M
1110.639 108.418 L
1102.905 116.965 L
1095.689 127.234 L
1089.017 139.169 L
1082.947 152.114 L
1077.48 166.038 L
1072.615 180.941 L
1068.377 196.807 L
1064.734 212.949 L
1061.683 229.313 L
1059.223 245.899 L
1057.364 262.744 L
1056.087 279.531 L
1055.351 295.98 L
1055.158 312.092 L
1055.505 327.865 L
1056.407 343.306 L
1057.808 358.131 L
1059.697 372.291 L
1062.072 385.786 L
1064.935 398.615 L
1068.287 410.753 L
1072.069 422.056 L
1076.281 432.522 L
1080.923 442.153 L
1086.001 450.953 L
1091.482 458.872 L
1097.315 465.858 L
1103.499 471.911 L
1110.035 477.033 L
1116.935 481.218 L
1124.097 484.404 L
1131.476 486.57 L
1139.072 487.717 L
1146.885 487.845 L
1154.933 486.937 L
1162.998 484.915 L
1171.044 481.773 L
1179.069 477.51 L
1187.074 472.126 L
1195.082 465.582 L
1202.741 457.846 L
1210.011 448.92 L
1216.889 438.804 L
1223.376 427.499 L
1229.458 414.941 L
1234.799 401.269 L
1239.347 386.525 L
1243.103 370.708 L
S
GR
GS
[0.55814 0 0 0.55814 0 0.23254] CT
0 0.447 0.741 RC
2 LJ
N
1243.103 370.708 M
1246.07 353.781 L
1248.076 336.024 L
1249.032 317.642 L
1248.94 298.636 L
1247.784 278.977 L
1245.556 259.272 L
1242.267 239.736 L
1237.917 220.37 L
1232.487 201.226 L
1226.237 183.17 L
1219.2 166.297 L
1211.379 150.609 L
1202.749 136.182 L
1193.819 123.774 L
1184.627 113.435 L
1175.174 105.164 L
1165.436 98.975 L
1155.703 95.013 L
1146.185 93.313 L
1136.882 93.876 L
1127.784 96.728 L
1119.068 101.602 L
1110.838 108.316 L
1103.095 116.87 L
1095.847 127.291 L
1089.178 138.998 L
1083.104 151.831 L
1077.625 165.79 L
1072.761 180.922 L
1068.504 196.572 L
1064.844 212.569 L
1061.781 228.912 L
1059.317 245.616 L
1057.461 262.526 L
1056.155 279.178 L
1055.401 295.571 L
1055.198 311.706 L
1055.557 327.607 L
1056.438 343.001 L
1057.816 357.774 L
1059.69 371.924 L
1062.061 385.453 L
1064.935 398.354 L
1068.257 410.458 L
1072.019 421.749 L
1076.221 432.227 L
1080.865 441.894 L
1085.945 450.722 L
1091.392 458.633 L
S
GR
GS
[0.55814 0 0 0.55814 0 0.23254] CT
0 0.447 0.741 RC
2 LJ
N
1091.392 458.633 M
1097.206 465.627 L
1103.389 471.703 L
1109.951 476.864 L
1116.824 481.054 L
1123.943 484.241 L
1131.308 486.426 L
1138.919 487.608 L
1146.8 487.78 L
1154.776 486.867 L
1162.782 484.851 L
1170.819 481.733 L
1178.887 477.513 L
1187.019 472.167 L
1194.913 465.637 L
1202.489 457.922 L
1209.749 449.021 L
1216.691 438.935 L
1223.327 427.61 L
1229.329 415.12 L
1234.606 401.514 L
1239.157 386.794 L
1242.986 370.946 L
1245.987 354.043 L
1247.969 336.409 L
1248.933 318.046 L
1248.877 298.919 L
1247.756 279.345 L
1245.557 259.777 L
1242.277 240.214 L
1237.892 220.61 L
1232.555 201.665 L
1226.362 183.719 L
1219.315 166.77 L
1211.361 150.795 L
1202.896 136.541 L
1194.063 124.23 L
1184.863 113.861 L
1175.27 105.436 L
1165.516 99.162 L
1155.895 95.172 L
1146.406 93.464 L
1137.039 94.055 L
1127.923 96.831 L
1119.252 101.568 L
1111.025 108.264 L
1103.242 116.963 L
1095.995 127.23 L
1089.331 138.784 L
1083.25 151.623 L
S
GR
GS
[0.55814 0 0 0.55814 0 0.23254] CT
0 0.447 0.741 RC
2 LJ
N
1083.25 151.623 M
1077.764 165.81 L
1072.888 180.775 L
1068.615 196.24 L
1064.944 212.205 L
1061.876 228.677 L
1059.427 245.538 L
1057.539 262.25 L
1056.214 278.811 L
1055.451 295.222 L
1055.262 311.511 L
1055.61 327.38 L
1056.465 342.687 L
1057.827 357.434 L
1059.698 371.621 L
1062.085 385.241 L
1064.931 398.098 L
1068.231 410.175 L
1071.984 421.469 L
1076.191 431.984 L
1080.846 441.689 L
1085.887 450.496 L
1091.313 458.405 L
1097.126 465.416 L
1103.335 471.531 L
1109.881 476.697 L
1116.705 480.879 L
1123.807 484.079 L
1131.187 486.295 L
1138.865 487.521 L
1146.685 487.683 L
1154.591 486.766 L
1162.585 484.77 L
1170.665 481.694 L
1178.862 477.517 L
1186.885 472.169 L
1194.677 465.649 L
1202.238 457.954 L
1209.567 449.086 L
1216.681 438.992 L
1223.229 427.718 L
1229.133 415.294 L
1234.393 401.721 L
1239.009 386.997 L
1242.921 371.099 L
1245.869 354.348 L
1247.842 336.762 L
1248.84 318.342 L
1248.825 299.154 L
1247.723 279.779 L
S
GR
GS
[0.55814 0 0 0.55814 0 0.23254] CT
0 0.447 0.741 RC
2 LJ
N
1247.723 279.779 M
1245.534 260.237 L
1242.244 240.489 L
1237.902 220.94 L
1232.637 202.181 L
1226.451 184.213 L
1219.298 166.981 L
1211.437 151.106 L
1203.096 137.01 L
1194.273 124.695 L
1184.949 114.153 L
1175.299 105.622 L
1165.689 99.365 L
1156.119 95.38 L
1146.589 93.668 L
1137.151 94.229 L
1128.101 96.861 L
1119.447 101.558 L
1111.186 108.31 L
1103.371 116.888 L
S
GR
GS
[0.55814 0 0 0.55814 638.51225 25.48837] CT
/Helvetica-Bold 20 F
GS
[1 0 0 1 0 0] CT
-68 -5 moveto 
1 -1 scale
(Solver ode23s) t 
GR
GR
%%Trailer
%%Pages: 1
%%EOF
