%!PS-Adobe-3.0 EPSF-3.0
%%Creator: (MATLAB, The Mathworks, Inc. Version 8.5.0.197613 \(R2015a\). Operating System: Windows 7)
%%Title: C:/Users/Shurshurik/Desktop/matlab_student/3/figure6.eps
%%CreationDate: 2018-11-19T13:04:38
%%Pages: (atend)
%%BoundingBox: 0 0 1072 553
%%LanguageLevel: 2
%%EndComments
%%BeginProlog
%%BeginResource: procset (Apache XML Graphics Std ProcSet) 1.2 0
%%Version: 1.2 0
%%Copyright: (Copyright 2001-2003,2010 The Apache Software Foundation. License terms: http://www.apache.org/licenses/LICENSE-2.0)
/bd{bind def}bind def
/ld{load def}bd
/GR/grestore ld
/M/moveto ld
/LJ/setlinejoin ld
/C/curveto ld
/f/fill ld
/LW/setlinewidth ld
/GC/setgray ld
/t/show ld
/N/newpath ld
/CT/concat ld
/cp/closepath ld
/S/stroke ld
/L/lineto ld
/CC/setcmykcolor ld
/A/ashow ld
/GS/gsave ld
/RC/setrgbcolor ld
/RM/rmoveto ld
/ML/setmiterlimit ld
/re {4 2 roll M
1 index 0 rlineto
0 exch rlineto
neg 0 rlineto
cp } bd
/_ctm matrix def
/_tm matrix def
/BT { _ctm currentmatrix pop matrix _tm copy pop 0 0 moveto } bd
/ET { _ctm setmatrix } bd
/iTm { _ctm setmatrix _tm concat } bd
/Tm { _tm astore pop iTm 0 0 moveto } bd
/ux 0.0 def
/uy 0.0 def
/F {
  /Tp exch def
  /Tf exch def
  Tf findfont Tp scalefont setfont
  /cf Tf def  /cs Tp def
} bd
/ULS {currentpoint /uy exch def /ux exch def} bd
/ULE {
  /Tcx currentpoint pop def
  gsave
  newpath
  cf findfont cs scalefont dup
  /FontMatrix get 0 get /Ts exch def /FontInfo get dup
  /UnderlinePosition get Ts mul /To exch def
  /UnderlineThickness get Ts mul /Tt exch def
  ux uy To add moveto  Tcx uy To add lineto
  Tt setlinewidth stroke
  grestore
} bd
/OLE {
  /Tcx currentpoint pop def
  gsave
  newpath
  cf findfont cs scalefont dup
  /FontMatrix get 0 get /Ts exch def /FontInfo get dup
  /UnderlinePosition get Ts mul /To exch def
  /UnderlineThickness get Ts mul /Tt exch def
  ux uy To add cs add moveto Tcx uy To add cs add lineto
  Tt setlinewidth stroke
  grestore
} bd
/SOE {
  /Tcx currentpoint pop def
  gsave
  newpath
  cf findfont cs scalefont dup
  /FontMatrix get 0 get /Ts exch def /FontInfo get dup
  /UnderlinePosition get Ts mul /To exch def
  /UnderlineThickness get Ts mul /Tt exch def
  ux uy To add cs 10 mul 26 idiv add moveto Tcx uy To add cs 10 mul 26 idiv add lineto
  Tt setlinewidth stroke
  grestore
} bd
/QT {
/Y22 exch store
/X22 exch store
/Y21 exch store
/X21 exch store
currentpoint
/Y21 load 2 mul add 3 div exch
/X21 load 2 mul add 3 div exch
/X21 load 2 mul /X22 load add 3 div
/Y21 load 2 mul /Y22 load add 3 div
/X22 load /Y22 load curveto
} bd
/SSPD {
dup length /d exch dict def
{
/v exch def
/k exch def
currentpagedevice k known {
/cpdv currentpagedevice k get def
v cpdv ne {
/upd false def
/nullv v type /nulltype eq def
/nullcpdv cpdv type /nulltype eq def
nullv nullcpdv or
{
/upd true def
} {
/sametype v type cpdv type eq def
sametype {
v type /arraytype eq {
/vlen v length def
/cpdvlen cpdv length def
vlen cpdvlen eq {
0 1 vlen 1 sub {
/i exch def
/obj v i get def
/cpdobj cpdv i get def
obj cpdobj ne {
/upd true def
exit
} if
} for
} {
/upd true def
} ifelse
} {
v type /dicttype eq {
v {
/dv exch def
/dk exch def
/cpddv cpdv dk get def
dv cpddv ne {
/upd true def
exit
} if
} forall
} {
/upd true def
} ifelse
} ifelse
} if
} ifelse
upd true eq {
d k v put
} if
} if
} if
} forall
d length 0 gt {
d setpagedevice
} if
} bd
%%EndResource
%%BeginResource: procset (Apache XML Graphics EPS ProcSet) 1.0 0
%%Version: 1.0 0
%%Copyright: (Copyright 2002-2003 The Apache Software Foundation. License terms: http://www.apache.org/licenses/LICENSE-2.0)
/BeginEPSF { %def
/b4_Inc_state save def         % Save state for cleanup
/dict_count countdictstack def % Count objects on dict stack
/op_count count 1 sub def      % Count objects on operand stack
userdict begin                 % Push userdict on dict stack
/showpage { } def              % Redefine showpage, { } = null proc
0 setgray 0 setlinecap         % Prepare graphics state
1 setlinewidth 0 setlinejoin
10 setmiterlimit [ ] 0 setdash newpath
/languagelevel where           % If level not equal to 1 then
{pop languagelevel             % set strokeadjust and
1 ne                           % overprint to their defaults.
{false setstrokeadjust false setoverprint
} if
} if
} bd
/EndEPSF { %def
count op_count sub {pop} repeat            % Clean up stacks
countdictstack dict_count sub {end} repeat
b4_Inc_state restore
} bd
%%EndResource
%FOPBeginFontDict
%%IncludeResource: font Courier-Bold
%%IncludeResource: font Helvetica
%%IncludeResource: font Courier-BoldOblique
%%IncludeResource: font Courier-Oblique
%%IncludeResource: font Times-Roman
%%IncludeResource: font Helvetica-BoldOblique
%%IncludeResource: font Helvetica-Bold
%%IncludeResource: font Helvetica-Oblique
%%IncludeResource: font Times-BoldItalic
%%IncludeResource: font Courier
%%IncludeResource: font Times-Italic
%%IncludeResource: font Times-Bold
%%IncludeResource: font Symbol
%%IncludeResource: font ZapfDingbats
%FOPEndFontDict
%%BeginResource: encoding WinAnsiEncoding
/WinAnsiEncoding [
/.notdef /.notdef /.notdef /.notdef /.notdef
/.notdef /.notdef /.notdef /.notdef /.notdef
/.notdef /.notdef /.notdef /.notdef /.notdef
/.notdef /.notdef /.notdef /.notdef /.notdef
/.notdef /.notdef /.notdef /.notdef /.notdef
/.notdef /.notdef /.notdef /.notdef /.notdef
/.notdef /.notdef /space /exclam /quotedbl
/numbersign /dollar /percent /ampersand /quotesingle
/parenleft /parenright /asterisk /plus /comma
/hyphen /period /slash /zero /one
/two /three /four /five /six
/seven /eight /nine /colon /semicolon
/less /equal /greater /question /at
/A /B /C /D /E
/F /G /H /I /J
/K /L /M /N /O
/P /Q /R /S /T
/U /V /W /X /Y
/Z /bracketleft /backslash /bracketright /asciicircum
/underscore /quoteleft /a /b /c
/d /e /f /g /h
/i /j /k /l /m
/n /o /p /q /r
/s /t /u /v /w
/x /y /z /braceleft /bar
/braceright /asciitilde /bullet /Euro /bullet
/quotesinglbase /florin /quotedblbase /ellipsis /dagger
/daggerdbl /circumflex /perthousand /Scaron /guilsinglleft
/OE /bullet /Zcaron /bullet /bullet
/quoteleft /quoteright /quotedblleft /quotedblright /bullet
/endash /emdash /asciitilde /trademark /scaron
/guilsinglright /oe /bullet /zcaron /Ydieresis
/space /exclamdown /cent /sterling /currency
/yen /brokenbar /section /dieresis /copyright
/ordfeminine /guillemotleft /logicalnot /sfthyphen /registered
/macron /degree /plusminus /twosuperior /threesuperior
/acute /mu /paragraph /middot /cedilla
/onesuperior /ordmasculine /guillemotright /onequarter /onehalf
/threequarters /questiondown /Agrave /Aacute /Acircumflex
/Atilde /Adieresis /Aring /AE /Ccedilla
/Egrave /Eacute /Ecircumflex /Edieresis /Igrave
/Iacute /Icircumflex /Idieresis /Eth /Ntilde
/Ograve /Oacute /Ocircumflex /Otilde /Odieresis
/multiply /Oslash /Ugrave /Uacute /Ucircumflex
/Udieresis /Yacute /Thorn /germandbls /agrave
/aacute /acircumflex /atilde /adieresis /aring
/ae /ccedilla /egrave /eacute /ecircumflex
/edieresis /igrave /iacute /icircumflex /idieresis
/eth /ntilde /ograve /oacute /ocircumflex
/otilde /odieresis /divide /oslash /ugrave
/uacute /ucircumflex /udieresis /yacute /thorn
/ydieresis
] def
%%EndResource
%FOPBeginFontReencode
/Courier-Bold findfont
dup length dict begin
  {1 index /FID ne {def} {pop pop} ifelse} forall
  /Encoding WinAnsiEncoding def
  currentdict
end
/Courier-Bold exch definefont pop
/Helvetica findfont
dup length dict begin
  {1 index /FID ne {def} {pop pop} ifelse} forall
  /Encoding WinAnsiEncoding def
  currentdict
end
/Helvetica exch definefont pop
/Courier-BoldOblique findfont
dup length dict begin
  {1 index /FID ne {def} {pop pop} ifelse} forall
  /Encoding WinAnsiEncoding def
  currentdict
end
/Courier-BoldOblique exch definefont pop
/Courier-Oblique findfont
dup length dict begin
  {1 index /FID ne {def} {pop pop} ifelse} forall
  /Encoding WinAnsiEncoding def
  currentdict
end
/Courier-Oblique exch definefont pop
/Times-Roman findfont
dup length dict begin
  {1 index /FID ne {def} {pop pop} ifelse} forall
  /Encoding WinAnsiEncoding def
  currentdict
end
/Times-Roman exch definefont pop
/Helvetica-BoldOblique findfont
dup length dict begin
  {1 index /FID ne {def} {pop pop} ifelse} forall
  /Encoding WinAnsiEncoding def
  currentdict
end
/Helvetica-BoldOblique exch definefont pop
/Helvetica-Bold findfont
dup length dict begin
  {1 index /FID ne {def} {pop pop} ifelse} forall
  /Encoding WinAnsiEncoding def
  currentdict
end
/Helvetica-Bold exch definefont pop
/Helvetica-Oblique findfont
dup length dict begin
  {1 index /FID ne {def} {pop pop} ifelse} forall
  /Encoding WinAnsiEncoding def
  currentdict
end
/Helvetica-Oblique exch definefont pop
/Times-BoldItalic findfont
dup length dict begin
  {1 index /FID ne {def} {pop pop} ifelse} forall
  /Encoding WinAnsiEncoding def
  currentdict
end
/Times-BoldItalic exch definefont pop
/Courier findfont
dup length dict begin
  {1 index /FID ne {def} {pop pop} ifelse} forall
  /Encoding WinAnsiEncoding def
  currentdict
end
/Courier exch definefont pop
/Times-Italic findfont
dup length dict begin
  {1 index /FID ne {def} {pop pop} ifelse} forall
  /Encoding WinAnsiEncoding def
  currentdict
end
/Times-Italic exch definefont pop
/Times-Bold findfont
dup length dict begin
  {1 index /FID ne {def} {pop pop} ifelse} forall
  /Encoding WinAnsiEncoding def
  currentdict
end
/Times-Bold exch definefont pop
%FOPEndFontReencode
%%EndProlog
%%Page: 1 1
%%PageBoundingBox: 0 0 1072 553
%%BeginPageSetup
[1 0 0 -1 0 553] CT
%%EndPageSetup
GS
[0.55814 0 0 0.55814 0 -0.11627] CT
N
0 0 M
1920 0 L
1920 991 L
0 991 L
0 0 L
cp
clip
1 GC
N
0 0 1920 991 re
f
GR
GS
[0.55814 0 0 0.55814 0 -0.11627] CT
1 GC
N
0 0 1920 991 re
f
GR
GS
[0.55814 0 0 0.55814 0 -0.11627] CT
1 GC
N
250 882 M
1738 882 L
1738 74 L
250 74 L
cp
f
GR
GS
[0.55814 0 0 0.55814 0 -0.11627] CT
0.873 GC
2 setlinecap
10.0 ML
N
283.532 882 M
283.532 74 L
S
GR
GS
[0.55814 0 0 0.55814 0 -0.11627] CT
0.873 GC
2 setlinecap
10.0 ML
N
520.355 882 M
520.355 74 L
S
GR
GS
[0.55814 0 0 0.55814 0 -0.11627] CT
0.873 GC
2 setlinecap
10.0 ML
N
757.177 882 M
757.177 74 L
S
GR
GS
[0.55814 0 0 0.55814 0 -0.11627] CT
0.873 GC
2 setlinecap
10.0 ML
N
994 882 M
994 74 L
S
GR
GS
[0.55814 0 0 0.55814 0 -0.11627] CT
0.873 GC
2 setlinecap
10.0 ML
N
1230.823 882 M
1230.823 74 L
S
GR
GS
[0.55814 0 0 0.55814 0 -0.11627] CT
0.873 GC
2 setlinecap
10.0 ML
N
1467.645 882 M
1467.645 74 L
S
GR
GS
[0.55814 0 0 0.55814 0 -0.11627] CT
0.873 GC
2 setlinecap
10.0 ML
N
1704.468 882 M
1704.468 74 L
S
GR
GS
[0.55814 0 0 0.55814 0 -0.11627] CT
0.873 GC
2 setlinecap
10.0 ML
N
1738 882 M
250 882 L
S
GR
GS
[0.55814 0 0 0.55814 0 -0.11627] CT
0.873 GC
2 setlinecap
10.0 ML
N
1738 781 M
250 781 L
S
GR
GS
[0.55814 0 0 0.55814 0 -0.11627] CT
0.873 GC
2 setlinecap
10.0 ML
N
1738 680 M
250 680 L
S
GR
GS
[0.55814 0 0 0.55814 0 -0.11627] CT
0.873 GC
2 setlinecap
10.0 ML
N
1738 579 M
250 579 L
S
GR
GS
[0.55814 0 0 0.55814 0 -0.11627] CT
0.873 GC
2 setlinecap
10.0 ML
N
1738 478 M
250 478 L
S
GR
GS
[0.55814 0 0 0.55814 0 -0.11627] CT
0.873 GC
2 setlinecap
10.0 ML
N
1738 377 M
250 377 L
S
GR
GS
[0.55814 0 0 0.55814 0 -0.11627] CT
0.873 GC
2 setlinecap
10.0 ML
N
1738 276 M
250 276 L
S
GR
GS
[0.55814 0 0 0.55814 0 -0.11627] CT
0.873 GC
2 setlinecap
10.0 ML
N
1738 175 M
250 175 L
S
GR
GS
[0.55814 0 0 0.55814 0 -0.11627] CT
0.873 GC
2 setlinecap
10.0 ML
N
1738 74 M
250 74 L
S
GR
GS
[0.55814 0 0 0.55814 554.79112 509.99999] CT
0.149 GC
/Helvetica 20 F
GS
[1 0 0 1 0 0] CT
-5 21 moveto 
1 -1 scale
(x) t 
GR
GR
GS
[0.55814 0 0 0.55814 0 -0.11627] CT
0.149 GC
2 setlinecap
10.0 ML
N
250 882 M
1738 882 L
S
GR
GS
[0.55814 0 0 0.55814 0 -0.11627] CT
0.149 GC
2 setlinecap
10.0 ML
N
250 74 M
1738 74 L
S
GR
GS
[0.55814 0 0 0.55814 0 -0.11627] CT
0.149 GC
2 setlinecap
10.0 ML
N
283.532 882 M
283.532 867.12 L
S
GR
GS
[0.55814 0 0 0.55814 0 -0.11627] CT
0.149 GC
2 setlinecap
10.0 ML
N
520.355 882 M
520.355 867.12 L
S
GR
GS
[0.55814 0 0 0.55814 0 -0.11627] CT
0.149 GC
2 setlinecap
10.0 ML
N
757.177 882 M
757.177 867.12 L
S
GR
GS
[0.55814 0 0 0.55814 0 -0.11627] CT
0.149 GC
2 setlinecap
10.0 ML
N
994 882 M
994 867.12 L
S
GR
GS
[0.55814 0 0 0.55814 0 -0.11627] CT
0.149 GC
2 setlinecap
10.0 ML
N
1230.823 882 M
1230.823 867.12 L
S
GR
GS
[0.55814 0 0 0.55814 0 -0.11627] CT
0.149 GC
2 setlinecap
10.0 ML
N
1467.645 882 M
1467.645 867.12 L
S
GR
GS
[0.55814 0 0 0.55814 0 -0.11627] CT
0.149 GC
2 setlinecap
10.0 ML
N
1704.468 882 M
1704.468 867.12 L
S
GR
GS
[0.55814 0 0 0.55814 0 -0.11627] CT
0.149 GC
2 setlinecap
10.0 ML
N
283.532 74 M
283.532 88.88 L
S
GR
GS
[0.55814 0 0 0.55814 0 -0.11627] CT
0.149 GC
2 setlinecap
10.0 ML
N
520.355 74 M
520.355 88.88 L
S
GR
GS
[0.55814 0 0 0.55814 0 -0.11627] CT
0.149 GC
2 setlinecap
10.0 ML
N
757.177 74 M
757.177 88.88 L
S
GR
GS
[0.55814 0 0 0.55814 0 -0.11627] CT
0.149 GC
2 setlinecap
10.0 ML
N
994 74 M
994 88.88 L
S
GR
GS
[0.55814 0 0 0.55814 0 -0.11627] CT
0.149 GC
2 setlinecap
10.0 ML
N
1230.823 74 M
1230.823 88.88 L
S
GR
GS
[0.55814 0 0 0.55814 0 -0.11627] CT
0.149 GC
2 setlinecap
10.0 ML
N
1467.645 74 M
1467.645 88.88 L
S
GR
GS
[0.55814 0 0 0.55814 0 -0.11627] CT
0.149 GC
2 setlinecap
10.0 ML
N
1704.468 74 M
1704.468 88.88 L
S
GR
GS
[0.55814 0 0 0.55814 158.25062 496.1628] CT
0.149 GC
/Helvetica 18 F
GS
[1 0 0 1 0 0] CT
-8.5 19 moveto 
1 -1 scale
(-3) t 
GR
GR
GS
[0.55814 0 0 0.55814 290.43066 496.1628] CT
0.149 GC
/Helvetica 18 F
GS
[1 0 0 1 0 0] CT
-8.5 19 moveto 
1 -1 scale
(-2) t 
GR
GR
GS
[0.55814 0 0 0.55814 422.61067 496.1628] CT
0.149 GC
/Helvetica 18 F
GS
[1 0 0 1 0 0] CT
-8.5 19 moveto 
1 -1 scale
(-1) t 
GR
GR
GS
[0.55814 0 0 0.55814 554.79071 496.1628] CT
0.149 GC
/Helvetica 18 F
GS
[1 0 0 1 0 0] CT
-5.5 19 moveto 
1 -1 scale
(0) t 
GR
GR
GS
[0.55814 0 0 0.55814 686.97072 496.1628] CT
0.149 GC
/Helvetica 18 F
GS
[1 0 0 1 0 0] CT
-5.5 19 moveto 
1 -1 scale
(1) t 
GR
GR
GS
[0.55814 0 0 0.55814 819.15079 496.1628] CT
0.149 GC
/Helvetica 18 F
GS
[1 0 0 1 0 0] CT
-5.5 19 moveto 
1 -1 scale
(2) t 
GR
GR
GS
[0.55814 0 0 0.55814 951.3308 496.1628] CT
0.149 GC
/Helvetica 18 F
GS
[1 0 0 1 0 0] CT
-5.5 19 moveto 
1 -1 scale
(3) t 
GR
GR
GS
[0 -0.55814 0.55814 0 123.0465 266.6742] CT
0.149 GC
/Helvetica 20 F
GS
[1 0 0 1 0 0] CT
-14.5 -5 moveto 
1 -1 scale
(f\(x\)) t 
GR
GR
GS
[0.55814 0 0 0.55814 0 -0.11627] CT
0.149 GC
2 setlinecap
10.0 ML
N
250 882 M
250 74 L
S
GR
GS
[0.55814 0 0 0.55814 0 -0.11627] CT
0.149 GC
2 setlinecap
10.0 ML
N
1738 882 M
1738 74 L
S
GR
GS
[0.55814 0 0 0.55814 0 -0.11627] CT
0.149 GC
2 setlinecap
10.0 ML
N
250 882 M
264.88 882 L
S
GR
GS
[0.55814 0 0 0.55814 0 -0.11627] CT
0.149 GC
2 setlinecap
10.0 ML
N
250 781 M
264.88 781 L
S
GR
GS
[0.55814 0 0 0.55814 0 -0.11627] CT
0.149 GC
2 setlinecap
10.0 ML
N
250 680 M
264.88 680 L
S
GR
GS
[0.55814 0 0 0.55814 0 -0.11627] CT
0.149 GC
2 setlinecap
10.0 ML
N
250 579 M
264.88 579 L
S
GR
GS
[0.55814 0 0 0.55814 0 -0.11627] CT
0.149 GC
2 setlinecap
10.0 ML
N
250 478 M
264.88 478 L
S
GR
GS
[0.55814 0 0 0.55814 0 -0.11627] CT
0.149 GC
2 setlinecap
10.0 ML
N
250 377 M
264.88 377 L
S
GR
GS
[0.55814 0 0 0.55814 0 -0.11627] CT
0.149 GC
2 setlinecap
10.0 ML
N
250 276 M
264.88 276 L
S
GR
GS
[0.55814 0 0 0.55814 0 -0.11627] CT
0.149 GC
2 setlinecap
10.0 ML
N
250 175 M
264.88 175 L
S
GR
GS
[0.55814 0 0 0.55814 0 -0.11627] CT
0.149 GC
2 setlinecap
10.0 ML
N
250 74 M
264.88 74 L
S
GR
GS
[0.55814 0 0 0.55814 0 -0.11627] CT
0.149 GC
2 setlinecap
10.0 ML
N
1738 882 M
1723.12 882 L
S
GR
GS
[0.55814 0 0 0.55814 0 -0.11627] CT
0.149 GC
2 setlinecap
10.0 ML
N
1738 781 M
1723.12 781 L
S
GR
GS
[0.55814 0 0 0.55814 0 -0.11627] CT
0.149 GC
2 setlinecap
10.0 ML
N
1738 680 M
1723.12 680 L
S
GR
GS
[0.55814 0 0 0.55814 0 -0.11627] CT
0.149 GC
2 setlinecap
10.0 ML
N
1738 579 M
1723.12 579 L
S
GR
GS
[0.55814 0 0 0.55814 0 -0.11627] CT
0.149 GC
2 setlinecap
10.0 ML
N
1738 478 M
1723.12 478 L
S
GR
GS
[0.55814 0 0 0.55814 0 -0.11627] CT
0.149 GC
2 setlinecap
10.0 ML
N
1738 377 M
1723.12 377 L
S
GR
GS
[0.55814 0 0 0.55814 0 -0.11627] CT
0.149 GC
2 setlinecap
10.0 ML
N
1738 276 M
1723.12 276 L
S
GR
GS
[0.55814 0 0 0.55814 0 -0.11627] CT
0.149 GC
2 setlinecap
10.0 ML
N
1738 175 M
1723.12 175 L
S
GR
GS
[0.55814 0 0 0.55814 0 -0.11627] CT
0.149 GC
2 setlinecap
10.0 ML
N
1738 74 M
1723.12 74 L
S
GR
GS
[0.55814 0 0 0.55814 135.53488 492.16279] CT
0.149 GC
/Helvetica 18 F
GS
[1 0 0 1 0 0] CT
-17 7.5 moveto 
1 -1 scale
(-5) t 
GR
GR
GS
[0.55814 0 0 0.55814 135.53488 435.7907] CT
0.149 GC
/Helvetica 18 F
GS
[1 0 0 1 0 0] CT
-17 7.5 moveto 
1 -1 scale
(-4) t 
GR
GR
GS
[0.55814 0 0 0.55814 135.53488 379.41861] CT
0.149 GC
/Helvetica 18 F
GS
[1 0 0 1 0 0] CT
-17 7.5 moveto 
1 -1 scale
(-3) t 
GR
GR
GS
[0.55814 0 0 0.55814 135.53488 323.04651] CT
0.149 GC
/Helvetica 18 F
GS
[1 0 0 1 0 0] CT
-17 7.5 moveto 
1 -1 scale
(-2) t 
GR
GR
GS
[0.55814 0 0 0.55814 135.53488 266.67442] CT
0.149 GC
/Helvetica 18 F
GS
[1 0 0 1 0 0] CT
-17 7.5 moveto 
1 -1 scale
(-1) t 
GR
GR
GS
[0.55814 0 0 0.55814 135.53488 210.30233] CT
0.149 GC
/Helvetica 18 F
GS
[1 0 0 1 0 0] CT
-11 7.5 moveto 
1 -1 scale
(0) t 
GR
GR
GS
[0.55814 0 0 0.55814 135.53488 153.93024] CT
0.149 GC
/Helvetica 18 F
GS
[1 0 0 1 0 0] CT
-11 7.5 moveto 
1 -1 scale
(1) t 
GR
GR
GS
[0.55814 0 0 0.55814 135.53488 97.55815] CT
0.149 GC
/Helvetica 18 F
GS
[1 0 0 1 0 0] CT
-11 7.5 moveto 
1 -1 scale
(2) t 
GR
GR
GS
[0.55814 0 0 0.55814 135.53488 41.18605] CT
0.149 GC
/Helvetica 18 F
GS
[1 0 0 1 0 0] CT
-11 7.5 moveto 
1 -1 scale
(3) t 
GR
GR
GS
[0.55814 0 0 0.55814 0 -0.11627] CT
0 0.447 0.741 RC
2 LJ
N
250 160.699 M
252.976 161.96 L
255.952 163.206 L
258.928 164.435 L
261.904 165.648 L
264.88 166.846 L
267.856 168.027 L
270.832 169.193 L
273.808 170.343 L
276.784 171.477 L
279.76 172.595 L
282.736 173.697 L
285.712 174.783 L
288.688 175.854 L
291.664 176.909 L
294.64 177.948 L
297.616 178.972 L
300.592 179.98 L
303.568 180.972 L
306.544 181.949 L
309.52 182.91 L
312.496 183.856 L
318.448 185.702 L
321.424 186.601 L
327.376 188.355 L
330.352 189.21 L
336.304 190.873 L
342.256 192.477 L
348.208 194.022 L
354.16 195.509 L
360.112 196.938 L
366.064 198.309 L
372.016 199.625 L
377.968 200.885 L
383.92 202.09 L
389.872 203.242 L
395.824 204.34 L
401.776 205.387 L
407.728 206.382 L
413.68 207.327 L
419.632 208.223 L
425.584 209.071 L
431.536 209.872 L
437.488 210.627 L
443.44 211.337 L
449.392 212.003 L
455.344 212.627 L
461.296 213.209 L
467.248 213.752 L
473.2 214.256 L
S
GR
GS
[0.55814 0 0 0.55814 0 -0.11627] CT
0 0.447 0.741 RC
2 LJ
N
473.2 214.256 M
479.152 214.722 L
491.056 215.547 L
497.008 215.909 L
508.912 216.537 L
514.864 216.807 L
526.768 217.264 L
538.672 217.621 L
550.576 217.89 L
562.48 218.083 L
574.384 218.213 L
586.288 218.292 L
610.096 218.347 L
657.712 218.407 L
669.616 218.486 L
681.52 218.616 L
693.424 218.809 L
705.328 219.078 L
717.232 219.435 L
729.136 219.892 L
741.04 220.461 L
746.992 220.79 L
758.896 221.547 L
764.848 221.977 L
776.752 222.947 L
782.704 223.49 L
794.608 224.696 L
800.56 225.363 L
806.512 226.073 L
812.464 226.827 L
818.416 227.628 L
824.368 228.476 L
830.32 229.372 L
836.272 230.317 L
842.224 231.312 L
848.176 232.359 L
854.128 233.457 L
860.08 234.609 L
866.032 235.814 L
871.984 237.074 L
877.936 238.39 L
883.888 239.761 L
889.84 241.19 L
895.792 242.677 L
901.744 244.222 L
907.696 245.826 L
913.648 247.489 L
919.6 249.213 L
925.552 250.998 L
931.504 252.843 L
S
GR
GS
[0.55814 0 0 0.55814 0 -0.11627] CT
0 0.447 0.741 RC
2 LJ
N
931.504 252.843 M
937.456 254.75 L
949.36 258.751 L
955.312 260.845 L
967.216 265.222 L
973.168 267.506 L
985.072 272.264 L
991.024 274.739 L
1002.928 279.879 L
1008.88 282.545 L
1020.784 288.068 L
1032.688 293.844 L
1044.592 299.872 L
1056.496 306.15 L
1068.4 312.673 L
1080.304 319.44 L
1092.208 326.444 L
1104.112 333.683 L
1116.016 341.149 L
1127.92 348.837 L
1139.824 356.741 L
1151.728 364.853 L
1163.632 373.165 L
1175.536 381.67 L
1187.44 390.359 L
1199.344 399.222 L
1211.248 408.251 L
1235.056 426.763 L
1246.96 436.225 L
1270.768 455.507 L
1294.576 475.188 L
1318.384 495.172 L
1366 535.65 L
1413.616 576.128 L
1461.232 615.794 L
1485.04 635.076 L
1508.848 653.866 L
1532.656 672.078 L
1556.464 689.631 L
1580.272 706.448 L
1604.08 722.464 L
1627.888 737.618 L
1651.696 751.861 L
1675.504 765.151 L
1699.312 777.456 L
1718.656 786.714 L
1738 795.301 L
S
GR
%%Trailer
%%Pages: 1
%%EOF
