%!PS-Adobe-3.0 EPSF-3.0
%%Creator: (MATLAB, The Mathworks, Inc. Version 8.5.0.197613 \(R2015a\). Operating System: Windows 7)
%%Title: C:/Users/Shurshurik/Desktop/matlab_student/4/figure6.eps
%%CreationDate: 2018-11-26T16:34:35
%%Pages: (atend)
%%BoundingBox: 0 0 1072 553
%%LanguageLevel: 2
%%EndComments
%%BeginProlog
%%BeginResource: procset (Apache XML Graphics Std ProcSet) 1.2 0
%%Version: 1.2 0
%%Copyright: (Copyright 2001-2003,2010 The Apache Software Foundation. License terms: http://www.apache.org/licenses/LICENSE-2.0)
/bd{bind def}bind def
/ld{load def}bd
/GR/grestore ld
/M/moveto ld
/LJ/setlinejoin ld
/C/curveto ld
/f/fill ld
/LW/setlinewidth ld
/GC/setgray ld
/t/show ld
/N/newpath ld
/CT/concat ld
/cp/closepath ld
/S/stroke ld
/L/lineto ld
/CC/setcmykcolor ld
/A/ashow ld
/GS/gsave ld
/RC/setrgbcolor ld
/RM/rmoveto ld
/ML/setmiterlimit ld
/re {4 2 roll M
1 index 0 rlineto
0 exch rlineto
neg 0 rlineto
cp } bd
/_ctm matrix def
/_tm matrix def
/BT { _ctm currentmatrix pop matrix _tm copy pop 0 0 moveto } bd
/ET { _ctm setmatrix } bd
/iTm { _ctm setmatrix _tm concat } bd
/Tm { _tm astore pop iTm 0 0 moveto } bd
/ux 0.0 def
/uy 0.0 def
/F {
  /Tp exch def
  /Tf exch def
  Tf findfont Tp scalefont setfont
  /cf Tf def  /cs Tp def
} bd
/ULS {currentpoint /uy exch def /ux exch def} bd
/ULE {
  /Tcx currentpoint pop def
  gsave
  newpath
  cf findfont cs scalefont dup
  /FontMatrix get 0 get /Ts exch def /FontInfo get dup
  /UnderlinePosition get Ts mul /To exch def
  /UnderlineThickness get Ts mul /Tt exch def
  ux uy To add moveto  Tcx uy To add lineto
  Tt setlinewidth stroke
  grestore
} bd
/OLE {
  /Tcx currentpoint pop def
  gsave
  newpath
  cf findfont cs scalefont dup
  /FontMatrix get 0 get /Ts exch def /FontInfo get dup
  /UnderlinePosition get Ts mul /To exch def
  /UnderlineThickness get Ts mul /Tt exch def
  ux uy To add cs add moveto Tcx uy To add cs add lineto
  Tt setlinewidth stroke
  grestore
} bd
/SOE {
  /Tcx currentpoint pop def
  gsave
  newpath
  cf findfont cs scalefont dup
  /FontMatrix get 0 get /Ts exch def /FontInfo get dup
  /UnderlinePosition get Ts mul /To exch def
  /UnderlineThickness get Ts mul /Tt exch def
  ux uy To add cs 10 mul 26 idiv add moveto Tcx uy To add cs 10 mul 26 idiv add lineto
  Tt setlinewidth stroke
  grestore
} bd
/QT {
/Y22 exch store
/X22 exch store
/Y21 exch store
/X21 exch store
currentpoint
/Y21 load 2 mul add 3 div exch
/X21 load 2 mul add 3 div exch
/X21 load 2 mul /X22 load add 3 div
/Y21 load 2 mul /Y22 load add 3 div
/X22 load /Y22 load curveto
} bd
/SSPD {
dup length /d exch dict def
{
/v exch def
/k exch def
currentpagedevice k known {
/cpdv currentpagedevice k get def
v cpdv ne {
/upd false def
/nullv v type /nulltype eq def
/nullcpdv cpdv type /nulltype eq def
nullv nullcpdv or
{
/upd true def
} {
/sametype v type cpdv type eq def
sametype {
v type /arraytype eq {
/vlen v length def
/cpdvlen cpdv length def
vlen cpdvlen eq {
0 1 vlen 1 sub {
/i exch def
/obj v i get def
/cpdobj cpdv i get def
obj cpdobj ne {
/upd true def
exit
} if
} for
} {
/upd true def
} ifelse
} {
v type /dicttype eq {
v {
/dv exch def
/dk exch def
/cpddv cpdv dk get def
dv cpddv ne {
/upd true def
exit
} if
} forall
} {
/upd true def
} ifelse
} ifelse
} if
} ifelse
upd true eq {
d k v put
} if
} if
} if
} forall
d length 0 gt {
d setpagedevice
} if
} bd
%%EndResource
%%BeginResource: procset (Apache XML Graphics EPS ProcSet) 1.0 0
%%Version: 1.0 0
%%Copyright: (Copyright 2002-2003 The Apache Software Foundation. License terms: http://www.apache.org/licenses/LICENSE-2.0)
/BeginEPSF { %def
/b4_Inc_state save def         % Save state for cleanup
/dict_count countdictstack def % Count objects on dict stack
/op_count count 1 sub def      % Count objects on operand stack
userdict begin                 % Push userdict on dict stack
/showpage { } def              % Redefine showpage, { } = null proc
0 setgray 0 setlinecap         % Prepare graphics state
1 setlinewidth 0 setlinejoin
10 setmiterlimit [ ] 0 setdash newpath
/languagelevel where           % If level not equal to 1 then
{pop languagelevel             % set strokeadjust and
1 ne                           % overprint to their defaults.
{false setstrokeadjust false setoverprint
} if
} if
} bd
/EndEPSF { %def
count op_count sub {pop} repeat            % Clean up stacks
countdictstack dict_count sub {end} repeat
b4_Inc_state restore
} bd
%%EndResource
%FOPBeginFontDict
%%IncludeResource: font Courier-Bold
%%IncludeResource: font Helvetica
%%IncludeResource: font Courier-BoldOblique
%%IncludeResource: font Courier-Oblique
%%IncludeResource: font Times-Roman
%%IncludeResource: font Helvetica-BoldOblique
%%IncludeResource: font Helvetica-Bold
%%IncludeResource: font Helvetica-Oblique
%%IncludeResource: font Times-BoldItalic
%%IncludeResource: font Courier
%%IncludeResource: font Times-Italic
%%IncludeResource: font Times-Bold
%%IncludeResource: font Symbol
%%IncludeResource: font ZapfDingbats
%FOPEndFontDict
%%BeginResource: encoding WinAnsiEncoding
/WinAnsiEncoding [
/.notdef /.notdef /.notdef /.notdef /.notdef
/.notdef /.notdef /.notdef /.notdef /.notdef
/.notdef /.notdef /.notdef /.notdef /.notdef
/.notdef /.notdef /.notdef /.notdef /.notdef
/.notdef /.notdef /.notdef /.notdef /.notdef
/.notdef /.notdef /.notdef /.notdef /.notdef
/.notdef /.notdef /space /exclam /quotedbl
/numbersign /dollar /percent /ampersand /quotesingle
/parenleft /parenright /asterisk /plus /comma
/hyphen /period /slash /zero /one
/two /three /four /five /six
/seven /eight /nine /colon /semicolon
/less /equal /greater /question /at
/A /B /C /D /E
/F /G /H /I /J
/K /L /M /N /O
/P /Q /R /S /T
/U /V /W /X /Y
/Z /bracketleft /backslash /bracketright /asciicircum
/underscore /quoteleft /a /b /c
/d /e /f /g /h
/i /j /k /l /m
/n /o /p /q /r
/s /t /u /v /w
/x /y /z /braceleft /bar
/braceright /asciitilde /bullet /Euro /bullet
/quotesinglbase /florin /quotedblbase /ellipsis /dagger
/daggerdbl /circumflex /perthousand /Scaron /guilsinglleft
/OE /bullet /Zcaron /bullet /bullet
/quoteleft /quoteright /quotedblleft /quotedblright /bullet
/endash /emdash /asciitilde /trademark /scaron
/guilsinglright /oe /bullet /zcaron /Ydieresis
/space /exclamdown /cent /sterling /currency
/yen /brokenbar /section /dieresis /copyright
/ordfeminine /guillemotleft /logicalnot /sfthyphen /registered
/macron /degree /plusminus /twosuperior /threesuperior
/acute /mu /paragraph /middot /cedilla
/onesuperior /ordmasculine /guillemotright /onequarter /onehalf
/threequarters /questiondown /Agrave /Aacute /Acircumflex
/Atilde /Adieresis /Aring /AE /Ccedilla
/Egrave /Eacute /Ecircumflex /Edieresis /Igrave
/Iacute /Icircumflex /Idieresis /Eth /Ntilde
/Ograve /Oacute /Ocircumflex /Otilde /Odieresis
/multiply /Oslash /Ugrave /Uacute /Ucircumflex
/Udieresis /Yacute /Thorn /germandbls /agrave
/aacute /acircumflex /atilde /adieresis /aring
/ae /ccedilla /egrave /eacute /ecircumflex
/edieresis /igrave /iacute /icircumflex /idieresis
/eth /ntilde /ograve /oacute /ocircumflex
/otilde /odieresis /divide /oslash /ugrave
/uacute /ucircumflex /udieresis /yacute /thorn
/ydieresis
] def
%%EndResource
%FOPBeginFontReencode
/Courier-Bold findfont
dup length dict begin
  {1 index /FID ne {def} {pop pop} ifelse} forall
  /Encoding WinAnsiEncoding def
  currentdict
end
/Courier-Bold exch definefont pop
/Helvetica findfont
dup length dict begin
  {1 index /FID ne {def} {pop pop} ifelse} forall
  /Encoding WinAnsiEncoding def
  currentdict
end
/Helvetica exch definefont pop
/Courier-BoldOblique findfont
dup length dict begin
  {1 index /FID ne {def} {pop pop} ifelse} forall
  /Encoding WinAnsiEncoding def
  currentdict
end
/Courier-BoldOblique exch definefont pop
/Courier-Oblique findfont
dup length dict begin
  {1 index /FID ne {def} {pop pop} ifelse} forall
  /Encoding WinAnsiEncoding def
  currentdict
end
/Courier-Oblique exch definefont pop
/Times-Roman findfont
dup length dict begin
  {1 index /FID ne {def} {pop pop} ifelse} forall
  /Encoding WinAnsiEncoding def
  currentdict
end
/Times-Roman exch definefont pop
/Helvetica-BoldOblique findfont
dup length dict begin
  {1 index /FID ne {def} {pop pop} ifelse} forall
  /Encoding WinAnsiEncoding def
  currentdict
end
/Helvetica-BoldOblique exch definefont pop
/Helvetica-Bold findfont
dup length dict begin
  {1 index /FID ne {def} {pop pop} ifelse} forall
  /Encoding WinAnsiEncoding def
  currentdict
end
/Helvetica-Bold exch definefont pop
/Helvetica-Oblique findfont
dup length dict begin
  {1 index /FID ne {def} {pop pop} ifelse} forall
  /Encoding WinAnsiEncoding def
  currentdict
end
/Helvetica-Oblique exch definefont pop
/Times-BoldItalic findfont
dup length dict begin
  {1 index /FID ne {def} {pop pop} ifelse} forall
  /Encoding WinAnsiEncoding def
  currentdict
end
/Times-BoldItalic exch definefont pop
/Courier findfont
dup length dict begin
  {1 index /FID ne {def} {pop pop} ifelse} forall
  /Encoding WinAnsiEncoding def
  currentdict
end
/Courier exch definefont pop
/Times-Italic findfont
dup length dict begin
  {1 index /FID ne {def} {pop pop} ifelse} forall
  /Encoding WinAnsiEncoding def
  currentdict
end
/Times-Italic exch definefont pop
/Times-Bold findfont
dup length dict begin
  {1 index /FID ne {def} {pop pop} ifelse} forall
  /Encoding WinAnsiEncoding def
  currentdict
end
/Times-Bold exch definefont pop
%FOPEndFontReencode
%%EndProlog
%%Page: 1 1
%%PageBoundingBox: 0 0 1072 553
%%BeginPageSetup
[1 0 0 -1 0 553] CT
%%EndPageSetup
GS
[0.55814 0 0 0.55814 0 -0.11627] CT
N
0 0 M
1920 0 L
1920 991 L
0 991 L
0 0 L
cp
clip
1 GC
N
0 0 1920 991 re
f
GR
GS
[0.55814 0 0 0.55814 0 -0.11627] CT
1 GC
N
0 0 1920 991 re
f
GR
GS
[0.55814 0 0 0.55814 0 -0.11627] CT
1 GC
N
250 882 M
659 882 L
659 74 L
250 74 L
cp
f
GR
GS
[0.55814 0 0 0.55814 0 -0.11627] CT
0.873 GC
2 setlinecap
10.0 ML
N
250 882 M
250 74 L
S
GR
GS
[0.55814 0 0 0.55814 0 -0.11627] CT
0.873 GC
2 setlinecap
10.0 ML
N
318.167 882 M
318.167 74 L
S
GR
GS
[0.55814 0 0 0.55814 0 -0.11627] CT
0.873 GC
2 setlinecap
10.0 ML
N
386.333 882 M
386.333 74 L
S
GR
GS
[0.55814 0 0 0.55814 0 -0.11627] CT
0.873 GC
2 setlinecap
10.0 ML
N
454.5 882 M
454.5 74 L
S
GR
GS
[0.55814 0 0 0.55814 0 -0.11627] CT
0.873 GC
2 setlinecap
10.0 ML
N
522.667 882 M
522.667 74 L
S
GR
GS
[0.55814 0 0 0.55814 0 -0.11627] CT
0.873 GC
2 setlinecap
10.0 ML
N
590.833 882 M
590.833 74 L
S
GR
GS
[0.55814 0 0 0.55814 0 -0.11627] CT
0.873 GC
2 setlinecap
10.0 ML
N
659 882 M
659 74 L
S
GR
GS
[0.55814 0 0 0.55814 0 -0.11627] CT
0.873 GC
2 setlinecap
10.0 ML
N
659 882 M
250 882 L
S
GR
GS
[0.55814 0 0 0.55814 0 -0.11627] CT
0.873 GC
2 setlinecap
10.0 ML
N
659 747.333 M
250 747.333 L
S
GR
GS
[0.55814 0 0 0.55814 0 -0.11627] CT
0.873 GC
2 setlinecap
10.0 ML
N
659 612.667 M
250 612.667 L
S
GR
GS
[0.55814 0 0 0.55814 0 -0.11627] CT
0.873 GC
2 setlinecap
10.0 ML
N
659 478 M
250 478 L
S
GR
GS
[0.55814 0 0 0.55814 0 -0.11627] CT
0.873 GC
2 setlinecap
10.0 ML
N
659 343.333 M
250 343.333 L
S
GR
GS
[0.55814 0 0 0.55814 0 -0.11627] CT
0.873 GC
2 setlinecap
10.0 ML
N
659 208.667 M
250 208.667 L
S
GR
GS
[0.55814 0 0 0.55814 0 -0.11627] CT
0.873 GC
2 setlinecap
10.0 ML
N
659 74 M
250 74 L
S
GR
GS
[0.55814 0 0 0.55814 253.67454 510.00002] CT
0.149 GC
/Helvetica 20 F
GS
[1 0 0 1 0 0] CT
-7.5 21 moveto 
1 -1 scale
(N) t 
GR
GR
GS
[0.55814 0 0 0.55814 0 -0.11627] CT
0.149 GC
2 setlinecap
10.0 ML
N
250 882 M
659 882 L
S
GR
GS
[0.55814 0 0 0.55814 0 -0.11627] CT
0.149 GC
2 setlinecap
10.0 ML
N
250 74 M
659 74 L
S
GR
GS
[0.55814 0 0 0.55814 0 -0.11627] CT
0.149 GC
2 setlinecap
10.0 ML
N
250 882 M
250 873.92 L
S
GR
GS
[0.55814 0 0 0.55814 0 -0.11627] CT
0.149 GC
2 setlinecap
10.0 ML
N
318.167 882 M
318.167 873.92 L
S
GR
GS
[0.55814 0 0 0.55814 0 -0.11627] CT
0.149 GC
2 setlinecap
10.0 ML
N
386.333 882 M
386.333 873.92 L
S
GR
GS
[0.55814 0 0 0.55814 0 -0.11627] CT
0.149 GC
2 setlinecap
10.0 ML
N
454.5 882 M
454.5 873.92 L
S
GR
GS
[0.55814 0 0 0.55814 0 -0.11627] CT
0.149 GC
2 setlinecap
10.0 ML
N
522.667 882 M
522.667 873.92 L
S
GR
GS
[0.55814 0 0 0.55814 0 -0.11627] CT
0.149 GC
2 setlinecap
10.0 ML
N
590.833 882 M
590.833 873.92 L
S
GR
GS
[0.55814 0 0 0.55814 0 -0.11627] CT
0.149 GC
2 setlinecap
10.0 ML
N
659 882 M
659 873.92 L
S
GR
GS
[0.55814 0 0 0.55814 0 -0.11627] CT
0.149 GC
2 setlinecap
10.0 ML
N
250 74 M
250 82.08 L
S
GR
GS
[0.55814 0 0 0.55814 0 -0.11627] CT
0.149 GC
2 setlinecap
10.0 ML
N
318.167 74 M
318.167 82.08 L
S
GR
GS
[0.55814 0 0 0.55814 0 -0.11627] CT
0.149 GC
2 setlinecap
10.0 ML
N
386.333 74 M
386.333 82.08 L
S
GR
GS
[0.55814 0 0 0.55814 0 -0.11627] CT
0.149 GC
2 setlinecap
10.0 ML
N
454.5 74 M
454.5 82.08 L
S
GR
GS
[0.55814 0 0 0.55814 0 -0.11627] CT
0.149 GC
2 setlinecap
10.0 ML
N
522.667 74 M
522.667 82.08 L
S
GR
GS
[0.55814 0 0 0.55814 0 -0.11627] CT
0.149 GC
2 setlinecap
10.0 ML
N
590.833 74 M
590.833 82.08 L
S
GR
GS
[0.55814 0 0 0.55814 0 -0.11627] CT
0.149 GC
2 setlinecap
10.0 ML
N
659 74 M
659 82.08 L
S
GR
GS
[0.55814 0 0 0.55814 139.53489 496.1628] CT
0.149 GC
/Helvetica 18 F
GS
[1 0 0 1 0 0] CT
-15.5 19 moveto 
1 -1 scale
(350) t 
GR
GR
GS
[0.55814 0 0 0.55814 177.58139 496.1628] CT
0.149 GC
/Helvetica 18 F
GS
[1 0 0 1 0 0] CT
-15.5 19 moveto 
1 -1 scale
(400) t 
GR
GR
GS
[0.55814 0 0 0.55814 215.62792 496.1628] CT
0.149 GC
/Helvetica 18 F
GS
[1 0 0 1 0 0] CT
-15.5 19 moveto 
1 -1 scale
(450) t 
GR
GR
GS
[0.55814 0 0 0.55814 253.67442 496.1628] CT
0.149 GC
/Helvetica 18 F
GS
[1 0 0 1 0 0] CT
-15.5 19 moveto 
1 -1 scale
(500) t 
GR
GR
GS
[0.55814 0 0 0.55814 291.72095 496.1628] CT
0.149 GC
/Helvetica 18 F
GS
[1 0 0 1 0 0] CT
-15.5 19 moveto 
1 -1 scale
(550) t 
GR
GR
GS
[0.55814 0 0 0.55814 329.76744 496.1628] CT
0.149 GC
/Helvetica 18 F
GS
[1 0 0 1 0 0] CT
-15.5 19 moveto 
1 -1 scale
(600) t 
GR
GR
GS
[0.55814 0 0 0.55814 367.81396 496.1628] CT
0.149 GC
/Helvetica 18 F
GS
[1 0 0 1 0 0] CT
-15.5 19 moveto 
1 -1 scale
(650) t 
GR
GR
GS
[0 -0.55814 0.55814 0 115.23256 266.6742] CT
0.149 GC
/Helvetica 20 F
GS
[1 0 0 1 0 0] CT
-7 -5 moveto 
1 -1 scale
(P) t 
GR
GR
GS
[0.55814 0 0 0.55814 0 -0.11627] CT
0.149 GC
2 setlinecap
10.0 ML
N
250 882 M
250 74 L
S
GR
GS
[0.55814 0 0 0.55814 0 -0.11627] CT
0.149 GC
2 setlinecap
10.0 ML
N
659 882 M
659 74 L
S
GR
GS
[0.55814 0 0 0.55814 0 -0.11627] CT
0.149 GC
2 setlinecap
10.0 ML
N
250 882 M
258.08 882 L
S
GR
GS
[0.55814 0 0 0.55814 0 -0.11627] CT
0.149 GC
2 setlinecap
10.0 ML
N
250 747.333 M
258.08 747.333 L
S
GR
GS
[0.55814 0 0 0.55814 0 -0.11627] CT
0.149 GC
2 setlinecap
10.0 ML
N
250 612.667 M
258.08 612.667 L
S
GR
GS
[0.55814 0 0 0.55814 0 -0.11627] CT
0.149 GC
2 setlinecap
10.0 ML
N
250 478 M
258.08 478 L
S
GR
GS
[0.55814 0 0 0.55814 0 -0.11627] CT
0.149 GC
2 setlinecap
10.0 ML
N
250 343.333 M
258.08 343.333 L
S
GR
GS
[0.55814 0 0 0.55814 0 -0.11627] CT
0.149 GC
2 setlinecap
10.0 ML
N
250 208.667 M
258.08 208.667 L
S
GR
GS
[0.55814 0 0 0.55814 0 -0.11627] CT
0.149 GC
2 setlinecap
10.0 ML
N
250 74 M
258.08 74 L
S
GR
GS
[0.55814 0 0 0.55814 0 -0.11627] CT
0.149 GC
2 setlinecap
10.0 ML
N
659 882 M
650.92 882 L
S
GR
GS
[0.55814 0 0 0.55814 0 -0.11627] CT
0.149 GC
2 setlinecap
10.0 ML
N
659 747.333 M
650.92 747.333 L
S
GR
GS
[0.55814 0 0 0.55814 0 -0.11627] CT
0.149 GC
2 setlinecap
10.0 ML
N
659 612.667 M
650.92 612.667 L
S
GR
GS
[0.55814 0 0 0.55814 0 -0.11627] CT
0.149 GC
2 setlinecap
10.0 ML
N
659 478 M
650.92 478 L
S
GR
GS
[0.55814 0 0 0.55814 0 -0.11627] CT
0.149 GC
2 setlinecap
10.0 ML
N
659 343.333 M
650.92 343.333 L
S
GR
GS
[0.55814 0 0 0.55814 0 -0.11627] CT
0.149 GC
2 setlinecap
10.0 ML
N
659 208.667 M
650.92 208.667 L
S
GR
GS
[0.55814 0 0 0.55814 0 -0.11627] CT
0.149 GC
2 setlinecap
10.0 ML
N
659 74 M
650.92 74 L
S
GR
GS
[0.55814 0 0 0.55814 135.53489 492.16279] CT
0.149 GC
/Helvetica 18 F
GS
[1 0 0 1 0 0] CT
-31 7.5 moveto 
1 -1 scale
(250) t 
GR
GR
GS
[0.55814 0 0 0.55814 135.53489 416.99999] CT
0.149 GC
/Helvetica 18 F
GS
[1 0 0 1 0 0] CT
-31 7.5 moveto 
1 -1 scale
(300) t 
GR
GR
GS
[0.55814 0 0 0.55814 135.53489 341.83722] CT
0.149 GC
/Helvetica 18 F
GS
[1 0 0 1 0 0] CT
-31 7.5 moveto 
1 -1 scale
(350) t 
GR
GR
GS
[0.55814 0 0 0.55814 135.53489 266.67442] CT
0.149 GC
/Helvetica 18 F
GS
[1 0 0 1 0 0] CT
-31 7.5 moveto 
1 -1 scale
(400) t 
GR
GR
GS
[0.55814 0 0 0.55814 135.53489 191.51164] CT
0.149 GC
/Helvetica 18 F
GS
[1 0 0 1 0 0] CT
-31 7.5 moveto 
1 -1 scale
(450) t 
GR
GR
GS
[0.55814 0 0 0.55814 135.53489 116.34885] CT
0.149 GC
/Helvetica 18 F
GS
[1 0 0 1 0 0] CT
-31 7.5 moveto 
1 -1 scale
(500) t 
GR
GR
GS
[0.55814 0 0 0.55814 135.53489 41.18605] CT
0.149 GC
/Helvetica 18 F
GS
[1 0 0 1 0 0] CT
-31 7.5 moveto 
1 -1 scale
(550) t 
GR
GR
GS
[0.55814 0 0 0.55814 0 -0.11627] CT
0 0.447 0.741 RC
2 LJ
N
454.5 141.333 M
437.682 143.089 L
421.483 148.353 L
406.037 156.959 L
391.414 168.588 L
377.688 182.919 L
364.93 199.64 L
353.25 218.559 L
342.67 239.406 L
333.18 261.851 L
324.769 285.564 L
317.437 310.223 L
311.229 335.595 L
306.124 361.454 L
302.084 387.567 L
299.075 413.7 L
297.083 439.624 L
296.126 465.169 L
296.167 490.207 L
297.167 514.609 L
299.089 538.249 L
301.912 560.987 L
305.662 582.704 L
310.304 603.346 L
315.8 622.865 L
322.114 641.211 L
329.209 658.336 L
337.071 674.172 L
345.739 688.623 L
355.166 701.671 L
365.301 713.303 L
376.092 723.505 L
387.486 732.265 L
399.433 739.57 L
411.895 745.389 L
424.896 749.614 L
438.361 752.219 L
452.196 753.192 L
466.308 752.522 L
480.604 750.199 L
494.992 746.212 L
509.402 740.491 L
523.758 732.922 L
537.918 723.513 L
551.737 712.276 L
565.073 699.22 L
577.781 684.356 L
589.718 667.579 L
600.737 648.871 L
610.686 628.341 L
S
GR
GS
[0.55814 0 0 0.55814 0 -0.11627] CT
0 0.447 0.741 RC
2 LJ
N
610.686 628.341 M
619.414 606.095 L
626.769 582.24 L
632.565 556.784 L
636.659 529.797 L
638.998 501.571 L
639.529 472.404 L
638.198 442.589 L
634.921 412.387 L
629.646 382.059 L
622.49 352.019 L
613.578 322.689 L
603.032 294.492 L
590.913 267.862 L
577.4 243.161 L
562.736 220.723 L
547.16 200.883 L
530.875 184.061 L
514.074 170.492 L
496.99 160.233 L
479.855 153.338 L
462.898 149.908 L
446.294 150.062 L
430.172 153.608 L
414.664 160.329 L
399.902 170.014 L
386.042 182.589 L
373.137 197.793 L
361.211 215.287 L
350.287 234.733 L
340.39 255.793 L
331.586 278.238 L
323.887 301.834 L
317.265 326.304 L
311.694 351.372 L
307.159 376.766 L
303.691 402.275 L
301.261 427.727 L
299.833 452.948 L
299.368 477.764 L
299.846 501.999 L
301.287 525.506 L
303.661 548.2 L
306.93 570.001 L
311.058 590.826 L
316.009 610.594 L
321.804 629.187 L
328.443 646.541 L
335.881 662.634 L
344.076 677.439 L
S
GR
GS
[0.55814 0 0 0.55814 0 -0.11627] CT
0 0.447 0.741 RC
2 LJ
N
344.076 677.439 M
352.984 690.932 L
362.563 703.089 L
372.774 713.881 L
383.654 723.214 L
395.169 731.046 L
407.248 737.367 L
419.82 742.165 L
432.815 745.431 L
446.161 747.154 L
459.791 747.319 L
473.693 745.808 L
487.777 742.576 L
501.924 737.62 L
516.013 730.936 L
529.925 722.521 L
543.539 712.372 L
556.753 700.375 L
569.435 686.485 L
581.433 670.759 L
592.596 653.25 L
602.77 634.014 L
611.793 613.049 L
619.501 590.304 L
625.785 565.966 L
630.538 540.236 L
633.653 513.317 L
635.002 485.376 L
634.438 456.524 L
631.989 427.111 L
627.704 397.515 L
621.632 368.116 L
613.803 339.285 L
604.224 311.368 L
593.073 284.742 L
580.549 259.789 L
566.849 236.896 L
552.108 216.51 L
536.533 198.874 L
520.366 184.159 L
503.852 172.538 L
487.213 164.257 L
470.618 159.449 L
454.236 158.001 L
438.238 159.793 L
422.798 164.745 L
408.071 172.854 L
394.124 183.85 L
381.021 197.432 L
368.823 213.298 L
S
GR
GS
[0.55814 0 0 0.55814 0 -0.11627] CT
0 0.447 0.741 RC
2 LJ
N
368.823 213.298 M
357.614 231.203 L
347.461 250.956 L
338.356 272.257 L
330.286 294.799 L
323.243 318.278 L
317.254 342.434 L
312.335 367.072 L
308.452 391.977 L
305.571 416.939 L
303.661 441.743 L
302.739 466.195 L
302.795 490.166 L
303.791 513.542 L
305.69 536.206 L
308.456 558.045 L
312.095 578.925 L
316.613 598.758 L
321.973 617.5 L
328.136 635.107 L
335.063 651.536 L
342.718 666.743 L
351.095 680.659 L
360.223 693.196 L
370.05 704.34 L
380.519 714.077 L
391.573 722.395 L
403.157 729.28 L
415.214 734.721 L
427.709 738.679 L
440.651 741.045 L
453.951 741.8 L
467.512 740.938 L
481.235 738.449 L
495.023 734.327 L
508.778 728.563 L
522.432 721.053 L
535.88 711.732 L
548.983 700.623 L
561.598 687.751 L
573.586 673.143 L
584.803 656.806 L
595.103 638.626 L
604.351 618.678 L
612.414 597.096 L
619.159 574.012 L
624.454 549.557 L
628.105 523.718 L
630.034 496.687 L
630.228 468.781 L
S
GR
GS
[0.55814 0 0 0.55814 0 -0.11627] CT
0 0.447 0.741 RC
2 LJ
N
630.228 468.781 M
628.671 440.318 L
625.348 411.616 L
620.214 382.962 L
613.257 354.64 L
604.622 327.035 L
594.46 300.538 L
582.915 275.542 L
570.072 252.468 L
556.124 231.607 L
541.304 213.213 L
525.846 197.542 L
509.949 184.932 L
493.788 175.555 L
477.56 169.389 L
461.463 166.414 L
445.694 166.647 L
430.413 170.159 L
415.718 176.733 L
401.706 186.122 L
388.475 198.079 L
376.149 212.457 L
364.793 229.06 L
354.412 247.576 L
345.014 267.69 L
336.606 289.091 L
329.222 311.514 L
322.9 334.775 L
317.611 358.64 L
313.326 382.872 L
310.019 407.237 L
307.705 431.521 L
306.384 455.576 L
306.018 479.262 L
306.572 502.442 L
308.01 524.975 L
310.339 546.712 L
313.562 567.558 L
317.643 587.453 L
322.544 606.336 L
328.23 624.147 L
334.664 640.826 L
341.875 656.267 L
349.858 670.415 L
358.562 683.252 L
367.936 694.76 L
377.932 704.923 L
388.498 713.724 L
399.585 721.143 L
411.193 727.113 L
S
GR
GS
[0.55814 0 0 0.55814 0 -0.11627] CT
0 0.447 0.741 RC
2 LJ
N
411.193 727.113 M
423.313 731.553 L
435.863 734.455 L
448.756 735.81 L
461.908 735.609 L
475.234 733.845 L
488.649 730.507 L
502.111 725.479 L
515.522 718.714 L
528.753 710.225 L
541.674 700.027 L
554.155 688.133 L
566.067 674.549 L
577.285 659.154 L
587.673 641.981 L
597.095 623.129 L
605.415 602.699 L
612.496 580.791 L
618.166 557.397 L
622.301 532.595 L
624.852 506.651 L
625.77 479.83 L
625.003 452.401 L
622.48 424.601 L
618.129 396.644 L
612.048 368.893 L
604.346 341.724 L
595.132 315.513 L
584.465 290.646 L
572.462 267.462 L
559.336 246.253 L
545.302 227.313 L
530.559 210.974 L
515.262 197.566 L
499.612 187.149 L
483.817 179.767 L
468.085 175.46 L
452.605 174.381 L
437.504 176.486 L
422.899 181.571 L
408.907 189.435 L
395.654 199.914 L
383.265 212.935 L
371.77 228.214 L
361.189 245.447 L
351.544 264.327 L
342.859 284.555 L
335.2 305.945 L
328.568 328.282 L
322.939 351.32 L
S
GR
GS
[0.55814 0 0 0.55814 0 -0.11627] CT
0 0.447 0.741 RC
2 LJ
N
322.939 351.32 M
318.291 374.813 L
314.609 398.519 L
311.928 422.253 L
310.221 445.862 L
309.455 469.193 L
309.594 492.094 L
310.615 514.409 L
312.541 535.996 L
315.35 556.776 L
319.004 576.677 L
323.467 595.629 L
328.703 613.56 L
334.706 630.378 L
341.507 645.988 L
349.061 660.365 L
357.322 673.486 L
366.242 685.33 L
375.775 695.874 L
385.874 705.097 L
396.515 712.953 L
407.725 719.345 L
419.435 724.256 L
431.568 727.676 L
444.046 729.598 L
456.792 730.012 L
469.728 728.911 L
482.8 726.238 L
495.96 721.885 L
509.091 715.856 L
522.072 708.163 L
534.781 698.813 L
547.099 687.818 L
558.908 675.135 L
570.092 660.663 L
580.517 644.479 L
590.047 626.667 L
598.55 607.31 L
605.886 586.48 L
611.883 564.116 L
616.454 540.379 L
619.534 515.504 L
621.057 489.728 L
620.961 463.286 L
619.13 436.347 L
615.542 409.15 L
610.283 382.054 L
603.438 355.415 L
595.092 329.59 L
585.268 304.937 L
S
GR
GS
[0.55814 0 0 0.55814 0 -0.11627] CT
0 0.447 0.741 RC
2 LJ
N
585.268 304.937 M
574.098 281.77 L
561.781 260.39 L
548.515 241.099 L
534.476 224.248 L
519.805 210.141 L
504.709 198.856 L
489.393 190.459 L
474.064 185.02 L
458.904 182.713 L
444.04 183.511 L
429.596 187.24 L
415.694 193.721 L
402.466 202.817 L
390.038 214.475 L
378.445 228.427 L
367.718 244.382 L
357.885 262.046 L
348.981 281.138 L
341.077 301.489 L
334.171 322.878 L
328.245 345.057 L
323.279 367.779 L
319.264 390.803 L
316.236 413.948 L
314.171 437.057 L
313.036 459.973 L
312.799 482.537 L
313.435 504.588 L
314.972 525.984 L
317.384 546.642 L
320.636 566.485 L
324.692 585.435 L
329.517 603.417 L
335.108 620.331 L
341.489 636.086 L
348.618 650.656 L
356.449 664.016 L
364.936 676.14 L
374.035 687.002 L
383.699 696.577 L
393.924 704.802 L
404.722 711.594 L
416.02 716.942 L
427.745 720.837 L
439.822 723.272 L
452.179 724.237 L
464.741 723.723 L
477.469 721.657 L
490.308 717.95 L
S
GR
GS
[0.55814 0 0 0.55814 0 -0.11627] CT
0 0.447 0.741 RC
2 LJ
N
490.308 717.95 M
503.144 712.612 L
515.862 705.651 L
528.347 697.076 L
540.483 686.896 L
552.163 675.06 L
563.275 661.477 L
573.69 646.222 L
583.277 629.371 L
591.905 611.002 L
599.44 591.182 L
605.718 569.845 L
610.649 547.136 L
614.166 523.276 L
616.2 498.485 L
616.683 472.984 L
615.502 446.929 L
612.616 420.53 L
608.1 394.13 L
602.029 368.068 L
594.479 342.686 L
585.473 318.324 L
575.104 295.287 L
563.56 273.872 L
551.03 254.372 L
537.688 237.111 L
523.66 222.434 L
509.138 210.441 L
494.322 201.205 L
479.414 194.798 L
464.603 191.359 L
450.021 190.971 L
435.788 193.474 L
422.027 198.705 L
408.862 206.505 L
396.432 216.844 L
384.794 229.52 L
373.979 244.254 L
364.019 260.764 L
354.945 278.769 L
346.821 298.072 L
339.677 318.492 L
333.495 339.79 L
328.258 361.723 L
323.948 384.052 L
320.594 406.574 L
318.198 429.136 L
316.727 451.583 L
316.15 473.759 L
316.436 495.509 L
S
GR
GS
[0.55814 0 0 0.55814 0 -0.11627] CT
0 0.447 0.741 RC
2 LJ
N
316.436 495.509 M
317.595 516.677 L
319.63 537.16 L
322.505 556.882 L
326.184 575.767 L
330.634 593.738 L
335.824 610.715 L
341.79 626.584 L
348.509 641.301 L
355.934 654.839 L
364.022 667.174 L
372.725 678.278 L
381.998 688.127 L
391.803 696.687 L
402.172 703.859 L
413.056 709.61 L
424.382 713.932 L
436.076 716.818 L
448.065 718.259 L
460.275 718.247 L
472.64 716.76 L
485.134 713.675 L
497.66 708.981 L
510.104 702.688 L
522.354 694.809 L
534.297 685.355 L
545.821 674.328 L
556.822 661.611 L
567.18 647.229 L
576.772 631.263 L
585.471 613.796 L
593.153 594.909 L
599.672 574.613 L
604.894 552.908 L
608.759 530.011 L
611.207 506.143 L
612.179 481.527 L
611.608 456.375 L
609.379 430.825 L
605.536 405.164 L
600.156 379.724 L
593.32 354.833 L
585.097 330.824 L
575.507 308.018 L
564.705 286.693 L
552.876 267.124 L
540.203 249.585 L
526.835 234.415 L
512.911 221.847 L
498.621 211.936 L
S
GR
GS
[0.55814 0 0 0.55814 0 -0.11627] CT
0 0.447 0.741 RC
2 LJ
N
498.621 211.936 M
484.158 204.737 L
469.71 200.306 L
455.441 198.81 L
441.467 200.199 L
427.901 204.306 L
414.854 210.96 L
402.447 220.022 L
390.801 231.451 L
379.951 245.005 L
369.923 260.412 L
360.745 277.397 L
352.442 295.692 L
345.081 315.125 L
338.676 335.512 L
333.208 356.626 L
328.658 378.241 L
325.012 400.13 L
322.3 422.11 L
320.517 444.036 L
319.631 465.767 L
319.611 487.157 L
320.425 508.064 L
322.089 528.338 L
324.601 547.889 L
327.926 566.646 L
332.03 584.539 L
336.875 601.5 L
342.431 617.456 L
348.732 632.296 L
355.759 645.972 L
363.467 658.461 L
371.804 669.74 L
380.724 679.785 L
390.178 688.575 L
400.117 696.086 L
410.555 702.233 L
421.468 706.957 L
432.78 710.252 L
444.412 712.111 L
456.287 712.529 L
468.327 711.5 L
480.455 709.013 L
492.637 704.955 L
504.783 699.295 L
516.779 692.052 L
528.512 683.248 L
539.868 672.9 L
550.731 661.025 L
560.993 647.52 L
S
GR
GS
[0.55814 0 0 0.55814 0 -0.11627] CT
0 0.447 0.741 RC
2 LJ
N
560.993 647.52 M
570.538 632.401 L
579.25 615.766 L
587.013 597.716 L
593.711 578.347 L
599.208 557.706 L
603.363 535.786 L
606.136 512.811 L
607.488 489.024 L
607.384 464.666 L
605.788 439.978 L
602.608 415.136 L
597.867 390.391 L
591.667 366.064 L
584.105 342.473 L
575.28 319.942 L
565.226 298.801 L
554.085 279.306 L
542.044 261.689 L
529.288 246.18 L
515.984 233.056 L
502.261 222.571 L
488.287 214.745 L
474.238 209.585 L
460.286 207.101 L
446.595 207.393 L
433.273 210.45 L
420.415 216.081 L
408.114 224.095 L
396.465 234.306 L
385.592 246.652 L
375.537 260.943 L
366.316 276.916 L
357.941 294.307 L
350.426 312.85 L
343.8 332.312 L
338.116 352.557 L
333.357 373.39 L
329.501 394.61 L
326.528 416.012 L
324.432 437.402 L
323.243 458.633 L
322.933 479.585 L
323.472 500.133 L
324.826 520.157 L
326.97 539.532 L
329.932 558.132 L
333.692 575.888 L
338.214 592.746 L
343.46 608.651 L
S
GR
GS
[0.55814 0 0 0.55814 0 -0.11627] CT
0 0.447 0.741 RC
2 LJ
N
343.46 608.651 M
349.394 623.547 L
355.983 637.376 L
363.26 650.035 L
371.206 661.478 L
379.766 671.688 L
388.886 680.647 L
398.513 688.339 L
408.592 694.747 L
419.07 699.853 L
429.938 703.582 L
441.178 705.862 L
452.703 706.69 L
464.427 706.066 L
476.264 703.988 L
488.127 700.455 L
499.933 695.458 L
511.628 688.879 L
523.112 680.707 L
534.27 670.98 L
544.985 659.733 L
555.14 647.002 L
564.62 632.803 L
573.3 617.041 L
581.077 599.799 L
587.851 581.209 L
593.522 561.403 L
597.992 540.511 L
601.117 518.577 L
602.796 495.685 L
603.035 472.106 L
601.837 448.113 L
599.207 423.976 L
595.15 399.969 L
589.613 376.313 L
582.665 353.269 L
574.435 331.134 L
565.057 310.204 L
554.651 290.785 L
543.286 273.205 L
531.127 257.645 L
518.359 244.261 L
505.168 233.21 L
491.724 224.7 L
478.152 218.906 L
464.594 215.77 L
451.195 215.226 L
438.1 217.207 L
425.453 221.751 L
413.343 228.78 L
S
GR
GS
[0.55814 0 0 0.55814 0 -0.11627] CT
0 0.447 0.741 RC
2 LJ
N
413.343 228.78 M
401.833 238.071 L
390.986 249.399 L
380.864 262.542 L
371.559 277.366 L
363.113 293.712 L
355.527 311.338 L
348.8 330.003 L
342.932 349.464 L
337.943 369.506 L
333.873 389.989 L
330.698 410.741 L
328.393 431.59 L
326.934 452.36 L
326.313 472.883 L
326.557 493.027 L
327.638 512.696 L
329.523 531.791 L
332.18 550.217 L
335.576 567.875 L
339.734 584.647 L
344.648 600.468 L
350.277 615.296 L
356.582 629.092 L
363.521 641.817 L
371.054 653.431 L
379.161 663.876 L
387.874 673.058 L
397.138 680.957 L
406.892 687.563 L
417.074 692.864 L
427.62 696.848 L
438.47 699.504 L
449.57 700.806 L
460.916 700.643 L
472.425 699 L
484.003 695.885 L
495.554 691.307 L
506.982 685.272 L
518.191 677.788 L
529.102 668.767 L
539.62 658.171 L
549.632 646.059 L
559.024 632.494 L
567.682 617.536 L
575.49 601.238 L
582.312 583.525 L
588.06 564.499 L
592.661 544.334 L
596.046 523.205 L
S
GR
GS
[0.55814 0 0 0.55814 0 -0.11627] CT
0 0.447 0.741 RC
2 LJ
N
596.046 523.205 M
598.142 501.287 L
598.852 478.711 L
598.083 455.586 L
595.873 432.186 L
592.269 408.797 L
587.317 385.703 L
581.054 363.187 L
573.469 341.508 L
564.682 320.922 L
554.846 301.688 L
544.112 284.063 L
532.607 268.345 L
520.428 254.805 L
507.747 243.53 L
494.739 234.599 L
481.578 228.092 L
468.426 224.145 L
455.395 222.861 L
442.6 224.118 L
430.153 227.786 L
418.167 233.738 L
406.77 241.946 L
396.036 252.309 L
385.999 264.586 L
376.694 278.539 L
368.158 293.931 L
360.44 310.554 L
353.598 328.29 L
347.627 346.934 L
342.513 366.273 L
338.247 386.093 L
334.826 406.189 L
332.29 426.415 L
330.62 446.634 L
329.789 466.705 L
329.769 486.489 L
330.534 505.844 L
332.111 524.636 L
334.487 542.782 L
337.629 560.211 L
341.502 576.852 L
346.072 592.633 L
351.312 607.478 L
357.258 621.279 L
363.884 633.995 L
371.14 645.601 L
378.98 656.072 L
387.356 665.382 L
396.22 673.507 L
S
GR
GS
[0.55814 0 0 0.55814 0 -0.11627] CT
0 0.447 0.741 RC
2 LJ
N
396.22 673.507 M
405.527 680.418 L
415.299 686.016 L
425.495 690.266 L
436.04 693.163 L
446.859 694.703 L
457.878 694.882 L
469.022 693.695 L
480.222 691.128 L
491.443 687.065 L
502.596 681.499 L
513.576 674.457 L
524.28 665.962 L
534.601 656.043 L
544.437 644.717 L
553.683 631.885 L
562.239 617.582 L
570.005 601.91 L
576.88 584.974 L
582.763 566.875 L
587.538 547.677 L
591.07 527.364 L
593.327 506.141 L
594.291 484.24 L
593.94 461.891 L
592.256 439.326 L
589.187 416.746 L
584.705 394.333 L
578.905 372.362 L
571.889 351.115 L
563.756 330.868 L
554.571 311.921 L
544.406 294.529 L
533.426 278.871 L
521.797 265.126 L
509.688 253.472 L
497.226 244.171 L
484.536 237.324 L
471.763 232.904 L
459.052 230.886 L
446.551 231.246 L
434.391 234.077 L
422.656 239.285 L
411.418 246.679 L
400.752 256.072 L
390.73 267.277 L
381.454 280.22 L
372.961 294.735 L
365.256 310.589 L
358.347 327.554 L
S
GR
GS
[0.55814 0 0 0.55814 0 -0.11627] CT
0 0.447 0.741 RC
2 LJ
N
358.347 327.554 M
352.242 345.396 L
346.963 363.91 L
342.557 382.972 L
339.009 402.417 L
336.298 422.073 L
334.402 441.77 L
333.309 461.336 L
333.052 480.638 L
333.611 499.574 L
334.955 518.044 L
337.053 535.948 L
339.874 553.185 L
343.423 569.641 L
347.714 585.235 L
352.709 599.921 L
358.366 613.656 L
364.648 626.397 L
371.515 638.099 L
378.938 648.712 L
386.952 658.133 L
395.514 666.338 L
404.565 673.312 L
414.043 679.045 L
423.89 683.524 L
434.045 686.736 L
444.451 688.666 L
455.103 689.212 L
465.941 688.339 L
476.875 686.057 L
487.815 682.375 L
498.671 677.304 L
509.353 670.851 L
519.778 662.978 L
529.872 653.594 L
539.53 642.754 L
548.647 630.521 L
557.118 616.954 L
564.837 602.116 L
571.685 585.989 L
577.554 568.568 L
582.382 550.016 L
586.103 530.502 L
588.656 510.192 L
589.974 489.25 L
589.939 467.754 L
588.539 445.891 L
585.821 423.928 L
581.83 402.126 L
576.611 380.75 L
S
GR
GS
[0.55814 0 0 0.55814 0 -0.11627] CT
0 0.447 0.741 RC
2 LJ
N
576.611 380.75 M
570.178 360.055 L
562.552 340.274 L
553.871 321.638 L
544.277 304.379 L
533.909 288.728 L
522.865 274.981 L
511.253 263.323 L
499.234 253.814 L
486.967 246.515 L
474.613 241.485 L
462.313 238.853 L
450.167 238.682 L
438.276 240.844 L
426.74 245.211 L
415.662 251.654 L
405.156 260.136 L
395.293 270.571 L
386.101 282.736 L
377.611 296.407 L
369.85 311.362 L
362.856 327.392 L
356.693 344.387 L
351.36 362.178 L
346.846 380.571 L
343.139 399.373 L
340.227 418.394 L
338.146 437.482 L
336.894 456.518 L
336.444 475.376 L
336.77 493.934 L
337.843 512.066 L
339.662 529.644 L
342.249 546.569 L
345.569 562.781 L
349.589 578.215 L
354.273 592.811 L
359.586 606.506 L
365.519 619.22 L
372.105 630.859 L
379.296 641.401 L
387.039 650.824 L
395.284 659.107 L
403.979 666.231 L
413.071 672.175 L
422.512 676.914 L
432.317 680.349 L
442.437 682.448 L
452.793 683.212 L
463.306 682.643 L
S
GR
GS
[0.55814 0 0 0.55814 0 -0.11627] CT
0 0.447 0.741 RC
2 LJ
N
463.306 682.643 M
473.899 680.744 L
484.493 677.515 L
495.016 672.937 L
505.419 666.898 L
515.607 659.42 L
525.48 650.543 L
534.938 640.309 L
543.879 628.759 L
552.202 615.911 L
559.797 601.679 L
566.58 586.155 L
572.471 569.466 L
577.39 551.74 L
581.257 533.105 L
583.964 513.638 L
585.404 493.381 L
585.586 472.564 L
584.521 451.423 L
582.221 430.198 L
578.7 409.128 L
573.93 388.424 L
567.926 368.287 L
560.803 348.96 L
552.677 330.682 L
543.666 313.697 L
533.841 298.288 L
523.295 284.657 L
512.184 272.912 L
500.665 263.16 L
488.894 255.509 L
477.003 250.143 L
465.091 247.137 L
453.276 246.409 L
441.673 247.879 L
430.398 251.463 L
419.571 257.178 L
409.265 264.956 L
399.527 274.597 L
390.403 285.898 L
381.939 298.658 L
374.196 312.712 L
367.235 327.967 L
361.059 344.232 L
355.662 361.307 L
351.042 378.99 L
347.197 397.083 L
344.17 415.448 L
341.961 433.959 L
340.546 452.476 L
S
GR
GS
[0.55814 0 0 0.55814 0 -0.11627] CT
0 0.447 0.741 RC
2 LJ
N
340.546 452.476 M
339.901 470.861 L
340.002 488.976 L
340.857 506.684 L
342.482 523.888 L
344.844 540.513 L
347.912 556.486 L
351.652 571.73 L
356.032 586.17 L
361.067 599.707 L
366.762 612.272 L
373.071 623.834 L
379.95 634.367 L
387.351 643.841 L
395.23 652.227 L
403.54 659.498 L
412.282 665.577 L
421.447 670.398 L
430.966 673.957 L
440.77 676.252 L
450.789 677.279 L
460.952 677.034 L
471.192 675.515 L
481.466 672.645 L
491.72 668.363 L
501.86 662.699 L
511.791 655.681 L
521.42 647.338 L
530.651 637.698 L
539.391 626.741 L
547.549 614.394 L
555.037 600.75 L
561.769 585.91 L
567.657 569.975 L
572.614 553.047 L
576.519 535.143 L
579.28 516.304 L
580.884 496.741 L
581.322 476.668 L
580.581 456.298 L
578.651 435.843 L
575.49 415.485 L
571.08 395.39 L
565.512 375.797 L
558.882 356.947 L
551.284 339.079 L
542.786 322.454 L
533.44 307.304 L
523.388 293.769 L
512.781 281.987 L
S
GR
GS
[0.55814 0 0 0.55814 0 -0.11627] CT
0 0.447 0.741 RC
2 LJ
N
512.781 281.987 M
501.765 272.093 L
490.473 264.272 L
478.998 258.682 L
467.463 255.287 L
455.99 254.039 L
444.703 254.895 L
433.726 257.855 L
423.149 262.954 L
413.033 270.025 L
403.434 278.888 L
394.412 289.363 L
386.03 301.288 L
378.369 314.6 L
371.444 329.126 L
365.258 344.663 L
359.814 361.013 L
355.116 377.973 L
351.177 395.379 L
348.016 413.122 L
S
GR
GS
[0.55814 0 0 0.55814 253.67466 39.65114] CT
/Helvetica-Bold 20 F
GS
[1 0 0 1 0 0] CT
-62.5 -5 moveto 
1 -1 scale
(Solver ode23) t 
GR
GR
GS
[0.55814 0 0 0.55814 0 -0.11627] CT
1 GC
N
789 882 M
1198 882 L
1198 74 L
789 74 L
cp
f
GR
GS
[0.55814 0 0 0.55814 0 -0.11627] CT
0.873 GC
2 LJ
N
789 882 M
789 74 L
S
GR
GS
[0.55814 0 0 0.55814 0 -0.11627] CT
0.873 GC
2 LJ
N
857.167 882 M
857.167 74 L
S
GR
GS
[0.55814 0 0 0.55814 0 -0.11627] CT
0.873 GC
2 LJ
N
925.333 882 M
925.333 74 L
S
GR
GS
[0.55814 0 0 0.55814 0 -0.11627] CT
0.873 GC
2 LJ
N
993.5 882 M
993.5 74 L
S
GR
GS
[0.55814 0 0 0.55814 0 -0.11627] CT
0.873 GC
2 LJ
N
1061.667 882 M
1061.667 74 L
S
GR
GS
[0.55814 0 0 0.55814 0 -0.11627] CT
0.873 GC
2 LJ
N
1129.833 882 M
1129.833 74 L
S
GR
GS
[0.55814 0 0 0.55814 0 -0.11627] CT
0.873 GC
2 LJ
N
1198 882 M
1198 74 L
S
GR
GS
[0.55814 0 0 0.55814 0 -0.11627] CT
0.873 GC
2 LJ
N
1198 882 M
789 882 L
S
GR
GS
[0.55814 0 0 0.55814 0 -0.11627] CT
0.873 GC
2 LJ
N
1198 747.333 M
789 747.333 L
S
GR
GS
[0.55814 0 0 0.55814 0 -0.11627] CT
0.873 GC
2 LJ
N
1198 612.667 M
789 612.667 L
S
GR
GS
[0.55814 0 0 0.55814 0 -0.11627] CT
0.873 GC
2 LJ
N
1198 478 M
789 478 L
S
GR
GS
[0.55814 0 0 0.55814 0 -0.11627] CT
0.873 GC
2 LJ
N
1198 343.333 M
789 343.333 L
S
GR
GS
[0.55814 0 0 0.55814 0 -0.11627] CT
0.873 GC
2 LJ
N
1198 208.667 M
789 208.667 L
S
GR
GS
[0.55814 0 0 0.55814 0 -0.11627] CT
0.873 GC
2 LJ
N
1198 74 M
789 74 L
S
GR
GS
[0.55814 0 0 0.55814 554.51174 510.00002] CT
0.149 GC
/Helvetica 20 F
GS
[1 0 0 1 0 0] CT
-7.5 21 moveto 
1 -1 scale
(N) t 
GR
GR
GS
[0.55814 0 0 0.55814 0 -0.11627] CT
0.149 GC
2 LJ
N
789 882 M
1198 882 L
S
GR
GS
[0.55814 0 0 0.55814 0 -0.11627] CT
0.149 GC
2 LJ
N
789 74 M
1198 74 L
S
GR
GS
[0.55814 0 0 0.55814 0 -0.11627] CT
0.149 GC
2 LJ
N
789 882 M
789 873.92 L
S
GR
GS
[0.55814 0 0 0.55814 0 -0.11627] CT
0.149 GC
2 LJ
N
857.167 882 M
857.167 873.92 L
S
GR
GS
[0.55814 0 0 0.55814 0 -0.11627] CT
0.149 GC
2 LJ
N
925.333 882 M
925.333 873.92 L
S
GR
GS
[0.55814 0 0 0.55814 0 -0.11627] CT
0.149 GC
2 LJ
N
993.5 882 M
993.5 873.92 L
S
GR
GS
[0.55814 0 0 0.55814 0 -0.11627] CT
0.149 GC
2 LJ
N
1061.667 882 M
1061.667 873.92 L
S
GR
GS
[0.55814 0 0 0.55814 0 -0.11627] CT
0.149 GC
2 LJ
N
1129.833 882 M
1129.833 873.92 L
S
GR
GS
[0.55814 0 0 0.55814 0 -0.11627] CT
0.149 GC
2 LJ
N
1198 882 M
1198 873.92 L
S
GR
GS
[0.55814 0 0 0.55814 0 -0.11627] CT
0.149 GC
2 LJ
N
789 74 M
789 82.08 L
S
GR
GS
[0.55814 0 0 0.55814 0 -0.11627] CT
0.149 GC
2 LJ
N
857.167 74 M
857.167 82.08 L
S
GR
GS
[0.55814 0 0 0.55814 0 -0.11627] CT
0.149 GC
2 LJ
N
925.333 74 M
925.333 82.08 L
S
GR
GS
[0.55814 0 0 0.55814 0 -0.11627] CT
0.149 GC
2 LJ
N
993.5 74 M
993.5 82.08 L
S
GR
GS
[0.55814 0 0 0.55814 0 -0.11627] CT
0.149 GC
2 LJ
N
1061.667 74 M
1061.667 82.08 L
S
GR
GS
[0.55814 0 0 0.55814 0 -0.11627] CT
0.149 GC
2 LJ
N
1129.833 74 M
1129.833 82.08 L
S
GR
GS
[0.55814 0 0 0.55814 0 -0.11627] CT
0.149 GC
2 LJ
N
1198 74 M
1198 82.08 L
S
GR
GS
[0.55814 0 0 0.55814 440.3721 496.1628] CT
0.149 GC
/Helvetica 18 F
GS
[1 0 0 1 0 0] CT
-15.5 19 moveto 
1 -1 scale
(350) t 
GR
GR
GS
[0.55814 0 0 0.55814 478.41863 496.1628] CT
0.149 GC
/Helvetica 18 F
GS
[1 0 0 1 0 0] CT
-15.5 19 moveto 
1 -1 scale
(400) t 
GR
GR
GS
[0.55814 0 0 0.55814 516.46512 496.1628] CT
0.149 GC
/Helvetica 18 F
GS
[1 0 0 1 0 0] CT
-15.5 19 moveto 
1 -1 scale
(450) t 
GR
GR
GS
[0.55814 0 0 0.55814 554.51164 496.1628] CT
0.149 GC
/Helvetica 18 F
GS
[1 0 0 1 0 0] CT
-15.5 19 moveto 
1 -1 scale
(500) t 
GR
GR
GS
[0.55814 0 0 0.55814 592.55813 496.1628] CT
0.149 GC
/Helvetica 18 F
GS
[1 0 0 1 0 0] CT
-15.5 19 moveto 
1 -1 scale
(550) t 
GR
GR
GS
[0.55814 0 0 0.55814 630.60469 496.1628] CT
0.149 GC
/Helvetica 18 F
GS
[1 0 0 1 0 0] CT
-15.5 19 moveto 
1 -1 scale
(600) t 
GR
GR
GS
[0.55814 0 0 0.55814 668.65118 496.1628] CT
0.149 GC
/Helvetica 18 F
GS
[1 0 0 1 0 0] CT
-15.5 19 moveto 
1 -1 scale
(650) t 
GR
GR
GS
[0 -0.55814 0.55814 0 416.06976 266.6742] CT
0.149 GC
/Helvetica 20 F
GS
[1 0 0 1 0 0] CT
-7 -5 moveto 
1 -1 scale
(P) t 
GR
GR
GS
[0.55814 0 0 0.55814 0 -0.11627] CT
0.149 GC
2 setlinecap
10.0 ML
N
789 882 M
789 74 L
S
GR
GS
[0.55814 0 0 0.55814 0 -0.11627] CT
0.149 GC
2 setlinecap
10.0 ML
N
1198 882 M
1198 74 L
S
GR
GS
[0.55814 0 0 0.55814 0 -0.11627] CT
0.149 GC
2 setlinecap
10.0 ML
N
789 882 M
797.08 882 L
S
GR
GS
[0.55814 0 0 0.55814 0 -0.11627] CT
0.149 GC
2 setlinecap
10.0 ML
N
789 747.333 M
797.08 747.333 L
S
GR
GS
[0.55814 0 0 0.55814 0 -0.11627] CT
0.149 GC
2 setlinecap
10.0 ML
N
789 612.667 M
797.08 612.667 L
S
GR
GS
[0.55814 0 0 0.55814 0 -0.11627] CT
0.149 GC
2 setlinecap
10.0 ML
N
789 478 M
797.08 478 L
S
GR
GS
[0.55814 0 0 0.55814 0 -0.11627] CT
0.149 GC
2 setlinecap
10.0 ML
N
789 343.333 M
797.08 343.333 L
S
GR
GS
[0.55814 0 0 0.55814 0 -0.11627] CT
0.149 GC
2 setlinecap
10.0 ML
N
789 208.667 M
797.08 208.667 L
S
GR
GS
[0.55814 0 0 0.55814 0 -0.11627] CT
0.149 GC
2 setlinecap
10.0 ML
N
789 74 M
797.08 74 L
S
GR
GS
[0.55814 0 0 0.55814 0 -0.11627] CT
0.149 GC
2 setlinecap
10.0 ML
N
1198 882 M
1189.92 882 L
S
GR
GS
[0.55814 0 0 0.55814 0 -0.11627] CT
0.149 GC
2 setlinecap
10.0 ML
N
1198 747.333 M
1189.92 747.333 L
S
GR
GS
[0.55814 0 0 0.55814 0 -0.11627] CT
0.149 GC
2 setlinecap
10.0 ML
N
1198 612.667 M
1189.92 612.667 L
S
GR
GS
[0.55814 0 0 0.55814 0 -0.11627] CT
0.149 GC
2 setlinecap
10.0 ML
N
1198 478 M
1189.92 478 L
S
GR
GS
[0.55814 0 0 0.55814 0 -0.11627] CT
0.149 GC
2 setlinecap
10.0 ML
N
1198 343.333 M
1189.92 343.333 L
S
GR
GS
[0.55814 0 0 0.55814 0 -0.11627] CT
0.149 GC
2 setlinecap
10.0 ML
N
1198 208.667 M
1189.92 208.667 L
S
GR
GS
[0.55814 0 0 0.55814 0 -0.11627] CT
0.149 GC
2 setlinecap
10.0 ML
N
1198 74 M
1189.92 74 L
S
GR
GS
[0.55814 0 0 0.55814 436.37212 492.16279] CT
0.149 GC
/Helvetica 18 F
GS
[1 0 0 1 0 0] CT
-31 7.5 moveto 
1 -1 scale
(250) t 
GR
GR
GS
[0.55814 0 0 0.55814 436.37212 416.99999] CT
0.149 GC
/Helvetica 18 F
GS
[1 0 0 1 0 0] CT
-31 7.5 moveto 
1 -1 scale
(300) t 
GR
GR
GS
[0.55814 0 0 0.55814 436.37212 341.83722] CT
0.149 GC
/Helvetica 18 F
GS
[1 0 0 1 0 0] CT
-31 7.5 moveto 
1 -1 scale
(350) t 
GR
GR
GS
[0.55814 0 0 0.55814 436.37212 266.67442] CT
0.149 GC
/Helvetica 18 F
GS
[1 0 0 1 0 0] CT
-31 7.5 moveto 
1 -1 scale
(400) t 
GR
GR
GS
[0.55814 0 0 0.55814 436.37212 191.51164] CT
0.149 GC
/Helvetica 18 F
GS
[1 0 0 1 0 0] CT
-31 7.5 moveto 
1 -1 scale
(450) t 
GR
GR
GS
[0.55814 0 0 0.55814 436.37212 116.34885] CT
0.149 GC
/Helvetica 18 F
GS
[1 0 0 1 0 0] CT
-31 7.5 moveto 
1 -1 scale
(500) t 
GR
GR
GS
[0.55814 0 0 0.55814 436.37212 41.18605] CT
0.149 GC
/Helvetica 18 F
GS
[1 0 0 1 0 0] CT
-31 7.5 moveto 
1 -1 scale
(550) t 
GR
GR
GS
[0.55814 0 0 0.55814 0 -0.11627] CT
0 0.447 0.741 RC
2 LJ
N
993.5 141.333 M
976.682 143.087 L
960.445 148.262 L
944.925 156.683 L
930.235 168.134 L
916.466 182.366 L
903.685 199.102 L
891.928 218.04 L
881.226 238.877 L
871.618 261.315 L
863.129 285.067 L
855.772 309.855 L
849.55 335.41 L
844.454 361.473 L
840.46 387.792 L
837.536 414.129 L
835.636 440.252 L
834.702 465.94 L
834.718 491.074 L
835.691 515.573 L
837.607 539.306 L
840.446 562.154 L
844.19 584.014 L
848.816 604.793 L
854.303 624.414 L
860.626 642.812 L
867.759 659.938 L
875.677 675.753 L
884.35 690.233 L
893.748 703.368 L
903.839 715.15 L
914.59 725.531 L
925.973 734.463 L
937.955 741.902 L
950.491 747.807 L
963.53 752.139 L
977.014 754.863 L
990.876 755.946 L
1005.04 755.36 L
1019.425 753.079 L
1033.939 749.078 L
1048.484 743.338 L
1062.954 735.842 L
1077.248 726.589 L
1091.279 715.588 L
1104.87 702.745 L
1117.841 687.988 L
1130.022 671.281 L
1141.251 652.623 L
1151.375 632.047 L
S
GR
GS
[0.55814 0 0 0.55814 0 -0.11627] CT
0 0.447 0.741 RC
2 LJ
N
1151.375 632.047 M
1160.247 609.62 L
1167.733 585.446 L
1173.703 559.661 L
1178.039 532.438 L
1180.63 503.984 L
1181.372 474.54 L
1180.161 444.303 L
1176.918 413.324 L
1171.712 382.144 L
1164.638 351.315 L
1155.805 321.34 L
1145.338 292.674 L
1133.375 265.726 L
1120.068 240.854 L
1105.583 218.368 L
1090.101 198.532 L
1073.817 181.558 L
1056.94 167.614 L
1039.694 156.815 L
1022.315 149.233 L
1005.037 145.081 L
988.048 144.46 L
971.515 147.26 L
955.585 153.344 L
940.385 162.545 L
926.026 174.668 L
912.599 189.49 L
900.177 206.759 L
888.812 226.196 L
878.54 247.491 L
869.377 270.308 L
861.321 294.293 L
854.355 319.189 L
848.477 344.741 L
843.682 370.698 L
839.96 396.83 L
837.297 422.921 L
835.674 448.778 L
835.068 474.224 L
835.45 499.1 L
836.788 523.268 L
839.045 546.604 L
842.184 569.018 L
846.196 590.457 L
851.07 610.836 L
856.79 630.075 L
863.339 648.101 L
870.695 664.852 L
878.834 680.272 L
S
GR
GS
[0.55814 0 0 0.55814 0 -0.11627] CT
0 0.447 0.741 RC
2 LJ
N
878.834 680.272 M
887.727 694.316 L
897.345 706.946 L
907.653 718.134 L
918.615 727.859 L
930.19 736.11 L
942.336 742.884 L
955.007 748.187 L
968.153 752.001 L
981.717 754.26 L
995.632 754.901 L
1009.822 753.871 L
1024.203 751.121 L
1038.679 746.611 L
1053.151 740.308 L
1067.505 732.185 L
1081.624 722.225 L
1095.378 710.416 L
1108.631 696.755 L
1121.235 681.243 L
1133.037 663.892 L
1143.937 644.738 L
1153.781 623.801 L
1162.354 601.105 L
1169.472 576.719 L
1174.983 550.753 L
1178.758 523.36 L
1180.704 494.735 L
1180.752 465.115 L
1178.865 434.781 L
1175.035 404.056 L
1169.282 373.305 L
1161.656 342.935 L
1152.237 313.395 L
1141.137 285.087 L
1128.523 258.364 L
1114.587 233.666 L
1099.525 211.381 L
1083.539 191.84 L
1066.835 175.321 L
1049.625 162.048 L
1032.126 152.189 L
1014.561 145.857 L
997.156 143.113 L
980.143 143.962 L
963.761 148.354 L
948.126 156.084 L
933.25 166.837 L
919.254 180.383 L
906.234 196.48 L
S
GR
GS
[0.55814 0 0 0.55814 0 -0.11627] CT
0 0.447 0.741 RC
2 LJ
N
906.234 196.48 M
894.269 214.873 L
883.414 235.292 L
873.706 257.456 L
865.16 281.068 L
857.769 305.819 L
851.509 331.386 L
846.331 357.432 L
842.167 383.609 L
838.972 409.659 L
836.8 435.572 L
835.636 461.177 L
835.464 486.304 L
836.262 510.805 L
838.01 534.545 L
840.686 557.408 L
844.265 579.296 L
848.723 600.128 L
854.033 619.839 L
860.169 638.382 L
867.1 655.725 L
874.807 671.817 L
883.274 686.605 L
892.478 700.038 L
902.395 712.069 L
912.993 722.657 L
924.234 731.767 L
936.077 739.364 L
948.473 745.423 L
961.371 749.92 L
974.711 752.836 L
988.43 754.157 L
1002.46 753.876 L
1016.731 751.99 L
1031.172 748.479 L
1045.672 743.254 L
1060.109 736.239 L
1074.359 727.375 L
1088.293 716.621 L
1101.778 703.955 L
1114.675 689.373 L
1126.844 672.887 L
1138.14 654.53 L
1148.412 634.351 L
1157.506 612.417 L
1165.266 588.815 L
1171.535 563.625 L
1176.201 536.849 L
1179.146 508.736 L
1180.269 479.586 L
S
GR
GS
[0.55814 0 0 0.55814 0 -0.11627] CT
0 0.447 0.741 RC
2 LJ
N
1180.269 479.586 M
1179.505 449.711 L
1176.818 419.429 L
1172.207 389.067 L
1165.7 358.962 L
1157.358 329.458 L
1147.275 300.909 L
1135.576 273.679 L
1122.419 248.137 L
1107.991 224.665 L
1092.514 203.65 L
1076.257 185.535 L
1059.449 170.586 L
1042.282 158.923 L
1024.941 150.63 L
1007.608 145.754 L
990.458 144.302 L
973.664 146.248 L
957.391 151.524 L
941.802 160.028 L
927.053 171.62 L
913.297 186.121 L
900.68 203.315 L
889.155 222.741 L
878.678 243.98 L
869.294 266.752 L
861.039 290.783 L
853.93 315.807 L
847.974 341.562 L
843.166 367.796 L
839.485 394.261 L
836.897 420.716 L
835.357 446.927 L
834.804 472.668 L
835.166 497.717 L
836.407 521.953 L
838.575 545.398 L
841.654 567.944 L
845.626 589.492 L
850.473 609.951 L
856.171 629.246 L
862.699 647.311 L
870.032 664.09 L
878.142 679.543 L
887.002 693.636 L
896.582 706.352 L
906.851 717.681 L
917.773 727.621 L
929.309 736.128 L
941.424 743.153 L
S
GR
GS
[0.55814 0 0 0.55814 0 -0.11627] CT
0 0.447 0.741 RC
2 LJ
N
941.424 743.153 M
954.077 748.649 L
967.216 752.571 L
980.782 754.881 L
994.707 755.542 L
1008.915 754.521 L
1023.321 751.789 L
1037.831 747.319 L
1052.344 741.089 L
1066.748 733.079 L
1080.924 723.275 L
1094.757 711.674 L
1108.163 698.302 L
1120.951 683.08 L
1132.928 665.952 L
1143.913 646.898 L
1153.74 625.941 L
1162.257 603.142 L
1169.328 578.6 L
1174.83 552.457 L
1178.654 524.893 L
1180.706 496.127 L
1180.906 466.418 L
1179.19 436.065 L
1175.498 405.355 L
1169.802 374.414 L
1162.209 343.77 L
1152.849 313.971 L
1141.865 285.509 L
1129.414 258.826 L
1115.662 234.308 L
1100.788 212.289 L
1084.984 193.049 L
1068.45 176.814 L
1051.402 163.757 L
1034.067 153.998 L
1016.682 147.602 L
999.483 144.613 L
982.631 145.127 L
966.283 149.035 L
950.584 156.181 L
935.66 166.38 L
921.616 179.423 L
908.537 195.076 L
896.489 213.082 L
885.518 233.154 L
875.648 254.985 L
866.885 278.239 L
859.215 302.557 L
852.62 327.635 L
S
GR
GS
[0.55814 0 0 0.55814 0 -0.11627] CT
0 0.447 0.741 RC
2 LJ
N
852.62 327.635 M
847.105 353.286 L
842.661 379.268 L
839.279 405.354 L
836.942 431.336 L
835.633 457.026 L
835.331 482.255 L
836.009 506.871 L
837.638 530.742 L
840.188 553.755 L
843.621 575.817 L
847.914 596.87 L
853.056 616.848 L
859.035 635.673 L
865.832 653.277 L
873.426 669.598 L
881.794 684.583 L
890.907 698.185 L
900.734 710.365 L
911.242 721.095 L
922.391 730.35 L
934.141 738.115 L
946.447 744.383 L
959.259 749.154 L
972.528 752.43 L
986.196 754.162 L
1000.192 754.281 L
1014.435 752.724 L
1028.837 749.44 L
1043.301 744.385 L
1057.721 737.523 L
1071.986 728.827 L
1085.972 718.282 L
1099.549 705.877 L
1112.579 691.613 L
1124.914 675.498 L
1136.401 657.55 L
1146.895 637.797 L
1156.299 616.276 L
1164.409 593.035 L
1171.036 568.16 L
1176.026 541.777 L
1179.254 514.053 L
1180.626 485.192 L
1180.081 455.438 L
1177.59 425.075 L
1173.152 394.426 L
1166.802 363.855 L
1158.602 333.764 L
1148.65 304.593 L
S
GR
GS
[0.55814 0 0 0.55814 0 -0.11627] CT
0 0.447 0.741 RC
2 LJ
N
1148.65 304.593 M
1137.073 276.812 L
1124.043 250.779 L
1109.756 226.884 L
1094.413 205.49 L
1078.215 186.907 L
1061.369 171.393 L
1044.084 159.155 L
1026.573 150.345 L
1009.051 145.063 L
991.738 143.357 L
974.856 145.223 L
958.631 150.602 L
943.245 159.34 L
928.659 171.04 L
914.967 185.44 L
902.263 202.293 L
890.625 221.342 L
880.108 242.319 L
870.749 264.946 L
862.561 288.931 L
855.541 313.977 L
849.664 339.772 L
844.883 365.996 L
841.134 392.316 L
838.333 418.398 L
836.504 444.184 L
835.675 469.609 L
835.826 494.513 L
836.937 518.749 L
838.99 542.191 L
841.96 564.725 L
845.826 586.255 L
850.564 606.702 L
856.149 626.002 L
862.554 644.108 L
869.753 660.989 L
877.715 676.613 L
886.421 690.929 L
895.853 703.887 L
905.984 715.441 L
916.783 725.549 L
928.214 734.172 L
940.232 741.278 L
952.789 746.836 L
965.83 750.819 L
979.294 753.206 L
993.113 753.978 L
1007.215 753.121 L
1021.522 750.625 L
S
GR
GS
[0.55814 0 0 0.55814 0 -0.11627] CT
0 0.447 0.741 RC
2 LJ
N
1021.522 750.625 M
1035.964 746.496 L
1050.446 740.685 L
1064.837 733.099 L
1079.001 723.667 L
1092.802 712.34 L
1106.099 699.089 L
1118.753 683.908 L
1130.62 666.813 L
1141.556 647.841 L
1151.415 627.05 L
1160.047 604.52 L
1167.304 580.354 L
1173.032 554.675 L
1177.088 527.526 L
1179.372 498.994 L
1179.812 469.456 L
1178.364 439.285 L
1175.014 408.851 L
1169.773 378.518 L
1162.686 348.643 L
1153.82 319.577 L
1143.277 291.668 L
1131.182 265.255 L
1117.693 240.673 L
1102.994 218.251 L
1087.298 198.311 L
1070.848 181.18 L
1053.923 167.277 L
1036.733 156.755 L
1019.459 149.654 L
1002.276 145.98 L
985.349 145.705 L
968.836 148.767 L
952.886 155.073 L
937.641 164.493 L
923.233 176.865 L
909.788 191.994 L
897.424 209.65 L
886.236 229.558 L
876.147 251.25 L
867.141 274.375 L
859.243 298.652 L
852.466 323.813 L
846.815 349.6 L
842.282 375.768 L
838.854 402.086 L
836.502 428.33 L
835.191 454.292 L
834.876 479.775 L
S
GR
GS
[0.55814 0 0 0.55814 0 -0.11627] CT
0 0.447 0.741 RC
2 LJ
N
834.876 479.775 M
835.498 504.593 L
837.01 528.605 L
839.434 551.794 L
842.76 574.064 L
846.972 595.318 L
852.053 615.468 L
857.98 634.437 L
864.733 652.16 L
872.285 668.582 L
880.61 683.658 L
889.678 697.355 L
899.459 709.65 L
909.918 720.531 L
921.021 729.998 L
932.729 738.048 L
944.997 744.631 L
957.785 749.693 L
971.041 753.184 L
984.704 755.06 L
998.705 755.278 L
1012.966 753.804 L
1027.4 750.603 L
1041.912 745.649 L
1056.397 738.916 L
1070.74 730.385 L
1084.82 720.041 L
1098.505 707.871 L
1111.676 693.885 L
1124.237 678.107 L
1135.982 660.476 L
1146.709 640.96 L
1156.237 619.574 L
1164.404 596.371 L
1171.069 571.449 L
1176.109 544.951 L
1179.422 517.059 L
1180.925 487.999 L
1180.555 458.041 L
1178.267 427.498 L
1174.039 396.723 L
1167.86 366.056 L
1159.77 335.713 L
1149.911 306.222 L
1138.442 278.099 L
1125.534 251.802 L
1111.364 227.737 L
1096.123 206.25 L
1080.009 187.635 L
1063.23 172.126 L
S
GR
GS
[0.55814 0 0 0.55814 0 -0.11627] CT
0 0.447 0.741 RC
2 LJ
N
1063.23 172.126 M
1046.005 159.905 L
1028.562 151.095 L
1011.139 145.765 L
993.982 143.928 L
977.262 145.565 L
961.087 150.568 L
945.602 158.76 L
930.929 169.94 L
917.171 183.889 L
904.41 200.363 L
892.708 219.098 L
882.105 239.809 L
872.62 262.188 L
864.253 285.907 L
856.982 310.614 L
850.766 335.945 L
845.608 361.713 L
841.513 387.739 L
838.469 413.802 L
836.459 439.699 L
835.465 465.249 L
835.468 490.288 L
836.443 514.669 L
838.365 538.267 L
841.205 560.975 L
844.933 582.703 L
849.516 603.386 L
854.934 622.974 L
861.177 641.397 L
868.227 658.591 L
876.066 674.495 L
884.67 689.057 L
894.01 702.229 L
904.057 713.974 L
914.773 724.257 L
926.12 733.054 L
938.056 740.344 L
950.532 746.116 L
963.497 750.363 L
976.898 753.086 L
990.679 754.275 L
1004.767 753.864 L
1019.078 751.78 L
1033.516 747.963 L
1047.981 742.363 L
1062.365 734.942 L
1076.549 725.669 L
1090.411 714.529 L
1103.817 701.515 L
S
GR
GS
[0.55814 0 0 0.55814 0 -0.11627] CT
0 0.447 0.741 RC
2 LJ
N
1103.817 701.515 M
1116.629 686.63 L
1128.7 669.89 L
1139.874 651.322 L
1149.989 630.961 L
1158.932 608.836 L
1166.561 585.009 L
1172.685 559.595 L
1177.148 532.747 L
1179.827 504.651 L
1180.631 475.525 L
1179.502 445.625 L
1176.418 415.239 L
1171.387 384.687 L
1164.451 354.328 L
1155.688 324.552 L
1145.205 295.782 L
1133.144 268.478 L
1119.689 243.098 L
1105.049 219.996 L
1089.427 199.499 L
1073.025 181.888 L
1056.048 167.394 L
1038.698 156.198 L
1021.183 148.434 L
1003.709 144.182 L
986.484 143.478 L
969.717 146.305 L
953.618 152.597 L
938.398 162.24 L
924.104 174.897 L
910.706 190.156 L
898.299 207.765 L
886.961 227.465 L
876.748 248.99 L
867.698 272.068 L
859.831 296.418 L
853.145 321.754 L
847.62 347.781 L
843.218 374.2 L
839.878 400.702 L
837.523 426.973 L
836.068 452.722 L
835.571 477.986 L
836.045 502.685 L
837.47 526.681 L
839.827 549.85 L
843.094 572.082 L
847.249 593.283 L
852.269 613.374 L
S
GR
GS
[0.55814 0 0 0.55814 0 -0.11627] CT
0 0.447 0.741 RC
2 LJ
N
852.269 613.374 M
858.131 632.291 L
864.809 649.984 L
872.277 666.417 L
880.508 681.57 L
889.468 695.415 L
899.137 707.905 L
909.49 718.991 L
920.499 728.631 L
932.126 736.784 L
944.328 743.412 L
957.054 748.484 L
970.249 751.968 L
983.848 753.839 L
997.78 754.072 L
1011.97 752.648 L
1026.332 749.551 L
1040.777 744.767 L
1055.23 738.308 L
1069.584 730.126 L
1083.685 720.126 L
1097.38 708.238 L
1110.52 694.42 L
1122.955 678.659 L
1134.538 660.965 L
1145.125 641.377 L
1154.572 619.96 L
1162.737 596.807 L
1169.481 572.036 L
1174.665 545.794 L
1178.153 518.252 L
1179.802 489.445 L
1179.533 459.509 L
1177.348 428.933 L
1173.267 398.185 L
1167.336 367.704 L
1159.619 337.901 L
1150.204 309.161 L
1139.201 281.84 L
1126.739 256.269 L
1112.972 232.749 L
1098.073 211.556 L
1082.239 192.935 L
1065.688 177.109 L
1048.659 164.27 L
1031.417 154.767 L
1014.178 148.773 L
997.12 146.254 L
980.409 147.146 L
964.194 151.353 L
S
GR
GS
[0.55814 0 0 0.55814 0 -0.11627] CT
0 0.447 0.741 RC
2 LJ
N
964.194 151.353 M
948.612 158.745 L
933.785 169.161 L
919.819 182.406 L
906.809 198.255 L
894.834 216.448 L
883.958 236.695 L
874.225 258.67 L
865.589 282.008 L
858.043 306.412 L
851.596 331.61 L
846.249 357.348 L
841.993 383.386 L
838.817 409.502 L
836.698 435.489 L
835.609 461.155 L
835.514 486.325 L
836.373 510.84 L
838.135 534.559 L
840.791 557.429 L
844.336 579.372 L
848.757 600.29 L
854.038 620.098 L
860.16 638.717 L
867.101 656.082 L
874.837 672.135 L
883.34 686.829 L
892.58 700.127 L
902.525 712.002 L
913.139 722.437 L
924.384 731.424 L
936.218 738.966 L
948.599 745.069 L
961.479 749.684 L
974.805 752.748 L
988.517 754.206 L
1002.542 754.008 L
1016.802 752.111 L
1031.208 748.478 L
1045.662 743.077 L
1060.057 735.883 L
1074.279 726.874 L
1088.203 716.037 L
1101.695 703.363 L
1114.615 688.851 L
1126.824 672.51 L
1138.235 654.38 L
1148.643 634.439 L
1157.843 612.693 L
1165.655 589.192 L
S
GR
GS
[0.55814 0 0 0.55814 0 -0.11627] CT
0 0.447 0.741 RC
2 LJ
N
1165.655 589.192 M
1171.928 564.03 L
1176.532 537.345 L
1179.366 509.316 L
1180.354 480.17 L
1179.445 450.174 L
1176.613 419.64 L
1171.859 388.924 L
1165.21 358.424 L
1156.716 328.565 L
1146.468 299.629 L
1134.632 272.072 L
1121.39 246.359 L
1106.929 222.901 L
1091.445 202.05 L
1075.142 184.107 L
1058.23 169.313 L
1040.924 157.856 L
1023.45 149.868 L
1006.038 145.424 L
988.927 144.545 L
972.358 147.194 L
956.414 153.19 L
941.177 162.31 L
926.773 174.341 L
913.304 189.051 L
900.852 206.195 L
889.48 225.507 L
879.227 246.707 L
870.113 269.499 L
862.137 293.568 L
855.277 318.583 L
849.49 344.196 L
844.715 370.049 L
840.961 396.009 L
838.243 421.948 L
836.546 447.673 L
835.852 473.006 L
836.14 497.787 L
837.391 521.876 L
839.58 545.15 L
842.682 567.504 L
846.673 588.85 L
851.522 609.121 L
857.201 628.265 L
863.686 646.242 L
870.961 662.989 L
879.012 678.451 L
887.815 692.573 L
897.345 705.31 L
S
GR
GS
[0.55814 0 0 0.55814 0 -0.11627] CT
0 0.447 0.741 RC
2 LJ
N
897.345 705.31 M
907.571 716.619 L
918.457 726.464 L
929.962 734.814 L
942.043 741.644 L
954.649 746.934 L
967.725 750.669 L
981.214 752.84 L
995.05 753.443 L
1009.175 752.477 L
1023.505 749.877 L
1037.937 745.564 L
1052.361 739.471 L
1066.662 731.548 L
1080.718 721.76 L
1094.402 710.084 L
1107.581 696.514 L
1120.116 681.059 L
1131.862 663.74 L
1142.668 644.596 L
1152.379 623.679 L
1160.831 601.055 L
1167.896 576.751 L
1173.452 550.852 L
1177.346 523.571 L
1179.459 495.144 L
1179.703 465.827 L
1178.028 435.897 L
1174.413 405.654 L
1168.872 375.417 L
1161.453 345.528 L
1152.238 316.348 L
1141.339 288.263 L
1128.907 261.675 L
1115.121 237.012 L
1100.203 214.722 L
1084.397 195.185 L
1067.906 178.63 L
1050.925 165.235 L
1033.649 155.139 L
1016.268 148.437 L
998.973 145.181 L
981.951 145.381 L
965.386 149.003 L
949.46 155.972 L
934.354 166.17 L
920.247 179.436 L
907.207 195.445 L
895.132 213.686 L
884.092 233.889 L
S
GR
GS
[0.55814 0 0 0.55814 0 -0.11627] CT
0 0.447 0.741 RC
2 LJ
N
884.092 233.889 M
874.151 255.793 L
865.353 279.135 L
857.726 303.651 L
851.281 329.076 L
846.012 355.144 L
841.896 381.588 L
838.893 408.141 L
836.946 434.533 L
835.981 460.494 L
835.907 485.754 L
836.688 510.186 L
838.403 533.884 L
841.037 556.737 L
844.572 578.639 L
848.986 599.498 L
854.258 619.232 L
860.365 637.773 L
867.284 655.064 L
874.987 671.061 L
883.448 685.732 L
892.639 699.057 L
902.53 711.028 L
913.082 721.621 L
924.265 730.789 L
936.047 738.483 L
948.387 744.662 L
961.236 749.283 L
974.536 752.311 L
988.224 753.712 L
1002.225 753.454 L
1016.46 751.512 L
1030.838 747.86 L
1045.264 742.478 L
1059.633 735.348 L
1073.83 726.456 L
1087.777 715.827 L
1101.339 703.416 L
1114.329 689.137 L
1126.571 672.942 L
1137.897 654.815 L
1148.151 634.779 L
1157.184 612.891 L
1164.862 589.245 L
1171.056 563.969 L
1175.65 537.228 L
1178.537 509.223 L
1179.621 480.19 L
1178.814 450.4 L
1176.016 419.941 L
S
GR
GS
[0.55814 0 0 0.55814 0 -0.11627] CT
0 0.447 0.741 RC
2 LJ
N
1176.016 419.941 M
1171.239 389.105 L
1164.578 358.463 L
1156.144 328.538 L
1146.061 299.802 L
1134.465 272.681 L
1121.508 247.55 L
1107.353 224.733 L
1092.177 204.51 L
1076.173 187.107 L
1059.544 172.702 L
1042.508 161.427 L
1025.297 153.36 L
1008.145 148.6 L
991.244 147.335 L
974.762 149.482 L
958.847 154.907 L
943.633 163.45 L
929.231 174.923 L
915.737 189.109 L
903.224 205.767 L
891.751 224.628 L
881.355 245.393 L
872.055 267.738 L
863.851 291.313 L
856.73 315.819 L
850.687 341.03 L
845.718 366.695 L
841.815 392.581 L
838.966 418.471 L
837.153 444.17 L
836.355 469.498 L
836.547 494.295 L
837.698 518.419 L
839.775 541.745 L
842.738 564.169 L
846.568 585.634 L
851.255 606.067 L
856.785 625.387 L
863.142 643.52 L
870.305 660.402 L
878.251 675.973 L
886.953 690.187 L
896.38 703.003 L
906.5 714.388 L
917.276 724.318 L
928.668 732.779 L
940.634 739.762 L
953.128 745.27 L
966.1 749.303 L
S
GR
GS
[0.55814 0 0 0.55814 0 -0.11627] CT
0 0.447 0.741 RC
2 LJ
N
966.1 749.303 M
979.497 751.813 L
993.252 752.732 L
1007.292 752.001 L
1021.531 749.569 L
1035.88 745.393 L
1050.237 739.437 L
1064.494 731.674 L
1078.534 722.084 L
1092.232 710.656 L
1105.453 697.385 L
1118.054 682.277 L
1129.886 665.343 L
1140.809 646.607 L
1150.727 626.105 L
1159.434 603.866 L
1166.74 579.951 L
1172.482 554.465 L
1176.529 527.553 L
1178.778 499.399 L
1179.157 470.231 L
1177.623 440.314 L
1174.163 409.956 L
1168.793 379.506 L
1161.561 349.352 L
1152.542 319.923 L
1141.842 291.675 L
1129.613 264.943 L
1116.042 240.136 L
1101.323 217.644 L
1085.652 197.801 L
1069.234 180.892 L
1052.275 167.146 L
1034.986 156.74 L
1017.582 149.799 L
1000.285 146.394 L
983.319 146.54 L
966.912 150.205 L
951.267 157.271 L
936.374 167.397 L
922.32 180.326 L
909.211 195.821 L
897.127 213.634 L
886.132 233.503 L
876.269 255.153 L
867.559 278.3 L
860.004 302.645 L
853.586 327.877 L
848.265 353.674 L
843.982 379.702 L
S
GR
GS
[0.55814 0 0 0.55814 0 -0.11627] CT
0 0.447 0.741 RC
2 LJ
N
843.982 379.702 M
840.661 405.62 L
838.322 431.354 L
836.989 456.819 L
836.643 481.847 L
837.265 506.284 L
838.835 529.994 L
841.332 552.858 L
844.732 574.773 L
849.012 595.652 L
854.147 615.427 L
860.109 634.044 L
866.871 651.467 L
874.405 667.663 L
882.693 682.576 L
891.716 696.156 L
901.45 708.355 L
911.866 719.129 L
922.927 728.44 L
934.594 736.253 L
946.818 742.539 L
959.549 747.27 L
972.728 750.426 L
986.292 751.99 L
1000.172 751.948 L
1014.295 750.294 L
1028.593 747.031 L
1042.977 742.105 L
1057.321 735.429 L
1071.498 726.933 L
1085.378 716.568 L
1098.828 704.303 L
1111.709 690.128 L
1123.885 674.053 L
1135.21 656.106 L
1145.541 636.336 L
1154.728 614.811 L
1162.621 591.619 L
1169.064 566.867 L
1173.918 540.594 L
1177.079 512.887 L
1178.452 484.073 L
1177.973 454.489 L
1175.605 424.47 L
1171.344 394.357 L
1165.215 364.488 L
1157.272 335.206 L
1147.6 306.855 L
1136.314 279.78 L
1123.56 254.33 L
S
GR
GS
[0.55814 0 0 0.55814 0 -0.11627] CT
0 0.447 0.741 RC
2 LJ
N
1123.56 254.33 M
1109.511 230.852 L
1094.373 209.699 L
1078.385 191.235 L
1061.82 175.878 L
1044.883 163.79 L
1027.755 155.04 L
1010.612 149.666 L
993.624 147.669 L
976.955 149.017 L
960.763 153.645 L
945.201 161.451 L
930.416 172.301 L
916.547 186.026 L
903.73 202.422 L
892.082 221.238 L
881.546 241.994 L
872.098 264.322 L
863.75 287.927 L
856.503 312.524 L
S
GR
GS
[0.55814 0 0 0.55814 554.51218 39.65114] CT
/Helvetica-Bold 20 F
GS
[1 0 0 1 0 0] CT
-62.5 -5 moveto 
1 -1 scale
(Solver ode45) t 
GR
GR
GS
[0.55814 0 0 0.55814 0 -0.11627] CT
1 GC
N
1328 882 M
1738 882 L
1738 74 L
1328 74 L
cp
f
GR
GS
[0.55814 0 0 0.55814 0 -0.11627] CT
0.873 GC
2 LJ
N
1328 882 M
1328 74 L
S
GR
GS
[0.55814 0 0 0.55814 0 -0.11627] CT
0.873 GC
2 LJ
N
1396.333 882 M
1396.333 74 L
S
GR
GS
[0.55814 0 0 0.55814 0 -0.11627] CT
0.873 GC
2 LJ
N
1464.667 882 M
1464.667 74 L
S
GR
GS
[0.55814 0 0 0.55814 0 -0.11627] CT
0.873 GC
2 LJ
N
1533 882 M
1533 74 L
S
GR
GS
[0.55814 0 0 0.55814 0 -0.11627] CT
0.873 GC
2 LJ
N
1601.333 882 M
1601.333 74 L
S
GR
GS
[0.55814 0 0 0.55814 0 -0.11627] CT
0.873 GC
2 LJ
N
1669.667 882 M
1669.667 74 L
S
GR
GS
[0.55814 0 0 0.55814 0 -0.11627] CT
0.873 GC
2 LJ
N
1738 882 M
1738 74 L
S
GR
GS
[0.55814 0 0 0.55814 0 -0.11627] CT
0.873 GC
2 LJ
N
1738 882 M
1328 882 L
S
GR
GS
[0.55814 0 0 0.55814 0 -0.11627] CT
0.873 GC
2 LJ
N
1738 747.333 M
1328 747.333 L
S
GR
GS
[0.55814 0 0 0.55814 0 -0.11627] CT
0.873 GC
2 LJ
N
1738 612.667 M
1328 612.667 L
S
GR
GS
[0.55814 0 0 0.55814 0 -0.11627] CT
0.873 GC
2 LJ
N
1738 478 M
1328 478 L
S
GR
GS
[0.55814 0 0 0.55814 0 -0.11627] CT
0.873 GC
2 LJ
N
1738 343.333 M
1328 343.333 L
S
GR
GS
[0.55814 0 0 0.55814 0 -0.11627] CT
0.873 GC
2 LJ
N
1738 208.667 M
1328 208.667 L
S
GR
GS
[0.55814 0 0 0.55814 0 -0.11627] CT
0.873 GC
2 LJ
N
1738 74 M
1328 74 L
S
GR
GS
[0.55814 0 0 0.55814 855.62806 510.00002] CT
0.149 GC
/Helvetica 20 F
GS
[1 0 0 1 0 0] CT
-7.5 21 moveto 
1 -1 scale
(N) t 
GR
GR
GS
[0.55814 0 0 0.55814 0 -0.11627] CT
0.149 GC
2 LJ
N
1328 882 M
1738 882 L
S
GR
GS
[0.55814 0 0 0.55814 0 -0.11627] CT
0.149 GC
2 LJ
N
1328 74 M
1738 74 L
S
GR
GS
[0.55814 0 0 0.55814 0 -0.11627] CT
0.149 GC
2 LJ
N
1328 882 M
1328 873.92 L
S
GR
GS
[0.55814 0 0 0.55814 0 -0.11627] CT
0.149 GC
2 LJ
N
1396.333 882 M
1396.333 873.92 L
S
GR
GS
[0.55814 0 0 0.55814 0 -0.11627] CT
0.149 GC
2 LJ
N
1464.667 882 M
1464.667 873.92 L
S
GR
GS
[0.55814 0 0 0.55814 0 -0.11627] CT
0.149 GC
2 LJ
N
1533 882 M
1533 873.92 L
S
GR
GS
[0.55814 0 0 0.55814 0 -0.11627] CT
0.149 GC
2 LJ
N
1601.333 882 M
1601.333 873.92 L
S
GR
GS
[0.55814 0 0 0.55814 0 -0.11627] CT
0.149 GC
2 LJ
N
1669.667 882 M
1669.667 873.92 L
S
GR
GS
[0.55814 0 0 0.55814 0 -0.11627] CT
0.149 GC
2 LJ
N
1738 882 M
1738 873.92 L
S
GR
GS
[0.55814 0 0 0.55814 0 -0.11627] CT
0.149 GC
2 LJ
N
1328 74 M
1328 82.08 L
S
GR
GS
[0.55814 0 0 0.55814 0 -0.11627] CT
0.149 GC
2 LJ
N
1396.333 74 M
1396.333 82.08 L
S
GR
GS
[0.55814 0 0 0.55814 0 -0.11627] CT
0.149 GC
2 LJ
N
1464.667 74 M
1464.667 82.08 L
S
GR
GS
[0.55814 0 0 0.55814 0 -0.11627] CT
0.149 GC
2 LJ
N
1533 74 M
1533 82.08 L
S
GR
GS
[0.55814 0 0 0.55814 0 -0.11627] CT
0.149 GC
2 LJ
N
1601.333 74 M
1601.333 82.08 L
S
GR
GS
[0.55814 0 0 0.55814 0 -0.11627] CT
0.149 GC
2 LJ
N
1669.667 74 M
1669.667 82.08 L
S
GR
GS
[0.55814 0 0 0.55814 0 -0.11627] CT
0.149 GC
2 LJ
N
1738 74 M
1738 82.08 L
S
GR
GS
[0.55814 0 0 0.55814 741.20932 496.1628] CT
0.149 GC
/Helvetica 18 F
GS
[1 0 0 1 0 0] CT
-15.5 19 moveto 
1 -1 scale
(350) t 
GR
GR
GS
[0.55814 0 0 0.55814 779.34888 496.1628] CT
0.149 GC
/Helvetica 18 F
GS
[1 0 0 1 0 0] CT
-15.5 19 moveto 
1 -1 scale
(400) t 
GR
GR
GS
[0.55814 0 0 0.55814 817.48837 496.1628] CT
0.149 GC
/Helvetica 18 F
GS
[1 0 0 1 0 0] CT
-15.5 19 moveto 
1 -1 scale
(450) t 
GR
GR
GS
[0.55814 0 0 0.55814 855.62793 496.1628] CT
0.149 GC
/Helvetica 18 F
GS
[1 0 0 1 0 0] CT
-15.5 19 moveto 
1 -1 scale
(500) t 
GR
GR
GS
[0.55814 0 0 0.55814 893.76748 496.1628] CT
0.149 GC
/Helvetica 18 F
GS
[1 0 0 1 0 0] CT
-15.5 19 moveto 
1 -1 scale
(550) t 
GR
GR
GS
[0.55814 0 0 0.55814 931.90697 496.1628] CT
0.149 GC
/Helvetica 18 F
GS
[1 0 0 1 0 0] CT
-15.5 19 moveto 
1 -1 scale
(600) t 
GR
GR
GS
[0.55814 0 0 0.55814 970.04653 496.1628] CT
0.149 GC
/Helvetica 18 F
GS
[1 0 0 1 0 0] CT
-15.5 19 moveto 
1 -1 scale
(650) t 
GR
GR
GS
[0 -0.55814 0.55814 0 716.90695 266.6742] CT
0.149 GC
/Helvetica 20 F
GS
[1 0 0 1 0 0] CT
-7 -5 moveto 
1 -1 scale
(P) t 
GR
GR
GS
[0.55814 0 0 0.55814 0 -0.11627] CT
0.149 GC
2 setlinecap
10.0 ML
N
1328 882 M
1328 74 L
S
GR
GS
[0.55814 0 0 0.55814 0 -0.11627] CT
0.149 GC
2 setlinecap
10.0 ML
N
1738 882 M
1738 74 L
S
GR
GS
[0.55814 0 0 0.55814 0 -0.11627] CT
0.149 GC
2 setlinecap
10.0 ML
N
1328 882 M
1336.08 882 L
S
GR
GS
[0.55814 0 0 0.55814 0 -0.11627] CT
0.149 GC
2 setlinecap
10.0 ML
N
1328 747.333 M
1336.08 747.333 L
S
GR
GS
[0.55814 0 0 0.55814 0 -0.11627] CT
0.149 GC
2 setlinecap
10.0 ML
N
1328 612.667 M
1336.08 612.667 L
S
GR
GS
[0.55814 0 0 0.55814 0 -0.11627] CT
0.149 GC
2 setlinecap
10.0 ML
N
1328 478 M
1336.08 478 L
S
GR
GS
[0.55814 0 0 0.55814 0 -0.11627] CT
0.149 GC
2 setlinecap
10.0 ML
N
1328 343.333 M
1336.08 343.333 L
S
GR
GS
[0.55814 0 0 0.55814 0 -0.11627] CT
0.149 GC
2 setlinecap
10.0 ML
N
1328 208.667 M
1336.08 208.667 L
S
GR
GS
[0.55814 0 0 0.55814 0 -0.11627] CT
0.149 GC
2 setlinecap
10.0 ML
N
1328 74 M
1336.08 74 L
S
GR
GS
[0.55814 0 0 0.55814 0 -0.11627] CT
0.149 GC
2 setlinecap
10.0 ML
N
1738 882 M
1729.92 882 L
S
GR
GS
[0.55814 0 0 0.55814 0 -0.11627] CT
0.149 GC
2 setlinecap
10.0 ML
N
1738 747.333 M
1729.92 747.333 L
S
GR
GS
[0.55814 0 0 0.55814 0 -0.11627] CT
0.149 GC
2 setlinecap
10.0 ML
N
1738 612.667 M
1729.92 612.667 L
S
GR
GS
[0.55814 0 0 0.55814 0 -0.11627] CT
0.149 GC
2 setlinecap
10.0 ML
N
1738 478 M
1729.92 478 L
S
GR
GS
[0.55814 0 0 0.55814 0 -0.11627] CT
0.149 GC
2 setlinecap
10.0 ML
N
1738 343.333 M
1729.92 343.333 L
S
GR
GS
[0.55814 0 0 0.55814 0 -0.11627] CT
0.149 GC
2 setlinecap
10.0 ML
N
1738 208.667 M
1729.92 208.667 L
S
GR
GS
[0.55814 0 0 0.55814 0 -0.11627] CT
0.149 GC
2 setlinecap
10.0 ML
N
1738 74 M
1729.92 74 L
S
GR
GS
[0.55814 0 0 0.55814 737.20934 492.16279] CT
0.149 GC
/Helvetica 18 F
GS
[1 0 0 1 0 0] CT
-31 7.5 moveto 
1 -1 scale
(250) t 
GR
GR
GS
[0.55814 0 0 0.55814 737.20934 416.99999] CT
0.149 GC
/Helvetica 18 F
GS
[1 0 0 1 0 0] CT
-31 7.5 moveto 
1 -1 scale
(300) t 
GR
GR
GS
[0.55814 0 0 0.55814 737.20934 341.83722] CT
0.149 GC
/Helvetica 18 F
GS
[1 0 0 1 0 0] CT
-31 7.5 moveto 
1 -1 scale
(350) t 
GR
GR
GS
[0.55814 0 0 0.55814 737.20934 266.67442] CT
0.149 GC
/Helvetica 18 F
GS
[1 0 0 1 0 0] CT
-31 7.5 moveto 
1 -1 scale
(400) t 
GR
GR
GS
[0.55814 0 0 0.55814 737.20934 191.51164] CT
0.149 GC
/Helvetica 18 F
GS
[1 0 0 1 0 0] CT
-31 7.5 moveto 
1 -1 scale
(450) t 
GR
GR
GS
[0.55814 0 0 0.55814 737.20934 116.34885] CT
0.149 GC
/Helvetica 18 F
GS
[1 0 0 1 0 0] CT
-31 7.5 moveto 
1 -1 scale
(500) t 
GR
GR
GS
[0.55814 0 0 0.55814 737.20934 41.18605] CT
0.149 GC
/Helvetica 18 F
GS
[1 0 0 1 0 0] CT
-31 7.5 moveto 
1 -1 scale
(550) t 
GR
GR
GS
[0.55814 0 0 0.55814 0 -0.11627] CT
0 0.447 0.741 RC
2 LJ
N
1533 141.333 M
1516.147 143.083 L
1499.866 148.354 L
1484.427 156.601 L
1469.831 167.824 L
1456.073 182.09 L
1443.288 198.815 L
1431.566 217.434 L
1420.906 237.946 L
1411.326 260.453 L
1402.852 284.206 L
1395.457 308.623 L
1389.142 333.703 L
1383.906 359.448 L
1379.781 385.813 L
1376.669 411.927 L
1374.557 437.724 L
1373.446 463.202 L
1373.35 488.402 L
1374.231 513 L
1376.015 536.677 L
1378.7 559.432 L
1382.288 581.266 L
1386.794 602.191 L
1392.134 621.945 L
1398.277 640.458 L
1405.223 657.73 L
1412.973 673.761 L
1421.533 688.536 L
1430.784 701.911 L
1440.715 713.876 L
1451.328 724.43 L
1462.631 733.578 L
1474.567 741.258 L
1486.981 747.397 L
1499.874 751.995 L
1513.246 755.052 L
1527.136 756.566 L
1541.309 756.429 L
1555.601 754.598 L
1570.013 751.074 L
1584.544 745.857 L
1599.264 738.925 L
1613.712 730.171 L
1627.686 719.578 L
1641.186 707.148 L
1654.211 692.88 L
1666.809 676.71 L
1678.436 658.675 L
1688.846 638.86 L
S
GR
GS
[0.55814 0 0 0.55814 0 -0.11627] CT
0 0.447 0.741 RC
2 LJ
N
1688.846 638.86 M
1698.041 617.266 L
1706.02 593.893 L
1712.702 568.701 L
1717.628 542.202 L
1720.764 514.45 L
1722.111 485.445 L
1721.608 455.285 L
1719.146 424.904 L
1714.722 394.346 L
1708.313 363.554 L
1700.016 333.152 L
1690.092 304.092 L
1678.542 276.371 L
1665.282 249.909 L
1650.787 225.646 L
1635.49 204.255 L
1619.392 185.734 L
1602.468 170.079 L
1584.977 157.605 L
1567.614 148.697 L
1550.379 143.358 L
1533.273 141.586 L
1516.394 143.365 L
1500.247 148.338 L
1484.845 156.492 L
1470.178 167.874 L
1456.387 182.072 L
1443.625 198.452 L
1431.894 217.013 L
1421.203 237.845 L
1411.605 260.243 L
1403.095 283.604 L
1395.675 307.927 L
1389.344 333.219 L
1384.136 359.323 L
1379.952 385.33 L
1376.794 411.239 L
1374.66 437.05 L
1373.574 462.811 L
1373.467 488.014 L
1374.287 512.422 L
1376.035 536.035 L
1378.71 558.854 L
1382.329 580.866 L
1386.789 601.73 L
1392.079 621.419 L
1398.199 639.932 L
1405.154 657.275 L
1412.925 673.386 L
S
GR
GS
[0.55814 0 0 0.55814 0 -0.11627] CT
0 0.447 0.741 RC
2 LJ
N
1412.925 673.386 M
1421.413 688.124 L
1430.618 701.49 L
1440.54 713.483 L
1451.197 724.108 L
1462.487 733.279 L
1474.32 740.943 L
1486.695 747.102 L
1499.613 751.755 L
1513.102 754.891 L
1526.899 756.395 L
1540.928 756.25 L
1555.191 754.454 L
1569.686 751.008 L
1584.45 745.872 L
1598.983 738.934 L
1613.221 730.188 L
1627.162 719.634 L
1640.807 707.273 L
1654.189 693.022 L
1666.622 676.925 L
1678.014 659.006 L
1688.365 639.263 L
1697.676 617.698 L
1705.882 594.229 L
1712.459 569.266 L
1717.344 542.888 L
1720.539 515.095 L
1722.004 485.884 L
1721.531 456.075 L
1719.095 425.808 L
1714.695 395.082 L
1708.311 364.111 L
1700.177 334.102 L
1690.299 305.077 L
1678.629 276.969 L
1665.42 250.465 L
1651.195 226.528 L
1635.953 205.157 L
1619.672 186.342 L
1602.551 170.423 L
1585.375 158.017 L
1568.146 149.124 L
1550.862 143.745 L
1533.556 141.915 L
1516.816 143.45 L
1500.721 148.313 L
1485.27 156.504 L
1470.53 167.923 L
1456.775 181.785 L
S
GR
GS
[0.55814 0 0 0.55814 0 -0.11627] CT
0 0.447 0.741 RC
2 LJ
N
1456.775 181.785 M
1444.01 198.065 L
1432.238 216.811 L
1421.524 237.631 L
1411.9 259.671 L
1403.366 282.932 L
1395.923 307.413 L
1389.609 333.019 L
1384.341 358.746 L
1380.116 384.575 L
1376.934 410.506 L
1374.817 436.593 L
1373.705 462.303 L
1373.542 487.338 L
1374.328 511.697 L
1376.061 535.38 L
1378.761 558.379 L
1382.326 580.304 L
1386.741 601.115 L
1392.006 620.812 L
1398.127 639.401 L
1405.088 656.816 L
1412.793 672.893 L
1421.24 687.629 L
1430.432 701.027 L
1440.381 713.09 L
1451.009 723.739 L
1462.224 732.909 L
1474.025 740.601 L
1486.412 746.814 L
1499.413 751.541 L
1512.802 754.673 L
1526.502 756.188 L
1540.514 756.085 L
1554.838 754.366 L
1569.507 750.995 L
1584.073 745.855 L
1598.473 738.937 L
1612.706 730.241 L
1626.771 719.767 L
1640.71 707.444 L
1653.85 693.265 L
1666.107 677.241 L
1677.482 659.372 L
1687.975 639.659 L
1697.546 618.008 L
1705.63 594.721 L
1712.138 569.884 L
1717.071 543.498 L
1720.415 515.513 L
S
GR
GS
[0.55814 0 0 0.55814 0 -0.11627] CT
0 0.447 0.741 RC
2 LJ
N
1720.415 515.513 M
1721.892 486.578 L
1721.428 456.928 L
1719.025 426.562 L
1714.646 395.532 L
1708.406 364.989 L
1700.33 335.082 L
1690.417 305.811 L
1678.694 277.46 L
1665.756 251.344 L
1651.605 227.464 L
1636.238 205.819 L
1619.696 186.649 L
1602.921 170.889 L
1585.916 158.542 L
1568.679 149.607 L
1551.182 144.119 L
1533.975 142.099 L
1517.315 143.508 L
1501.202 148.345 L
1485.639 156.639 L
1470.944 167.736 L
1457.197 181.446 L
1444.4 197.768 L
1432.588 216.672 L
1421.856 237.129 L
1412.211 259.027 L
1403.65 282.369 L
1396.211 307.18 L
1389.846 332.44 L
1384.537 357.98 L
1380.284 383.799 L
1377.1 409.942 L
1374.969 436.05 L
1373.804 461.592 L
1373.603 486.568 L
1374.368 510.977 L
1376.119 534.843 L
1378.771 557.769 L
1382.29 579.639 L
1386.677 600.453 L
1391.931 620.211 L
1398.062 638.893 L
1404.963 656.278 L
1412.629 672.355 L
1421.058 687.122 L
1430.259 700.584 L
1440.198 712.69 L
1450.757 723.34 L
1461.938 732.536 L
S
GR
GS
[0.55814 0 0 0.55814 0 -0.11627] CT
0 0.447 0.741 RC
2 LJ
N
1461.938 732.536 M
1473.739 740.276 L
1486.186 746.561 L
1499.116 751.297 L
1512.42 754.442 L
1526.097 755.998 L
1540.147 755.964 L
1554.615 754.323 L
1569.129 750.953 L
1583.58 745.834 L
1597.968 738.966 L
1612.293 730.348 L
1626.617 719.932 L
1640.341 707.659 L
1653.324 693.534 L
1665.567 677.559 L
1677.069 659.733 L
1687.832 639.969 L
1697.284 618.453 L
1705.279 595.289 L
1711.817 570.478 L
1716.906 543.963 L
1720.276 516.138 L
1721.745 487.389 L
1721.314 457.716 L
1718.961 427.061 L
1714.683 396.345 L
1708.508 365.964 L
1700.435 335.918 L
1690.427 306.256 L
1678.96 278.323 L
1666.118 252.312 L
1651.901 228.223 L
1636.245 206.135 L
1620.065 187.204 L
1603.471 171.542 L
1586.461 159.149 L
1568.998 150.04 L
1551.503 144.392 L
1534.435 142.252 L
1517.794 143.62 L
1501.561 148.538 L
1486.011 156.616 L
1471.355 167.505 L
1457.592 181.204 L
1444.733 197.77 L
1432.916 216.335 L
1422.173 236.582 L
1412.504 258.512 L
1403.938 282.214 L
S
GR
GS
[0.55814 0 0 0.55814 0 -0.11627] CT
0 0.447 0.741 RC
2 LJ
N
1403.938 282.214 M
1396.465 306.742 L
1390.06 331.749 L
1384.724 357.235 L
1380.455 383.202 L
1377.284 409.526 L
1375.095 435.41 L
1373.889 460.854 L
1373.667 485.859 L
1374.446 510.463 L
1376.165 534.291 L
1378.768 557.132 L
1382.257 578.985 L
1386.63 599.852 L
1391.902 619.731 L
1397.978 638.373 L
1404.838 655.743 L
1412.482 671.839 L
1420.911 686.663 L
1430.124 700.187 L
1439.992 712.283 L
1450.513 722.949 L
1461.687 732.185 L
1473.532 739.993 L
1485.943 746.296 L
1498.785 751.037 L
1512.057 754.215 L
1525.759 755.831 L
1539.936 755.878 L
1554.291 754.237 L
1568.681 750.879 L
1583.108 745.802 L
1597.57 739.007 L
1612.138 730.462 L
1626.287 720.074 L
1639.838 707.841 L
1652.792 693.762 L
1665.147 677.838 L
1676.932 659.992 L
1687.588 640.322 L
1696.915 618.929 L
1704.911 595.812 L
1711.583 570.957 L
1716.757 544.459 L
1720.087 516.853 L
1721.574 488.14 L
1721.213 458.269 L
1718.933 427.735 L
1714.716 397.255 L
1708.564 366.83 L
S
GR
GS
[0.55814 0 0 0.55814 0 -0.11627] CT
0 0.447 0.741 RC
2 LJ
N
1708.564 366.83 M
1700.427 336.389 L
1690.596 307.033 L
1679.249 279.286 L
1666.388 253.147 L
1651.919 228.58 L
1636.565 206.741 L
1620.586 187.967 L
1603.982 172.259 L
1586.713 159.62 L
1569.171 150.346 L
1551.896 144.627 L
1534.889 142.464 L
1518.13 143.88 L
1501.85 148.684 L
1486.385 156.51 L
1471.733 167.36 L
1457.894 181.298 L
1445.032 197.627 L
1433.221 215.916 L
1422.462 236.166 L
1412.777 258.475 L
1404.189 281.939 L
1396.68 306.14 L
1390.252 331.078 L
1384.905 356.762 L
1380.665 383.02 L
1377.43 409.015 L
1375.2 434.747 L
1373.975 460.216 L
1373.776 485.465 L
1374.534 510.041 L
1376.2 533.729 L
1378.772 556.528 L
1382.251 578.439 L
1386.652 599.454 L
1391.874 619.276 L
1397.905 637.876 L
1404.745 655.254 L
1412.396 671.411 L
1420.846 686.305 L
1429.985 699.799 L
1439.812 711.896 L
1450.327 722.594 L
1461.55 731.896 L
1473.37 739.719 L
1485.683 746.013 L
1498.489 750.776 L
1511.789 754.01 L
1525.618 755.703 L
S
GR
GS
[0.55814 0 0 0.55814 0 -0.11627] CT
0 0.447 0.741 RC
2 LJ
N
1525.618 755.703 M
1539.688 755.739 L
1553.905 754.096 L
1568.268 750.772 L
1582.778 745.769 L
1597.485 739.048 L
1611.864 730.507 L
1625.812 720.139 L
1639.329 707.943 L
1652.416 693.92 L
1665.095 677.988 L
1676.736 660.222 L
1687.205 640.67 L
1696.503 619.332 L
1704.63 596.208 L
1711.459 571.272 L
1716.537 545.032 L
1719.855 517.504 L
1721.411 488.687 L
1721.13 458.729 L
1718.894 428.524 L
1714.701 398.075 L
1708.522 367.312 L
1700.483 337.001 L
1690.794 307.944 L
1679.456 280.14 L
1666.383 253.513 L
1652.115 229.132 L
1636.997 207.544 L
1621.03 188.748 L
1604.163 172.735 L
1586.809 159.927 L
1569.54 150.665 L
1552.356 144.947 L
1535.254 142.777 L
1518.377 144.128 L
1502.218 148.685 L
1486.778 156.45 L
1472.047 167.474 L
1458.191 181.275 L
1445.352 197.305 L
1433.532 215.565 L
1422.742 236.146 L
1413.039 258.253 L
1404.423 281.38 L
1396.893 305.525 L
1390.457 330.73 L
1385.129 356.661 L
1380.828 382.539 L
1377.555 408.366 L
S
GR
GS
[0.55814 0 0 0.55814 0 -0.11627] CT
0 0.447 0.741 RC
2 LJ
N
1377.555 408.366 M
1375.308 434.141 L
1374.113 459.901 L
1373.888 485.075 L
1374.593 509.484 L
1376.228 533.126 L
1378.794 556.002 L
1382.304 578.078 L
1386.651 599.005 L
1391.831 618.772 L
1397.844 637.379 L
1404.699 654.837 L
1412.357 671.051 L
1420.737 685.903 L
1429.838 699.393 L
1439.66 711.519 L
1450.222 722.285 L
1461.406 731.596 L
1473.141 739.409 L
1485.425 745.724 L
1498.26 750.543 L
1511.669 753.845 L
1525.376 755.52 L
1539.331 755.554 L
1553.534 753.948 L
1567.985 750.701 L
1582.703 745.764 L
1597.182 739.032 L
1611.393 730.502 L
1625.334 720.174 L
1639.006 708.049 L
1652.323 694.02 L
1664.749 678.128 L
1676.256 660.385 L
1686.844 640.791 L
1696.473 619.304 L
1704.611 596.205 L
1711.212 571.528 L
1716.277 545.273 L
1719.758 517.435 L
1721.348 488.71 L
1721.016 459.19 L
1718.764 428.875 L
1714.551 397.963 L
1708.479 367.554 L
1700.551 337.665 L
1690.721 308.22 L
1679.228 279.995 L
1666.461 253.882 L
1652.42 229.88 L
S
GR
GS
[0.55814 0 0 0.55814 0 -0.11627] CT
0 0.447 0.741 RC
2 LJ
N
1652.42 229.88 M
1637.019 207.93 L
1620.684 188.678 L
1604.061 172.786 L
1587.149 160.252 L
1569.948 151.077 L
1552.452 145.312 L
1535.297 143.01 L
1518.656 144.15 L
1502.527 148.734 L
1486.933 156.76 L
1472.217 167.562 L
1458.434 181.025 L
1445.582 197.148 L
1433.713 215.828 L
1422.922 236.047 L
1413.212 257.77 L
1404.582 280.997 L
1397.074 305.69 L
1390.633 330.783 L
1385.248 356.208 L
1380.922 381.965 L
1377.672 408.113 L
1375.458 434.135 L
1374.213 459.626 L
1373.936 484.584 L
1374.627 509.011 L
1376.308 532.909 L
1378.88 555.837 L
1382.322 577.73 L
1386.635 598.586 L
1391.821 618.41 L
1397.876 637.147 L
1404.7 654.587 L
1412.292 670.729 L
1420.652 685.573 L
1429.793 699.126 L
1439.651 711.307 L
1450.135 722.042 L
1461.248 731.33 L
1472.988 739.172 L
1485.38 745.561 L
1498.232 750.395 L
1511.47 753.648 L
1525.095 755.32 L
1539.107 755.412 L
1553.534 753.894 L
1567.98 750.645 L
1582.386 745.658 L
1596.755 738.932 L
S
GR
GS
[0.55814 0 0 0.55814 0 -0.11627] CT
0 0.447 0.741 RC
2 LJ
N
1596.755 738.932 M
1611.084 730.468 L
1625.408 720.199 L
1639.09 708.081 L
1652.068 694.116 L
1664.342 678.305 L
1675.912 660.647 L
1686.739 641.044 L
1696.221 619.721 L
1704.28 596.735 L
1710.914 572.086 L
1716.13 545.714 L
1719.603 518.087 L
1721.194 489.494 L
1720.904 459.934 L
1718.703 429.376 L
1714.585 398.799 L
1708.564 368.488 L
1700.641 338.446 L
1690.793 308.793 L
1679.494 280.877 L
1666.79 254.805 L
1652.68 230.576 L
1637.146 208.353 L
1621.108 189.304 L
1604.605 173.47 L
1587.638 160.85 L
1570.166 151.476 L
1552.753 145.57 L
1535.727 143.177 L
1519.091 144.296 L
1502.826 148.971 L
1487.276 156.743 L
1472.598 167.371 L
1458.793 180.854 L
1445.882 197.213 L
1434.016 215.514 L
1423.216 235.561 L
1413.484 257.353 L
1404.855 280.942 L
1397.31 305.273 L
1390.834 330.139 L
1385.427 355.54 L
1381.098 381.517 L
1377.846 407.728 L
1375.579 433.538 L
1374.299 458.945 L
1374.005 483.95 L
1374.718 508.584 L
1376.358 532.396 L
S
GR
GS
[0.55814 0 0 0.55814 0 -0.11627] CT
0 0.447 0.741 RC
2 LJ
N
1376.358 532.396 M
1378.886 555.244 L
1382.302 577.127 L
1386.606 598.044 L
1391.809 617.976 L
1397.808 636.662 L
1404.595 654.086 L
1412.17 670.249 L
1420.54 685.157 L
1429.675 698.75 L
1439.469 710.921 L
1449.921 721.671 L
1461.033 730.999 L
1472.825 738.905 L
1485.156 745.298 L
1497.93 750.138 L
1511.146 753.424 L
1524.804 755.156 L
1538.941 755.318 L
1553.223 753.79 L
1567.562 750.554 L
1581.959 745.609 L
1596.414 738.957 L
1610.977 730.55 L
1625.074 720.305 L
1638.606 708.221 L
1651.575 694.299 L
1663.98 678.537 L
1675.822 660.845 L
1686.487 641.36 L
1695.856 620.142 L
1703.928 597.191 L
1710.718 572.471 L
1715.975 546.175 L
1719.408 518.739 L
1721.018 490.163 L
1720.799 460.384 L
1718.666 430.014 L
1714.597 399.641 L
1708.593 369.265 L
1700.606 338.838 L
1690.945 309.542 L
1679.746 281.782 L
1667.01 255.558 L
1652.658 230.876 L
1637.456 208.959 L
1621.586 190.05 L
1605.05 174.148 L
1587.795 161.265 L
1570.348 151.768 L
S
GR
GS
[0.55814 0 0 0.55814 0 -0.11627] CT
0 0.447 0.741 RC
2 LJ
N
1570.348 151.768 M
1553.133 145.817 L
1536.149 143.412 L
1519.372 144.587 L
1503.104 149.098 L
1487.631 156.662 L
1472.951 167.277 L
1459.068 181 L
1446.165 197.064 L
1434.306 215.137 L
1423.49 235.217 L
1413.745 257.383 L
1405.09 280.646 L
1397.515 304.697 L
1391.019 329.537 L
1385.612 355.214 L
1381.295 381.339 L
1377.985 407.241 L
1375.683 432.921 L
1374.388 458.377 L
1374.125 483.64 L
1374.806 508.186 L
1376.397 531.867 L
1378.899 554.684 L
1382.31 576.638 L
1386.642 597.694 L
1391.79 617.548 L
1397.75 636.194 L
1404.521 653.63 L
1412.114 669.865 L
1420.487 684.817 L
1429.553 698.38 L
1439.312 710.552 L
1449.764 721.334 L
1460.93 730.727 L
1472.673 738.634 L
1484.919 745.02 L
1497.667 749.883 L
1510.918 753.225 L
1524.698 755.024 L
1538.698 755.165 L
1552.862 753.636 L
1567.19 750.437 L
1581.682 745.567 L
1596.364 738.975 L
1610.69 730.566 L
1624.615 720.338 L
1638.138 708.292 L
1651.259 694.426 L
1663.971 678.645 L
S
GR
GS
[0.55814 0 0 0.55814 0 -0.11627] CT
0 0.447 0.741 RC
2 LJ
N
1663.971 678.645 M
1675.608 661.051 L
1686.104 641.669 L
1695.46 620.497 L
1703.679 597.531 L
1710.585 572.773 L
1715.75 546.706 L
1719.175 519.33 L
1720.86 490.628 L
1720.712 460.834 L
1718.613 430.756 L
1714.564 400.393 L
1708.53 369.67 L
1700.656 339.441 L
1691.118 310.407 L
1679.917 282.57 L
1666.969 255.865 L
1652.853 231.434 L
1637.856 209.742 L
1621.979 190.79 L
1605.16 174.567 L
1587.906 161.568 L
1570.708 152.096 L
1553.566 146.15 L
1536.47 143.74 L
1519.613 144.819 L
1503.458 149.117 L
1488.005 156.634 L
1473.242 167.427 L
1459.354 180.971 L
1446.474 196.774 L
1434.605 214.835 L
1423.759 235.244 L
1413.996 257.156 L
1405.318 280.122 L
1397.723 304.142 L
1391.224 329.272 L
1385.825 355.08 L
1381.454 380.864 L
1378.11 406.626 L
1375.794 432.364 L
1374.531 458.106 L
1374.233 483.25 L
1374.867 507.646 L
1376.432 531.294 L
1378.929 554.195 L
1382.37 576.299 L
1386.646 597.254 L
1391.755 617.06 L
1397.7 635.718 L
S
GR
GS
[0.55814 0 0 0.55814 0 -0.11627] CT
0 0.447 0.741 RC
2 LJ
N
1397.7 635.718 M
1404.49 653.237 L
1412.076 669.509 L
1420.386 684.424 L
1429.419 697.984 L
1439.175 710.186 L
1449.673 721.035 L
1460.788 730.427 L
1472.457 738.328 L
1484.681 744.737 L
1497.459 749.653 L
1510.81 753.056 L
1524.456 754.834 L
1538.359 754.978 L
1552.518 753.487 L
1566.934 750.363 L
1581.613 745.548 L
1596.053 738.943 L
1610.239 730.548 L
1624.172 720.361 L
1637.85 708.384 L
1651.169 694.503 L
1663.603 678.768 L
1675.137 661.185 L
1685.773 641.754 L
1695.456 620.435 L
1703.656 597.506 L
1710.336 572.993 L
1715.497 546.896 L
1719.087 519.215 L
1720.794 490.639 L
1720.589 461.249 L
1718.475 431.046 L
1714.409 400.234 L
1708.484 369.901 L
1700.702 340.054 L
1691.017 310.617 L
1679.674 282.388 L
1667.043 256.23 L
1653.125 232.145 L
1637.828 210.068 L
1621.6 190.676 L
1605.068 174.619 L
1588.232 161.897 L
1571.092 152.51 L
1553.637 146.51 L
1536.505 143.964 L
1519.876 144.855 L
1503.75 149.184 L
1488.142 156.957 L
S
GR
GS
[0.55814 0 0 0.55814 0 -0.11627] CT
0 0.447 0.741 RC
2 LJ
N
1488.142 156.957 M
1473.4 167.521 L
1459.584 180.751 L
1446.693 196.646 L
1434.774 215.12 L
1423.929 235.158 L
1414.162 256.711 L
1405.472 279.779 L
1397.899 304.337 L
1391.392 329.323 L
1385.941 354.652 L
1381.547 380.326 L
1378.226 406.401 L
1375.944 432.386 L
1374.63 457.847 L
1374.284 482.785 L
1374.905 507.201 L
1376.516 531.102 L
1379.019 554.05 L
1382.393 575.968 L
1386.637 596.856 L
1391.752 616.715 L
1397.74 635.503 L
1404.497 652.998 L
1412.021 669.199 L
1420.313 684.107 L
1429.385 697.728 L
1439.177 709.985 L
1449.598 720.799 L
1460.646 730.169 L
1472.321 738.096 L
1484.649 744.576 L
1497.444 749.506 L
1510.627 752.859 L
1524.196 754.635 L
1538.153 754.833 L
1552.531 753.427 L
1566.94 750.298 L
1581.313 745.434 L
1595.65 738.835 L
1609.951 730.501 L
1624.257 720.373 L
1637.941 708.398 L
1650.927 694.581 L
1663.215 678.923 L
1674.805 661.424 L
1685.67 641.986 L
1695.211 620.823 L
1703.337 598 L
1710.046 573.518 L
S
GR
GS
[0.55814 0 0 0.55814 0 -0.11627] CT
0 0.447 0.741 RC
2 LJ
N
1710.046 573.518 M
1715.347 547.316 L
1718.93 519.83 L
1720.639 491.377 L
1720.474 461.958 L
1718.409 431.527 L
1714.43 401.026 L
1708.554 370.787 L
1700.781 340.81 L
1691.081 311.177 L
1679.915 283.228 L
1667.345 257.111 L
1653.371 232.827 L
1637.955 210.496 L
1622.001 191.29 L
1605.58 175.286 L
1588.692 162.483 L
1571.295 152.904 L
1553.907 146.771 L
1536.904 144.14 L
1520.285 145.01 L
1504.03 149.426 L
1488.459 156.969 L
1473.757 167.362 L
1459.924 180.604 L
1446.975 196.734 L
1435.06 214.855 L
1424.209 234.719 L
1414.422 256.326 L
1405.732 279.749 L
1398.127 303.974 L
1391.588 328.735 L
1386.115 354.032 L
1381.715 379.888 L
1378.398 406.063 L
1376.066 431.838 L
1374.719 457.213 L
1374.355 482.189 L
1374.997 506.801 L
1376.572 530.63 L
1379.033 553.496 L
1382.381 575.4 L
1386.616 596.341 L
1391.751 616.31 L
1397.685 635.047 L
1404.406 652.524 L
1411.913 668.743 L
1420.21 683.705 L
1429.284 697.37 L
1439.016 709.616 L
S
GR
GS
[0.55814 0 0 0.55814 0 -0.11627] CT
0 0.447 0.741 RC
2 LJ
N
1439.016 709.616 M
1449.404 720.442 L
1460.448 729.847 L
1472.171 737.836 L
1484.45 744.321 L
1497.168 749.254 L
1510.326 752.636 L
1523.924 754.466 L
1538.003 754.733 L
1552.251 753.318 L
1566.554 750.198 L
1580.912 745.372 L
1595.325 738.841 L
1609.854 730.565 L
1623.955 720.458 L
1637.491 708.515 L
1650.459 694.738 L
1662.862 679.125 L
1674.717 661.596 L
1685.44 642.262 L
1694.866 621.202 L
1702.996 598.417 L
1709.838 573.886 L
1715.199 547.721 L
1718.741 520.426 L
1720.463 492.001 L
1720.362 462.396 L
1718.36 432.098 L
1714.43 401.808 L
1708.572 371.526 L
1700.738 341.182 L
1691.203 311.858 L
1680.14 284.078 L
1667.549 257.843 L
1653.339 233.115 L
1638.217 211.052 L
1622.438 191.996 L
1606.001 175.946 L
1588.864 162.904 L
1571.438 153.194 L
1554.25 147.017 L
1537.298 144.374 L
1520.565 145.288 L
1504.279 149.586 L
1488.788 156.917 L
1474.091 167.283 L
1460.186 180.747 L
1447.24 196.64 L
1435.335 214.523 L
1424.471 234.397 L
S
GR
GS
[0.55814 0 0 0.55814 0 -0.11627] CT
0 0.447 0.741 RC
2 LJ
N
1424.471 234.397 M
1414.669 256.357 L
1405.959 279.521 L
1398.325 303.459 L
1391.766 328.171 L
1386.286 353.669 L
1381.91 379.768 L
1378.538 405.635 L
1376.171 431.27 L
1374.808 456.673 L
1374.471 481.887 L
1375.091 506.45 L
1376.619 530.145 L
1379.053 552.971 L
1382.395 574.93 L
1386.659 596.012 L
1391.745 615.915 L
1397.64 634.607 L
1404.344 652.09 L
1411.86 668.365 L
1420.175 683.388 L
1429.181 697.02 L
1438.876 709.262 L
1449.26 720.115 L
1460.352 729.581 L
1472.046 737.577 L
1484.237 744.051 L
1496.925 749.003 L
1510.11 752.433 L
1523.827 754.331 L
1537.797 754.582 L
1551.922 753.163 L
1566.202 750.073 L
1580.637 745.312 L
1595.28 738.845 L
1609.614 730.569 L
1623.535 720.475 L
1637.042 708.565 L
1650.135 694.838 L
1662.845 679.213 L
1674.542 661.762 L
1685.089 642.532 L
1694.486 621.521 L
1702.733 598.732 L
1709.722 574.123 L
1714.989 548.193 L
1718.513 520.972 L
1720.295 492.46 L
1720.269 462.76 L
1718.301 432.769 L
S
GR
GS
[0.55814 0 0 0.55814 0 -0.11627] CT
0 0.447 0.741 RC
2 LJ
N
1718.301 432.769 M
1714.389 402.519 L
1708.512 371.952 L
1700.755 341.693 L
1691.35 312.656 L
1680.298 284.843 L
1667.519 258.169 L
1653.476 233.596 L
1638.574 211.779 L
1622.813 192.716 L
1606.155 176.397 L
1588.915 163.193 L
1571.746 153.507 L
1554.65 147.339 L
1537.624 144.689 L
1520.765 145.557 L
1504.597 149.632 L
1489.136 156.902 L
1474.377 167.353 L
1460.417 180.631 L
S
GR
GS
[0.55814 0 0 0.55814 855.62874 39.65114] CT
/Helvetica-Bold 20 F
GS
[1 0 0 1 0 0] CT
-68 -5 moveto 
1 -1 scale
(Solver ode23s) t 
GR
GR
%%Trailer
%%Pages: 1
%%EOF
