%!PS-Adobe-3.0 EPSF-3.0
%%Creator: (MATLAB, The Mathworks, Inc. Version 8.5.0.197613 \(R2015a\). Operating System: Windows 7)
%%Title: C:/Users/Shurshurik/Desktop/matlab_student/3/plot1.eps
%%CreationDate: 2018-11-20T14:56:09
%%Pages: (atend)
%%BoundingBox: 0 0 714 522
%%LanguageLevel: 2
%%EndComments
%%BeginProlog
%%BeginResource: procset (Apache XML Graphics Std ProcSet) 1.2 0
%%Version: 1.2 0
%%Copyright: (Copyright 2001-2003,2010 The Apache Software Foundation. License terms: http://www.apache.org/licenses/LICENSE-2.0)
/bd{bind def}bind def
/ld{load def}bd
/GR/grestore ld
/M/moveto ld
/LJ/setlinejoin ld
/C/curveto ld
/f/fill ld
/LW/setlinewidth ld
/GC/setgray ld
/t/show ld
/N/newpath ld
/CT/concat ld
/cp/closepath ld
/S/stroke ld
/L/lineto ld
/CC/setcmykcolor ld
/A/ashow ld
/GS/gsave ld
/RC/setrgbcolor ld
/RM/rmoveto ld
/ML/setmiterlimit ld
/re {4 2 roll M
1 index 0 rlineto
0 exch rlineto
neg 0 rlineto
cp } bd
/_ctm matrix def
/_tm matrix def
/BT { _ctm currentmatrix pop matrix _tm copy pop 0 0 moveto } bd
/ET { _ctm setmatrix } bd
/iTm { _ctm setmatrix _tm concat } bd
/Tm { _tm astore pop iTm 0 0 moveto } bd
/ux 0.0 def
/uy 0.0 def
/F {
  /Tp exch def
  /Tf exch def
  Tf findfont Tp scalefont setfont
  /cf Tf def  /cs Tp def
} bd
/ULS {currentpoint /uy exch def /ux exch def} bd
/ULE {
  /Tcx currentpoint pop def
  gsave
  newpath
  cf findfont cs scalefont dup
  /FontMatrix get 0 get /Ts exch def /FontInfo get dup
  /UnderlinePosition get Ts mul /To exch def
  /UnderlineThickness get Ts mul /Tt exch def
  ux uy To add moveto  Tcx uy To add lineto
  Tt setlinewidth stroke
  grestore
} bd
/OLE {
  /Tcx currentpoint pop def
  gsave
  newpath
  cf findfont cs scalefont dup
  /FontMatrix get 0 get /Ts exch def /FontInfo get dup
  /UnderlinePosition get Ts mul /To exch def
  /UnderlineThickness get Ts mul /Tt exch def
  ux uy To add cs add moveto Tcx uy To add cs add lineto
  Tt setlinewidth stroke
  grestore
} bd
/SOE {
  /Tcx currentpoint pop def
  gsave
  newpath
  cf findfont cs scalefont dup
  /FontMatrix get 0 get /Ts exch def /FontInfo get dup
  /UnderlinePosition get Ts mul /To exch def
  /UnderlineThickness get Ts mul /Tt exch def
  ux uy To add cs 10 mul 26 idiv add moveto Tcx uy To add cs 10 mul 26 idiv add lineto
  Tt setlinewidth stroke
  grestore
} bd
/QT {
/Y22 exch store
/X22 exch store
/Y21 exch store
/X21 exch store
currentpoint
/Y21 load 2 mul add 3 div exch
/X21 load 2 mul add 3 div exch
/X21 load 2 mul /X22 load add 3 div
/Y21 load 2 mul /Y22 load add 3 div
/X22 load /Y22 load curveto
} bd
/SSPD {
dup length /d exch dict def
{
/v exch def
/k exch def
currentpagedevice k known {
/cpdv currentpagedevice k get def
v cpdv ne {
/upd false def
/nullv v type /nulltype eq def
/nullcpdv cpdv type /nulltype eq def
nullv nullcpdv or
{
/upd true def
} {
/sametype v type cpdv type eq def
sametype {
v type /arraytype eq {
/vlen v length def
/cpdvlen cpdv length def
vlen cpdvlen eq {
0 1 vlen 1 sub {
/i exch def
/obj v i get def
/cpdobj cpdv i get def
obj cpdobj ne {
/upd true def
exit
} if
} for
} {
/upd true def
} ifelse
} {
v type /dicttype eq {
v {
/dv exch def
/dk exch def
/cpddv cpdv dk get def
dv cpddv ne {
/upd true def
exit
} if
} forall
} {
/upd true def
} ifelse
} ifelse
} if
} ifelse
upd true eq {
d k v put
} if
} if
} if
} forall
d length 0 gt {
d setpagedevice
} if
} bd
%%EndResource
%%BeginResource: procset (Apache XML Graphics EPS ProcSet) 1.0 0
%%Version: 1.0 0
%%Copyright: (Copyright 2002-2003 The Apache Software Foundation. License terms: http://www.apache.org/licenses/LICENSE-2.0)
/BeginEPSF { %def
/b4_Inc_state save def         % Save state for cleanup
/dict_count countdictstack def % Count objects on dict stack
/op_count count 1 sub def      % Count objects on operand stack
userdict begin                 % Push userdict on dict stack
/showpage { } def              % Redefine showpage, { } = null proc
0 setgray 0 setlinecap         % Prepare graphics state
1 setlinewidth 0 setlinejoin
10 setmiterlimit [ ] 0 setdash newpath
/languagelevel where           % If level not equal to 1 then
{pop languagelevel             % set strokeadjust and
1 ne                           % overprint to their defaults.
{false setstrokeadjust false setoverprint
} if
} if
} bd
/EndEPSF { %def
count op_count sub {pop} repeat            % Clean up stacks
countdictstack dict_count sub {end} repeat
b4_Inc_state restore
} bd
%%EndResource
%FOPBeginFontDict
%%IncludeResource: font Courier-Bold
%%IncludeResource: font Helvetica
%%IncludeResource: font Courier-BoldOblique
%%IncludeResource: font Courier-Oblique
%%IncludeResource: font Times-Roman
%%IncludeResource: font Helvetica-BoldOblique
%%IncludeResource: font Helvetica-Bold
%%IncludeResource: font Helvetica-Oblique
%%IncludeResource: font Times-BoldItalic
%%IncludeResource: font Courier
%%IncludeResource: font Times-Italic
%%IncludeResource: font Times-Bold
%%IncludeResource: font Symbol
%%IncludeResource: font ZapfDingbats
%FOPEndFontDict
%%BeginResource: encoding WinAnsiEncoding
/WinAnsiEncoding [
/.notdef /.notdef /.notdef /.notdef /.notdef
/.notdef /.notdef /.notdef /.notdef /.notdef
/.notdef /.notdef /.notdef /.notdef /.notdef
/.notdef /.notdef /.notdef /.notdef /.notdef
/.notdef /.notdef /.notdef /.notdef /.notdef
/.notdef /.notdef /.notdef /.notdef /.notdef
/.notdef /.notdef /space /exclam /quotedbl
/numbersign /dollar /percent /ampersand /quotesingle
/parenleft /parenright /asterisk /plus /comma
/hyphen /period /slash /zero /one
/two /three /four /five /six
/seven /eight /nine /colon /semicolon
/less /equal /greater /question /at
/A /B /C /D /E
/F /G /H /I /J
/K /L /M /N /O
/P /Q /R /S /T
/U /V /W /X /Y
/Z /bracketleft /backslash /bracketright /asciicircum
/underscore /quoteleft /a /b /c
/d /e /f /g /h
/i /j /k /l /m
/n /o /p /q /r
/s /t /u /v /w
/x /y /z /braceleft /bar
/braceright /asciitilde /bullet /Euro /bullet
/quotesinglbase /florin /quotedblbase /ellipsis /dagger
/daggerdbl /circumflex /perthousand /Scaron /guilsinglleft
/OE /bullet /Zcaron /bullet /bullet
/quoteleft /quoteright /quotedblleft /quotedblright /bullet
/endash /emdash /asciitilde /trademark /scaron
/guilsinglright /oe /bullet /zcaron /Ydieresis
/space /exclamdown /cent /sterling /currency
/yen /brokenbar /section /dieresis /copyright
/ordfeminine /guillemotleft /logicalnot /sfthyphen /registered
/macron /degree /plusminus /twosuperior /threesuperior
/acute /mu /paragraph /middot /cedilla
/onesuperior /ordmasculine /guillemotright /onequarter /onehalf
/threequarters /questiondown /Agrave /Aacute /Acircumflex
/Atilde /Adieresis /Aring /AE /Ccedilla
/Egrave /Eacute /Ecircumflex /Edieresis /Igrave
/Iacute /Icircumflex /Idieresis /Eth /Ntilde
/Ograve /Oacute /Ocircumflex /Otilde /Odieresis
/multiply /Oslash /Ugrave /Uacute /Ucircumflex
/Udieresis /Yacute /Thorn /germandbls /agrave
/aacute /acircumflex /atilde /adieresis /aring
/ae /ccedilla /egrave /eacute /ecircumflex
/edieresis /igrave /iacute /icircumflex /idieresis
/eth /ntilde /ograve /oacute /ocircumflex
/otilde /odieresis /divide /oslash /ugrave
/uacute /ucircumflex /udieresis /yacute /thorn
/ydieresis
] def
%%EndResource
%FOPBeginFontReencode
/Courier-Bold findfont
dup length dict begin
  {1 index /FID ne {def} {pop pop} ifelse} forall
  /Encoding WinAnsiEncoding def
  currentdict
end
/Courier-Bold exch definefont pop
/Helvetica findfont
dup length dict begin
  {1 index /FID ne {def} {pop pop} ifelse} forall
  /Encoding WinAnsiEncoding def
  currentdict
end
/Helvetica exch definefont pop
/Courier-BoldOblique findfont
dup length dict begin
  {1 index /FID ne {def} {pop pop} ifelse} forall
  /Encoding WinAnsiEncoding def
  currentdict
end
/Courier-BoldOblique exch definefont pop
/Courier-Oblique findfont
dup length dict begin
  {1 index /FID ne {def} {pop pop} ifelse} forall
  /Encoding WinAnsiEncoding def
  currentdict
end
/Courier-Oblique exch definefont pop
/Times-Roman findfont
dup length dict begin
  {1 index /FID ne {def} {pop pop} ifelse} forall
  /Encoding WinAnsiEncoding def
  currentdict
end
/Times-Roman exch definefont pop
/Helvetica-BoldOblique findfont
dup length dict begin
  {1 index /FID ne {def} {pop pop} ifelse} forall
  /Encoding WinAnsiEncoding def
  currentdict
end
/Helvetica-BoldOblique exch definefont pop
/Helvetica-Bold findfont
dup length dict begin
  {1 index /FID ne {def} {pop pop} ifelse} forall
  /Encoding WinAnsiEncoding def
  currentdict
end
/Helvetica-Bold exch definefont pop
/Helvetica-Oblique findfont
dup length dict begin
  {1 index /FID ne {def} {pop pop} ifelse} forall
  /Encoding WinAnsiEncoding def
  currentdict
end
/Helvetica-Oblique exch definefont pop
/Times-BoldItalic findfont
dup length dict begin
  {1 index /FID ne {def} {pop pop} ifelse} forall
  /Encoding WinAnsiEncoding def
  currentdict
end
/Times-BoldItalic exch definefont pop
/Courier findfont
dup length dict begin
  {1 index /FID ne {def} {pop pop} ifelse} forall
  /Encoding WinAnsiEncoding def
  currentdict
end
/Courier exch definefont pop
/Times-Italic findfont
dup length dict begin
  {1 index /FID ne {def} {pop pop} ifelse} forall
  /Encoding WinAnsiEncoding def
  currentdict
end
/Times-Italic exch definefont pop
/Times-Bold findfont
dup length dict begin
  {1 index /FID ne {def} {pop pop} ifelse} forall
  /Encoding WinAnsiEncoding def
  currentdict
end
/Times-Bold exch definefont pop
%FOPEndFontReencode
%%EndProlog
%%Page: 1 1
%%PageBoundingBox: 0 0 714 522
%%BeginPageSetup
[1 0 0 -1 0 522] CT
%%EndPageSetup
GS
[0.55814 0 0 0.55814 0 0.13953] CT
1 GC
N
0 0 1280 935 re
f
GR
GS
[0.55814 0 0 0.55814 0 0.13953] CT
1 GC
N
0 0 1280 935 re
f
GR
GS
[0.55814 0 0 0.55814 0 0.13953] CT
1 GC
N
166 832 M
1158 832 L
1158 70 L
166 70 L
cp
f
GR
GS
[0.55814 0 0 0.55814 0 0.13953] CT
0.873 GC
2 setlinecap
10.0 ML
N
166 832 M
166 70 L
S
GR
GS
[0.55814 0 0 0.55814 0 0.13953] CT
0.873 GC
2 setlinecap
10.0 ML
N
331.333 832 M
331.333 70 L
S
GR
GS
[0.55814 0 0 0.55814 0 0.13953] CT
0.873 GC
2 setlinecap
10.0 ML
N
496.667 832 M
496.667 70 L
S
GR
GS
[0.55814 0 0 0.55814 0 0.13953] CT
0.873 GC
2 setlinecap
10.0 ML
N
662 832 M
662 70 L
S
GR
GS
[0.55814 0 0 0.55814 0 0.13953] CT
0.873 GC
2 setlinecap
10.0 ML
N
827.333 832 M
827.333 70 L
S
GR
GS
[0.55814 0 0 0.55814 0 0.13953] CT
0.873 GC
2 setlinecap
10.0 ML
N
992.667 832 M
992.667 70 L
S
GR
GS
[0.55814 0 0 0.55814 0 0.13953] CT
0.873 GC
2 setlinecap
10.0 ML
N
1158 832 M
1158 70 L
S
GR
GS
[0.55814 0 0 0.55814 0 0.13953] CT
0.873 GC
2 setlinecap
10.0 ML
N
1158 832 M
166 832 L
S
GR
GS
[0.55814 0 0 0.55814 0 0.13953] CT
0.873 GC
2 setlinecap
10.0 ML
N
1158 723.143 M
166 723.143 L
S
GR
GS
[0.55814 0 0 0.55814 0 0.13953] CT
0.873 GC
2 setlinecap
10.0 ML
N
1158 614.286 M
166 614.286 L
S
GR
GS
[0.55814 0 0 0.55814 0 0.13953] CT
0.873 GC
2 setlinecap
10.0 ML
N
1158 505.429 M
166 505.429 L
S
GR
GS
[0.55814 0 0 0.55814 0 0.13953] CT
0.873 GC
2 setlinecap
10.0 ML
N
1158 396.571 M
166 396.571 L
S
GR
GS
[0.55814 0 0 0.55814 0 0.13953] CT
0.873 GC
2 setlinecap
10.0 ML
N
1158 287.714 M
166 287.714 L
S
GR
GS
[0.55814 0 0 0.55814 0 0.13953] CT
0.873 GC
2 setlinecap
10.0 ML
N
1158 178.857 M
166 178.857 L
S
GR
GS
[0.55814 0 0 0.55814 0 0.13953] CT
0.873 GC
2 setlinecap
10.0 ML
N
1158 70 M
166 70 L
S
GR
GS
[0.55814 0 0 0.55814 369.48863 482.34883] CT
0.149 GC
/Helvetica 20 F
GS
[1 0 0 1 0 0] CT
-5 21 moveto 
1 -1 scale
(x) t 
GR
GR
GS
[0.55814 0 0 0.55814 0 0.13953] CT
0.149 GC
2 setlinecap
10.0 ML
N
166 832 M
1158 832 L
S
GR
GS
[0.55814 0 0 0.55814 0 0.13953] CT
0.149 GC
2 setlinecap
10.0 ML
N
166 70 M
1158 70 L
S
GR
GS
[0.55814 0 0 0.55814 0 0.13953] CT
0.149 GC
2 setlinecap
10.0 ML
N
166 832 M
166 822.08 L
S
GR
GS
[0.55814 0 0 0.55814 0 0.13953] CT
0.149 GC
2 setlinecap
10.0 ML
N
331.333 832 M
331.333 822.08 L
S
GR
GS
[0.55814 0 0 0.55814 0 0.13953] CT
0.149 GC
2 setlinecap
10.0 ML
N
496.667 832 M
496.667 822.08 L
S
GR
GS
[0.55814 0 0 0.55814 0 0.13953] CT
0.149 GC
2 setlinecap
10.0 ML
N
662 832 M
662 822.08 L
S
GR
GS
[0.55814 0 0 0.55814 0 0.13953] CT
0.149 GC
2 setlinecap
10.0 ML
N
827.333 832 M
827.333 822.08 L
S
GR
GS
[0.55814 0 0 0.55814 0 0.13953] CT
0.149 GC
2 setlinecap
10.0 ML
N
992.667 832 M
992.667 822.08 L
S
GR
GS
[0.55814 0 0 0.55814 0 0.13953] CT
0.149 GC
2 setlinecap
10.0 ML
N
1158 832 M
1158 822.08 L
S
GR
GS
[0.55814 0 0 0.55814 0 0.13953] CT
0.149 GC
2 setlinecap
10.0 ML
N
166 70 M
166 79.92 L
S
GR
GS
[0.55814 0 0 0.55814 0 0.13953] CT
0.149 GC
2 setlinecap
10.0 ML
N
331.333 70 M
331.333 79.92 L
S
GR
GS
[0.55814 0 0 0.55814 0 0.13953] CT
0.149 GC
2 setlinecap
10.0 ML
N
496.667 70 M
496.667 79.92 L
S
GR
GS
[0.55814 0 0 0.55814 0 0.13953] CT
0.149 GC
2 setlinecap
10.0 ML
N
662 70 M
662 79.92 L
S
GR
GS
[0.55814 0 0 0.55814 0 0.13953] CT
0.149 GC
2 setlinecap
10.0 ML
N
827.333 70 M
827.333 79.92 L
S
GR
GS
[0.55814 0 0 0.55814 0 0.13953] CT
0.149 GC
2 setlinecap
10.0 ML
N
992.667 70 M
992.667 79.92 L
S
GR
GS
[0.55814 0 0 0.55814 0 0.13953] CT
0.149 GC
2 setlinecap
10.0 ML
N
1158 70 M
1158 79.92 L
S
GR
GS
[0.55814 0 0 0.55814 92.65116 468.51164] CT
0.149 GC
/Helvetica 18 F
GS
[1 0 0 1 0 0] CT
-5.5 19 moveto 
1 -1 scale
(0) t 
GR
GR
GS
[0.55814 0 0 0.55814 184.93023 468.51164] CT
0.149 GC
/Helvetica 18 F
GS
[1 0 0 1 0 0] CT
-13 19 moveto 
1 -1 scale
(0.5) t 
GR
GR
GS
[0.55814 0 0 0.55814 277.20929 468.51164] CT
0.149 GC
/Helvetica 18 F
GS
[1 0 0 1 0 0] CT
-5.5 19 moveto 
1 -1 scale
(1) t 
GR
GR
GS
[0.55814 0 0 0.55814 369.48836 468.51164] CT
0.149 GC
/Helvetica 18 F
GS
[1 0 0 1 0 0] CT
-13 19 moveto 
1 -1 scale
(1.5) t 
GR
GR
GS
[0.55814 0 0 0.55814 461.76741 468.51164] CT
0.149 GC
/Helvetica 18 F
GS
[1 0 0 1 0 0] CT
-5.5 19 moveto 
1 -1 scale
(2) t 
GR
GR
GS
[0.55814 0 0 0.55814 554.0465 468.51164] CT
0.149 GC
/Helvetica 18 F
GS
[1 0 0 1 0 0] CT
-13 19 moveto 
1 -1 scale
(2.5) t 
GR
GR
GS
[0.55814 0 0 0.55814 646.32556 468.51164] CT
0.149 GC
/Helvetica 18 F
GS
[1 0 0 1 0 0] CT
-5.5 19 moveto 
1 -1 scale
(3) t 
GR
GR
GS
[0.55814 0 0 0.55814 0 0.13953] CT
0.149 GC
2 setlinecap
10.0 ML
N
166 832 M
166 70 L
S
GR
GS
[0.55814 0 0 0.55814 0 0.13953] CT
0.149 GC
2 setlinecap
10.0 ML
N
1158 832 M
1158 70 L
S
GR
GS
[0.55814 0 0 0.55814 0 0.13953] CT
0.149 GC
2 setlinecap
10.0 ML
N
166 832 M
175.92 832 L
S
GR
GS
[0.55814 0 0 0.55814 0 0.13953] CT
0.149 GC
2 setlinecap
10.0 ML
N
166 723.143 M
175.92 723.143 L
S
GR
GS
[0.55814 0 0 0.55814 0 0.13953] CT
0.149 GC
2 setlinecap
10.0 ML
N
166 614.286 M
175.92 614.286 L
S
GR
GS
[0.55814 0 0 0.55814 0 0.13953] CT
0.149 GC
2 setlinecap
10.0 ML
N
166 505.429 M
175.92 505.429 L
S
GR
GS
[0.55814 0 0 0.55814 0 0.13953] CT
0.149 GC
2 setlinecap
10.0 ML
N
166 396.571 M
175.92 396.571 L
S
GR
GS
[0.55814 0 0 0.55814 0 0.13953] CT
0.149 GC
2 setlinecap
10.0 ML
N
166 287.714 M
175.92 287.714 L
S
GR
GS
[0.55814 0 0 0.55814 0 0.13953] CT
0.149 GC
2 setlinecap
10.0 ML
N
166 178.857 M
175.92 178.857 L
S
GR
GS
[0.55814 0 0 0.55814 0 0.13953] CT
0.149 GC
2 setlinecap
10.0 ML
N
166 70 M
175.92 70 L
S
GR
GS
[0.55814 0 0 0.55814 0 0.13953] CT
0.149 GC
2 setlinecap
10.0 ML
N
1158 832 M
1148.08 832 L
S
GR
GS
[0.55814 0 0 0.55814 0 0.13953] CT
0.149 GC
2 setlinecap
10.0 ML
N
1158 723.143 M
1148.08 723.143 L
S
GR
GS
[0.55814 0 0 0.55814 0 0.13953] CT
0.149 GC
2 setlinecap
10.0 ML
N
1158 614.286 M
1148.08 614.286 L
S
GR
GS
[0.55814 0 0 0.55814 0 0.13953] CT
0.149 GC
2 setlinecap
10.0 ML
N
1158 505.429 M
1148.08 505.429 L
S
GR
GS
[0.55814 0 0 0.55814 0 0.13953] CT
0.149 GC
2 setlinecap
10.0 ML
N
1158 396.571 M
1148.08 396.571 L
S
GR
GS
[0.55814 0 0 0.55814 0 0.13953] CT
0.149 GC
2 setlinecap
10.0 ML
N
1158 287.714 M
1148.08 287.714 L
S
GR
GS
[0.55814 0 0 0.55814 0 0.13953] CT
0.149 GC
2 setlinecap
10.0 ML
N
1158 178.857 M
1148.08 178.857 L
S
GR
GS
[0.55814 0 0 0.55814 0 0.13953] CT
0.149 GC
2 setlinecap
10.0 ML
N
1158 70 M
1148.08 70 L
S
GR
GS
[0.55814 0 0 0.55814 88.65116 464.51163] CT
0.149 GC
/Helvetica 18 F
GS
[1 0 0 1 0 0] CT
-17 7.5 moveto 
1 -1 scale
(-3) t 
GR
GR
GS
[0.55814 0 0 0.55814 88.65116 403.75417] CT
0.149 GC
/Helvetica 18 F
GS
[1 0 0 1 0 0] CT
-17 7.5 moveto 
1 -1 scale
(-2) t 
GR
GR
GS
[0.55814 0 0 0.55814 88.65116 342.99667] CT
0.149 GC
/Helvetica 18 F
GS
[1 0 0 1 0 0] CT
-17 7.5 moveto 
1 -1 scale
(-1) t 
GR
GR
GS
[0.55814 0 0 0.55814 88.65116 282.23919] CT
0.149 GC
/Helvetica 18 F
GS
[1 0 0 1 0 0] CT
-11 7.5 moveto 
1 -1 scale
(0) t 
GR
GR
GS
[0.55814 0 0 0.55814 88.65116 221.48173] CT
0.149 GC
/Helvetica 18 F
GS
[1 0 0 1 0 0] CT
-11 7.5 moveto 
1 -1 scale
(1) t 
GR
GR
GS
[0.55814 0 0 0.55814 88.65116 160.72425] CT
0.149 GC
/Helvetica 18 F
GS
[1 0 0 1 0 0] CT
-11 7.5 moveto 
1 -1 scale
(2) t 
GR
GR
GS
[0.55814 0 0 0.55814 88.65116 99.96677] CT
0.149 GC
/Helvetica 18 F
GS
[1 0 0 1 0 0] CT
-11 7.5 moveto 
1 -1 scale
(3) t 
GR
GR
GS
[0.55814 0 0 0.55814 88.65116 39.20929] CT
0.149 GC
/Helvetica 18 F
GS
[1 0 0 1 0 0] CT
-11 7.5 moveto 
1 -1 scale
(4) t 
GR
GR
GS
[0.55814 0 0 0.55814 0 0.13953] CT
0 0.447 0.741 RC
2 LJ
N
166 723.361 M
167.984 720.109 L
169.968 716.888 L
171.952 713.698 L
173.936 710.539 L
175.92 707.411 L
177.904 704.314 L
179.888 701.247 L
181.872 698.211 L
183.856 695.204 L
185.84 692.228 L
187.824 689.282 L
189.808 686.366 L
191.792 683.479 L
193.776 680.622 L
195.76 677.794 L
199.728 672.226 L
201.712 669.485 L
205.68 664.091 L
209.648 658.81 L
213.616 653.643 L
217.584 648.587 L
221.552 643.642 L
225.52 638.807 L
229.488 634.08 L
233.456 629.461 L
237.424 624.948 L
241.392 620.54 L
245.36 616.236 L
249.328 612.035 L
253.296 607.935 L
257.264 603.936 L
261.232 600.037 L
265.2 596.236 L
269.168 592.532 L
273.136 588.925 L
277.104 585.412 L
281.072 581.993 L
289.008 575.432 L
292.976 572.288 L
300.912 566.267 L
304.88 563.387 L
312.816 557.885 L
316.784 555.26 L
324.72 550.256 L
332.656 545.573 L
340.592 541.203 L
348.528 537.135 L
356.464 533.362 L
364.4 529.874 L
S
GR
GS
[0.55814 0 0 0.55814 0 0.13953] CT
0 0.447 0.741 RC
2 LJ
N
364.4 529.874 M
372.336 526.661 L
380.272 523.716 L
388.208 521.029 L
396.144 518.59 L
404.08 516.392 L
412.016 514.424 L
419.952 512.678 L
427.888 511.145 L
435.824 509.816 L
443.76 508.681 L
451.696 507.733 L
459.632 506.961 L
467.568 506.356 L
475.504 505.91 L
483.44 505.614 L
499.312 505.435 L
507.248 505.533 L
523.12 506.062 L
538.992 506.972 L
554.864 508.191 L
570.736 509.648 L
602.48 512.985 L
665.968 519.327 L
673.904 519.913 L
689.776 520.847 L
705.648 521.404 L
713.584 521.519 L
729.456 521.375 L
737.392 521.099 L
745.328 520.675 L
753.264 520.093 L
761.2 519.345 L
769.136 518.421 L
777.072 517.313 L
785.008 516.011 L
792.944 514.507 L
800.88 512.792 L
808.816 510.855 L
816.752 508.689 L
824.688 506.285 L
832.624 503.632 L
840.56 500.724 L
848.496 497.549 L
856.432 494.099 L
864.368 490.366 L
872.304 486.34 L
880.24 482.012 L
888.176 477.374 L
896.112 472.415 L
S
GR
GS
[0.55814 0 0 0.55814 0 0.13953] CT
0 0.447 0.741 RC
2 LJ
N
896.112 472.415 M
904.048 467.127 L
911.984 461.502 L
919.92 455.529 L
927.856 449.201 L
935.792 442.507 L
943.728 435.439 L
951.664 427.988 L
959.6 420.146 L
967.536 411.901 L
975.472 403.247 L
983.408 394.174 L
991.344 384.672 L
999.28 374.733 L
1007.216 364.347 L
1015.152 353.507 L
1023.088 342.202 L
1031.024 330.423 L
1038.96 318.162 L
1046.896 305.41 L
1054.832 292.157 L
1062.768 278.395 L
1070.704 264.114 L
1078.64 249.305 L
1086.576 233.96 L
1094.512 218.07 L
1102.448 201.624 L
1110.384 184.615 L
1118.32 167.033 L
1126.256 148.87 L
1134.192 130.116 L
1142.128 110.761 L
1150.064 90.799 L
1158 70.218 L
S
GR
GS
[0.55814 0 0 0.55814 306.41859 34.74418] CT
/Helvetica-Bold 20 F
GS
[1 0 0 1 0 0] CT
0 0 moveto 
1 -1 scale
(x) t 
GR
GR
GS
[0.55814 0 0 0.55814 313.11627 29.72092] CT
/Helvetica-Bold 14 F
GS
[1 0 0 1 0 0] CT
0 0 moveto 
1 -1 scale
(3) t 
GR
GR
GS
[0.55814 0 0 0.55814 317.58138 34.74418] CT
/Helvetica-Bold 20 F
GS
[1 0 0 1 0 0] CT
0 0 moveto 
1 -1 scale
(-4.001x) t 
GR
GR
GS
[0.55814 0 0 0.55814 355.53487 29.72092] CT
/Helvetica-Bold 14 F
GS
[1 0 0 1 0 0] CT
0 0 moveto 
1 -1 scale
(2) t 
GR
GR
GS
[0.55814 0 0 0.55814 359.99999 34.74418] CT
/Helvetica-Bold 20 F
GS
[1 0 0 1 0 0] CT
0 0 moveto 
1 -1 scale
(+5.003x-2.002) t 
GR
GR
%%Trailer
%%Pages: 1
%%EOF
