%!PS-Adobe-3.0 EPSF-3.0
%%Creator: (MATLAB, The Mathworks, Inc. Version 8.5.0.197613 \(R2015a\). Operating System: Windows 7)
%%Title: C:/Users/Shurshurik/Desktop/matlab_student/5/figure2.eps
%%CreationDate: 2018-12-03T11:55:02
%%Pages: (atend)
%%BoundingBox: 0 0 420 315
%%LanguageLevel: 2
%%EndComments
%%BeginProlog
%%BeginResource: procset (Apache XML Graphics Std ProcSet) 1.2 0
%%Version: 1.2 0
%%Copyright: (Copyright 2001-2003,2010 The Apache Software Foundation. License terms: http://www.apache.org/licenses/LICENSE-2.0)
/bd{bind def}bind def
/ld{load def}bd
/GR/grestore ld
/M/moveto ld
/LJ/setlinejoin ld
/C/curveto ld
/f/fill ld
/LW/setlinewidth ld
/GC/setgray ld
/t/show ld
/N/newpath ld
/CT/concat ld
/cp/closepath ld
/S/stroke ld
/L/lineto ld
/CC/setcmykcolor ld
/A/ashow ld
/GS/gsave ld
/RC/setrgbcolor ld
/RM/rmoveto ld
/ML/setmiterlimit ld
/re {4 2 roll M
1 index 0 rlineto
0 exch rlineto
neg 0 rlineto
cp } bd
/_ctm matrix def
/_tm matrix def
/BT { _ctm currentmatrix pop matrix _tm copy pop 0 0 moveto } bd
/ET { _ctm setmatrix } bd
/iTm { _ctm setmatrix _tm concat } bd
/Tm { _tm astore pop iTm 0 0 moveto } bd
/ux 0.0 def
/uy 0.0 def
/F {
  /Tp exch def
  /Tf exch def
  Tf findfont Tp scalefont setfont
  /cf Tf def  /cs Tp def
} bd
/ULS {currentpoint /uy exch def /ux exch def} bd
/ULE {
  /Tcx currentpoint pop def
  gsave
  newpath
  cf findfont cs scalefont dup
  /FontMatrix get 0 get /Ts exch def /FontInfo get dup
  /UnderlinePosition get Ts mul /To exch def
  /UnderlineThickness get Ts mul /Tt exch def
  ux uy To add moveto  Tcx uy To add lineto
  Tt setlinewidth stroke
  grestore
} bd
/OLE {
  /Tcx currentpoint pop def
  gsave
  newpath
  cf findfont cs scalefont dup
  /FontMatrix get 0 get /Ts exch def /FontInfo get dup
  /UnderlinePosition get Ts mul /To exch def
  /UnderlineThickness get Ts mul /Tt exch def
  ux uy To add cs add moveto Tcx uy To add cs add lineto
  Tt setlinewidth stroke
  grestore
} bd
/SOE {
  /Tcx currentpoint pop def
  gsave
  newpath
  cf findfont cs scalefont dup
  /FontMatrix get 0 get /Ts exch def /FontInfo get dup
  /UnderlinePosition get Ts mul /To exch def
  /UnderlineThickness get Ts mul /Tt exch def
  ux uy To add cs 10 mul 26 idiv add moveto Tcx uy To add cs 10 mul 26 idiv add lineto
  Tt setlinewidth stroke
  grestore
} bd
/QT {
/Y22 exch store
/X22 exch store
/Y21 exch store
/X21 exch store
currentpoint
/Y21 load 2 mul add 3 div exch
/X21 load 2 mul add 3 div exch
/X21 load 2 mul /X22 load add 3 div
/Y21 load 2 mul /Y22 load add 3 div
/X22 load /Y22 load curveto
} bd
/SSPD {
dup length /d exch dict def
{
/v exch def
/k exch def
currentpagedevice k known {
/cpdv currentpagedevice k get def
v cpdv ne {
/upd false def
/nullv v type /nulltype eq def
/nullcpdv cpdv type /nulltype eq def
nullv nullcpdv or
{
/upd true def
} {
/sametype v type cpdv type eq def
sametype {
v type /arraytype eq {
/vlen v length def
/cpdvlen cpdv length def
vlen cpdvlen eq {
0 1 vlen 1 sub {
/i exch def
/obj v i get def
/cpdobj cpdv i get def
obj cpdobj ne {
/upd true def
exit
} if
} for
} {
/upd true def
} ifelse
} {
v type /dicttype eq {
v {
/dv exch def
/dk exch def
/cpddv cpdv dk get def
dv cpddv ne {
/upd true def
exit
} if
} forall
} {
/upd true def
} ifelse
} ifelse
} if
} ifelse
upd true eq {
d k v put
} if
} if
} if
} forall
d length 0 gt {
d setpagedevice
} if
} bd
%%EndResource
%%BeginResource: procset (Apache XML Graphics EPS ProcSet) 1.0 0
%%Version: 1.0 0
%%Copyright: (Copyright 2002-2003 The Apache Software Foundation. License terms: http://www.apache.org/licenses/LICENSE-2.0)
/BeginEPSF { %def
/b4_Inc_state save def         % Save state for cleanup
/dict_count countdictstack def % Count objects on dict stack
/op_count count 1 sub def      % Count objects on operand stack
userdict begin                 % Push userdict on dict stack
/showpage { } def              % Redefine showpage, { } = null proc
0 setgray 0 setlinecap         % Prepare graphics state
1 setlinewidth 0 setlinejoin
10 setmiterlimit [ ] 0 setdash newpath
/languagelevel where           % If level not equal to 1 then
{pop languagelevel             % set strokeadjust and
1 ne                           % overprint to their defaults.
{false setstrokeadjust false setoverprint
} if
} if
} bd
/EndEPSF { %def
count op_count sub {pop} repeat            % Clean up stacks
countdictstack dict_count sub {end} repeat
b4_Inc_state restore
} bd
%%EndResource
%FOPBeginFontDict
%%IncludeResource: font Courier-Bold
%%IncludeResource: font Helvetica
%%IncludeResource: font Courier-BoldOblique
%%IncludeResource: font Courier-Oblique
%%IncludeResource: font Times-Roman
%%IncludeResource: font Helvetica-BoldOblique
%%IncludeResource: font Helvetica-Bold
%%IncludeResource: font Helvetica-Oblique
%%IncludeResource: font Times-BoldItalic
%%IncludeResource: font Courier
%%IncludeResource: font Times-Italic
%%IncludeResource: font Times-Bold
%%IncludeResource: font Symbol
%%IncludeResource: font ZapfDingbats
%FOPEndFontDict
%%BeginResource: encoding WinAnsiEncoding
/WinAnsiEncoding [
/.notdef /.notdef /.notdef /.notdef /.notdef
/.notdef /.notdef /.notdef /.notdef /.notdef
/.notdef /.notdef /.notdef /.notdef /.notdef
/.notdef /.notdef /.notdef /.notdef /.notdef
/.notdef /.notdef /.notdef /.notdef /.notdef
/.notdef /.notdef /.notdef /.notdef /.notdef
/.notdef /.notdef /space /exclam /quotedbl
/numbersign /dollar /percent /ampersand /quotesingle
/parenleft /parenright /asterisk /plus /comma
/hyphen /period /slash /zero /one
/two /three /four /five /six
/seven /eight /nine /colon /semicolon
/less /equal /greater /question /at
/A /B /C /D /E
/F /G /H /I /J
/K /L /M /N /O
/P /Q /R /S /T
/U /V /W /X /Y
/Z /bracketleft /backslash /bracketright /asciicircum
/underscore /quoteleft /a /b /c
/d /e /f /g /h
/i /j /k /l /m
/n /o /p /q /r
/s /t /u /v /w
/x /y /z /braceleft /bar
/braceright /asciitilde /bullet /Euro /bullet
/quotesinglbase /florin /quotedblbase /ellipsis /dagger
/daggerdbl /circumflex /perthousand /Scaron /guilsinglleft
/OE /bullet /Zcaron /bullet /bullet
/quoteleft /quoteright /quotedblleft /quotedblright /bullet
/endash /emdash /asciitilde /trademark /scaron
/guilsinglright /oe /bullet /zcaron /Ydieresis
/space /exclamdown /cent /sterling /currency
/yen /brokenbar /section /dieresis /copyright
/ordfeminine /guillemotleft /logicalnot /sfthyphen /registered
/macron /degree /plusminus /twosuperior /threesuperior
/acute /mu /paragraph /middot /cedilla
/onesuperior /ordmasculine /guillemotright /onequarter /onehalf
/threequarters /questiondown /Agrave /Aacute /Acircumflex
/Atilde /Adieresis /Aring /AE /Ccedilla
/Egrave /Eacute /Ecircumflex /Edieresis /Igrave
/Iacute /Icircumflex /Idieresis /Eth /Ntilde
/Ograve /Oacute /Ocircumflex /Otilde /Odieresis
/multiply /Oslash /Ugrave /Uacute /Ucircumflex
/Udieresis /Yacute /Thorn /germandbls /agrave
/aacute /acircumflex /atilde /adieresis /aring
/ae /ccedilla /egrave /eacute /ecircumflex
/edieresis /igrave /iacute /icircumflex /idieresis
/eth /ntilde /ograve /oacute /ocircumflex
/otilde /odieresis /divide /oslash /ugrave
/uacute /ucircumflex /udieresis /yacute /thorn
/ydieresis
] def
%%EndResource
%FOPBeginFontReencode
/Courier-Bold findfont
dup length dict begin
  {1 index /FID ne {def} {pop pop} ifelse} forall
  /Encoding WinAnsiEncoding def
  currentdict
end
/Courier-Bold exch definefont pop
/Helvetica findfont
dup length dict begin
  {1 index /FID ne {def} {pop pop} ifelse} forall
  /Encoding WinAnsiEncoding def
  currentdict
end
/Helvetica exch definefont pop
/Courier-BoldOblique findfont
dup length dict begin
  {1 index /FID ne {def} {pop pop} ifelse} forall
  /Encoding WinAnsiEncoding def
  currentdict
end
/Courier-BoldOblique exch definefont pop
/Courier-Oblique findfont
dup length dict begin
  {1 index /FID ne {def} {pop pop} ifelse} forall
  /Encoding WinAnsiEncoding def
  currentdict
end
/Courier-Oblique exch definefont pop
/Times-Roman findfont
dup length dict begin
  {1 index /FID ne {def} {pop pop} ifelse} forall
  /Encoding WinAnsiEncoding def
  currentdict
end
/Times-Roman exch definefont pop
/Helvetica-BoldOblique findfont
dup length dict begin
  {1 index /FID ne {def} {pop pop} ifelse} forall
  /Encoding WinAnsiEncoding def
  currentdict
end
/Helvetica-BoldOblique exch definefont pop
/Helvetica-Bold findfont
dup length dict begin
  {1 index /FID ne {def} {pop pop} ifelse} forall
  /Encoding WinAnsiEncoding def
  currentdict
end
/Helvetica-Bold exch definefont pop
/Helvetica-Oblique findfont
dup length dict begin
  {1 index /FID ne {def} {pop pop} ifelse} forall
  /Encoding WinAnsiEncoding def
  currentdict
end
/Helvetica-Oblique exch definefont pop
/Times-BoldItalic findfont
dup length dict begin
  {1 index /FID ne {def} {pop pop} ifelse} forall
  /Encoding WinAnsiEncoding def
  currentdict
end
/Times-BoldItalic exch definefont pop
/Courier findfont
dup length dict begin
  {1 index /FID ne {def} {pop pop} ifelse} forall
  /Encoding WinAnsiEncoding def
  currentdict
end
/Courier exch definefont pop
/Times-Italic findfont
dup length dict begin
  {1 index /FID ne {def} {pop pop} ifelse} forall
  /Encoding WinAnsiEncoding def
  currentdict
end
/Times-Italic exch definefont pop
/Times-Bold findfont
dup length dict begin
  {1 index /FID ne {def} {pop pop} ifelse} forall
  /Encoding WinAnsiEncoding def
  currentdict
end
/Times-Bold exch definefont pop
%FOPEndFontReencode
%%EndProlog
%%Page: 1 1
%%PageBoundingBox: 0 0 420 315
%%BeginPageSetup
[1 0 0 -1 0 315] CT
%%EndPageSetup
GS
[0.55814 0 0 0.55814 0 0.20929] CT
N
0 0 M
752 0 L
752 564 L
0 564 L
0 0 L
cp
clip
1 GC
N
0 0 752 564 re
f
GR
GS
[0.55814 0 0 0.55814 0 0.20929] CT
1 GC
N
0 0 752 564 re
f
GR
GS
[0.55814 0 0 0.55814 0 0.20929] CT
1 GC
N
98 502 M
681 502 L
681 42 L
98 42 L
cp
f
GR
GS
[0.55814 0 0 0.55814 0 0.20929] CT
0.873 GC
2 setlinecap
10.0 ML
N
98 502 M
98 42 L
S
GR
GS
[0.55814 0 0 0.55814 0 0.20929] CT
0.873 GC
2 setlinecap
10.0 ML
N
243.75 502 M
243.75 42 L
S
GR
GS
[0.55814 0 0 0.55814 0 0.20929] CT
0.873 GC
2 setlinecap
10.0 ML
N
389.5 502 M
389.5 42 L
S
GR
GS
[0.55814 0 0 0.55814 0 0.20929] CT
0.873 GC
2 setlinecap
10.0 ML
N
535.25 502 M
535.25 42 L
S
GR
GS
[0.55814 0 0 0.55814 0 0.20929] CT
0.873 GC
2 setlinecap
10.0 ML
N
681 502 M
681 42 L
S
GR
GS
[0.55814 0 0 0.55814 0 0.20929] CT
0.873 GC
2 setlinecap
10.0 ML
N
681 502 M
98 502 L
S
GR
GS
[0.55814 0 0 0.55814 0 0.20929] CT
0.873 GC
2 setlinecap
10.0 ML
N
681 425.333 M
98 425.333 L
S
GR
GS
[0.55814 0 0 0.55814 0 0.20929] CT
0.873 GC
2 setlinecap
10.0 ML
N
681 348.667 M
98 348.667 L
S
GR
GS
[0.55814 0 0 0.55814 0 0.20929] CT
0.873 GC
2 setlinecap
10.0 ML
N
681 272 M
98 272 L
S
GR
GS
[0.55814 0 0 0.55814 0 0.20929] CT
0.873 GC
2 setlinecap
10.0 ML
N
681 195.333 M
98 195.333 L
S
GR
GS
[0.55814 0 0 0.55814 0 0.20929] CT
0.873 GC
2 setlinecap
10.0 ML
N
681 118.667 M
98 118.667 L
S
GR
GS
[0.55814 0 0 0.55814 0 0.20929] CT
0.873 GC
2 setlinecap
10.0 ML
N
681 42 M
98 42 L
S
GR
GS
[0.55814 0 0 0.55814 217.3955 298.23255] CT
0.149 GC
/Helvetica 20 F
GS
[1 0 0 1 0 0] CT
-3 21 moveto 
1 -1 scale
(t) t 
GR
GR
GS
[0.55814 0 0 0.55814 0 0.20929] CT
0.149 GC
2 setlinecap
10.0 ML
N
98 502 M
681 502 L
S
GR
GS
[0.55814 0 0 0.55814 0 0.20929] CT
0.149 GC
2 setlinecap
10.0 ML
N
98 42 M
681 42 L
S
GR
GS
[0.55814 0 0 0.55814 0 0.20929] CT
0.149 GC
2 setlinecap
10.0 ML
N
98 502 M
98 496.17 L
S
GR
GS
[0.55814 0 0 0.55814 0 0.20929] CT
0.149 GC
2 setlinecap
10.0 ML
N
243.75 502 M
243.75 496.17 L
S
GR
GS
[0.55814 0 0 0.55814 0 0.20929] CT
0.149 GC
2 setlinecap
10.0 ML
N
389.5 502 M
389.5 496.17 L
S
GR
GS
[0.55814 0 0 0.55814 0 0.20929] CT
0.149 GC
2 setlinecap
10.0 ML
N
535.25 502 M
535.25 496.17 L
S
GR
GS
[0.55814 0 0 0.55814 0 0.20929] CT
0.149 GC
2 setlinecap
10.0 ML
N
681 502 M
681 496.17 L
S
GR
GS
[0.55814 0 0 0.55814 0 0.20929] CT
0.149 GC
2 setlinecap
10.0 ML
N
98 42 M
98 47.83 L
S
GR
GS
[0.55814 0 0 0.55814 0 0.20929] CT
0.149 GC
2 setlinecap
10.0 ML
N
243.75 42 M
243.75 47.83 L
S
GR
GS
[0.55814 0 0 0.55814 0 0.20929] CT
0.149 GC
2 setlinecap
10.0 ML
N
389.5 42 M
389.5 47.83 L
S
GR
GS
[0.55814 0 0 0.55814 0 0.20929] CT
0.149 GC
2 setlinecap
10.0 ML
N
535.25 42 M
535.25 47.83 L
S
GR
GS
[0.55814 0 0 0.55814 0 0.20929] CT
0.149 GC
2 setlinecap
10.0 ML
N
681 42 M
681 47.83 L
S
GR
GS
[0.55814 0 0 0.55814 54.69767 284.39534] CT
0.149 GC
/Helvetica 18 F
GS
[1 0 0 1 0 0] CT
-5.5 19 moveto 
1 -1 scale
(0) t 
GR
GR
GS
[0.55814 0 0 0.55814 136.04651 284.39534] CT
0.149 GC
/Helvetica 18 F
GS
[1 0 0 1 0 0] CT
-5.5 19 moveto 
1 -1 scale
(5) t 
GR
GR
GS
[0.55814 0 0 0.55814 217.39534 284.39534] CT
0.149 GC
/Helvetica 18 F
GS
[1 0 0 1 0 0] CT
-10.5 19 moveto 
1 -1 scale
(10) t 
GR
GR
GS
[0.55814 0 0 0.55814 298.74418 284.39534] CT
0.149 GC
/Helvetica 18 F
GS
[1 0 0 1 0 0] CT
-10.5 19 moveto 
1 -1 scale
(15) t 
GR
GR
GS
[0.55814 0 0 0.55814 380.09301 284.39534] CT
0.149 GC
/Helvetica 18 F
GS
[1 0 0 1 0 0] CT
-10.5 19 moveto 
1 -1 scale
(20) t 
GR
GR
GS
[0 -0.55814 0.55814 0 22.32558 160.39534] CT
0.149 GC
/Helvetica 20 F
GS
[1 0 0 1 0 0] CT
0 0 moveto 
1 -1 scale
(S) t 
GR
GR
GS
[0 -0.55814 0.55814 0 27.34884 152.58139] CT
0.149 GC
/Helvetica 14 F
GS
[1 0 0 1 0 0] CT
0 0 moveto 
1 -1 scale
(15) t 
GR
GR
GS
[0.55814 0 0 0.55814 0 0.20929] CT
0.149 GC
2 setlinecap
10.0 ML
N
98 502 M
98 42 L
S
GR
GS
[0.55814 0 0 0.55814 0 0.20929] CT
0.149 GC
2 setlinecap
10.0 ML
N
681 502 M
681 42 L
S
GR
GS
[0.55814 0 0 0.55814 0 0.20929] CT
0.149 GC
2 setlinecap
10.0 ML
N
98 502 M
103.83 502 L
S
GR
GS
[0.55814 0 0 0.55814 0 0.20929] CT
0.149 GC
2 setlinecap
10.0 ML
N
98 425.333 M
103.83 425.333 L
S
GR
GS
[0.55814 0 0 0.55814 0 0.20929] CT
0.149 GC
2 setlinecap
10.0 ML
N
98 348.667 M
103.83 348.667 L
S
GR
GS
[0.55814 0 0 0.55814 0 0.20929] CT
0.149 GC
2 setlinecap
10.0 ML
N
98 272 M
103.83 272 L
S
GR
GS
[0.55814 0 0 0.55814 0 0.20929] CT
0.149 GC
2 setlinecap
10.0 ML
N
98 195.333 M
103.83 195.333 L
S
GR
GS
[0.55814 0 0 0.55814 0 0.20929] CT
0.149 GC
2 setlinecap
10.0 ML
N
98 118.667 M
103.83 118.667 L
S
GR
GS
[0.55814 0 0 0.55814 0 0.20929] CT
0.149 GC
2 setlinecap
10.0 ML
N
98 42 M
103.83 42 L
S
GR
GS
[0.55814 0 0 0.55814 0 0.20929] CT
0.149 GC
2 setlinecap
10.0 ML
N
681 502 M
675.17 502 L
S
GR
GS
[0.55814 0 0 0.55814 0 0.20929] CT
0.149 GC
2 setlinecap
10.0 ML
N
681 425.333 M
675.17 425.333 L
S
GR
GS
[0.55814 0 0 0.55814 0 0.20929] CT
0.149 GC
2 setlinecap
10.0 ML
N
681 348.667 M
675.17 348.667 L
S
GR
GS
[0.55814 0 0 0.55814 0 0.20929] CT
0.149 GC
2 setlinecap
10.0 ML
N
681 272 M
675.17 272 L
S
GR
GS
[0.55814 0 0 0.55814 0 0.20929] CT
0.149 GC
2 setlinecap
10.0 ML
N
681 195.333 M
675.17 195.333 L
S
GR
GS
[0.55814 0 0 0.55814 0 0.20929] CT
0.149 GC
2 setlinecap
10.0 ML
N
681 118.667 M
675.17 118.667 L
S
GR
GS
[0.55814 0 0 0.55814 0 0.20929] CT
0.149 GC
2 setlinecap
10.0 ML
N
681 42 M
675.17 42 L
S
GR
GS
[0.55814 0 0 0.55814 50.69767 280.39535] CT
0.149 GC
/Helvetica 18 F
GS
[1 0 0 1 0 0] CT
-32 7.5 moveto 
1 -1 scale
(-1.5) t 
GR
GR
GS
[0.55814 0 0 0.55814 50.69767 237.60465] CT
0.149 GC
/Helvetica 18 F
GS
[1 0 0 1 0 0] CT
-17 7.5 moveto 
1 -1 scale
(-1) t 
GR
GR
GS
[0.55814 0 0 0.55814 50.69767 194.81394] CT
0.149 GC
/Helvetica 18 F
GS
[1 0 0 1 0 0] CT
-32 7.5 moveto 
1 -1 scale
(-0.5) t 
GR
GR
GS
[0.55814 0 0 0.55814 50.69767 152.02325] CT
0.149 GC
/Helvetica 18 F
GS
[1 0 0 1 0 0] CT
-11 7.5 moveto 
1 -1 scale
(0) t 
GR
GR
GS
[0.55814 0 0 0.55814 50.69767 109.23255] CT
0.149 GC
/Helvetica 18 F
GS
[1 0 0 1 0 0] CT
-26 7.5 moveto 
1 -1 scale
(0.5) t 
GR
GR
GS
[0.55814 0 0 0.55814 50.69767 66.44185] CT
0.149 GC
/Helvetica 18 F
GS
[1 0 0 1 0 0] CT
-11 7.5 moveto 
1 -1 scale
(1) t 
GR
GR
GS
[0.55814 0 0 0.55814 50.69767 23.65115] CT
0.149 GC
/Helvetica 18 F
GS
[1 0 0 1 0 0] CT
-26 7.5 moveto 
1 -1 scale
(1.5) t 
GR
GR
GS
[0.55814 0 0 0.55814 0 0.20929] CT
0 0.447 0.741 RC
2 LJ
N
98 272 M
98.611 211.995 L
99.221 159.588 L
99.832 120.646 L
100.442 98.036 L
101.053 91.166 L
101.663 96.428 L
102.274 108.369 L
102.884 121.243 L
103.495 130.481 L
104.105 133.681 L
104.716 130.874 L
105.326 124.071 L
105.937 116.297 L
106.547 110.447 L
107.158 108.346 L
107.768 110.275 L
108.379 115.069 L
108.989 120.682 L
109.6 124.997 L
110.21 126.574 L
110.821 125.092 L
111.431 121.36 L
112.042 116.93 L
112.652 113.481 L
113.263 112.207 L
113.873 113.421 L
114.484 116.505 L
115.094 120.198 L
115.705 123.096 L
116.315 124.174 L
116.926 123.136 L
117.537 120.484 L
118.147 117.289 L
118.758 114.766 L
119.368 113.822 L
119.979 114.737 L
120.589 117.086 L
121.2 119.93 L
121.81 122.186 L
122.421 123.033 L
123.031 122.207 L
123.642 120.078 L
124.252 117.49 L
124.863 115.43 L
125.473 114.654 L
126.084 115.414 L
126.694 117.38 L
127.305 119.778 L
127.915 121.694 L
S
GR
GS
[0.55814 0 0 0.55814 0 0.20929] CT
0 0.447 0.741 RC
2 LJ
N
127.915 121.694 M
128.526 122.417 L
129.136 121.705 L
129.747 119.86 L
130.357 117.603 L
130.968 115.795 L
131.578 115.11 L
132.189 115.787 L
132.799 117.543 L
133.41 119.697 L
134.02 121.427 L
134.631 122.083 L
135.241 121.433 L
135.852 119.739 L
136.463 117.657 L
137.073 115.981 L
137.684 115.344 L
138.294 115.978 L
138.905 117.631 L
139.515 119.667 L
140.126 121.309 L
140.736 121.935 L
141.347 121.311 L
141.957 119.679 L
142.568 117.666 L
143.178 116.038 L
143.789 115.416 L
144.399 116.038 L
145.01 117.666 L
145.62 119.679 L
146.231 121.311 L
146.841 121.935 L
147.452 121.309 L
148.062 119.667 L
148.673 117.631 L
149.283 115.978 L
149.894 115.344 L
150.504 115.981 L
151.115 117.657 L
151.725 119.739 L
152.336 121.433 L
152.946 122.083 L
153.557 121.427 L
154.167 119.697 L
154.778 117.543 L
155.389 115.787 L
155.999 115.11 L
156.61 115.795 L
157.22 117.603 L
157.831 119.86 L
S
GR
GS
[0.55814 0 0 0.55814 0 0.20929] CT
0 0.447 0.741 RC
2 LJ
N
157.831 119.86 M
158.441 121.705 L
159.052 122.417 L
159.662 121.694 L
160.273 119.778 L
160.883 117.38 L
161.494 115.414 L
162.104 114.654 L
162.715 115.43 L
163.325 117.49 L
163.936 120.078 L
164.546 122.207 L
165.157 123.033 L
165.767 122.186 L
166.378 119.93 L
166.988 117.086 L
167.599 114.737 L
168.209 113.822 L
168.82 114.766 L
169.43 117.289 L
170.041 120.484 L
170.651 123.136 L
171.262 124.174 L
171.872 123.096 L
172.483 120.198 L
173.093 116.505 L
173.704 113.421 L
174.315 112.207 L
174.925 113.481 L
175.536 116.93 L
176.146 121.36 L
176.757 125.092 L
177.367 126.574 L
177.978 124.997 L
178.588 120.682 L
179.199 115.069 L
179.809 110.275 L
180.42 108.346 L
181.03 110.447 L
181.641 116.297 L
182.251 124.071 L
182.862 130.874 L
183.472 133.681 L
184.083 130.481 L
184.693 121.243 L
185.304 108.369 L
185.914 96.428 L
186.525 91.166 L
187.135 98.036 L
187.746 120.646 L
S
GR
GS
[0.55814 0 0 0.55814 0 0.20929] CT
0 0.447 0.741 RC
2 LJ
N
187.746 120.646 M
188.356 159.588 L
188.967 211.995 L
189.577 272 L
190.188 332.005 L
190.798 384.412 L
191.409 423.354 L
192.019 445.964 L
192.63 452.834 L
193.241 447.572 L
193.851 435.631 L
194.462 422.757 L
195.072 413.519 L
195.683 410.319 L
196.293 413.126 L
196.904 419.929 L
197.514 427.703 L
198.125 433.553 L
198.735 435.654 L
199.346 433.725 L
199.956 428.931 L
200.567 423.318 L
201.177 419.003 L
201.788 417.426 L
202.398 418.908 L
203.009 422.64 L
203.619 427.07 L
204.23 430.519 L
204.84 431.793 L
205.451 430.579 L
206.061 427.495 L
206.672 423.802 L
207.282 420.904 L
207.893 419.826 L
208.503 420.864 L
209.114 423.516 L
209.724 426.711 L
210.335 429.234 L
210.945 430.178 L
211.556 429.263 L
212.167 426.914 L
212.777 424.07 L
213.388 421.814 L
213.998 420.967 L
214.609 421.793 L
215.219 423.922 L
215.83 426.51 L
216.44 428.57 L
217.051 429.346 L
217.661 428.586 L
S
GR
GS
[0.55814 0 0 0.55814 0 0.20929] CT
0 0.447 0.741 RC
2 LJ
N
217.661 428.586 M
218.272 426.62 L
218.882 424.222 L
219.493 422.306 L
220.103 421.583 L
220.714 422.295 L
221.324 424.14 L
221.935 426.397 L
222.545 428.205 L
223.156 428.89 L
223.766 428.213 L
224.377 426.457 L
224.987 424.303 L
225.598 422.573 L
226.208 421.917 L
226.819 422.567 L
227.429 424.261 L
228.04 426.343 L
228.65 428.019 L
229.261 428.656 L
229.871 428.022 L
230.482 426.37 L
231.093 424.333 L
231.703 422.691 L
232.314 422.065 L
232.924 422.689 L
233.535 424.32 L
234.145 426.334 L
234.756 427.962 L
235.366 428.584 L
235.977 427.962 L
236.587 426.334 L
237.198 424.32 L
237.808 422.689 L
238.419 422.065 L
239.029 422.691 L
239.64 424.333 L
240.25 426.37 L
240.861 428.022 L
241.471 428.656 L
242.082 428.019 L
242.692 426.343 L
243.303 424.261 L
243.913 422.567 L
244.524 421.917 L
245.134 422.573 L
245.745 424.303 L
246.355 426.457 L
246.966 428.213 L
247.576 428.89 L
S
GR
GS
[0.55814 0 0 0.55814 0 0.20929] CT
0 0.447 0.741 RC
2 LJ
N
247.576 428.89 M
248.187 428.205 L
248.797 426.397 L
249.408 424.14 L
250.019 422.295 L
250.629 421.583 L
251.24 422.306 L
251.85 424.222 L
252.461 426.62 L
253.071 428.586 L
253.682 429.346 L
254.292 428.57 L
254.903 426.51 L
255.513 423.922 L
256.124 421.793 L
256.734 420.967 L
257.345 421.814 L
257.955 424.07 L
258.566 426.914 L
259.176 429.263 L
259.787 430.178 L
260.397 429.234 L
261.008 426.711 L
261.618 423.516 L
262.229 420.864 L
262.839 419.826 L
263.45 420.904 L
264.06 423.802 L
264.671 427.495 L
265.281 430.579 L
265.892 431.793 L
266.502 430.519 L
267.113 427.07 L
267.723 422.64 L
268.334 418.908 L
268.945 417.426 L
269.555 419.003 L
270.166 423.318 L
270.776 428.931 L
271.387 433.725 L
271.997 435.654 L
272.608 433.553 L
273.218 427.703 L
273.829 419.929 L
274.439 413.126 L
275.05 410.319 L
275.66 413.519 L
276.271 422.757 L
276.881 435.631 L
277.492 447.572 L
S
GR
GS
[0.55814 0 0 0.55814 0 0.20929] CT
0 0.447 0.741 RC
2 LJ
N
277.492 447.572 M
278.102 452.834 L
278.713 445.964 L
279.323 423.354 L
279.934 384.412 L
280.544 332.005 L
281.155 272 L
281.765 211.995 L
282.376 159.588 L
282.986 120.646 L
283.597 98.036 L
284.207 91.166 L
284.818 96.428 L
285.428 108.369 L
286.039 121.243 L
286.65 130.481 L
287.26 133.681 L
287.871 130.874 L
288.481 124.071 L
289.092 116.297 L
289.702 110.447 L
290.313 108.346 L
290.923 110.275 L
291.534 115.069 L
292.144 120.682 L
292.755 124.997 L
293.365 126.574 L
293.976 125.092 L
294.586 121.36 L
295.197 116.93 L
295.807 113.481 L
296.418 112.207 L
297.028 113.421 L
297.639 116.505 L
298.249 120.198 L
298.86 123.096 L
299.47 124.174 L
300.081 123.136 L
300.691 120.484 L
301.302 117.289 L
301.912 114.766 L
302.523 113.822 L
303.133 114.737 L
303.744 117.086 L
304.354 119.93 L
304.965 122.186 L
305.576 123.033 L
306.186 122.207 L
306.797 120.078 L
307.407 117.49 L
S
GR
GS
[0.55814 0 0 0.55814 0 0.20929] CT
0 0.447 0.741 RC
2 LJ
N
307.407 117.49 M
308.018 115.43 L
308.628 114.654 L
309.239 115.414 L
309.849 117.38 L
310.46 119.778 L
311.07 121.694 L
311.681 122.417 L
312.291 121.705 L
312.902 119.86 L
313.512 117.603 L
314.123 115.795 L
314.733 115.11 L
315.344 115.787 L
315.954 117.543 L
316.565 119.697 L
317.175 121.427 L
317.786 122.083 L
318.396 121.433 L
319.007 119.739 L
319.617 117.657 L
320.228 115.981 L
320.838 115.344 L
321.449 115.978 L
322.059 117.631 L
322.67 119.667 L
323.28 121.309 L
323.891 121.935 L
324.501 121.311 L
325.112 119.679 L
325.723 117.666 L
326.333 116.038 L
326.944 115.416 L
327.554 116.038 L
328.165 117.666 L
328.775 119.679 L
329.386 121.311 L
329.996 121.935 L
330.607 121.309 L
331.217 119.667 L
331.828 117.631 L
332.438 115.978 L
333.049 115.344 L
333.659 115.981 L
334.27 117.657 L
334.88 119.739 L
335.491 121.433 L
336.101 122.083 L
336.712 121.427 L
337.322 119.697 L
S
GR
GS
[0.55814 0 0 0.55814 0 0.20929] CT
0 0.447 0.741 RC
2 LJ
N
337.322 119.697 M
337.933 117.543 L
338.543 115.787 L
339.154 115.11 L
339.764 115.795 L
340.375 117.603 L
340.985 119.86 L
341.596 121.705 L
342.206 122.417 L
342.817 121.694 L
343.427 119.778 L
344.038 117.38 L
344.649 115.414 L
345.259 114.654 L
345.87 115.43 L
346.48 117.49 L
347.091 120.078 L
347.701 122.207 L
348.312 123.033 L
348.922 122.186 L
349.533 119.93 L
350.143 117.086 L
350.754 114.737 L
351.364 113.822 L
351.975 114.766 L
352.585 117.289 L
353.196 120.484 L
353.806 123.136 L
354.417 124.174 L
355.027 123.096 L
355.638 120.198 L
356.248 116.505 L
356.859 113.421 L
357.469 112.207 L
358.08 113.481 L
358.69 116.93 L
359.301 121.36 L
359.911 125.092 L
360.522 126.574 L
361.132 124.997 L
361.743 120.682 L
362.353 115.069 L
362.964 110.275 L
363.575 108.346 L
364.185 110.447 L
364.796 116.297 L
365.406 124.071 L
366.017 130.874 L
366.627 133.681 L
367.238 130.481 L
S
GR
GS
[0.55814 0 0 0.55814 0 0.20929] CT
0 0.447 0.741 RC
2 LJ
N
367.238 130.481 M
367.848 121.243 L
368.459 108.369 L
369.069 96.428 L
369.68 91.166 L
370.29 98.036 L
370.901 120.646 L
371.511 159.588 L
372.122 211.995 L
372.732 272 L
373.343 332.005 L
373.953 384.412 L
374.564 423.354 L
375.174 445.964 L
375.785 452.834 L
376.395 447.572 L
377.006 435.631 L
377.616 422.757 L
378.227 413.519 L
378.837 410.319 L
379.448 413.126 L
380.058 419.929 L
380.669 427.703 L
381.28 433.553 L
381.89 435.654 L
382.501 433.725 L
383.111 428.931 L
383.722 423.318 L
384.332 419.003 L
384.943 417.426 L
385.553 418.908 L
386.164 422.64 L
386.774 427.07 L
387.385 430.519 L
387.995 431.793 L
388.606 430.579 L
389.216 427.495 L
389.827 423.802 L
390.437 420.904 L
391.048 419.826 L
391.658 420.864 L
392.269 423.516 L
392.879 426.711 L
393.49 429.234 L
394.1 430.178 L
394.711 429.263 L
395.321 426.914 L
395.932 424.07 L
396.542 421.814 L
397.153 420.967 L
S
GR
GS
[0.55814 0 0 0.55814 0 0.20929] CT
0 0.447 0.741 RC
2 LJ
N
397.153 420.967 M
397.763 421.793 L
398.374 423.922 L
398.984 426.51 L
399.595 428.57 L
400.206 429.346 L
400.816 428.586 L
401.427 426.62 L
402.037 424.222 L
402.648 422.306 L
403.258 421.583 L
403.869 422.295 L
404.479 424.14 L
405.09 426.397 L
405.7 428.205 L
406.311 428.89 L
406.921 428.213 L
407.532 426.457 L
408.142 424.303 L
408.753 422.573 L
409.363 421.917 L
409.974 422.567 L
410.584 424.261 L
411.195 426.343 L
411.805 428.019 L
412.416 428.656 L
413.026 428.022 L
413.637 426.37 L
414.247 424.333 L
414.858 422.691 L
415.468 422.065 L
416.079 422.689 L
416.689 424.32 L
417.3 426.334 L
417.91 427.962 L
418.521 428.584 L
419.132 427.962 L
419.742 426.334 L
420.353 424.32 L
420.963 422.689 L
421.574 422.065 L
422.184 422.691 L
422.795 424.333 L
423.405 426.37 L
424.016 428.022 L
424.626 428.656 L
425.237 428.019 L
425.847 426.343 L
426.458 424.261 L
427.068 422.567 L
S
GR
GS
[0.55814 0 0 0.55814 0 0.20929] CT
0 0.447 0.741 RC
2 LJ
N
427.068 422.567 M
427.679 421.917 L
428.289 422.573 L
428.9 424.303 L
429.51 426.457 L
430.121 428.213 L
430.731 428.89 L
431.342 428.205 L
431.952 426.397 L
432.563 424.14 L
433.173 422.295 L
433.784 421.583 L
434.394 422.306 L
435.005 424.222 L
435.615 426.62 L
436.226 428.586 L
436.836 429.346 L
437.447 428.57 L
438.058 426.51 L
438.668 423.922 L
439.279 421.793 L
439.889 420.967 L
440.5 421.814 L
441.11 424.07 L
441.721 426.914 L
442.331 429.263 L
442.942 430.178 L
443.552 429.234 L
444.163 426.711 L
444.773 423.516 L
445.384 420.864 L
445.994 419.826 L
446.605 420.904 L
447.215 423.802 L
447.826 427.495 L
448.436 430.579 L
449.047 431.793 L
449.657 430.519 L
450.268 427.07 L
450.878 422.64 L
451.489 418.908 L
452.099 417.426 L
452.71 419.003 L
453.32 423.318 L
453.931 428.931 L
454.541 433.725 L
455.152 435.654 L
455.762 433.553 L
456.373 427.703 L
456.984 419.929 L
S
GR
GS
[0.55814 0 0 0.55814 0 0.20929] CT
0 0.447 0.741 RC
2 LJ
N
456.984 419.929 M
457.594 413.126 L
458.205 410.319 L
458.815 413.519 L
459.426 422.757 L
460.036 435.631 L
460.647 447.572 L
461.257 452.834 L
461.868 445.964 L
462.478 423.354 L
463.089 384.412 L
463.699 332.005 L
464.31 272 L
464.92 211.995 L
465.531 159.588 L
466.141 120.646 L
466.752 98.036 L
467.362 91.166 L
467.973 96.428 L
468.583 108.369 L
469.194 121.243 L
469.804 130.481 L
470.415 133.681 L
471.025 130.874 L
471.636 124.071 L
472.246 116.297 L
472.857 110.447 L
473.467 108.346 L
474.078 110.275 L
474.688 115.069 L
475.299 120.682 L
475.91 124.997 L
476.52 126.574 L
477.131 125.092 L
477.741 121.36 L
478.352 116.93 L
478.962 113.481 L
479.573 112.207 L
480.183 113.421 L
480.794 116.505 L
481.404 120.198 L
482.015 123.096 L
482.625 124.174 L
483.236 123.136 L
483.846 120.484 L
484.457 117.289 L
485.067 114.766 L
485.678 113.822 L
486.288 114.737 L
486.899 117.086 L
S
GR
GS
[0.55814 0 0 0.55814 0 0.20929] CT
0 0.447 0.741 RC
2 LJ
N
486.899 117.086 M
487.509 119.93 L
488.12 122.186 L
488.73 123.033 L
489.341 122.207 L
489.951 120.078 L
490.562 117.49 L
491.172 115.43 L
491.783 114.654 L
492.393 115.414 L
493.004 117.38 L
493.614 119.778 L
494.225 121.694 L
494.836 122.417 L
495.446 121.705 L
496.057 119.86 L
496.667 117.603 L
497.278 115.795 L
497.888 115.11 L
498.499 115.787 L
499.109 117.543 L
499.72 119.697 L
500.33 121.427 L
500.941 122.083 L
501.551 121.433 L
502.162 119.739 L
502.772 117.657 L
503.383 115.981 L
503.993 115.344 L
504.604 115.978 L
505.214 117.631 L
505.825 119.667 L
506.435 121.309 L
507.046 121.935 L
507.656 121.311 L
508.267 119.679 L
508.877 117.666 L
509.488 116.038 L
510.098 115.416 L
510.709 116.038 L
511.319 117.666 L
511.93 119.679 L
512.54 121.311 L
513.151 121.935 L
513.762 121.309 L
514.372 119.667 L
514.983 117.631 L
515.593 115.978 L
516.204 115.344 L
516.814 115.981 L
S
GR
GS
[0.55814 0 0 0.55814 0 0.20929] CT
0 0.447 0.741 RC
2 LJ
N
516.814 115.981 M
517.425 117.657 L
518.035 119.739 L
518.646 121.433 L
519.256 122.083 L
519.867 121.427 L
520.477 119.697 L
521.088 117.543 L
521.698 115.787 L
522.309 115.11 L
522.919 115.795 L
523.53 117.603 L
524.14 119.86 L
524.751 121.705 L
525.361 122.417 L
525.972 121.694 L
526.582 119.778 L
527.193 117.38 L
527.803 115.414 L
528.414 114.654 L
529.024 115.43 L
529.635 117.49 L
530.245 120.078 L
530.856 122.207 L
531.466 123.033 L
532.077 122.186 L
532.688 119.93 L
533.298 117.086 L
533.909 114.737 L
534.519 113.822 L
535.13 114.766 L
535.74 117.289 L
536.351 120.484 L
536.961 123.136 L
537.572 124.174 L
538.182 123.096 L
538.793 120.198 L
539.403 116.505 L
540.014 113.421 L
540.624 112.207 L
541.235 113.481 L
541.845 116.93 L
542.456 121.36 L
543.066 125.092 L
543.677 126.574 L
544.287 124.997 L
544.898 120.682 L
545.508 115.069 L
546.119 110.275 L
546.729 108.346 L
S
GR
GS
[0.55814 0 0 0.55814 0 0.20929] CT
0 0.447 0.741 RC
2 LJ
N
546.729 108.346 M
547.34 110.447 L
547.95 116.297 L
548.561 124.071 L
549.171 130.874 L
549.782 133.681 L
550.392 130.481 L
551.003 121.243 L
551.614 108.369 L
552.224 96.428 L
552.835 91.166 L
553.445 98.036 L
554.056 120.646 L
554.666 159.588 L
555.277 211.995 L
555.887 272 L
556.498 332.005 L
557.108 384.412 L
557.719 423.354 L
558.329 445.964 L
558.94 452.834 L
559.55 447.572 L
560.161 435.631 L
560.771 422.757 L
561.382 413.519 L
561.992 410.319 L
562.603 413.126 L
563.213 419.929 L
563.824 427.703 L
564.434 433.553 L
565.045 435.654 L
565.655 433.725 L
566.266 428.931 L
566.876 423.318 L
567.487 419.003 L
568.097 417.426 L
568.708 418.908 L
569.318 422.64 L
569.929 427.07 L
570.54 430.519 L
571.15 431.793 L
571.761 430.579 L
572.371 427.495 L
572.982 423.802 L
573.592 420.904 L
574.203 419.826 L
574.813 420.864 L
575.424 423.516 L
576.034 426.711 L
576.645 429.234 L
S
GR
GS
[0.55814 0 0 0.55814 0 0.20929] CT
0 0.447 0.741 RC
2 LJ
N
576.645 429.234 M
577.255 430.178 L
577.866 429.263 L
578.476 426.914 L
579.087 424.07 L
579.697 421.814 L
580.308 420.967 L
580.918 421.793 L
581.529 423.922 L
582.139 426.51 L
582.75 428.57 L
583.36 429.346 L
583.971 428.586 L
584.581 426.62 L
585.192 424.222 L
585.802 422.306 L
586.413 421.583 L
587.023 422.295 L
587.634 424.14 L
588.245 426.397 L
588.855 428.205 L
589.466 428.89 L
590.076 428.213 L
590.687 426.457 L
591.297 424.303 L
591.908 422.573 L
592.518 421.917 L
593.129 422.567 L
593.739 424.261 L
594.35 426.343 L
594.96 428.019 L
595.571 428.656 L
596.181 428.022 L
596.792 426.37 L
597.402 424.333 L
598.013 422.691 L
598.623 422.065 L
599.234 422.689 L
599.844 424.32 L
600.455 426.334 L
601.065 427.962 L
601.676 428.584 L
602.286 427.962 L
602.897 426.334 L
603.507 424.32 L
604.118 422.689 L
604.728 422.065 L
605.339 422.691 L
605.949 424.333 L
606.56 426.37 L
S
GR
GS
[0.55814 0 0 0.55814 0 0.20929] CT
0 0.447 0.741 RC
2 LJ
N
606.56 426.37 M
607.17 428.022 L
607.781 428.656 L
608.392 428.019 L
609.002 426.343 L
609.613 424.261 L
610.223 422.567 L
610.834 421.917 L
611.444 422.573 L
612.055 424.303 L
612.665 426.457 L
613.276 428.213 L
613.886 428.89 L
614.497 428.205 L
615.107 426.397 L
615.718 424.14 L
616.328 422.295 L
616.939 421.583 L
617.549 422.306 L
618.16 424.222 L
618.77 426.62 L
619.381 428.586 L
619.991 429.346 L
620.602 428.57 L
621.212 426.51 L
621.823 423.922 L
622.433 421.793 L
623.044 420.967 L
623.654 421.814 L
624.265 424.07 L
624.875 426.914 L
625.486 429.263 L
626.096 430.178 L
626.707 429.234 L
627.318 426.711 L
627.928 423.516 L
628.539 420.864 L
629.149 419.826 L
629.76 420.904 L
630.37 423.802 L
630.981 427.495 L
631.591 430.579 L
632.202 431.793 L
632.812 430.519 L
633.423 427.07 L
634.033 422.64 L
634.644 418.908 L
635.254 417.426 L
635.865 419.003 L
636.475 423.318 L
S
GR
GS
[0.55814 0 0 0.55814 0 0.20929] CT
0 0.447 0.741 RC
2 LJ
N
636.475 423.318 M
637.086 428.931 L
637.696 433.725 L
638.307 435.654 L
638.917 433.553 L
639.528 427.703 L
640.138 419.929 L
640.749 413.126 L
641.359 410.319 L
641.97 413.519 L
642.58 422.757 L
643.191 435.631 L
643.801 447.572 L
644.412 452.834 L
645.022 445.964 L
645.633 423.354 L
646.244 384.412 L
646.854 332.005 L
647.465 272 L
S
GR
%%Trailer
%%Pages: 1
%%EOF
