%!PS-Adobe-3.0 EPSF-3.0
%%Creator: (MATLAB, The Mathworks, Inc. Version 8.5.0.197613 \(R2015a\). Operating System: Windows 7)
%%Title: C:/Users/Shurshurik/Desktop/matlab_student/3/fiure9.eps
%%CreationDate: 2018-11-20T11:36:58
%%Pages: (atend)
%%BoundingBox: 0 0 1072 525
%%LanguageLevel: 2
%%EndComments
%%BeginProlog
%%BeginResource: procset (Apache XML Graphics Std ProcSet) 1.2 0
%%Version: 1.2 0
%%Copyright: (Copyright 2001-2003,2010 The Apache Software Foundation. License terms: http://www.apache.org/licenses/LICENSE-2.0)
/bd{bind def}bind def
/ld{load def}bd
/GR/grestore ld
/M/moveto ld
/LJ/setlinejoin ld
/C/curveto ld
/f/fill ld
/LW/setlinewidth ld
/GC/setgray ld
/t/show ld
/N/newpath ld
/CT/concat ld
/cp/closepath ld
/S/stroke ld
/L/lineto ld
/CC/setcmykcolor ld
/A/ashow ld
/GS/gsave ld
/RC/setrgbcolor ld
/RM/rmoveto ld
/ML/setmiterlimit ld
/re {4 2 roll M
1 index 0 rlineto
0 exch rlineto
neg 0 rlineto
cp } bd
/_ctm matrix def
/_tm matrix def
/BT { _ctm currentmatrix pop matrix _tm copy pop 0 0 moveto } bd
/ET { _ctm setmatrix } bd
/iTm { _ctm setmatrix _tm concat } bd
/Tm { _tm astore pop iTm 0 0 moveto } bd
/ux 0.0 def
/uy 0.0 def
/F {
  /Tp exch def
  /Tf exch def
  Tf findfont Tp scalefont setfont
  /cf Tf def  /cs Tp def
} bd
/ULS {currentpoint /uy exch def /ux exch def} bd
/ULE {
  /Tcx currentpoint pop def
  gsave
  newpath
  cf findfont cs scalefont dup
  /FontMatrix get 0 get /Ts exch def /FontInfo get dup
  /UnderlinePosition get Ts mul /To exch def
  /UnderlineThickness get Ts mul /Tt exch def
  ux uy To add moveto  Tcx uy To add lineto
  Tt setlinewidth stroke
  grestore
} bd
/OLE {
  /Tcx currentpoint pop def
  gsave
  newpath
  cf findfont cs scalefont dup
  /FontMatrix get 0 get /Ts exch def /FontInfo get dup
  /UnderlinePosition get Ts mul /To exch def
  /UnderlineThickness get Ts mul /Tt exch def
  ux uy To add cs add moveto Tcx uy To add cs add lineto
  Tt setlinewidth stroke
  grestore
} bd
/SOE {
  /Tcx currentpoint pop def
  gsave
  newpath
  cf findfont cs scalefont dup
  /FontMatrix get 0 get /Ts exch def /FontInfo get dup
  /UnderlinePosition get Ts mul /To exch def
  /UnderlineThickness get Ts mul /Tt exch def
  ux uy To add cs 10 mul 26 idiv add moveto Tcx uy To add cs 10 mul 26 idiv add lineto
  Tt setlinewidth stroke
  grestore
} bd
/QT {
/Y22 exch store
/X22 exch store
/Y21 exch store
/X21 exch store
currentpoint
/Y21 load 2 mul add 3 div exch
/X21 load 2 mul add 3 div exch
/X21 load 2 mul /X22 load add 3 div
/Y21 load 2 mul /Y22 load add 3 div
/X22 load /Y22 load curveto
} bd
/SSPD {
dup length /d exch dict def
{
/v exch def
/k exch def
currentpagedevice k known {
/cpdv currentpagedevice k get def
v cpdv ne {
/upd false def
/nullv v type /nulltype eq def
/nullcpdv cpdv type /nulltype eq def
nullv nullcpdv or
{
/upd true def
} {
/sametype v type cpdv type eq def
sametype {
v type /arraytype eq {
/vlen v length def
/cpdvlen cpdv length def
vlen cpdvlen eq {
0 1 vlen 1 sub {
/i exch def
/obj v i get def
/cpdobj cpdv i get def
obj cpdobj ne {
/upd true def
exit
} if
} for
} {
/upd true def
} ifelse
} {
v type /dicttype eq {
v {
/dv exch def
/dk exch def
/cpddv cpdv dk get def
dv cpddv ne {
/upd true def
exit
} if
} forall
} {
/upd true def
} ifelse
} ifelse
} if
} ifelse
upd true eq {
d k v put
} if
} if
} if
} forall
d length 0 gt {
d setpagedevice
} if
} bd
%%EndResource
%%BeginResource: procset (Apache XML Graphics EPS ProcSet) 1.0 0
%%Version: 1.0 0
%%Copyright: (Copyright 2002-2003 The Apache Software Foundation. License terms: http://www.apache.org/licenses/LICENSE-2.0)
/BeginEPSF { %def
/b4_Inc_state save def         % Save state for cleanup
/dict_count countdictstack def % Count objects on dict stack
/op_count count 1 sub def      % Count objects on operand stack
userdict begin                 % Push userdict on dict stack
/showpage { } def              % Redefine showpage, { } = null proc
0 setgray 0 setlinecap         % Prepare graphics state
1 setlinewidth 0 setlinejoin
10 setmiterlimit [ ] 0 setdash newpath
/languagelevel where           % If level not equal to 1 then
{pop languagelevel             % set strokeadjust and
1 ne                           % overprint to their defaults.
{false setstrokeadjust false setoverprint
} if
} if
} bd
/EndEPSF { %def
count op_count sub {pop} repeat            % Clean up stacks
countdictstack dict_count sub {end} repeat
b4_Inc_state restore
} bd
%%EndResource
%FOPBeginFontDict
%%IncludeResource: font Courier-Bold
%%IncludeResource: font Helvetica
%%IncludeResource: font Courier-BoldOblique
%%IncludeResource: font Courier-Oblique
%%IncludeResource: font Times-Roman
%%IncludeResource: font Helvetica-BoldOblique
%%IncludeResource: font Helvetica-Bold
%%IncludeResource: font Helvetica-Oblique
%%IncludeResource: font Times-BoldItalic
%%IncludeResource: font Courier
%%IncludeResource: font Times-Italic
%%IncludeResource: font Times-Bold
%%IncludeResource: font Symbol
%%IncludeResource: font ZapfDingbats
%FOPEndFontDict
%%BeginResource: encoding WinAnsiEncoding
/WinAnsiEncoding [
/.notdef /.notdef /.notdef /.notdef /.notdef
/.notdef /.notdef /.notdef /.notdef /.notdef
/.notdef /.notdef /.notdef /.notdef /.notdef
/.notdef /.notdef /.notdef /.notdef /.notdef
/.notdef /.notdef /.notdef /.notdef /.notdef
/.notdef /.notdef /.notdef /.notdef /.notdef
/.notdef /.notdef /space /exclam /quotedbl
/numbersign /dollar /percent /ampersand /quotesingle
/parenleft /parenright /asterisk /plus /comma
/hyphen /period /slash /zero /one
/two /three /four /five /six
/seven /eight /nine /colon /semicolon
/less /equal /greater /question /at
/A /B /C /D /E
/F /G /H /I /J
/K /L /M /N /O
/P /Q /R /S /T
/U /V /W /X /Y
/Z /bracketleft /backslash /bracketright /asciicircum
/underscore /quoteleft /a /b /c
/d /e /f /g /h
/i /j /k /l /m
/n /o /p /q /r
/s /t /u /v /w
/x /y /z /braceleft /bar
/braceright /asciitilde /bullet /Euro /bullet
/quotesinglbase /florin /quotedblbase /ellipsis /dagger
/daggerdbl /circumflex /perthousand /Scaron /guilsinglleft
/OE /bullet /Zcaron /bullet /bullet
/quoteleft /quoteright /quotedblleft /quotedblright /bullet
/endash /emdash /asciitilde /trademark /scaron
/guilsinglright /oe /bullet /zcaron /Ydieresis
/space /exclamdown /cent /sterling /currency
/yen /brokenbar /section /dieresis /copyright
/ordfeminine /guillemotleft /logicalnot /sfthyphen /registered
/macron /degree /plusminus /twosuperior /threesuperior
/acute /mu /paragraph /middot /cedilla
/onesuperior /ordmasculine /guillemotright /onequarter /onehalf
/threequarters /questiondown /Agrave /Aacute /Acircumflex
/Atilde /Adieresis /Aring /AE /Ccedilla
/Egrave /Eacute /Ecircumflex /Edieresis /Igrave
/Iacute /Icircumflex /Idieresis /Eth /Ntilde
/Ograve /Oacute /Ocircumflex /Otilde /Odieresis
/multiply /Oslash /Ugrave /Uacute /Ucircumflex
/Udieresis /Yacute /Thorn /germandbls /agrave
/aacute /acircumflex /atilde /adieresis /aring
/ae /ccedilla /egrave /eacute /ecircumflex
/edieresis /igrave /iacute /icircumflex /idieresis
/eth /ntilde /ograve /oacute /ocircumflex
/otilde /odieresis /divide /oslash /ugrave
/uacute /ucircumflex /udieresis /yacute /thorn
/ydieresis
] def
%%EndResource
%FOPBeginFontReencode
/Courier-Bold findfont
dup length dict begin
  {1 index /FID ne {def} {pop pop} ifelse} forall
  /Encoding WinAnsiEncoding def
  currentdict
end
/Courier-Bold exch definefont pop
/Helvetica findfont
dup length dict begin
  {1 index /FID ne {def} {pop pop} ifelse} forall
  /Encoding WinAnsiEncoding def
  currentdict
end
/Helvetica exch definefont pop
/Courier-BoldOblique findfont
dup length dict begin
  {1 index /FID ne {def} {pop pop} ifelse} forall
  /Encoding WinAnsiEncoding def
  currentdict
end
/Courier-BoldOblique exch definefont pop
/Courier-Oblique findfont
dup length dict begin
  {1 index /FID ne {def} {pop pop} ifelse} forall
  /Encoding WinAnsiEncoding def
  currentdict
end
/Courier-Oblique exch definefont pop
/Times-Roman findfont
dup length dict begin
  {1 index /FID ne {def} {pop pop} ifelse} forall
  /Encoding WinAnsiEncoding def
  currentdict
end
/Times-Roman exch definefont pop
/Helvetica-BoldOblique findfont
dup length dict begin
  {1 index /FID ne {def} {pop pop} ifelse} forall
  /Encoding WinAnsiEncoding def
  currentdict
end
/Helvetica-BoldOblique exch definefont pop
/Helvetica-Bold findfont
dup length dict begin
  {1 index /FID ne {def} {pop pop} ifelse} forall
  /Encoding WinAnsiEncoding def
  currentdict
end
/Helvetica-Bold exch definefont pop
/Helvetica-Oblique findfont
dup length dict begin
  {1 index /FID ne {def} {pop pop} ifelse} forall
  /Encoding WinAnsiEncoding def
  currentdict
end
/Helvetica-Oblique exch definefont pop
/Times-BoldItalic findfont
dup length dict begin
  {1 index /FID ne {def} {pop pop} ifelse} forall
  /Encoding WinAnsiEncoding def
  currentdict
end
/Times-BoldItalic exch definefont pop
/Courier findfont
dup length dict begin
  {1 index /FID ne {def} {pop pop} ifelse} forall
  /Encoding WinAnsiEncoding def
  currentdict
end
/Courier exch definefont pop
/Times-Italic findfont
dup length dict begin
  {1 index /FID ne {def} {pop pop} ifelse} forall
  /Encoding WinAnsiEncoding def
  currentdict
end
/Times-Italic exch definefont pop
/Times-Bold findfont
dup length dict begin
  {1 index /FID ne {def} {pop pop} ifelse} forall
  /Encoding WinAnsiEncoding def
  currentdict
end
/Times-Bold exch definefont pop
%FOPEndFontReencode
%%EndProlog
%%Page: 1 1
%%PageBoundingBox: 0 0 1072 525
%%BeginPageSetup
[1 0 0 -1 0 525] CT
%%EndPageSetup
GS
[0.55814 0 0 0.55814 0 0.34882] CT
1 GC
N
0 0 1920 940 re
f
GR
GS
[0.55814 0 0 0.55814 0 0.34882] CT
1 GC
N
0 0 1920 940 re
f
GR
GS
[0.55814 0 0 0.55814 0 0.34882] CT
1 GC
N
250 391 M
1738 391 L
1738 70 L
250 70 L
cp
f
GR
GS
[0.55814 0 0 0.55814 0 0.34882] CT
0.873 GC
2 setlinecap
10.0 ML
N
250 391 M
250 70 L
S
GR
GS
[0.55814 0 0 0.55814 0 0.34882] CT
0.873 GC
2 setlinecap
10.0 ML
N
746 391 M
746 70 L
S
GR
GS
[0.55814 0 0 0.55814 0 0.34882] CT
0.873 GC
2 setlinecap
10.0 ML
N
1242 391 M
1242 70 L
S
GR
GS
[0.55814 0 0 0.55814 0 0.34882] CT
0.873 GC
2 setlinecap
10.0 ML
N
1738 391 M
1738 70 L
S
GR
GS
[0.55814 0 0 0.55814 0 0.34882] CT
0.873 GC
2 setlinecap
10.0 ML
N
1738 391 M
250 391 L
S
GR
GS
[0.55814 0 0 0.55814 0 0.34882] CT
0.873 GC
2 setlinecap
10.0 ML
N
1738 345.143 M
250 345.143 L
S
GR
GS
[0.55814 0 0 0.55814 0 0.34882] CT
0.873 GC
2 setlinecap
10.0 ML
N
1738 299.286 M
250 299.286 L
S
GR
GS
[0.55814 0 0 0.55814 0 0.34882] CT
0.873 GC
2 setlinecap
10.0 ML
N
1738 253.429 M
250 253.429 L
S
GR
GS
[0.55814 0 0 0.55814 0 0.34882] CT
0.873 GC
2 setlinecap
10.0 ML
N
1738 207.571 M
250 207.571 L
S
GR
GS
[0.55814 0 0 0.55814 0 0.34882] CT
0.873 GC
2 setlinecap
10.0 ML
N
1738 161.714 M
250 161.714 L
S
GR
GS
[0.55814 0 0 0.55814 0 0.34882] CT
0.873 GC
2 setlinecap
10.0 ML
N
1738 115.857 M
250 115.857 L
S
GR
GS
[0.55814 0 0 0.55814 0 0.34882] CT
0.873 GC
2 setlinecap
10.0 ML
N
1738 70 M
250 70 L
S
GR
GS
[0.55814 0 0 0.55814 554.79112 236.4186] CT
0.149 GC
/Helvetica 20 F
GS
[1 0 0 1 0 0] CT
-11 21 moveto 
1 -1 scale
(t,s) t 
GR
GR
GS
[0.55814 0 0 0.55814 0 0.34882] CT
0.149 GC
2 setlinecap
10.0 ML
N
250 391 M
1738 391 L
S
GR
GS
[0.55814 0 0 0.55814 0 0.34882] CT
0.149 GC
2 setlinecap
10.0 ML
N
250 70 M
1738 70 L
S
GR
GS
[0.55814 0 0 0.55814 0 0.34882] CT
0.149 GC
2 setlinecap
10.0 ML
N
250 391 M
250 376.12 L
S
GR
GS
[0.55814 0 0 0.55814 0 0.34882] CT
0.149 GC
2 setlinecap
10.0 ML
N
746 391 M
746 376.12 L
S
GR
GS
[0.55814 0 0 0.55814 0 0.34882] CT
0.149 GC
2 setlinecap
10.0 ML
N
1242 391 M
1242 376.12 L
S
GR
GS
[0.55814 0 0 0.55814 0 0.34882] CT
0.149 GC
2 setlinecap
10.0 ML
N
1738 391 M
1738 376.12 L
S
GR
GS
[0.55814 0 0 0.55814 0 0.34882] CT
0.149 GC
2 setlinecap
10.0 ML
N
250 70 M
250 84.88 L
S
GR
GS
[0.55814 0 0 0.55814 0 0.34882] CT
0.149 GC
2 setlinecap
10.0 ML
N
746 70 M
746 84.88 L
S
GR
GS
[0.55814 0 0 0.55814 0 0.34882] CT
0.149 GC
2 setlinecap
10.0 ML
N
1242 70 M
1242 84.88 L
S
GR
GS
[0.55814 0 0 0.55814 0 0.34882] CT
0.149 GC
2 setlinecap
10.0 ML
N
1738 70 M
1738 84.88 L
S
GR
GS
[0.55814 0 0 0.55814 139.53489 222.58138] CT
0.149 GC
/Helvetica 18 F
GS
[1 0 0 1 0 0] CT
-5.5 19 moveto 
1 -1 scale
(0) t 
GR
GR
GS
[0.55814 0 0 0.55814 416.3721 222.58138] CT
0.149 GC
/Helvetica 18 F
GS
[1 0 0 1 0 0] CT
-5.5 19 moveto 
1 -1 scale
(5) t 
GR
GR
GS
[0.55814 0 0 0.55814 693.20932 222.58138] CT
0.149 GC
/Helvetica 18 F
GS
[1 0 0 1 0 0] CT
-10.5 19 moveto 
1 -1 scale
(10) t 
GR
GR
GS
[0.55814 0 0 0.55814 970.04653 222.58138] CT
0.149 GC
/Helvetica 18 F
GS
[1 0 0 1 0 0] CT
-10.5 19 moveto 
1 -1 scale
(15) t 
GR
GR
GS
[0.55814 0 0 0.55814 0 0.34882] CT
0.149 GC
2 setlinecap
10.0 ML
N
250 391 M
250 70 L
S
GR
GS
[0.55814 0 0 0.55814 0 0.34882] CT
0.149 GC
2 setlinecap
10.0 ML
N
1738 391 M
1738 70 L
S
GR
GS
[0.55814 0 0 0.55814 0 0.34882] CT
0.149 GC
2 setlinecap
10.0 ML
N
250 391 M
264.88 391 L
S
GR
GS
[0.55814 0 0 0.55814 0 0.34882] CT
0.149 GC
2 setlinecap
10.0 ML
N
250 345.143 M
264.88 345.143 L
S
GR
GS
[0.55814 0 0 0.55814 0 0.34882] CT
0.149 GC
2 setlinecap
10.0 ML
N
250 299.286 M
264.88 299.286 L
S
GR
GS
[0.55814 0 0 0.55814 0 0.34882] CT
0.149 GC
2 setlinecap
10.0 ML
N
250 253.429 M
264.88 253.429 L
S
GR
GS
[0.55814 0 0 0.55814 0 0.34882] CT
0.149 GC
2 setlinecap
10.0 ML
N
250 207.571 M
264.88 207.571 L
S
GR
GS
[0.55814 0 0 0.55814 0 0.34882] CT
0.149 GC
2 setlinecap
10.0 ML
N
250 161.714 M
264.88 161.714 L
S
GR
GS
[0.55814 0 0 0.55814 0 0.34882] CT
0.149 GC
2 setlinecap
10.0 ML
N
250 115.857 M
264.88 115.857 L
S
GR
GS
[0.55814 0 0 0.55814 0 0.34882] CT
0.149 GC
2 setlinecap
10.0 ML
N
250 70 M
264.88 70 L
S
GR
GS
[0.55814 0 0 0.55814 0 0.34882] CT
0.149 GC
2 setlinecap
10.0 ML
N
1738 391 M
1723.12 391 L
S
GR
GS
[0.55814 0 0 0.55814 0 0.34882] CT
0.149 GC
2 setlinecap
10.0 ML
N
1738 345.143 M
1723.12 345.143 L
S
GR
GS
[0.55814 0 0 0.55814 0 0.34882] CT
0.149 GC
2 setlinecap
10.0 ML
N
1738 299.286 M
1723.12 299.286 L
S
GR
GS
[0.55814 0 0 0.55814 0 0.34882] CT
0.149 GC
2 setlinecap
10.0 ML
N
1738 253.429 M
1723.12 253.429 L
S
GR
GS
[0.55814 0 0 0.55814 0 0.34882] CT
0.149 GC
2 setlinecap
10.0 ML
N
1738 207.571 M
1723.12 207.571 L
S
GR
GS
[0.55814 0 0 0.55814 0 0.34882] CT
0.149 GC
2 setlinecap
10.0 ML
N
1738 161.714 M
1723.12 161.714 L
S
GR
GS
[0.55814 0 0 0.55814 0 0.34882] CT
0.149 GC
2 setlinecap
10.0 ML
N
1738 115.857 M
1723.12 115.857 L
S
GR
GS
[0.55814 0 0 0.55814 0 0.34882] CT
0.149 GC
2 setlinecap
10.0 ML
N
1738 70 M
1723.12 70 L
S
GR
GS
[0.55814 0 0 0.55814 135.53488 218.58138] CT
0.149 GC
/Helvetica 18 F
GS
[1 0 0 1 0 0] CT
-32 7.5 moveto 
1 -1 scale
(-0.4) t 
GR
GR
GS
[0.55814 0 0 0.55814 135.53488 192.9867] CT
0.149 GC
/Helvetica 18 F
GS
[1 0 0 1 0 0] CT
-32 7.5 moveto 
1 -1 scale
(-0.2) t 
GR
GR
GS
[0.55814 0 0 0.55814 135.53488 167.39201] CT
0.149 GC
/Helvetica 18 F
GS
[1 0 0 1 0 0] CT
-11 7.5 moveto 
1 -1 scale
(0) t 
GR
GR
GS
[0.55814 0 0 0.55814 135.53488 141.79733] CT
0.149 GC
/Helvetica 18 F
GS
[1 0 0 1 0 0] CT
-26 7.5 moveto 
1 -1 scale
(0.2) t 
GR
GR
GS
[0.55814 0 0 0.55814 135.53488 116.20264] CT
0.149 GC
/Helvetica 18 F
GS
[1 0 0 1 0 0] CT
-26 7.5 moveto 
1 -1 scale
(0.4) t 
GR
GR
GS
[0.55814 0 0 0.55814 135.53488 90.60795] CT
0.149 GC
/Helvetica 18 F
GS
[1 0 0 1 0 0] CT
-26 7.5 moveto 
1 -1 scale
(0.6) t 
GR
GR
GS
[0.55814 0 0 0.55814 135.53488 65.01327] CT
0.149 GC
/Helvetica 18 F
GS
[1 0 0 1 0 0] CT
-26 7.5 moveto 
1 -1 scale
(0.8) t 
GR
GR
GS
[0.55814 0 0 0.55814 135.53488 39.41858] CT
0.149 GC
/Helvetica 18 F
GS
[1 0 0 1 0 0] CT
-11 7.5 moveto 
1 -1 scale
(1) t 
GR
GR
GS
[0.55814 0 0 0.55814 0 0.34882] CT
0 0.447 0.741 RC
2 LJ
N
250 70 M
251.489 70.256 L
252.979 71.012 L
254.468 72.251 L
255.958 73.955 L
257.447 76.106 L
258.937 78.687 L
260.426 81.682 L
261.916 85.07 L
263.405 88.827 L
264.895 92.934 L
266.384 97.368 L
267.874 102.109 L
269.363 107.136 L
270.853 112.429 L
272.342 117.966 L
273.832 123.729 L
275.321 129.697 L
276.811 135.852 L
278.3 142.173 L
279.79 148.642 L
281.279 155.24 L
282.769 161.949 L
284.258 168.75 L
285.748 175.627 L
287.237 182.561 L
288.727 189.532 L
290.216 196.522 L
291.706 203.512 L
293.195 210.486 L
294.685 217.426 L
296.174 224.319 L
297.664 231.149 L
299.153 237.901 L
300.643 244.564 L
302.132 251.124 L
303.622 257.571 L
305.111 263.893 L
306.601 270.08 L
308.09 276.124 L
309.58 282.016 L
311.069 287.746 L
312.559 293.304 L
314.048 298.682 L
315.538 303.872 L
317.027 308.866 L
318.517 313.66 L
320.006 318.246 L
321.495 322.62 L
322.985 326.779 L
S
GR
GS
[0.55814 0 0 0.55814 0 0.34882] CT
0 0.447 0.741 RC
2 LJ
N
322.985 326.779 M
324.474 330.718 L
325.964 334.434 L
327.453 337.927 L
328.943 341.193 L
330.432 344.234 L
331.922 347.048 L
333.411 349.637 L
334.901 352.001 L
336.39 354.141 L
337.88 356.056 L
339.369 357.748 L
340.859 359.221 L
342.348 360.477 L
343.838 361.52 L
345.327 362.352 L
346.817 362.978 L
348.306 363.402 L
349.796 363.628 L
351.285 363.662 L
352.775 363.508 L
354.264 363.172 L
355.754 362.659 L
357.243 361.976 L
358.733 361.13 L
360.222 360.127 L
361.712 358.971 L
363.201 357.671 L
364.691 356.232 L
366.18 354.664 L
367.67 352.972 L
369.159 351.164 L
370.649 349.248 L
372.138 347.231 L
373.628 345.119 L
375.117 342.921 L
376.607 340.642 L
378.096 338.29 L
379.586 335.873 L
381.075 333.396 L
382.565 330.866 L
384.054 328.291 L
385.544 325.677 L
387.033 323.031 L
388.523 320.359 L
390.012 317.671 L
391.501 314.971 L
392.991 312.266 L
394.48 309.563 L
395.97 306.867 L
S
GR
GS
[0.55814 0 0 0.55814 0 0.34882] CT
0 0.447 0.741 RC
2 LJ
N
395.97 306.867 M
397.459 304.184 L
398.949 301.52 L
400.438 298.879 L
401.928 296.267 L
403.417 293.688 L
404.907 291.147 L
406.396 288.647 L
407.886 286.193 L
409.375 283.789 L
410.865 281.439 L
412.354 279.148 L
413.844 276.918 L
415.333 274.753 L
416.823 272.656 L
418.312 270.63 L
419.802 268.677 L
421.291 266.8 L
422.781 265.001 L
424.27 263.281 L
425.76 261.642 L
427.249 260.086 L
428.739 258.612 L
430.228 257.222 L
431.718 255.917 L
433.207 254.698 L
434.697 253.564 L
436.186 252.517 L
437.676 251.557 L
439.165 250.682 L
440.655 249.893 L
442.144 249.189 L
443.634 248.57 L
445.123 248.035 L
446.613 247.583 L
448.102 247.213 L
449.592 246.923 L
451.081 246.711 L
452.571 246.578 L
454.06 246.519 L
455.55 246.534 L
457.039 246.621 L
458.529 246.779 L
460.018 247.004 L
461.508 247.296 L
462.997 247.651 L
464.486 248.068 L
465.976 248.544 L
467.465 249.076 L
468.955 249.662 L
S
GR
GS
[0.55814 0 0 0.55814 0 0.34882] CT
0 0.447 0.741 RC
2 LJ
N
468.955 249.662 M
470.444 250.3 L
471.934 250.987 L
473.423 251.721 L
474.913 252.5 L
476.402 253.32 L
477.892 254.18 L
479.381 255.076 L
480.871 256.007 L
482.36 256.97 L
483.85 257.963 L
485.339 258.983 L
486.829 260.027 L
488.318 261.092 L
489.808 262.176 L
491.297 263.276 L
492.787 264.39 L
494.276 265.516 L
495.766 266.65 L
497.255 267.792 L
498.745 268.938 L
500.234 270.088 L
501.724 271.238 L
503.213 272.388 L
504.703 273.535 L
506.192 274.678 L
507.682 275.815 L
509.171 276.945 L
510.661 278.066 L
512.15 279.177 L
513.64 280.275 L
515.129 281.36 L
516.619 282.429 L
518.108 283.481 L
519.598 284.516 L
521.087 285.532 L
522.577 286.528 L
524.066 287.502 L
525.556 288.455 L
527.045 289.385 L
528.535 290.292 L
530.024 291.175 L
531.514 292.034 L
533.003 292.869 L
534.492 293.678 L
535.982 294.463 L
537.471 295.222 L
538.961 295.956 L
540.45 296.665 L
541.94 297.347 L
S
GR
GS
[0.55814 0 0 0.55814 0 0.34882] CT
0 0.447 0.741 RC
2 LJ
N
541.94 297.347 M
543.429 298.004 L
544.919 298.635 L
546.408 299.24 L
547.898 299.819 L
549.387 300.373 L
550.877 300.902 L
552.366 301.406 L
553.856 301.886 L
555.345 302.342 L
556.835 302.774 L
558.324 303.183 L
559.814 303.569 L
561.303 303.934 L
562.793 304.277 L
564.282 304.6 L
565.772 304.903 L
567.261 305.186 L
568.751 305.451 L
570.24 305.698 L
571.73 305.927 L
573.219 306.141 L
574.709 306.339 L
576.198 306.522 L
577.688 306.691 L
579.177 306.847 L
580.667 306.99 L
582.156 307.122 L
583.646 307.244 L
585.135 307.355 L
586.625 307.457 L
588.114 307.55 L
589.604 307.636 L
591.093 307.715 L
592.583 307.787 L
594.072 307.854 L
595.562 307.917 L
597.051 307.975 L
598.541 308.03 L
600.03 308.082 L
601.52 308.133 L
603.009 308.182 L
604.498 308.231 L
605.988 308.28 L
607.477 308.33 L
608.967 308.381 L
610.456 308.434 L
611.946 308.489 L
613.435 308.546 L
614.925 308.607 L
S
GR
GS
[0.55814 0 0 0.55814 0 0.34882] CT
0 0.447 0.741 RC
2 LJ
N
614.925 308.607 M
616.414 308.671 L
617.904 308.739 L
619.393 308.812 L
620.883 308.889 L
622.372 308.971 L
623.862 309.058 L
625.351 309.151 L
626.841 309.25 L
628.33 309.354 L
629.82 309.466 L
631.309 309.583 L
632.799 309.707 L
634.288 309.838 L
635.778 309.976 L
637.267 310.12 L
638.757 310.271 L
640.246 310.429 L
641.736 310.594 L
643.225 310.765 L
644.715 310.944 L
646.204 311.129 L
647.694 311.32 L
649.183 311.518 L
650.673 311.723 L
652.162 311.933 L
653.652 312.149 L
655.141 312.372 L
656.631 312.599 L
658.12 312.832 L
659.61 313.071 L
661.099 313.314 L
662.589 313.561 L
664.078 313.813 L
665.568 314.069 L
667.057 314.329 L
668.547 314.592 L
670.036 314.858 L
671.526 315.128 L
673.015 315.399 L
674.505 315.672 L
675.994 315.947 L
677.484 316.224 L
678.973 316.501 L
680.462 316.779 L
681.952 317.058 L
683.441 317.336 L
684.931 317.614 L
686.42 317.891 L
687.91 318.167 L
S
GR
GS
[0.55814 0 0 0.55814 0 0.34882] CT
0 0.447 0.741 RC
2 LJ
N
687.91 318.167 M
689.399 318.442 L
690.889 318.715 L
692.378 318.986 L
693.868 319.255 L
695.357 319.52 L
696.847 319.783 L
698.336 320.043 L
699.826 320.298 L
701.315 320.549 L
702.805 320.796 L
704.294 321.039 L
705.784 321.276 L
707.273 321.507 L
708.763 321.734 L
710.252 321.954 L
711.742 322.168 L
713.231 322.376 L
714.721 322.577 L
716.21 322.771 L
717.7 322.959 L
719.189 323.139 L
720.679 323.312 L
722.168 323.478 L
723.658 323.635 L
725.147 323.785 L
726.637 323.927 L
728.126 324.061 L
729.616 324.186 L
731.105 324.303 L
732.595 324.411 L
734.084 324.511 L
735.574 324.601 L
737.063 324.683 L
738.553 324.756 L
740.042 324.82 L
741.532 324.875 L
743.021 324.92 L
744.51 324.957 L
746 324.985 L
747.49 325.004 L
748.979 325.013 L
750.468 325.014 L
751.958 325.006 L
753.447 324.988 L
754.937 324.962 L
756.426 324.927 L
757.916 324.883 L
759.405 324.83 L
760.895 324.768 L
S
GR
GS
[0.55814 0 0 0.55814 0 0.34882] CT
0 0.447 0.741 RC
2 LJ
N
760.895 324.768 M
762.384 324.698 L
763.874 324.619 L
765.363 324.532 L
766.853 324.436 L
768.342 324.332 L
769.832 324.22 L
771.321 324.1 L
772.811 323.972 L
774.3 323.836 L
775.79 323.692 L
777.279 323.541 L
778.769 323.382 L
780.258 323.216 L
781.748 323.043 L
783.237 322.863 L
784.727 322.675 L
786.216 322.481 L
787.706 322.281 L
789.195 322.074 L
790.685 321.861 L
792.174 321.641 L
793.664 321.416 L
795.153 321.185 L
796.643 320.948 L
798.132 320.705 L
799.622 320.457 L
801.111 320.204 L
802.601 319.946 L
804.09 319.682 L
805.58 319.414 L
807.069 319.141 L
808.559 318.864 L
810.048 318.582 L
811.538 318.296 L
813.027 318.006 L
814.516 317.713 L
816.006 317.415 L
817.495 317.114 L
818.985 316.809 L
820.474 316.501 L
821.964 316.19 L
823.453 315.875 L
824.943 315.558 L
826.432 315.237 L
827.922 314.914 L
829.411 314.588 L
830.901 314.26 L
832.39 313.929 L
833.88 313.595 L
S
GR
GS
[0.55814 0 0 0.55814 0 0.34882] CT
0 0.447 0.741 RC
2 LJ
N
833.88 313.595 M
835.369 313.26 L
836.859 312.922 L
838.348 312.582 L
839.838 312.241 L
841.327 311.897 L
842.817 311.552 L
844.306 311.205 L
845.796 310.856 L
847.285 310.507 L
848.775 310.155 L
850.264 309.803 L
851.754 309.449 L
853.243 309.095 L
854.733 308.739 L
856.222 308.382 L
857.712 308.025 L
859.201 307.666 L
860.691 307.307 L
862.18 306.947 L
863.67 306.587 L
865.159 306.225 L
866.649 305.864 L
868.138 305.501 L
869.628 305.139 L
871.117 304.775 L
872.607 304.412 L
874.096 304.048 L
875.586 303.683 L
877.075 303.319 L
878.565 302.954 L
880.054 302.59 L
881.544 302.225 L
883.033 301.86 L
884.523 301.496 L
886.012 301.132 L
887.502 300.767 L
888.991 300.403 L
890.481 300.04 L
891.97 299.676 L
893.459 299.313 L
894.949 298.951 L
896.438 298.589 L
897.928 298.227 L
899.417 297.866 L
900.907 297.506 L
902.396 297.147 L
903.886 296.788 L
905.375 296.429 L
906.865 296.072 L
S
GR
GS
[0.55814 0 0 0.55814 0 0.34882] CT
0 0.447 0.741 RC
2 LJ
N
906.865 296.072 M
908.354 295.715 L
909.844 295.359 L
911.333 295.004 L
912.823 294.65 L
914.312 294.297 L
915.802 293.944 L
917.291 293.593 L
918.781 293.243 L
920.27 292.894 L
921.76 292.547 L
923.249 292.2 L
924.739 291.855 L
926.228 291.512 L
927.718 291.17 L
929.207 290.83 L
930.697 290.492 L
932.186 290.155 L
933.676 289.82 L
935.165 289.487 L
936.655 289.156 L
938.144 288.827 L
939.634 288.5 L
941.123 288.175 L
942.613 287.852 L
944.102 287.531 L
945.592 287.213 L
947.081 286.897 L
948.571 286.584 L
950.06 286.273 L
951.55 285.964 L
953.039 285.658 L
954.529 285.354 L
956.018 285.053 L
957.508 284.755 L
958.997 284.459 L
960.487 284.167 L
961.976 283.877 L
963.465 283.59 L
964.955 283.307 L
966.444 283.026 L
967.934 282.749 L
969.423 282.476 L
970.913 282.206 L
972.402 281.94 L
973.892 281.677 L
975.381 281.418 L
976.871 281.163 L
978.36 280.911 L
979.85 280.664 L
S
GR
GS
[0.55814 0 0 0.55814 0 0.34882] CT
0 0.447 0.741 RC
2 LJ
N
979.85 280.664 M
981.339 280.421 L
982.829 280.181 L
984.318 279.946 L
985.808 279.715 L
987.297 279.488 L
988.787 279.265 L
990.276 279.047 L
991.766 278.832 L
993.255 278.622 L
994.745 278.417 L
996.234 278.216 L
997.724 278.019 L
999.213 277.827 L
1000.703 277.639 L
1002.192 277.457 L
1003.682 277.279 L
1005.171 277.106 L
1006.661 276.938 L
1008.15 276.775 L
1009.64 276.617 L
1011.129 276.464 L
1012.619 276.317 L
1014.108 276.174 L
1015.598 276.037 L
1017.087 275.905 L
1018.577 275.779 L
1020.066 275.657 L
1021.556 275.542 L
1023.045 275.431 L
1024.535 275.326 L
1026.024 275.226 L
1027.514 275.132 L
1029.003 275.043 L
1030.493 274.96 L
1031.982 274.882 L
1033.471 274.81 L
1034.961 274.744 L
1036.45 274.683 L
1037.94 274.627 L
1039.429 274.578 L
1040.919 274.534 L
1042.408 274.496 L
1043.898 274.464 L
1045.387 274.437 L
1046.877 274.416 L
1048.366 274.401 L
1049.856 274.391 L
1051.345 274.388 L
1052.835 274.39 L
S
GR
GS
[0.55814 0 0 0.55814 0 0.34882] CT
0 0.447 0.741 RC
2 LJ
N
1052.835 274.39 M
1054.324 274.398 L
1055.814 274.412 L
1057.303 274.431 L
1058.793 274.456 L
1060.282 274.487 L
1061.772 274.523 L
1063.261 274.566 L
1064.751 274.614 L
1066.24 274.667 L
1067.73 274.727 L
1069.219 274.792 L
1070.709 274.862 L
1072.198 274.939 L
1073.688 275.021 L
1075.177 275.108 L
1076.667 275.201 L
1078.156 275.3 L
1079.646 275.404 L
1081.135 275.514 L
1082.625 275.629 L
1084.114 275.75 L
1085.604 275.876 L
1087.093 276.007 L
1088.583 276.144 L
1090.072 276.286 L
1091.562 276.434 L
1093.051 276.586 L
1094.541 276.744 L
1096.03 276.907 L
1097.52 277.075 L
1099.009 277.248 L
1100.498 277.426 L
1101.988 277.609 L
1103.477 277.797 L
1104.967 277.99 L
1106.456 278.188 L
1107.946 278.391 L
1109.435 278.598 L
1110.925 278.81 L
1112.414 279.026 L
1113.904 279.248 L
1115.393 279.473 L
1116.883 279.704 L
1118.372 279.938 L
1119.862 280.177 L
1121.351 280.421 L
1122.841 280.668 L
1124.33 280.92 L
1125.82 281.176 L
S
GR
GS
[0.55814 0 0 0.55814 0 0.34882] CT
0 0.447 0.741 RC
2 LJ
N
1125.82 281.176 M
1127.309 281.436 L
1128.799 281.7 L
1130.288 281.968 L
1131.778 282.24 L
1133.267 282.515 L
1134.757 282.795 L
1136.246 283.078 L
1137.736 283.365 L
1139.225 283.655 L
1140.715 283.948 L
1142.204 284.245 L
1143.694 284.546 L
1145.183 284.85 L
1146.673 285.157 L
1148.162 285.467 L
1149.652 285.78 L
1151.141 286.096 L
1152.631 286.415 L
1154.12 286.737 L
1155.61 287.062 L
1157.099 287.39 L
1158.589 287.72 L
1160.078 288.052 L
1161.568 288.387 L
1163.057 288.725 L
1164.547 289.065 L
1166.036 289.407 L
1167.526 289.751 L
1169.015 290.097 L
1170.505 290.446 L
1171.994 290.796 L
1173.483 291.148 L
1174.973 291.502 L
1176.462 291.858 L
1177.952 292.215 L
1179.441 292.574 L
1180.931 292.935 L
1182.42 293.296 L
1183.91 293.66 L
1185.399 294.024 L
1186.889 294.39 L
1188.378 294.756 L
1189.868 295.124 L
1191.357 295.492 L
1192.847 295.862 L
1194.336 296.231 L
1195.826 296.602 L
1197.315 296.973 L
1198.805 297.345 L
S
GR
GS
[0.55814 0 0 0.55814 0 0.34882] CT
0 0.447 0.741 RC
2 LJ
N
1198.805 297.345 M
1200.294 297.717 L
1201.784 298.089 L
1203.273 298.462 L
1204.763 298.834 L
1206.252 299.207 L
1207.742 299.58 L
1209.231 299.952 L
1210.721 300.325 L
1212.21 300.697 L
1213.7 301.069 L
1215.189 301.441 L
1216.679 301.812 L
1218.168 302.182 L
1219.658 302.553 L
1221.147 302.922 L
1222.637 303.291 L
1224.126 303.658 L
1225.616 304.025 L
1227.105 304.391 L
1228.595 304.755 L
1230.084 305.119 L
1231.573 305.48 L
1233.063 305.841 L
1234.552 306.2 L
1236.042 306.557 L
1237.531 306.913 L
1239.021 307.266 L
1240.51 307.618 L
1242 307.968 L
1243.49 308.316 L
1244.979 308.662 L
1246.469 309.006 L
1247.958 309.348 L
1249.448 309.687 L
1250.937 310.024 L
1252.427 310.359 L
1253.916 310.692 L
1255.405 311.022 L
1256.895 311.349 L
1258.384 311.674 L
1259.874 311.996 L
1261.363 312.316 L
1262.853 312.632 L
1264.342 312.946 L
1265.832 313.257 L
1267.321 313.564 L
1268.811 313.868 L
1270.3 314.169 L
1271.79 314.466 L
S
GR
GS
[0.55814 0 0 0.55814 0 0.34882] CT
0 0.447 0.741 RC
2 LJ
N
1271.79 314.466 M
1273.279 314.76 L
1274.769 315.051 L
1276.258 315.337 L
1277.748 315.62 L
1279.237 315.9 L
1280.727 316.175 L
1282.216 316.447 L
1283.706 316.714 L
1285.195 316.978 L
1286.685 317.238 L
1288.174 317.493 L
1289.664 317.745 L
1291.153 317.993 L
1292.643 318.236 L
1294.132 318.475 L
1295.622 318.711 L
1297.111 318.942 L
1298.601 319.168 L
1300.09 319.391 L
1301.58 319.608 L
1303.069 319.821 L
1304.559 320.03 L
1306.048 320.234 L
1307.538 320.433 L
1309.027 320.627 L
1310.517 320.817 L
1312.006 321.001 L
1313.495 321.181 L
1314.985 321.355 L
1316.474 321.525 L
1317.964 321.69 L
1319.453 321.849 L
1320.943 322.004 L
1322.432 322.153 L
1323.922 322.297 L
1325.411 322.436 L
1326.901 322.57 L
1328.39 322.698 L
1329.88 322.822 L
1331.369 322.94 L
1332.859 323.053 L
1334.348 323.16 L
1335.838 323.262 L
1337.327 323.359 L
1338.817 323.45 L
1340.306 323.536 L
1341.796 323.617 L
1343.285 323.691 L
1344.775 323.761 L
S
GR
GS
[0.55814 0 0 0.55814 0 0.34882] CT
0 0.447 0.741 RC
2 LJ
N
1344.775 323.761 M
1346.264 323.824 L
1347.754 323.882 L
1349.243 323.935 L
1350.733 323.982 L
1352.222 324.023 L
1353.712 324.059 L
1355.201 324.09 L
1356.691 324.114 L
1358.18 324.133 L
1359.67 324.147 L
1361.159 324.155 L
1362.649 324.157 L
1364.138 324.154 L
1365.628 324.145 L
1367.117 324.13 L
1368.607 324.11 L
1370.096 324.084 L
1371.586 324.053 L
1373.075 324.016 L
1374.565 323.974 L
1376.054 323.925 L
1377.544 323.872 L
1379.033 323.812 L
1380.523 323.748 L
1382.012 323.677 L
1383.502 323.601 L
1384.991 323.52 L
1386.48 323.433 L
1387.97 323.341 L
1389.459 323.243 L
1390.949 323.14 L
1392.438 323.032 L
1393.928 322.918 L
1395.417 322.799 L
1396.907 322.674 L
1398.396 322.545 L
1399.886 322.41 L
1401.375 322.269 L
1402.865 322.124 L
1404.354 321.973 L
1405.844 321.818 L
1407.333 321.657 L
1408.823 321.491 L
1410.312 321.32 L
1411.802 321.144 L
1413.291 320.964 L
1414.781 320.778 L
1416.27 320.588 L
1417.76 320.392 L
S
GR
GS
[0.55814 0 0 0.55814 0 0.34882] CT
0 0.447 0.741 RC
2 LJ
N
1417.76 320.392 M
1419.249 320.192 L
1420.739 319.988 L
1422.228 319.778 L
1423.718 319.564 L
1425.207 319.345 L
1426.697 319.122 L
1428.186 318.894 L
1429.676 318.662 L
1431.165 318.426 L
1432.655 318.185 L
1434.144 317.94 L
1435.634 317.691 L
1437.123 317.438 L
1438.613 317.18 L
1440.102 316.919 L
1441.592 316.653 L
1443.081 316.384 L
1444.571 316.111 L
1446.06 315.834 L
1447.55 315.553 L
1449.039 315.268 L
1450.529 314.98 L
1452.018 314.689 L
1453.508 314.394 L
1454.997 314.095 L
1456.486 313.794 L
1457.976 313.489 L
1459.465 313.18 L
1460.955 312.869 L
1462.444 312.554 L
1463.934 312.237 L
1465.423 311.917 L
1466.913 311.594 L
1468.402 311.268 L
1469.892 310.939 L
1471.381 310.608 L
1472.871 310.274 L
1474.36 309.938 L
1475.85 309.599 L
1477.339 309.258 L
1478.829 308.915 L
1480.318 308.57 L
1481.808 308.222 L
1483.297 307.872 L
1484.787 307.521 L
1486.276 307.168 L
1487.766 306.812 L
1489.255 306.456 L
1490.745 306.097 L
S
GR
GS
[0.55814 0 0 0.55814 0 0.34882] CT
0 0.447 0.741 RC
2 LJ
N
1490.745 306.097 M
1492.234 305.737 L
1493.724 305.376 L
1495.213 305.013 L
1496.703 304.649 L
1498.192 304.284 L
1499.682 303.918 L
1501.171 303.55 L
1502.661 303.182 L
1504.15 302.813 L
1505.64 302.443 L
1507.129 302.073 L
1508.619 301.701 L
1510.108 301.33 L
1511.598 300.957 L
1513.087 300.585 L
1514.577 300.212 L
1516.066 299.838 L
1517.556 299.465 L
1519.045 299.091 L
1520.535 298.718 L
1522.024 298.344 L
1523.514 297.971 L
1525.003 297.598 L
1526.492 297.225 L
1527.982 296.853 L
1529.471 296.482 L
1530.961 296.111 L
1532.45 295.741 L
1533.94 295.372 L
1535.429 295.004 L
1536.919 294.636 L
1538.408 294.27 L
1539.898 293.906 L
1541.387 293.542 L
1542.877 293.18 L
1544.366 292.819 L
1545.856 292.46 L
1547.345 292.102 L
1548.835 291.746 L
1550.324 291.391 L
1551.814 291.039 L
1553.303 290.688 L
1554.793 290.338 L
1556.282 289.991 L
1557.772 289.646 L
1559.261 289.303 L
1560.751 288.961 L
1562.24 288.622 L
1563.73 288.286 L
S
GR
GS
[0.55814 0 0 0.55814 0 0.34882] CT
0 0.447 0.741 RC
2 LJ
N
1563.73 288.286 M
1565.219 287.952 L
1566.709 287.62 L
1568.198 287.292 L
1569.688 286.966 L
1571.177 286.642 L
1572.667 286.322 L
1574.156 286.005 L
1575.646 285.691 L
1577.135 285.38 L
1578.625 285.072 L
1580.114 284.767 L
1581.604 284.466 L
1583.093 284.169 L
1584.583 283.875 L
1586.072 283.584 L
1587.562 283.297 L
1589.051 283.013 L
1590.541 282.733 L
1592.03 282.457 L
1593.52 282.185 L
1595.009 281.916 L
1596.498 281.651 L
1597.988 281.39 L
1599.477 281.132 L
1600.967 280.879 L
1602.456 280.63 L
1603.946 280.385 L
1605.435 280.144 L
1606.925 279.907 L
1608.414 279.675 L
1609.904 279.448 L
1611.393 279.225 L
1612.883 279.006 L
1614.372 278.792 L
1615.862 278.583 L
1617.351 278.378 L
1618.841 278.179 L
1620.33 277.984 L
1621.82 277.794 L
1623.309 277.608 L
1624.799 277.428 L
1626.288 277.252 L
1627.778 277.082 L
1629.267 276.916 L
1630.757 276.756 L
1632.246 276.6 L
1633.736 276.45 L
1635.225 276.304 L
1636.715 276.164 L
S
GR
GS
[0.55814 0 0 0.55814 0 0.34882] CT
0 0.447 0.741 RC
2 LJ
N
1636.715 276.164 M
1638.204 276.029 L
1639.694 275.899 L
1641.183 275.775 L
1642.673 275.655 L
1644.162 275.541 L
1645.652 275.433 L
1647.141 275.33 L
1648.631 275.232 L
1650.12 275.14 L
1651.61 275.053 L
1653.099 274.972 L
1654.589 274.896 L
1656.078 274.826 L
1657.568 274.761 L
1659.057 274.702 L
1660.547 274.648 L
1662.036 274.6 L
1663.526 274.557 L
1665.015 274.52 L
1666.505 274.489 L
1667.994 274.463 L
1669.483 274.442 L
1670.973 274.428 L
1672.462 274.419 L
1673.952 274.415 L
1675.441 274.417 L
1676.931 274.425 L
1678.42 274.438 L
1679.91 274.457 L
1681.399 274.482 L
1682.889 274.512 L
1684.378 274.548 L
1685.868 274.589 L
1687.357 274.636 L
1688.847 274.689 L
1690.336 274.747 L
1691.826 274.81 L
1693.315 274.879 L
1694.805 274.954 L
1696.294 275.034 L
1697.784 275.12 L
1699.273 275.211 L
1700.763 275.307 L
1702.252 275.409 L
1703.742 275.516 L
1705.231 275.629 L
1706.721 275.747 L
1708.21 275.87 L
1709.7 275.998 L
S
GR
GS
[0.55814 0 0 0.55814 0 0.34882] CT
0 0.447 0.741 RC
2 LJ
N
1709.7 275.998 M
1711.189 276.132 L
1712.679 276.271 L
1714.168 276.415 L
1715.658 276.565 L
1717.147 276.719 L
1718.637 276.879 L
1720.126 277.043 L
1721.616 277.213 L
1723.105 277.388 L
1724.595 277.567 L
1726.084 277.752 L
1727.573 277.941 L
1729.063 278.135 L
1730.552 278.334 L
1732.042 278.538 L
1733.531 278.746 L
1735.021 278.959 L
1736.51 279.176 L
1738 279.399 L
S
GR
GS
[0.55814 0 0 0.55814 554.79125 37.8837] CT
/Helvetica-Bold 20 F
GS
[1 0 0 1 0 0] CT
-17 -5 moveto 
1 -1 scale
(Y\(t\)) t 
GR
GR
GS
[0.55814 0 0 0.55814 0 0.34882] CT
1 GC
N
250 837 M
1738 837 L
1738 516 L
250 516 L
cp
f
GR
GS
[0.55814 0 0 0.55814 0 0.34882] CT
0.873 GC
2 LJ
N
250 837 M
250 516 L
S
GR
GS
[0.55814 0 0 0.55814 0 0.34882] CT
0.873 GC
2 LJ
N
746 837 M
746 516 L
S
GR
GS
[0.55814 0 0 0.55814 0 0.34882] CT
0.873 GC
2 LJ
N
1242 837 M
1242 516 L
S
GR
GS
[0.55814 0 0 0.55814 0 0.34882] CT
0.873 GC
2 LJ
N
1738 837 M
1738 516 L
S
GR
GS
[0.55814 0 0 0.55814 0 0.34882] CT
0.873 GC
2 LJ
N
1738 837 M
250 837 L
S
GR
GS
[0.55814 0 0 0.55814 0 0.34882] CT
0.873 GC
2 LJ
N
1738 791.143 M
250 791.143 L
S
GR
GS
[0.55814 0 0 0.55814 0 0.34882] CT
0.873 GC
2 LJ
N
1738 745.286 M
250 745.286 L
S
GR
GS
[0.55814 0 0 0.55814 0 0.34882] CT
0.873 GC
2 LJ
N
1738 699.429 M
250 699.429 L
S
GR
GS
[0.55814 0 0 0.55814 0 0.34882] CT
0.873 GC
2 LJ
N
1738 653.571 M
250 653.571 L
S
GR
GS
[0.55814 0 0 0.55814 0 0.34882] CT
0.873 GC
2 LJ
N
1738 607.714 M
250 607.714 L
S
GR
GS
[0.55814 0 0 0.55814 0 0.34882] CT
0.873 GC
2 LJ
N
1738 561.857 M
250 561.857 L
S
GR
GS
[0.55814 0 0 0.55814 0 0.34882] CT
0.873 GC
2 LJ
N
1738 516 M
250 516 L
S
GR
GS
[0.55814 0 0 0.55814 554.79112 485.34882] CT
0.149 GC
/Helvetica 20 F
GS
[1 0 0 1 0 0] CT
-11 21 moveto 
1 -1 scale
(t,s) t 
GR
GR
GS
[0.55814 0 0 0.55814 0 0.34882] CT
0.149 GC
2 LJ
N
250 837 M
1738 837 L
S
GR
GS
[0.55814 0 0 0.55814 0 0.34882] CT
0.149 GC
2 LJ
N
250 516 M
1738 516 L
S
GR
GS
[0.55814 0 0 0.55814 0 0.34882] CT
0.149 GC
2 LJ
N
250 837 M
250 822.12 L
S
GR
GS
[0.55814 0 0 0.55814 0 0.34882] CT
0.149 GC
2 LJ
N
746 837 M
746 822.12 L
S
GR
GS
[0.55814 0 0 0.55814 0 0.34882] CT
0.149 GC
2 LJ
N
1242 837 M
1242 822.12 L
S
GR
GS
[0.55814 0 0 0.55814 0 0.34882] CT
0.149 GC
2 LJ
N
1738 837 M
1738 822.12 L
S
GR
GS
[0.55814 0 0 0.55814 0 0.34882] CT
0.149 GC
2 LJ
N
250 516 M
250 530.88 L
S
GR
GS
[0.55814 0 0 0.55814 0 0.34882] CT
0.149 GC
2 LJ
N
746 516 M
746 530.88 L
S
GR
GS
[0.55814 0 0 0.55814 0 0.34882] CT
0.149 GC
2 LJ
N
1242 516 M
1242 530.88 L
S
GR
GS
[0.55814 0 0 0.55814 0 0.34882] CT
0.149 GC
2 LJ
N
1738 516 M
1738 530.88 L
S
GR
GS
[0.55814 0 0 0.55814 139.53489 471.51164] CT
0.149 GC
/Helvetica 18 F
GS
[1 0 0 1 0 0] CT
-5.5 19 moveto 
1 -1 scale
(0) t 
GR
GR
GS
[0.55814 0 0 0.55814 416.3721 471.51164] CT
0.149 GC
/Helvetica 18 F
GS
[1 0 0 1 0 0] CT
-5.5 19 moveto 
1 -1 scale
(5) t 
GR
GR
GS
[0.55814 0 0 0.55814 693.20932 471.51164] CT
0.149 GC
/Helvetica 18 F
GS
[1 0 0 1 0 0] CT
-10.5 19 moveto 
1 -1 scale
(10) t 
GR
GR
GS
[0.55814 0 0 0.55814 970.04653 471.51164] CT
0.149 GC
/Helvetica 18 F
GS
[1 0 0 1 0 0] CT
-10.5 19 moveto 
1 -1 scale
(15) t 
GR
GR
GS
[0.55814 0 0 0.55814 0 0.34882] CT
0.149 GC
2 setlinecap
10.0 ML
N
250 837 M
250 516 L
S
GR
GS
[0.55814 0 0 0.55814 0 0.34882] CT
0.149 GC
2 setlinecap
10.0 ML
N
1738 837 M
1738 516 L
S
GR
GS
[0.55814 0 0 0.55814 0 0.34882] CT
0.149 GC
2 setlinecap
10.0 ML
N
250 837 M
264.88 837 L
S
GR
GS
[0.55814 0 0 0.55814 0 0.34882] CT
0.149 GC
2 setlinecap
10.0 ML
N
250 791.143 M
264.88 791.143 L
S
GR
GS
[0.55814 0 0 0.55814 0 0.34882] CT
0.149 GC
2 setlinecap
10.0 ML
N
250 745.286 M
264.88 745.286 L
S
GR
GS
[0.55814 0 0 0.55814 0 0.34882] CT
0.149 GC
2 setlinecap
10.0 ML
N
250 699.429 M
264.88 699.429 L
S
GR
GS
[0.55814 0 0 0.55814 0 0.34882] CT
0.149 GC
2 setlinecap
10.0 ML
N
250 653.571 M
264.88 653.571 L
S
GR
GS
[0.55814 0 0 0.55814 0 0.34882] CT
0.149 GC
2 setlinecap
10.0 ML
N
250 607.714 M
264.88 607.714 L
S
GR
GS
[0.55814 0 0 0.55814 0 0.34882] CT
0.149 GC
2 setlinecap
10.0 ML
N
250 561.857 M
264.88 561.857 L
S
GR
GS
[0.55814 0 0 0.55814 0 0.34882] CT
0.149 GC
2 setlinecap
10.0 ML
N
250 516 M
264.88 516 L
S
GR
GS
[0.55814 0 0 0.55814 0 0.34882] CT
0.149 GC
2 setlinecap
10.0 ML
N
1738 837 M
1723.12 837 L
S
GR
GS
[0.55814 0 0 0.55814 0 0.34882] CT
0.149 GC
2 setlinecap
10.0 ML
N
1738 791.143 M
1723.12 791.143 L
S
GR
GS
[0.55814 0 0 0.55814 0 0.34882] CT
0.149 GC
2 setlinecap
10.0 ML
N
1738 745.286 M
1723.12 745.286 L
S
GR
GS
[0.55814 0 0 0.55814 0 0.34882] CT
0.149 GC
2 setlinecap
10.0 ML
N
1738 699.429 M
1723.12 699.429 L
S
GR
GS
[0.55814 0 0 0.55814 0 0.34882] CT
0.149 GC
2 setlinecap
10.0 ML
N
1738 653.571 M
1723.12 653.571 L
S
GR
GS
[0.55814 0 0 0.55814 0 0.34882] CT
0.149 GC
2 setlinecap
10.0 ML
N
1738 607.714 M
1723.12 607.714 L
S
GR
GS
[0.55814 0 0 0.55814 0 0.34882] CT
0.149 GC
2 setlinecap
10.0 ML
N
1738 561.857 M
1723.12 561.857 L
S
GR
GS
[0.55814 0 0 0.55814 0 0.34882] CT
0.149 GC
2 setlinecap
10.0 ML
N
1738 516 M
1723.12 516 L
S
GR
GS
[0.55814 0 0 0.55814 135.53488 467.51163] CT
0.149 GC
/Helvetica 18 F
GS
[1 0 0 1 0 0] CT
-32 7.5 moveto 
1 -1 scale
(-2.5) t 
GR
GR
GS
[0.55814 0 0 0.55814 135.53488 441.91695] CT
0.149 GC
/Helvetica 18 F
GS
[1 0 0 1 0 0] CT
-17 7.5 moveto 
1 -1 scale
(-2) t 
GR
GR
GS
[0.55814 0 0 0.55814 135.53488 416.32225] CT
0.149 GC
/Helvetica 18 F
GS
[1 0 0 1 0 0] CT
-32 7.5 moveto 
1 -1 scale
(-1.5) t 
GR
GR
GS
[0.55814 0 0 0.55814 135.53488 390.72758] CT
0.149 GC
/Helvetica 18 F
GS
[1 0 0 1 0 0] CT
-17 7.5 moveto 
1 -1 scale
(-1) t 
GR
GR
GS
[0.55814 0 0 0.55814 135.53488 365.13287] CT
0.149 GC
/Helvetica 18 F
GS
[1 0 0 1 0 0] CT
-32 7.5 moveto 
1 -1 scale
(-0.5) t 
GR
GR
GS
[0.55814 0 0 0.55814 135.53488 339.5382] CT
0.149 GC
/Helvetica 18 F
GS
[1 0 0 1 0 0] CT
-11 7.5 moveto 
1 -1 scale
(0) t 
GR
GR
GS
[0.55814 0 0 0.55814 135.53488 313.9435] CT
0.149 GC
/Helvetica 18 F
GS
[1 0 0 1 0 0] CT
-26 7.5 moveto 
1 -1 scale
(0.5) t 
GR
GR
GS
[0.55814 0 0 0.55814 135.53488 288.34883] CT
0.149 GC
/Helvetica 18 F
GS
[1 0 0 1 0 0] CT
-11 7.5 moveto 
1 -1 scale
(1) t 
GR
GR
GS
[0.55814 0 0 0.55814 0 0.34882] CT
0 0.447 0.741 RC
2 LJ
N
250 607.714 M
251.489 621.265 L
252.979 634.365 L
254.468 646.997 L
255.958 659.148 L
257.447 670.805 L
258.937 681.958 L
260.426 692.597 L
261.916 702.714 L
263.405 712.301 L
264.895 721.352 L
266.384 729.863 L
267.874 737.83 L
269.363 745.252 L
270.853 752.126 L
272.342 758.454 L
273.832 764.239 L
275.321 769.483 L
276.811 774.19 L
278.3 778.368 L
279.79 782.023 L
281.279 785.165 L
282.769 787.803 L
284.258 789.948 L
285.748 791.604 L
287.237 792.782 L
288.727 793.494 L
290.216 793.754 L
291.706 793.575 L
293.195 792.971 L
294.685 791.957 L
296.174 790.546 L
297.664 788.754 L
299.153 786.596 L
300.643 784.087 L
302.132 781.243 L
303.622 778.081 L
305.111 774.616 L
306.601 770.865 L
308.09 766.845 L
309.58 762.573 L
311.069 758.065 L
312.559 753.337 L
314.048 748.406 L
315.538 743.293 L
317.027 738.014 L
318.517 732.588 L
320.006 727.031 L
321.495 721.36 L
322.985 715.591 L
S
GR
GS
[0.55814 0 0 0.55814 0 0.34882] CT
0 0.447 0.741 RC
2 LJ
N
322.985 715.591 M
324.474 709.74 L
325.964 703.823 L
327.453 697.854 L
328.943 691.847 L
330.432 685.816 L
331.922 679.776 L
333.411 673.739 L
334.901 667.718 L
336.39 661.725 L
337.88 655.775 L
339.369 649.88 L
340.859 644.053 L
342.348 638.305 L
343.838 632.649 L
345.327 627.094 L
346.817 621.651 L
348.306 616.328 L
349.796 611.134 L
351.285 606.077 L
352.775 601.163 L
354.264 596.4 L
355.754 591.792 L
357.243 587.346 L
358.733 583.065 L
360.222 578.953 L
361.712 575.017 L
363.201 571.261 L
364.691 567.688 L
366.18 564.301 L
367.67 561.104 L
369.159 558.097 L
370.649 555.282 L
372.138 552.66 L
373.628 550.232 L
375.117 547.997 L
376.607 545.956 L
378.096 544.106 L
379.586 542.447 L
381.075 540.976 L
382.565 539.691 L
384.054 538.59 L
385.544 537.671 L
387.033 536.931 L
388.523 536.366 L
390.012 535.973 L
391.501 535.747 L
392.991 535.685 L
394.48 535.781 L
395.97 536.032 L
S
GR
GS
[0.55814 0 0 0.55814 0 0.34882] CT
0 0.447 0.741 RC
2 LJ
N
395.97 536.032 M
397.459 536.432 L
398.949 536.976 L
400.438 537.661 L
401.928 538.479 L
403.417 539.426 L
404.907 540.497 L
406.396 541.685 L
407.886 542.985 L
409.375 544.391 L
410.865 545.897 L
412.354 547.498 L
413.844 549.186 L
415.333 550.956 L
416.823 552.8 L
418.312 554.714 L
419.802 556.691 L
421.291 558.725 L
422.781 560.811 L
424.27 562.942 L
425.76 565.113 L
427.249 567.319 L
428.739 569.554 L
430.228 571.812 L
431.718 574.09 L
433.207 576.382 L
434.697 578.681 L
436.186 580.983 L
437.676 583.282 L
439.165 585.574 L
440.655 587.853 L
442.144 590.114 L
443.634 592.355 L
445.123 594.57 L
446.613 596.755 L
448.102 598.909 L
449.592 601.025 L
451.081 603.103 L
452.571 605.139 L
454.06 607.13 L
455.55 609.074 L
457.039 610.968 L
458.529 612.809 L
460.018 614.595 L
461.508 616.324 L
462.997 617.993 L
464.486 619.602 L
465.976 621.147 L
467.465 622.628 L
468.955 624.043 L
S
GR
GS
[0.55814 0 0 0.55814 0 0.34882] CT
0 0.447 0.741 RC
2 LJ
N
468.955 624.043 M
470.444 625.392 L
471.934 626.674 L
473.423 627.888 L
474.913 629.034 L
476.402 630.112 L
477.892 631.122 L
479.381 632.064 L
480.871 632.938 L
482.36 633.745 L
483.85 634.484 L
485.339 635.156 L
486.829 635.762 L
488.318 636.302 L
489.808 636.778 L
491.297 637.191 L
492.787 637.542 L
494.276 637.831 L
495.766 638.061 L
497.255 638.233 L
498.745 638.347 L
500.234 638.407 L
501.724 638.413 L
503.213 638.367 L
504.703 638.272 L
506.192 638.128 L
507.682 637.939 L
509.171 637.706 L
510.661 637.431 L
512.15 637.116 L
513.64 636.761 L
515.129 636.371 L
516.619 635.947 L
518.108 635.491 L
519.598 635.005 L
521.087 634.493 L
522.577 633.955 L
524.066 633.393 L
525.556 632.811 L
527.045 632.209 L
528.535 631.59 L
530.024 630.956 L
531.514 630.308 L
533.003 629.649 L
534.492 628.98 L
535.982 628.303 L
537.471 627.62 L
538.961 626.932 L
540.45 626.241 L
541.94 625.548 L
S
GR
GS
[0.55814 0 0 0.55814 0 0.34882] CT
0 0.447 0.741 RC
2 LJ
N
541.94 625.548 M
543.429 624.857 L
544.919 624.168 L
546.408 623.483 L
547.898 622.804 L
549.387 622.131 L
550.877 621.467 L
552.366 620.813 L
553.856 620.17 L
555.345 619.538 L
556.835 618.919 L
558.324 618.315 L
559.814 617.725 L
561.303 617.151 L
562.793 616.593 L
564.282 616.051 L
565.772 615.528 L
567.261 615.022 L
568.751 614.536 L
570.24 614.068 L
571.73 613.621 L
573.219 613.194 L
574.709 612.788 L
576.198 612.403 L
577.688 612.039 L
579.177 611.697 L
580.667 611.376 L
582.156 611.077 L
583.646 610.799 L
585.135 610.542 L
586.625 610.307 L
588.114 610.092 L
589.604 609.898 L
591.093 609.725 L
592.583 609.571 L
594.072 609.437 L
595.562 609.323 L
597.051 609.227 L
598.541 609.151 L
600.03 609.092 L
601.52 609.05 L
603.009 609.026 L
604.498 609.018 L
605.988 609.026 L
607.477 609.049 L
608.967 609.087 L
610.456 609.138 L
611.946 609.203 L
613.435 609.28 L
614.925 609.37 L
S
GR
GS
[0.55814 0 0 0.55814 0 0.34882] CT
0 0.447 0.741 RC
2 LJ
N
614.925 609.37 M
616.414 609.47 L
617.904 609.581 L
619.393 609.702 L
620.883 609.832 L
622.372 609.97 L
623.862 610.116 L
625.351 610.268 L
626.841 610.427 L
628.33 610.591 L
629.82 610.759 L
631.309 610.932 L
632.799 611.108 L
634.288 611.286 L
635.778 611.467 L
637.267 611.648 L
638.757 611.831 L
640.246 612.013 L
641.736 612.195 L
643.225 612.375 L
644.715 612.554 L
646.204 612.731 L
647.694 612.904 L
649.183 613.074 L
650.673 613.24 L
652.162 613.401 L
653.652 613.557 L
655.141 613.708 L
656.631 613.853 L
658.12 613.992 L
659.61 614.124 L
661.099 614.25 L
662.589 614.368 L
664.078 614.479 L
665.568 614.581 L
667.057 614.676 L
668.547 614.762 L
670.036 614.84 L
671.526 614.909 L
673.015 614.969 L
674.505 615.02 L
675.994 615.062 L
677.484 615.095 L
678.973 615.118 L
680.462 615.132 L
681.952 615.136 L
683.441 615.131 L
684.931 615.116 L
686.42 615.091 L
687.91 615.058 L
S
GR
GS
[0.55814 0 0 0.55814 0 0.34882] CT
0 0.447 0.741 RC
2 LJ
N
687.91 615.058 M
689.399 615.015 L
690.889 614.963 L
692.378 614.901 L
693.868 614.831 L
695.357 614.752 L
696.847 614.664 L
698.336 614.567 L
699.826 614.461 L
701.315 614.348 L
702.805 614.226 L
704.294 614.097 L
705.784 613.96 L
707.273 613.815 L
708.763 613.664 L
710.252 613.506 L
711.742 613.341 L
713.231 613.169 L
714.721 612.992 L
716.21 612.808 L
717.7 612.619 L
719.189 612.424 L
720.679 612.225 L
722.168 612.02 L
723.658 611.811 L
725.147 611.598 L
726.637 611.38 L
728.126 611.159 L
729.616 610.935 L
731.105 610.708 L
732.595 610.478 L
734.084 610.246 L
735.574 610.012 L
737.063 609.776 L
738.553 609.538 L
740.042 609.3 L
741.532 609.06 L
743.021 608.819 L
744.51 608.578 L
746 608.337 L
747.49 608.096 L
748.979 607.854 L
750.468 607.613 L
751.958 607.373 L
753.447 607.133 L
754.937 606.895 L
756.426 606.658 L
757.916 606.423 L
759.405 606.189 L
760.895 605.958 L
S
GR
GS
[0.55814 0 0 0.55814 0 0.34882] CT
0 0.447 0.741 RC
2 LJ
N
760.895 605.958 M
762.384 605.728 L
763.874 605.501 L
765.363 605.277 L
766.853 605.055 L
768.342 604.836 L
769.832 604.619 L
771.321 604.406 L
772.811 604.196 L
774.3 603.989 L
775.79 603.785 L
777.279 603.585 L
778.769 603.388 L
780.258 603.195 L
781.748 603.005 L
783.237 602.819 L
784.727 602.638 L
786.216 602.46 L
787.706 602.286 L
789.195 602.116 L
790.685 601.95 L
792.174 601.788 L
793.664 601.63 L
795.153 601.476 L
796.643 601.327 L
798.132 601.181 L
799.622 601.039 L
801.111 600.901 L
802.601 600.767 L
804.09 600.637 L
805.58 600.511 L
807.069 600.388 L
808.559 600.27 L
810.048 600.156 L
811.538 600.045 L
813.027 599.938 L
814.516 599.835 L
816.006 599.736 L
817.495 599.64 L
818.985 599.548 L
820.474 599.46 L
821.964 599.375 L
823.453 599.293 L
824.943 599.215 L
826.432 599.139 L
827.922 599.067 L
829.411 598.998 L
830.901 598.932 L
832.39 598.868 L
833.88 598.808 L
S
GR
GS
[0.55814 0 0 0.55814 0 0.34882] CT
0 0.447 0.741 RC
2 LJ
N
833.88 598.808 M
835.369 598.75 L
836.859 598.694 L
838.348 598.642 L
839.838 598.592 L
841.327 598.544 L
842.817 598.499 L
844.306 598.456 L
845.796 598.416 L
847.285 598.378 L
848.775 598.343 L
850.264 598.309 L
851.754 598.278 L
853.243 598.248 L
854.733 598.221 L
856.222 598.195 L
857.712 598.172 L
859.201 598.15 L
860.691 598.13 L
862.18 598.112 L
863.67 598.095 L
865.159 598.08 L
866.649 598.066 L
868.138 598.054 L
869.628 598.043 L
871.117 598.034 L
872.607 598.026 L
874.096 598.019 L
875.586 598.013 L
877.075 598.009 L
878.565 598.007 L
880.054 598.005 L
881.544 598.005 L
883.033 598.007 L
884.523 598.009 L
886.012 598.013 L
887.502 598.018 L
888.991 598.024 L
890.481 598.031 L
891.97 598.04 L
893.459 598.05 L
894.949 598.061 L
896.438 598.074 L
897.928 598.087 L
899.417 598.102 L
900.907 598.118 L
902.396 598.135 L
903.886 598.154 L
905.375 598.174 L
906.865 598.195 L
S
GR
GS
[0.55814 0 0 0.55814 0 0.34882] CT
0 0.447 0.741 RC
2 LJ
N
906.865 598.195 M
908.354 598.217 L
909.844 598.241 L
911.333 598.266 L
912.823 598.292 L
914.312 598.32 L
915.802 598.349 L
917.291 598.38 L
918.781 598.412 L
920.27 598.446 L
921.76 598.481 L
923.249 598.518 L
924.739 598.556 L
926.228 598.596 L
927.718 598.637 L
929.207 598.68 L
930.697 598.724 L
932.186 598.77 L
933.676 598.818 L
935.165 598.867 L
936.655 598.917 L
938.144 598.97 L
939.634 599.024 L
941.123 599.079 L
942.613 599.137 L
944.102 599.195 L
945.592 599.256 L
947.081 599.319 L
948.571 599.383 L
950.06 599.449 L
951.55 599.517 L
953.039 599.587 L
954.529 599.659 L
956.018 599.732 L
957.508 599.808 L
958.997 599.886 L
960.487 599.966 L
961.976 600.048 L
963.465 600.131 L
964.955 600.217 L
966.444 600.304 L
967.934 600.394 L
969.423 600.485 L
970.913 600.578 L
972.402 600.672 L
973.892 600.768 L
975.381 600.866 L
976.871 600.966 L
978.36 601.068 L
979.85 601.17 L
S
GR
GS
[0.55814 0 0 0.55814 0 0.34882] CT
0 0.447 0.741 RC
2 LJ
N
979.85 601.17 M
981.339 601.275 L
982.829 601.381 L
984.318 601.49 L
985.808 601.599 L
987.297 601.71 L
988.787 601.823 L
990.276 601.938 L
991.766 602.055 L
993.255 602.173 L
994.745 602.293 L
996.234 602.414 L
997.724 602.538 L
999.213 602.663 L
1000.703 602.79 L
1002.192 602.918 L
1003.682 603.047 L
1005.171 603.178 L
1006.661 603.31 L
1008.15 603.444 L
1009.64 603.579 L
1011.129 603.714 L
1012.619 603.851 L
1014.108 603.989 L
1015.598 604.128 L
1017.087 604.268 L
1018.577 604.409 L
1020.066 604.551 L
1021.556 604.694 L
1023.045 604.837 L
1024.535 604.982 L
1026.024 605.127 L
1027.514 605.274 L
1029.003 605.421 L
1030.493 605.569 L
1031.982 605.718 L
1033.471 605.868 L
1034.961 606.018 L
1036.45 606.169 L
1037.94 606.32 L
1039.429 606.472 L
1040.919 606.624 L
1042.408 606.776 L
1043.898 606.928 L
1045.387 607.081 L
1046.877 607.234 L
1048.366 607.387 L
1049.856 607.54 L
1051.345 607.693 L
1052.835 607.846 L
S
GR
GS
[0.55814 0 0 0.55814 0 0.34882] CT
0 0.447 0.741 RC
2 LJ
N
1052.835 607.846 M
1054.324 607.999 L
1055.814 608.152 L
1057.303 608.305 L
1058.793 608.458 L
1060.282 608.611 L
1061.772 608.764 L
1063.261 608.917 L
1064.751 609.069 L
1066.24 609.221 L
1067.73 609.372 L
1069.219 609.523 L
1070.709 609.674 L
1072.198 609.824 L
1073.688 609.973 L
1075.177 610.122 L
1076.667 610.27 L
1078.156 610.417 L
1079.646 610.564 L
1081.135 610.71 L
1082.625 610.855 L
1084.114 611 L
1085.604 611.143 L
1087.093 611.286 L
1088.583 611.428 L
1090.072 611.57 L
1091.562 611.71 L
1093.051 611.849 L
1094.541 611.986 L
1096.03 612.123 L
1097.52 612.259 L
1099.009 612.393 L
1100.498 612.526 L
1101.988 612.658 L
1103.477 612.789 L
1104.967 612.919 L
1106.456 613.047 L
1107.946 613.174 L
1109.435 613.299 L
1110.925 613.423 L
1112.414 613.547 L
1113.904 613.668 L
1115.393 613.788 L
1116.883 613.907 L
1118.372 614.025 L
1119.862 614.14 L
1121.351 614.254 L
1122.841 614.367 L
1124.33 614.478 L
1125.82 614.587 L
S
GR
GS
[0.55814 0 0 0.55814 0 0.34882] CT
0 0.447 0.741 RC
2 LJ
N
1125.82 614.587 M
1127.309 614.694 L
1128.799 614.8 L
1130.288 614.904 L
1131.778 615.006 L
1133.267 615.107 L
1134.757 615.206 L
1136.246 615.303 L
1137.736 615.398 L
1139.225 615.492 L
1140.715 615.583 L
1142.204 615.674 L
1143.694 615.762 L
1145.183 615.849 L
1146.673 615.934 L
1148.162 616.017 L
1149.652 616.098 L
1151.141 616.177 L
1152.631 616.254 L
1154.12 616.329 L
1155.61 616.403 L
1157.099 616.474 L
1158.589 616.543 L
1160.078 616.61 L
1161.568 616.675 L
1163.057 616.737 L
1164.547 616.798 L
1166.036 616.857 L
1167.526 616.914 L
1169.015 616.968 L
1170.505 617.021 L
1171.994 617.071 L
1173.483 617.12 L
1174.973 617.166 L
1176.462 617.211 L
1177.952 617.253 L
1179.441 617.293 L
1180.931 617.332 L
1182.42 617.368 L
1183.91 617.402 L
1185.399 617.434 L
1186.889 617.464 L
1188.378 617.491 L
1189.868 617.516 L
1191.357 617.539 L
1192.847 617.56 L
1194.336 617.579 L
1195.826 617.595 L
1197.315 617.61 L
1198.805 617.622 L
S
GR
GS
[0.55814 0 0 0.55814 0 0.34882] CT
0 0.447 0.741 RC
2 LJ
N
1198.805 617.622 M
1200.294 617.631 L
1201.784 617.639 L
1203.273 617.644 L
1204.763 617.647 L
1206.252 617.648 L
1207.742 617.647 L
1209.231 617.643 L
1210.721 617.637 L
1212.21 617.63 L
1213.7 617.62 L
1215.189 617.608 L
1216.679 617.594 L
1218.168 617.577 L
1219.658 617.558 L
1221.147 617.537 L
1222.637 617.514 L
1224.126 617.489 L
1225.616 617.461 L
1227.105 617.432 L
1228.595 617.4 L
1230.084 617.366 L
1231.573 617.33 L
1233.063 617.292 L
1234.552 617.252 L
1236.042 617.209 L
1237.531 617.165 L
1239.021 617.119 L
1240.51 617.07 L
1242 617.02 L
1243.49 616.967 L
1244.979 616.912 L
1246.469 616.856 L
1247.958 616.797 L
1249.448 616.736 L
1250.937 616.673 L
1252.427 616.609 L
1253.916 616.542 L
1255.405 616.473 L
1256.895 616.402 L
1258.384 616.329 L
1259.874 616.254 L
1261.363 616.176 L
1262.853 616.097 L
1264.342 616.016 L
1265.832 615.933 L
1267.321 615.848 L
1268.811 615.761 L
1270.3 615.673 L
1271.79 615.583 L
S
GR
GS
[0.55814 0 0 0.55814 0 0.34882] CT
0 0.447 0.741 RC
2 LJ
N
1271.79 615.583 M
1273.279 615.491 L
1274.769 615.398 L
1276.258 615.303 L
1277.748 615.206 L
1279.237 615.108 L
1280.727 615.008 L
1282.216 614.907 L
1283.706 614.804 L
1285.195 614.7 L
1286.685 614.594 L
1288.174 614.487 L
1289.664 614.378 L
1291.153 614.267 L
1292.643 614.155 L
1294.132 614.041 L
1295.622 613.926 L
1297.111 613.809 L
1298.601 613.69 L
1300.09 613.57 L
1301.58 613.449 L
1303.069 613.326 L
1304.559 613.202 L
1306.048 613.076 L
1307.538 612.95 L
1309.027 612.822 L
1310.517 612.693 L
1312.006 612.564 L
1313.495 612.433 L
1314.985 612.301 L
1316.474 612.168 L
1317.964 612.035 L
1319.453 611.9 L
1320.943 611.765 L
1322.432 611.628 L
1323.922 611.491 L
1325.411 611.353 L
1326.901 611.214 L
1328.39 611.074 L
1329.88 610.933 L
1331.369 610.791 L
1332.859 610.649 L
1334.348 610.505 L
1335.838 610.361 L
1337.327 610.216 L
1338.817 610.071 L
1340.306 609.925 L
1341.796 609.779 L
1343.285 609.632 L
1344.775 609.485 L
S
GR
GS
[0.55814 0 0 0.55814 0 0.34882] CT
0 0.447 0.741 RC
2 LJ
N
1344.775 609.485 M
1346.264 609.338 L
1347.754 609.19 L
1349.243 609.042 L
1350.733 608.894 L
1352.222 608.746 L
1353.712 608.597 L
1355.201 608.448 L
1356.691 608.299 L
1358.18 608.15 L
1359.67 608.001 L
1361.159 607.851 L
1362.649 607.701 L
1364.138 607.551 L
1365.628 607.402 L
1367.117 607.252 L
1368.607 607.102 L
1370.096 606.953 L
1371.586 606.804 L
1373.075 606.655 L
1374.565 606.506 L
1376.054 606.358 L
1377.544 606.21 L
1379.033 606.062 L
1380.523 605.915 L
1382.012 605.768 L
1383.502 605.622 L
1384.991 605.476 L
1386.48 605.33 L
1387.97 605.185 L
1389.459 605.041 L
1390.949 604.897 L
1392.438 604.753 L
1393.928 604.611 L
1395.417 604.469 L
1396.907 604.328 L
1398.396 604.187 L
1399.886 604.048 L
1401.375 603.909 L
1402.865 603.771 L
1404.354 603.635 L
1405.844 603.499 L
1407.333 603.364 L
1408.823 603.23 L
1410.312 603.097 L
1411.802 602.965 L
1413.291 602.834 L
1414.781 602.704 L
1416.27 602.576 L
1417.76 602.448 L
S
GR
GS
[0.55814 0 0 0.55814 0 0.34882] CT
0 0.447 0.741 RC
2 LJ
N
1417.76 602.448 M
1419.249 602.321 L
1420.739 602.196 L
1422.228 602.072 L
1423.718 601.95 L
1425.207 601.828 L
1426.697 601.708 L
1428.186 601.59 L
1429.676 601.473 L
1431.165 601.357 L
1432.655 601.243 L
1434.144 601.131 L
1435.634 601.02 L
1437.123 600.91 L
1438.613 600.802 L
1440.102 600.696 L
1441.592 600.591 L
1443.081 600.487 L
1444.571 600.385 L
1446.06 600.285 L
1447.55 600.186 L
1449.039 600.089 L
1450.529 599.994 L
1452.018 599.9 L
1453.508 599.809 L
1454.997 599.719 L
1456.486 599.631 L
1457.976 599.544 L
1459.465 599.46 L
1460.955 599.378 L
1462.444 599.298 L
1463.934 599.219 L
1465.423 599.143 L
1466.913 599.068 L
1468.402 598.996 L
1469.892 598.925 L
1471.381 598.857 L
1472.871 598.79 L
1474.36 598.725 L
1475.85 598.662 L
1477.339 598.601 L
1478.829 598.542 L
1480.318 598.486 L
1481.808 598.431 L
1483.297 598.378 L
1484.787 598.327 L
1486.276 598.279 L
1487.766 598.232 L
1489.255 598.188 L
1490.745 598.146 L
S
GR
GS
[0.55814 0 0 0.55814 0 0.34882] CT
0 0.447 0.741 RC
2 LJ
N
1490.745 598.146 M
1492.234 598.106 L
1493.724 598.069 L
1495.213 598.033 L
1496.703 598 L
1498.192 597.969 L
1499.682 597.941 L
1501.171 597.914 L
1502.661 597.89 L
1504.15 597.868 L
1505.64 597.849 L
1507.129 597.831 L
1508.619 597.816 L
1510.108 597.803 L
1511.598 597.792 L
1513.087 597.783 L
1514.577 597.776 L
1516.066 597.772 L
1517.556 597.77 L
1519.045 597.77 L
1520.535 597.772 L
1522.024 597.777 L
1523.514 597.783 L
1525.003 597.792 L
1526.492 597.804 L
1527.982 597.817 L
1529.471 597.833 L
1530.961 597.851 L
1532.45 597.871 L
1533.94 597.894 L
1535.429 597.918 L
1536.919 597.945 L
1538.408 597.974 L
1539.898 598.005 L
1541.387 598.039 L
1542.877 598.074 L
1544.366 598.112 L
1545.856 598.152 L
1547.345 598.194 L
1548.835 598.238 L
1550.324 598.284 L
1551.814 598.333 L
1553.303 598.383 L
1554.793 598.436 L
1556.282 598.49 L
1557.772 598.547 L
1559.261 598.606 L
1560.751 598.667 L
1562.24 598.731 L
1563.73 598.796 L
S
GR
GS
[0.55814 0 0 0.55814 0 0.34882] CT
0 0.447 0.741 RC
2 LJ
N
1563.73 598.796 M
1565.219 598.864 L
1566.709 598.933 L
1568.198 599.005 L
1569.688 599.078 L
1571.177 599.154 L
1572.667 599.231 L
1574.156 599.31 L
1575.646 599.39 L
1577.135 599.473 L
1578.625 599.557 L
1580.114 599.643 L
1581.604 599.731 L
1583.093 599.82 L
1584.583 599.911 L
1586.072 600.003 L
1587.562 600.098 L
1589.051 600.194 L
1590.541 600.292 L
1592.03 600.391 L
1593.52 600.492 L
1595.009 600.595 L
1596.498 600.7 L
1597.988 600.806 L
1599.477 600.914 L
1600.967 601.024 L
1602.456 601.136 L
1603.946 601.249 L
1605.435 601.363 L
1606.925 601.479 L
1608.414 601.597 L
1609.904 601.716 L
1611.393 601.836 L
1612.883 601.957 L
1614.372 602.079 L
1615.862 602.203 L
1617.351 602.328 L
1618.841 602.454 L
1620.33 602.581 L
1621.82 602.709 L
1623.309 602.838 L
1624.799 602.968 L
1626.288 603.099 L
1627.778 603.231 L
1629.267 603.365 L
1630.757 603.499 L
1632.246 603.635 L
1633.736 603.771 L
1635.225 603.909 L
1636.715 604.048 L
S
GR
GS
[0.55814 0 0 0.55814 0 0.34882] CT
0 0.447 0.741 RC
2 LJ
N
1636.715 604.048 M
1638.204 604.188 L
1639.694 604.328 L
1641.183 604.469 L
1642.673 604.611 L
1644.162 604.754 L
1645.652 604.897 L
1647.141 605.041 L
1648.631 605.185 L
1650.12 605.33 L
1651.61 605.475 L
1653.099 605.621 L
1654.589 605.767 L
1656.078 605.913 L
1657.568 606.06 L
1659.057 606.207 L
1660.547 606.355 L
1662.036 606.503 L
1663.526 606.651 L
1665.015 606.8 L
1666.505 606.949 L
1667.994 607.098 L
1669.483 607.248 L
1670.973 607.398 L
1672.462 607.547 L
1673.952 607.697 L
1675.441 607.847 L
1676.931 607.996 L
1678.42 608.146 L
1679.91 608.295 L
1681.399 608.444 L
1682.889 608.593 L
1684.378 608.741 L
1685.868 608.89 L
1687.357 609.038 L
1688.847 609.186 L
1690.336 609.333 L
1691.826 609.481 L
1693.315 609.628 L
1694.805 609.774 L
1696.294 609.92 L
1697.784 610.066 L
1699.273 610.211 L
1700.763 610.356 L
1702.252 610.5 L
1703.742 610.643 L
1705.231 610.785 L
1706.721 610.927 L
1708.21 611.068 L
1709.7 611.208 L
S
GR
GS
[0.55814 0 0 0.55814 0 0.34882] CT
0 0.447 0.741 RC
2 LJ
N
1709.7 611.208 M
1711.189 611.348 L
1712.679 611.487 L
1714.168 611.624 L
1715.658 611.761 L
1717.147 611.897 L
1718.637 612.033 L
1720.126 612.167 L
1721.616 612.3 L
1723.105 612.432 L
1724.595 612.563 L
1726.084 612.693 L
1727.573 612.822 L
1729.063 612.95 L
1730.552 613.076 L
1732.042 613.202 L
1733.531 613.326 L
1735.021 613.448 L
1736.51 613.57 L
1738 613.69 L
S
GR
GS
[0.55814 0 0 0.55814 554.79125 286.81394] CT
/Helvetica-Bold 20 F
GS
[1 0 0 1 0 0] CT
-25 -5 moveto 
1 -1 scale
(dY/dt) t 
GR
GR
%%Trailer
%%Pages: 1
%%EOF
