%!PS-Adobe-3.0 EPSF-3.0
%%Creator: (MATLAB, The Mathworks, Inc. Version 8.5.0.197613 \(R2015a\). Operating System: Windows 7)
%%Title: C:/Users/Shurshurik/Desktop/matlab_student/3/figure7.eps
%%CreationDate: 2018-11-19T13:47:20
%%Pages: (atend)
%%BoundingBox: 0 0 1072 525
%%LanguageLevel: 2
%%EndComments
%%BeginProlog
%%BeginResource: procset (Apache XML Graphics Std ProcSet) 1.2 0
%%Version: 1.2 0
%%Copyright: (Copyright 2001-2003,2010 The Apache Software Foundation. License terms: http://www.apache.org/licenses/LICENSE-2.0)
/bd{bind def}bind def
/ld{load def}bd
/GR/grestore ld
/M/moveto ld
/LJ/setlinejoin ld
/C/curveto ld
/f/fill ld
/LW/setlinewidth ld
/GC/setgray ld
/t/show ld
/N/newpath ld
/CT/concat ld
/cp/closepath ld
/S/stroke ld
/L/lineto ld
/CC/setcmykcolor ld
/A/ashow ld
/GS/gsave ld
/RC/setrgbcolor ld
/RM/rmoveto ld
/ML/setmiterlimit ld
/re {4 2 roll M
1 index 0 rlineto
0 exch rlineto
neg 0 rlineto
cp } bd
/_ctm matrix def
/_tm matrix def
/BT { _ctm currentmatrix pop matrix _tm copy pop 0 0 moveto } bd
/ET { _ctm setmatrix } bd
/iTm { _ctm setmatrix _tm concat } bd
/Tm { _tm astore pop iTm 0 0 moveto } bd
/ux 0.0 def
/uy 0.0 def
/F {
  /Tp exch def
  /Tf exch def
  Tf findfont Tp scalefont setfont
  /cf Tf def  /cs Tp def
} bd
/ULS {currentpoint /uy exch def /ux exch def} bd
/ULE {
  /Tcx currentpoint pop def
  gsave
  newpath
  cf findfont cs scalefont dup
  /FontMatrix get 0 get /Ts exch def /FontInfo get dup
  /UnderlinePosition get Ts mul /To exch def
  /UnderlineThickness get Ts mul /Tt exch def
  ux uy To add moveto  Tcx uy To add lineto
  Tt setlinewidth stroke
  grestore
} bd
/OLE {
  /Tcx currentpoint pop def
  gsave
  newpath
  cf findfont cs scalefont dup
  /FontMatrix get 0 get /Ts exch def /FontInfo get dup
  /UnderlinePosition get Ts mul /To exch def
  /UnderlineThickness get Ts mul /Tt exch def
  ux uy To add cs add moveto Tcx uy To add cs add lineto
  Tt setlinewidth stroke
  grestore
} bd
/SOE {
  /Tcx currentpoint pop def
  gsave
  newpath
  cf findfont cs scalefont dup
  /FontMatrix get 0 get /Ts exch def /FontInfo get dup
  /UnderlinePosition get Ts mul /To exch def
  /UnderlineThickness get Ts mul /Tt exch def
  ux uy To add cs 10 mul 26 idiv add moveto Tcx uy To add cs 10 mul 26 idiv add lineto
  Tt setlinewidth stroke
  grestore
} bd
/QT {
/Y22 exch store
/X22 exch store
/Y21 exch store
/X21 exch store
currentpoint
/Y21 load 2 mul add 3 div exch
/X21 load 2 mul add 3 div exch
/X21 load 2 mul /X22 load add 3 div
/Y21 load 2 mul /Y22 load add 3 div
/X22 load /Y22 load curveto
} bd
/SSPD {
dup length /d exch dict def
{
/v exch def
/k exch def
currentpagedevice k known {
/cpdv currentpagedevice k get def
v cpdv ne {
/upd false def
/nullv v type /nulltype eq def
/nullcpdv cpdv type /nulltype eq def
nullv nullcpdv or
{
/upd true def
} {
/sametype v type cpdv type eq def
sametype {
v type /arraytype eq {
/vlen v length def
/cpdvlen cpdv length def
vlen cpdvlen eq {
0 1 vlen 1 sub {
/i exch def
/obj v i get def
/cpdobj cpdv i get def
obj cpdobj ne {
/upd true def
exit
} if
} for
} {
/upd true def
} ifelse
} {
v type /dicttype eq {
v {
/dv exch def
/dk exch def
/cpddv cpdv dk get def
dv cpddv ne {
/upd true def
exit
} if
} forall
} {
/upd true def
} ifelse
} ifelse
} if
} ifelse
upd true eq {
d k v put
} if
} if
} if
} forall
d length 0 gt {
d setpagedevice
} if
} bd
%%EndResource
%%BeginResource: procset (Apache XML Graphics EPS ProcSet) 1.0 0
%%Version: 1.0 0
%%Copyright: (Copyright 2002-2003 The Apache Software Foundation. License terms: http://www.apache.org/licenses/LICENSE-2.0)
/BeginEPSF { %def
/b4_Inc_state save def         % Save state for cleanup
/dict_count countdictstack def % Count objects on dict stack
/op_count count 1 sub def      % Count objects on operand stack
userdict begin                 % Push userdict on dict stack
/showpage { } def              % Redefine showpage, { } = null proc
0 setgray 0 setlinecap         % Prepare graphics state
1 setlinewidth 0 setlinejoin
10 setmiterlimit [ ] 0 setdash newpath
/languagelevel where           % If level not equal to 1 then
{pop languagelevel             % set strokeadjust and
1 ne                           % overprint to their defaults.
{false setstrokeadjust false setoverprint
} if
} if
} bd
/EndEPSF { %def
count op_count sub {pop} repeat            % Clean up stacks
countdictstack dict_count sub {end} repeat
b4_Inc_state restore
} bd
%%EndResource
%FOPBeginFontDict
%%IncludeResource: font Courier-Bold
%%IncludeResource: font Helvetica
%%IncludeResource: font Courier-BoldOblique
%%IncludeResource: font Courier-Oblique
%%IncludeResource: font Times-Roman
%%IncludeResource: font Helvetica-BoldOblique
%%IncludeResource: font Helvetica-Bold
%%IncludeResource: font Helvetica-Oblique
%%IncludeResource: font Times-BoldItalic
%%IncludeResource: font Courier
%%IncludeResource: font Times-Italic
%%IncludeResource: font Times-Bold
%%IncludeResource: font Symbol
%%IncludeResource: font ZapfDingbats
%FOPEndFontDict
%%BeginResource: encoding WinAnsiEncoding
/WinAnsiEncoding [
/.notdef /.notdef /.notdef /.notdef /.notdef
/.notdef /.notdef /.notdef /.notdef /.notdef
/.notdef /.notdef /.notdef /.notdef /.notdef
/.notdef /.notdef /.notdef /.notdef /.notdef
/.notdef /.notdef /.notdef /.notdef /.notdef
/.notdef /.notdef /.notdef /.notdef /.notdef
/.notdef /.notdef /space /exclam /quotedbl
/numbersign /dollar /percent /ampersand /quotesingle
/parenleft /parenright /asterisk /plus /comma
/hyphen /period /slash /zero /one
/two /three /four /five /six
/seven /eight /nine /colon /semicolon
/less /equal /greater /question /at
/A /B /C /D /E
/F /G /H /I /J
/K /L /M /N /O
/P /Q /R /S /T
/U /V /W /X /Y
/Z /bracketleft /backslash /bracketright /asciicircum
/underscore /quoteleft /a /b /c
/d /e /f /g /h
/i /j /k /l /m
/n /o /p /q /r
/s /t /u /v /w
/x /y /z /braceleft /bar
/braceright /asciitilde /bullet /Euro /bullet
/quotesinglbase /florin /quotedblbase /ellipsis /dagger
/daggerdbl /circumflex /perthousand /Scaron /guilsinglleft
/OE /bullet /Zcaron /bullet /bullet
/quoteleft /quoteright /quotedblleft /quotedblright /bullet
/endash /emdash /asciitilde /trademark /scaron
/guilsinglright /oe /bullet /zcaron /Ydieresis
/space /exclamdown /cent /sterling /currency
/yen /brokenbar /section /dieresis /copyright
/ordfeminine /guillemotleft /logicalnot /sfthyphen /registered
/macron /degree /plusminus /twosuperior /threesuperior
/acute /mu /paragraph /middot /cedilla
/onesuperior /ordmasculine /guillemotright /onequarter /onehalf
/threequarters /questiondown /Agrave /Aacute /Acircumflex
/Atilde /Adieresis /Aring /AE /Ccedilla
/Egrave /Eacute /Ecircumflex /Edieresis /Igrave
/Iacute /Icircumflex /Idieresis /Eth /Ntilde
/Ograve /Oacute /Ocircumflex /Otilde /Odieresis
/multiply /Oslash /Ugrave /Uacute /Ucircumflex
/Udieresis /Yacute /Thorn /germandbls /agrave
/aacute /acircumflex /atilde /adieresis /aring
/ae /ccedilla /egrave /eacute /ecircumflex
/edieresis /igrave /iacute /icircumflex /idieresis
/eth /ntilde /ograve /oacute /ocircumflex
/otilde /odieresis /divide /oslash /ugrave
/uacute /ucircumflex /udieresis /yacute /thorn
/ydieresis
] def
%%EndResource
%FOPBeginFontReencode
/Courier-Bold findfont
dup length dict begin
  {1 index /FID ne {def} {pop pop} ifelse} forall
  /Encoding WinAnsiEncoding def
  currentdict
end
/Courier-Bold exch definefont pop
/Helvetica findfont
dup length dict begin
  {1 index /FID ne {def} {pop pop} ifelse} forall
  /Encoding WinAnsiEncoding def
  currentdict
end
/Helvetica exch definefont pop
/Courier-BoldOblique findfont
dup length dict begin
  {1 index /FID ne {def} {pop pop} ifelse} forall
  /Encoding WinAnsiEncoding def
  currentdict
end
/Courier-BoldOblique exch definefont pop
/Courier-Oblique findfont
dup length dict begin
  {1 index /FID ne {def} {pop pop} ifelse} forall
  /Encoding WinAnsiEncoding def
  currentdict
end
/Courier-Oblique exch definefont pop
/Times-Roman findfont
dup length dict begin
  {1 index /FID ne {def} {pop pop} ifelse} forall
  /Encoding WinAnsiEncoding def
  currentdict
end
/Times-Roman exch definefont pop
/Helvetica-BoldOblique findfont
dup length dict begin
  {1 index /FID ne {def} {pop pop} ifelse} forall
  /Encoding WinAnsiEncoding def
  currentdict
end
/Helvetica-BoldOblique exch definefont pop
/Helvetica-Bold findfont
dup length dict begin
  {1 index /FID ne {def} {pop pop} ifelse} forall
  /Encoding WinAnsiEncoding def
  currentdict
end
/Helvetica-Bold exch definefont pop
/Helvetica-Oblique findfont
dup length dict begin
  {1 index /FID ne {def} {pop pop} ifelse} forall
  /Encoding WinAnsiEncoding def
  currentdict
end
/Helvetica-Oblique exch definefont pop
/Times-BoldItalic findfont
dup length dict begin
  {1 index /FID ne {def} {pop pop} ifelse} forall
  /Encoding WinAnsiEncoding def
  currentdict
end
/Times-BoldItalic exch definefont pop
/Courier findfont
dup length dict begin
  {1 index /FID ne {def} {pop pop} ifelse} forall
  /Encoding WinAnsiEncoding def
  currentdict
end
/Courier exch definefont pop
/Times-Italic findfont
dup length dict begin
  {1 index /FID ne {def} {pop pop} ifelse} forall
  /Encoding WinAnsiEncoding def
  currentdict
end
/Times-Italic exch definefont pop
/Times-Bold findfont
dup length dict begin
  {1 index /FID ne {def} {pop pop} ifelse} forall
  /Encoding WinAnsiEncoding def
  currentdict
end
/Times-Bold exch definefont pop
%FOPEndFontReencode
%%EndProlog
%%Page: 1 1
%%PageBoundingBox: 0 0 1072 525
%%BeginPageSetup
[1 0 0 -1 0 525] CT
%%EndPageSetup
GS
[0.55814 0 0 0.55814 0 0.34882] CT
1 GC
N
0 0 1920 940 re
f
GR
GS
[0.55814 0 0 0.55814 0 0.34882] CT
1 GC
N
0 0 1920 940 re
f
GR
GS
[0.55814 0 0 0.55814 0 0.34882] CT
1 GC
N
250 837 M
1738 837 L
1738 70 L
250 70 L
cp
f
GR
GS
[0.55814 0 0 0.55814 0 0.34882] CT
0.873 GC
2 setlinecap
10.0 ML
N
250 837 M
250 70 L
S
GR
GS
[0.55814 0 0 0.55814 0 0.34882] CT
0.873 GC
2 setlinecap
10.0 ML
N
398.8 837 M
398.8 70 L
S
GR
GS
[0.55814 0 0 0.55814 0 0.34882] CT
0.873 GC
2 setlinecap
10.0 ML
N
547.6 837 M
547.6 70 L
S
GR
GS
[0.55814 0 0 0.55814 0 0.34882] CT
0.873 GC
2 setlinecap
10.0 ML
N
696.4 837 M
696.4 70 L
S
GR
GS
[0.55814 0 0 0.55814 0 0.34882] CT
0.873 GC
2 setlinecap
10.0 ML
N
845.2 837 M
845.2 70 L
S
GR
GS
[0.55814 0 0 0.55814 0 0.34882] CT
0.873 GC
2 setlinecap
10.0 ML
N
994 837 M
994 70 L
S
GR
GS
[0.55814 0 0 0.55814 0 0.34882] CT
0.873 GC
2 setlinecap
10.0 ML
N
1142.8 837 M
1142.8 70 L
S
GR
GS
[0.55814 0 0 0.55814 0 0.34882] CT
0.873 GC
2 setlinecap
10.0 ML
N
1291.6 837 M
1291.6 70 L
S
GR
GS
[0.55814 0 0 0.55814 0 0.34882] CT
0.873 GC
2 setlinecap
10.0 ML
N
1440.4 837 M
1440.4 70 L
S
GR
GS
[0.55814 0 0 0.55814 0 0.34882] CT
0.873 GC
2 setlinecap
10.0 ML
N
1589.2 837 M
1589.2 70 L
S
GR
GS
[0.55814 0 0 0.55814 0 0.34882] CT
0.873 GC
2 setlinecap
10.0 ML
N
1738 837 M
1738 70 L
S
GR
GS
[0.55814 0 0 0.55814 0 0.34882] CT
0.873 GC
2 setlinecap
10.0 ML
N
1738 837 M
250 837 L
S
GR
GS
[0.55814 0 0 0.55814 0 0.34882] CT
0.873 GC
2 setlinecap
10.0 ML
N
1738 683.6 M
250 683.6 L
S
GR
GS
[0.55814 0 0 0.55814 0 0.34882] CT
0.873 GC
2 setlinecap
10.0 ML
N
1738 530.2 M
250 530.2 L
S
GR
GS
[0.55814 0 0 0.55814 0 0.34882] CT
0.873 GC
2 setlinecap
10.0 ML
N
1738 376.8 M
250 376.8 L
S
GR
GS
[0.55814 0 0 0.55814 0 0.34882] CT
0.873 GC
2 setlinecap
10.0 ML
N
1738 223.4 M
250 223.4 L
S
GR
GS
[0.55814 0 0 0.55814 0 0.34882] CT
0.873 GC
2 setlinecap
10.0 ML
N
1738 70 M
250 70 L
S
GR
GS
[0.55814 0 0 0.55814 554.79112 485.34886] CT
0.149 GC
/Helvetica 20 F
GS
[1 0 0 1 0 0] CT
-5 21 moveto 
1 -1 scale
(x) t 
GR
GR
GS
[0.55814 0 0 0.55814 0 0.34882] CT
0.149 GC
2 setlinecap
10.0 ML
N
250 837 M
1738 837 L
S
GR
GS
[0.55814 0 0 0.55814 0 0.34882] CT
0.149 GC
2 setlinecap
10.0 ML
N
250 70 M
1738 70 L
S
GR
GS
[0.55814 0 0 0.55814 0 0.34882] CT
0.149 GC
2 setlinecap
10.0 ML
N
250 837 M
250 822.12 L
S
GR
GS
[0.55814 0 0 0.55814 0 0.34882] CT
0.149 GC
2 setlinecap
10.0 ML
N
398.8 837 M
398.8 822.12 L
S
GR
GS
[0.55814 0 0 0.55814 0 0.34882] CT
0.149 GC
2 setlinecap
10.0 ML
N
547.6 837 M
547.6 822.12 L
S
GR
GS
[0.55814 0 0 0.55814 0 0.34882] CT
0.149 GC
2 setlinecap
10.0 ML
N
696.4 837 M
696.4 822.12 L
S
GR
GS
[0.55814 0 0 0.55814 0 0.34882] CT
0.149 GC
2 setlinecap
10.0 ML
N
845.2 837 M
845.2 822.12 L
S
GR
GS
[0.55814 0 0 0.55814 0 0.34882] CT
0.149 GC
2 setlinecap
10.0 ML
N
994 837 M
994 822.12 L
S
GR
GS
[0.55814 0 0 0.55814 0 0.34882] CT
0.149 GC
2 setlinecap
10.0 ML
N
1142.8 837 M
1142.8 822.12 L
S
GR
GS
[0.55814 0 0 0.55814 0 0.34882] CT
0.149 GC
2 setlinecap
10.0 ML
N
1291.6 837 M
1291.6 822.12 L
S
GR
GS
[0.55814 0 0 0.55814 0 0.34882] CT
0.149 GC
2 setlinecap
10.0 ML
N
1440.4 837 M
1440.4 822.12 L
S
GR
GS
[0.55814 0 0 0.55814 0 0.34882] CT
0.149 GC
2 setlinecap
10.0 ML
N
1589.2 837 M
1589.2 822.12 L
S
GR
GS
[0.55814 0 0 0.55814 0 0.34882] CT
0.149 GC
2 setlinecap
10.0 ML
N
1738 837 M
1738 822.12 L
S
GR
GS
[0.55814 0 0 0.55814 0 0.34882] CT
0.149 GC
2 setlinecap
10.0 ML
N
250 70 M
250 84.88 L
S
GR
GS
[0.55814 0 0 0.55814 0 0.34882] CT
0.149 GC
2 setlinecap
10.0 ML
N
398.8 70 M
398.8 84.88 L
S
GR
GS
[0.55814 0 0 0.55814 0 0.34882] CT
0.149 GC
2 setlinecap
10.0 ML
N
547.6 70 M
547.6 84.88 L
S
GR
GS
[0.55814 0 0 0.55814 0 0.34882] CT
0.149 GC
2 setlinecap
10.0 ML
N
696.4 70 M
696.4 84.88 L
S
GR
GS
[0.55814 0 0 0.55814 0 0.34882] CT
0.149 GC
2 setlinecap
10.0 ML
N
845.2 70 M
845.2 84.88 L
S
GR
GS
[0.55814 0 0 0.55814 0 0.34882] CT
0.149 GC
2 setlinecap
10.0 ML
N
994 70 M
994 84.88 L
S
GR
GS
[0.55814 0 0 0.55814 0 0.34882] CT
0.149 GC
2 setlinecap
10.0 ML
N
1142.8 70 M
1142.8 84.88 L
S
GR
GS
[0.55814 0 0 0.55814 0 0.34882] CT
0.149 GC
2 setlinecap
10.0 ML
N
1291.6 70 M
1291.6 84.88 L
S
GR
GS
[0.55814 0 0 0.55814 0 0.34882] CT
0.149 GC
2 setlinecap
10.0 ML
N
1440.4 70 M
1440.4 84.88 L
S
GR
GS
[0.55814 0 0 0.55814 0 0.34882] CT
0.149 GC
2 setlinecap
10.0 ML
N
1589.2 70 M
1589.2 84.88 L
S
GR
GS
[0.55814 0 0 0.55814 0 0.34882] CT
0.149 GC
2 setlinecap
10.0 ML
N
1738 70 M
1738 84.88 L
S
GR
GS
[0.55814 0 0 0.55814 139.53489 471.5116] CT
0.149 GC
/Helvetica 18 F
GS
[1 0 0 1 0 0] CT
-8.5 19 moveto 
1 -1 scale
(-1) t 
GR
GR
GS
[0.55814 0 0 0.55814 222.58604 471.5116] CT
0.149 GC
/Helvetica 18 F
GS
[1 0 0 1 0 0] CT
-16 19 moveto 
1 -1 scale
(-0.8) t 
GR
GR
GS
[0.55814 0 0 0.55814 305.6372 471.5116] CT
0.149 GC
/Helvetica 18 F
GS
[1 0 0 1 0 0] CT
-16 19 moveto 
1 -1 scale
(-0.6) t 
GR
GR
GS
[0.55814 0 0 0.55814 388.68839 471.5116] CT
0.149 GC
/Helvetica 18 F
GS
[1 0 0 1 0 0] CT
-16 19 moveto 
1 -1 scale
(-0.4) t 
GR
GR
GS
[0.55814 0 0 0.55814 471.73955 471.5116] CT
0.149 GC
/Helvetica 18 F
GS
[1 0 0 1 0 0] CT
-16 19 moveto 
1 -1 scale
(-0.2) t 
GR
GR
GS
[0.55814 0 0 0.55814 554.79071 471.5116] CT
0.149 GC
/Helvetica 18 F
GS
[1 0 0 1 0 0] CT
-5.5 19 moveto 
1 -1 scale
(0) t 
GR
GR
GS
[0.55814 0 0 0.55814 637.8419 471.5116] CT
0.149 GC
/Helvetica 18 F
GS
[1 0 0 1 0 0] CT
-13 19 moveto 
1 -1 scale
(0.2) t 
GR
GR
GS
[0.55814 0 0 0.55814 720.89302 471.5116] CT
0.149 GC
/Helvetica 18 F
GS
[1 0 0 1 0 0] CT
-13 19 moveto 
1 -1 scale
(0.4) t 
GR
GR
GS
[0.55814 0 0 0.55814 803.94422 471.5116] CT
0.149 GC
/Helvetica 18 F
GS
[1 0 0 1 0 0] CT
-13 19 moveto 
1 -1 scale
(0.6) t 
GR
GR
GS
[0.55814 0 0 0.55814 886.99534 471.5116] CT
0.149 GC
/Helvetica 18 F
GS
[1 0 0 1 0 0] CT
-13 19 moveto 
1 -1 scale
(0.8) t 
GR
GR
GS
[0.55814 0 0 0.55814 970.04653 471.5116] CT
0.149 GC
/Helvetica 18 F
GS
[1 0 0 1 0 0] CT
-5.5 19 moveto 
1 -1 scale
(1) t 
GR
GR
GS
[0.55814 0 0 0.55814 0 0.34882] CT
0.149 GC
2 setlinecap
10.0 ML
N
250 837 M
250 70 L
S
GR
GS
[0.55814 0 0 0.55814 0 0.34882] CT
0.149 GC
2 setlinecap
10.0 ML
N
1738 837 M
1738 70 L
S
GR
GS
[0.55814 0 0 0.55814 0 0.34882] CT
0.149 GC
2 setlinecap
10.0 ML
N
250 837 M
264.88 837 L
S
GR
GS
[0.55814 0 0 0.55814 0 0.34882] CT
0.149 GC
2 setlinecap
10.0 ML
N
250 683.6 M
264.88 683.6 L
S
GR
GS
[0.55814 0 0 0.55814 0 0.34882] CT
0.149 GC
2 setlinecap
10.0 ML
N
250 530.2 M
264.88 530.2 L
S
GR
GS
[0.55814 0 0 0.55814 0 0.34882] CT
0.149 GC
2 setlinecap
10.0 ML
N
250 376.8 M
264.88 376.8 L
S
GR
GS
[0.55814 0 0 0.55814 0 0.34882] CT
0.149 GC
2 setlinecap
10.0 ML
N
250 223.4 M
264.88 223.4 L
S
GR
GS
[0.55814 0 0 0.55814 0 0.34882] CT
0.149 GC
2 setlinecap
10.0 ML
N
250 70 M
264.88 70 L
S
GR
GS
[0.55814 0 0 0.55814 0 0.34882] CT
0.149 GC
2 setlinecap
10.0 ML
N
1738 837 M
1723.12 837 L
S
GR
GS
[0.55814 0 0 0.55814 0 0.34882] CT
0.149 GC
2 setlinecap
10.0 ML
N
1738 683.6 M
1723.12 683.6 L
S
GR
GS
[0.55814 0 0 0.55814 0 0.34882] CT
0.149 GC
2 setlinecap
10.0 ML
N
1738 530.2 M
1723.12 530.2 L
S
GR
GS
[0.55814 0 0 0.55814 0 0.34882] CT
0.149 GC
2 setlinecap
10.0 ML
N
1738 376.8 M
1723.12 376.8 L
S
GR
GS
[0.55814 0 0 0.55814 0 0.34882] CT
0.149 GC
2 setlinecap
10.0 ML
N
1738 223.4 M
1723.12 223.4 L
S
GR
GS
[0.55814 0 0 0.55814 0 0.34882] CT
0.149 GC
2 setlinecap
10.0 ML
N
1738 70 M
1723.12 70 L
S
GR
GS
[0.55814 0 0 0.55814 135.5349 467.51163] CT
0.149 GC
/Helvetica 18 F
GS
[1 0 0 1 0 0] CT
-32 7.5 moveto 
1 -1 scale
(-2.5) t 
GR
GR
GS
[0.55814 0 0 0.55814 135.5349 381.893] CT
0.149 GC
/Helvetica 18 F
GS
[1 0 0 1 0 0] CT
-17 7.5 moveto 
1 -1 scale
(-2) t 
GR
GR
GS
[0.55814 0 0 0.55814 135.5349 296.27442] CT
0.149 GC
/Helvetica 18 F
GS
[1 0 0 1 0 0] CT
-32 7.5 moveto 
1 -1 scale
(-1.5) t 
GR
GR
GS
[0.55814 0 0 0.55814 135.5349 210.65579] CT
0.149 GC
/Helvetica 18 F
GS
[1 0 0 1 0 0] CT
-17 7.5 moveto 
1 -1 scale
(-1) t 
GR
GR
GS
[0.55814 0 0 0.55814 135.5349 125.03719] CT
0.149 GC
/Helvetica 18 F
GS
[1 0 0 1 0 0] CT
-32 7.5 moveto 
1 -1 scale
(-0.5) t 
GR
GR
GS
[0.55814 0 0 0.55814 135.5349 39.41858] CT
0.149 GC
/Helvetica 18 F
GS
[1 0 0 1 0 0] CT
-11 7.5 moveto 
1 -1 scale
(0) t 
GR
GR
GS
[0.55814 0 0 0.55814 0 0.34882] CT
0 0.447 0.741 RC
2 LJ
N
250 739.039 M
252.976 731.369 L
255.952 723.781 L
258.928 716.273 L
261.904 708.845 L
264.88 701.497 L
267.856 694.225 L
270.832 687.031 L
273.808 679.912 L
276.784 672.868 L
279.76 665.899 L
282.736 659.002 L
285.712 652.177 L
288.688 645.424 L
291.664 638.741 L
294.64 632.127 L
300.592 619.106 L
303.568 612.696 L
309.52 600.074 L
315.472 587.711 L
321.424 575.601 L
327.376 563.737 L
333.328 552.114 L
339.28 540.726 L
345.232 529.568 L
351.184 518.635 L
357.136 507.921 L
363.088 497.422 L
369.04 487.133 L
374.992 477.048 L
380.944 467.165 L
386.896 457.477 L
392.848 447.981 L
404.752 429.548 L
410.704 420.604 L
422.608 403.238 L
428.56 394.81 L
440.464 378.447 L
452.368 362.717 L
464.272 347.597 L
476.176 333.062 L
488.08 319.09 L
499.984 305.659 L
511.888 292.751 L
523.792 280.345 L
535.696 268.425 L
547.6 256.972 L
559.504 245.973 L
571.408 235.411 L
583.312 225.272 L
S
GR
GS
[0.55814 0 0 0.55814 0 0.34882] CT
0 0.447 0.741 RC
2 LJ
N
583.312 225.272 M
595.216 215.544 L
607.12 206.213 L
619.024 197.268 L
630.928 188.698 L
654.736 172.638 L
666.64 165.13 L
690.448 151.114 L
702.352 144.589 L
726.16 132.469 L
749.968 121.545 L
773.776 111.771 L
797.584 103.104 L
821.392 95.509 L
845.2 88.956 L
869.008 83.418 L
892.816 78.873 L
916.624 75.304 L
940.432 72.698 L
964.24 71.044 L
988.048 70.336 L
1011.856 70.572 L
1035.664 71.752 L
1059.472 73.882 L
1083.28 76.968 L
1107.088 81.022 L
1130.896 86.061 L
1154.704 92.104 L
1178.512 99.175 L
1202.32 107.301 L
1226.128 116.517 L
1249.936 126.861 L
1273.744 138.376 L
1297.552 151.114 L
1321.36 165.13 L
1333.264 172.638 L
1357.072 188.698 L
1368.976 197.268 L
1392.784 215.544 L
1404.688 225.272 L
1428.496 245.973 L
1440.4 256.972 L
1452.304 268.425 L
1464.208 280.345 L
1476.112 292.751 L
1488.016 305.659 L
1499.92 319.09 L
1511.824 333.062 L
1523.728 347.597 L
1535.632 362.717 L
S
GR
GS
[0.55814 0 0 0.55814 0 0.34882] CT
0 0.447 0.741 RC
2 LJ
N
1535.632 362.717 M
1547.536 378.447 L
1559.44 394.81 L
1571.344 411.835 L
1583.248 429.548 L
1595.152 447.981 L
1607.056 467.165 L
1618.96 487.133 L
1630.864 507.921 L
1642.768 529.568 L
1654.672 552.114 L
1666.576 575.601 L
1678.48 600.074 L
1690.384 625.583 L
1702.288 652.177 L
1714.192 679.912 L
1726.096 708.845 L
1738 739.039 L
S
GR
GS
[0.55814 0 0 0.55814 500.09303 34.95347] CT
/Helvetica-Bold 20 F
GS
[1 0 0 1 0 0] CT
0 0 moveto 
1 -1 scale
(cos\(x\)-exp\(0.001+x) t 
GR
GR
GS
[0.55814 0 0 0.55814 600.55815 29.93021] CT
/Helvetica-Bold 14 F
GS
[1 0 0 1 0 0] CT
0 0 moveto 
1 -1 scale
(2) t 
GR
GR
GS
[0.55814 0 0 0.55814 605.02327 34.95347] CT
/Helvetica-Bold 20 F
GS
[1 0 0 1 0 0] CT
0 0 moveto 
1 -1 scale
(\)) t 
GR
GR
%%Trailer
%%Pages: 1
%%EOF
