%!PS-Adobe-3.0 EPSF-3.0
%%Creator: (MATLAB, The Mathworks, Inc. Version 8.5.0.197613 \(R2015a\). Operating System: Windows 7)
%%Title: C:/Users/Shurshurik/Desktop/matlab_student/5/figure7.eps
%%CreationDate: 2018-12-04T13:57:25
%%Pages: (atend)
%%BoundingBox: 0 0 420 315
%%LanguageLevel: 2
%%EndComments
%%BeginProlog
%%BeginResource: procset (Apache XML Graphics Std ProcSet) 1.2 0
%%Version: 1.2 0
%%Copyright: (Copyright 2001-2003,2010 The Apache Software Foundation. License terms: http://www.apache.org/licenses/LICENSE-2.0)
/bd{bind def}bind def
/ld{load def}bd
/GR/grestore ld
/M/moveto ld
/LJ/setlinejoin ld
/C/curveto ld
/f/fill ld
/LW/setlinewidth ld
/GC/setgray ld
/t/show ld
/N/newpath ld
/CT/concat ld
/cp/closepath ld
/S/stroke ld
/L/lineto ld
/CC/setcmykcolor ld
/A/ashow ld
/GS/gsave ld
/RC/setrgbcolor ld
/RM/rmoveto ld
/ML/setmiterlimit ld
/re {4 2 roll M
1 index 0 rlineto
0 exch rlineto
neg 0 rlineto
cp } bd
/_ctm matrix def
/_tm matrix def
/BT { _ctm currentmatrix pop matrix _tm copy pop 0 0 moveto } bd
/ET { _ctm setmatrix } bd
/iTm { _ctm setmatrix _tm concat } bd
/Tm { _tm astore pop iTm 0 0 moveto } bd
/ux 0.0 def
/uy 0.0 def
/F {
  /Tp exch def
  /Tf exch def
  Tf findfont Tp scalefont setfont
  /cf Tf def  /cs Tp def
} bd
/ULS {currentpoint /uy exch def /ux exch def} bd
/ULE {
  /Tcx currentpoint pop def
  gsave
  newpath
  cf findfont cs scalefont dup
  /FontMatrix get 0 get /Ts exch def /FontInfo get dup
  /UnderlinePosition get Ts mul /To exch def
  /UnderlineThickness get Ts mul /Tt exch def
  ux uy To add moveto  Tcx uy To add lineto
  Tt setlinewidth stroke
  grestore
} bd
/OLE {
  /Tcx currentpoint pop def
  gsave
  newpath
  cf findfont cs scalefont dup
  /FontMatrix get 0 get /Ts exch def /FontInfo get dup
  /UnderlinePosition get Ts mul /To exch def
  /UnderlineThickness get Ts mul /Tt exch def
  ux uy To add cs add moveto Tcx uy To add cs add lineto
  Tt setlinewidth stroke
  grestore
} bd
/SOE {
  /Tcx currentpoint pop def
  gsave
  newpath
  cf findfont cs scalefont dup
  /FontMatrix get 0 get /Ts exch def /FontInfo get dup
  /UnderlinePosition get Ts mul /To exch def
  /UnderlineThickness get Ts mul /Tt exch def
  ux uy To add cs 10 mul 26 idiv add moveto Tcx uy To add cs 10 mul 26 idiv add lineto
  Tt setlinewidth stroke
  grestore
} bd
/QT {
/Y22 exch store
/X22 exch store
/Y21 exch store
/X21 exch store
currentpoint
/Y21 load 2 mul add 3 div exch
/X21 load 2 mul add 3 div exch
/X21 load 2 mul /X22 load add 3 div
/Y21 load 2 mul /Y22 load add 3 div
/X22 load /Y22 load curveto
} bd
/SSPD {
dup length /d exch dict def
{
/v exch def
/k exch def
currentpagedevice k known {
/cpdv currentpagedevice k get def
v cpdv ne {
/upd false def
/nullv v type /nulltype eq def
/nullcpdv cpdv type /nulltype eq def
nullv nullcpdv or
{
/upd true def
} {
/sametype v type cpdv type eq def
sametype {
v type /arraytype eq {
/vlen v length def
/cpdvlen cpdv length def
vlen cpdvlen eq {
0 1 vlen 1 sub {
/i exch def
/obj v i get def
/cpdobj cpdv i get def
obj cpdobj ne {
/upd true def
exit
} if
} for
} {
/upd true def
} ifelse
} {
v type /dicttype eq {
v {
/dv exch def
/dk exch def
/cpddv cpdv dk get def
dv cpddv ne {
/upd true def
exit
} if
} forall
} {
/upd true def
} ifelse
} ifelse
} if
} ifelse
upd true eq {
d k v put
} if
} if
} if
} forall
d length 0 gt {
d setpagedevice
} if
} bd
%%EndResource
%%BeginResource: procset (Apache XML Graphics EPS ProcSet) 1.0 0
%%Version: 1.0 0
%%Copyright: (Copyright 2002-2003 The Apache Software Foundation. License terms: http://www.apache.org/licenses/LICENSE-2.0)
/BeginEPSF { %def
/b4_Inc_state save def         % Save state for cleanup
/dict_count countdictstack def % Count objects on dict stack
/op_count count 1 sub def      % Count objects on operand stack
userdict begin                 % Push userdict on dict stack
/showpage { } def              % Redefine showpage, { } = null proc
0 setgray 0 setlinecap         % Prepare graphics state
1 setlinewidth 0 setlinejoin
10 setmiterlimit [ ] 0 setdash newpath
/languagelevel where           % If level not equal to 1 then
{pop languagelevel             % set strokeadjust and
1 ne                           % overprint to their defaults.
{false setstrokeadjust false setoverprint
} if
} if
} bd
/EndEPSF { %def
count op_count sub {pop} repeat            % Clean up stacks
countdictstack dict_count sub {end} repeat
b4_Inc_state restore
} bd
%%EndResource
%FOPBeginFontDict
%%IncludeResource: font Courier-Bold
%%IncludeResource: font Helvetica
%%IncludeResource: font Courier-BoldOblique
%%IncludeResource: font Courier-Oblique
%%IncludeResource: font Times-Roman
%%IncludeResource: font Helvetica-BoldOblique
%%IncludeResource: font Helvetica-Bold
%%IncludeResource: font Helvetica-Oblique
%%IncludeResource: font Times-BoldItalic
%%IncludeResource: font Courier
%%IncludeResource: font Times-Italic
%%IncludeResource: font Times-Bold
%%IncludeResource: font Symbol
%%IncludeResource: font ZapfDingbats
%FOPEndFontDict
%%BeginResource: encoding WinAnsiEncoding
/WinAnsiEncoding [
/.notdef /.notdef /.notdef /.notdef /.notdef
/.notdef /.notdef /.notdef /.notdef /.notdef
/.notdef /.notdef /.notdef /.notdef /.notdef
/.notdef /.notdef /.notdef /.notdef /.notdef
/.notdef /.notdef /.notdef /.notdef /.notdef
/.notdef /.notdef /.notdef /.notdef /.notdef
/.notdef /.notdef /space /exclam /quotedbl
/numbersign /dollar /percent /ampersand /quotesingle
/parenleft /parenright /asterisk /plus /comma
/hyphen /period /slash /zero /one
/two /three /four /five /six
/seven /eight /nine /colon /semicolon
/less /equal /greater /question /at
/A /B /C /D /E
/F /G /H /I /J
/K /L /M /N /O
/P /Q /R /S /T
/U /V /W /X /Y
/Z /bracketleft /backslash /bracketright /asciicircum
/underscore /quoteleft /a /b /c
/d /e /f /g /h
/i /j /k /l /m
/n /o /p /q /r
/s /t /u /v /w
/x /y /z /braceleft /bar
/braceright /asciitilde /bullet /Euro /bullet
/quotesinglbase /florin /quotedblbase /ellipsis /dagger
/daggerdbl /circumflex /perthousand /Scaron /guilsinglleft
/OE /bullet /Zcaron /bullet /bullet
/quoteleft /quoteright /quotedblleft /quotedblright /bullet
/endash /emdash /asciitilde /trademark /scaron
/guilsinglright /oe /bullet /zcaron /Ydieresis
/space /exclamdown /cent /sterling /currency
/yen /brokenbar /section /dieresis /copyright
/ordfeminine /guillemotleft /logicalnot /sfthyphen /registered
/macron /degree /plusminus /twosuperior /threesuperior
/acute /mu /paragraph /middot /cedilla
/onesuperior /ordmasculine /guillemotright /onequarter /onehalf
/threequarters /questiondown /Agrave /Aacute /Acircumflex
/Atilde /Adieresis /Aring /AE /Ccedilla
/Egrave /Eacute /Ecircumflex /Edieresis /Igrave
/Iacute /Icircumflex /Idieresis /Eth /Ntilde
/Ograve /Oacute /Ocircumflex /Otilde /Odieresis
/multiply /Oslash /Ugrave /Uacute /Ucircumflex
/Udieresis /Yacute /Thorn /germandbls /agrave
/aacute /acircumflex /atilde /adieresis /aring
/ae /ccedilla /egrave /eacute /ecircumflex
/edieresis /igrave /iacute /icircumflex /idieresis
/eth /ntilde /ograve /oacute /ocircumflex
/otilde /odieresis /divide /oslash /ugrave
/uacute /ucircumflex /udieresis /yacute /thorn
/ydieresis
] def
%%EndResource
%FOPBeginFontReencode
/Courier-Bold findfont
dup length dict begin
  {1 index /FID ne {def} {pop pop} ifelse} forall
  /Encoding WinAnsiEncoding def
  currentdict
end
/Courier-Bold exch definefont pop
/Helvetica findfont
dup length dict begin
  {1 index /FID ne {def} {pop pop} ifelse} forall
  /Encoding WinAnsiEncoding def
  currentdict
end
/Helvetica exch definefont pop
/Courier-BoldOblique findfont
dup length dict begin
  {1 index /FID ne {def} {pop pop} ifelse} forall
  /Encoding WinAnsiEncoding def
  currentdict
end
/Courier-BoldOblique exch definefont pop
/Courier-Oblique findfont
dup length dict begin
  {1 index /FID ne {def} {pop pop} ifelse} forall
  /Encoding WinAnsiEncoding def
  currentdict
end
/Courier-Oblique exch definefont pop
/Times-Roman findfont
dup length dict begin
  {1 index /FID ne {def} {pop pop} ifelse} forall
  /Encoding WinAnsiEncoding def
  currentdict
end
/Times-Roman exch definefont pop
/Helvetica-BoldOblique findfont
dup length dict begin
  {1 index /FID ne {def} {pop pop} ifelse} forall
  /Encoding WinAnsiEncoding def
  currentdict
end
/Helvetica-BoldOblique exch definefont pop
/Helvetica-Bold findfont
dup length dict begin
  {1 index /FID ne {def} {pop pop} ifelse} forall
  /Encoding WinAnsiEncoding def
  currentdict
end
/Helvetica-Bold exch definefont pop
/Helvetica-Oblique findfont
dup length dict begin
  {1 index /FID ne {def} {pop pop} ifelse} forall
  /Encoding WinAnsiEncoding def
  currentdict
end
/Helvetica-Oblique exch definefont pop
/Times-BoldItalic findfont
dup length dict begin
  {1 index /FID ne {def} {pop pop} ifelse} forall
  /Encoding WinAnsiEncoding def
  currentdict
end
/Times-BoldItalic exch definefont pop
/Courier findfont
dup length dict begin
  {1 index /FID ne {def} {pop pop} ifelse} forall
  /Encoding WinAnsiEncoding def
  currentdict
end
/Courier exch definefont pop
/Times-Italic findfont
dup length dict begin
  {1 index /FID ne {def} {pop pop} ifelse} forall
  /Encoding WinAnsiEncoding def
  currentdict
end
/Times-Italic exch definefont pop
/Times-Bold findfont
dup length dict begin
  {1 index /FID ne {def} {pop pop} ifelse} forall
  /Encoding WinAnsiEncoding def
  currentdict
end
/Times-Bold exch definefont pop
%FOPEndFontReencode
%%EndProlog
%%Page: 1 1
%%PageBoundingBox: 0 0 420 315
%%BeginPageSetup
[1 0 0 -1 0 315] CT
%%EndPageSetup
GS
[0.55814 0 0 0.55814 0 0.20929] CT
N
0 0 M
752 0 L
752 564 L
0 564 L
0 0 L
cp
clip
1 GC
N
0 0 752 564 re
f
GR
GS
[0.55814 0 0 0.55814 0 0.20929] CT
1 GC
N
0 0 752 564 re
f
GR
GS
[0.55814 0 0 0.55814 0 0.20929] CT
1 GC
N
98 225 M
681 225 L
681 47 L
98 47 L
cp
f
GR
GS
[0.55814 0 0 0.55814 217.3955 143.62791] CT
0.149 GC
/Helvetica 20 F
GS
[1 0 0 1 0 0] CT
-13.5 21 moveto 
1 -1 scale
(t, s) t 
GR
GR
GS
[0.55814 0 0 0.55814 0 0.20929] CT
0.149 GC
2 setlinecap
10.0 ML
N
98 225 M
681 225 L
S
GR
GS
[0.55814 0 0 0.55814 0 0.20929] CT
0.149 GC
2 setlinecap
10.0 ML
N
98 47 M
681 47 L
S
GR
GS
[0.55814 0 0 0.55814 0 0.20929] CT
0.149 GC
2 setlinecap
10.0 ML
N
98 225 M
98 219.17 L
S
GR
GS
[0.55814 0 0 0.55814 0 0.20929] CT
0.149 GC
2 setlinecap
10.0 ML
N
214.6 225 M
214.6 219.17 L
S
GR
GS
[0.55814 0 0 0.55814 0 0.20929] CT
0.149 GC
2 setlinecap
10.0 ML
N
331.2 225 M
331.2 219.17 L
S
GR
GS
[0.55814 0 0 0.55814 0 0.20929] CT
0.149 GC
2 setlinecap
10.0 ML
N
447.8 225 M
447.8 219.17 L
S
GR
GS
[0.55814 0 0 0.55814 0 0.20929] CT
0.149 GC
2 setlinecap
10.0 ML
N
564.4 225 M
564.4 219.17 L
S
GR
GS
[0.55814 0 0 0.55814 0 0.20929] CT
0.149 GC
2 setlinecap
10.0 ML
N
681 225 M
681 219.17 L
S
GR
GS
[0.55814 0 0 0.55814 0 0.20929] CT
0.149 GC
2 setlinecap
10.0 ML
N
98 47 M
98 52.83 L
S
GR
GS
[0.55814 0 0 0.55814 0 0.20929] CT
0.149 GC
2 setlinecap
10.0 ML
N
214.6 47 M
214.6 52.83 L
S
GR
GS
[0.55814 0 0 0.55814 0 0.20929] CT
0.149 GC
2 setlinecap
10.0 ML
N
331.2 47 M
331.2 52.83 L
S
GR
GS
[0.55814 0 0 0.55814 0 0.20929] CT
0.149 GC
2 setlinecap
10.0 ML
N
447.8 47 M
447.8 52.83 L
S
GR
GS
[0.55814 0 0 0.55814 0 0.20929] CT
0.149 GC
2 setlinecap
10.0 ML
N
564.4 47 M
564.4 52.83 L
S
GR
GS
[0.55814 0 0 0.55814 0 0.20929] CT
0.149 GC
2 setlinecap
10.0 ML
N
681 47 M
681 52.83 L
S
GR
GS
[0.55814 0 0 0.55814 54.69767 129.79069] CT
0.149 GC
/Helvetica 18 F
GS
[1 0 0 1 0 0] CT
-5.5 19 moveto 
1 -1 scale
(0) t 
GR
GR
GS
[0.55814 0 0 0.55814 119.77674 129.79069] CT
0.149 GC
/Helvetica 18 F
GS
[1 0 0 1 0 0] CT
-13 19 moveto 
1 -1 scale
(0.2) t 
GR
GR
GS
[0.55814 0 0 0.55814 184.85581 129.79069] CT
0.149 GC
/Helvetica 18 F
GS
[1 0 0 1 0 0] CT
-13 19 moveto 
1 -1 scale
(0.4) t 
GR
GR
GS
[0.55814 0 0 0.55814 249.93489 129.79069] CT
0.149 GC
/Helvetica 18 F
GS
[1 0 0 1 0 0] CT
-13 19 moveto 
1 -1 scale
(0.6) t 
GR
GR
GS
[0.55814 0 0 0.55814 315.01396 129.79069] CT
0.149 GC
/Helvetica 18 F
GS
[1 0 0 1 0 0] CT
-13 19 moveto 
1 -1 scale
(0.8) t 
GR
GR
GS
[0.55814 0 0 0.55814 380.09301 129.79069] CT
0.149 GC
/Helvetica 18 F
GS
[1 0 0 1 0 0] CT
-5.5 19 moveto 
1 -1 scale
(1) t 
GR
GR
GS
[0.55814 0 0 0.55814 0 0.20929] CT
0.149 GC
2 setlinecap
10.0 ML
N
98 225 M
98 47 L
S
GR
GS
[0.55814 0 0 0.55814 0 0.20929] CT
0.149 GC
2 setlinecap
10.0 ML
N
681 225 M
681 47 L
S
GR
GS
[0.55814 0 0 0.55814 0 0.20929] CT
0.149 GC
2 setlinecap
10.0 ML
N
98 225 M
103.83 225 L
S
GR
GS
[0.55814 0 0 0.55814 0 0.20929] CT
0.149 GC
2 setlinecap
10.0 ML
N
98 180.5 M
103.83 180.5 L
S
GR
GS
[0.55814 0 0 0.55814 0 0.20929] CT
0.149 GC
2 setlinecap
10.0 ML
N
98 136 M
103.83 136 L
S
GR
GS
[0.55814 0 0 0.55814 0 0.20929] CT
0.149 GC
2 setlinecap
10.0 ML
N
98 91.5 M
103.83 91.5 L
S
GR
GS
[0.55814 0 0 0.55814 0 0.20929] CT
0.149 GC
2 setlinecap
10.0 ML
N
98 47 M
103.83 47 L
S
GR
GS
[0.55814 0 0 0.55814 0 0.20929] CT
0.149 GC
2 setlinecap
10.0 ML
N
681 225 M
675.17 225 L
S
GR
GS
[0.55814 0 0 0.55814 0 0.20929] CT
0.149 GC
2 setlinecap
10.0 ML
N
681 180.5 M
675.17 180.5 L
S
GR
GS
[0.55814 0 0 0.55814 0 0.20929] CT
0.149 GC
2 setlinecap
10.0 ML
N
681 136 M
675.17 136 L
S
GR
GS
[0.55814 0 0 0.55814 0 0.20929] CT
0.149 GC
2 setlinecap
10.0 ML
N
681 91.5 M
675.17 91.5 L
S
GR
GS
[0.55814 0 0 0.55814 0 0.20929] CT
0.149 GC
2 setlinecap
10.0 ML
N
681 47 M
675.17 47 L
S
GR
GS
[0.55814 0 0 0.55814 50.69767 125.79069] CT
0.149 GC
/Helvetica 18 F
GS
[1 0 0 1 0 0] CT
-17 7.5 moveto 
1 -1 scale
(-2) t 
GR
GR
GS
[0.55814 0 0 0.55814 50.69767 100.95348] CT
0.149 GC
/Helvetica 18 F
GS
[1 0 0 1 0 0] CT
-17 7.5 moveto 
1 -1 scale
(-1) t 
GR
GR
GS
[0.55814 0 0 0.55814 50.69767 76.11627] CT
0.149 GC
/Helvetica 18 F
GS
[1 0 0 1 0 0] CT
-11 7.5 moveto 
1 -1 scale
(0) t 
GR
GR
GS
[0.55814 0 0 0.55814 50.69767 51.27906] CT
0.149 GC
/Helvetica 18 F
GS
[1 0 0 1 0 0] CT
-11 7.5 moveto 
1 -1 scale
(1) t 
GR
GR
GS
[0.55814 0 0 0.55814 50.69767 26.44185] CT
0.149 GC
/Helvetica 18 F
GS
[1 0 0 1 0 0] CT
-11 7.5 moveto 
1 -1 scale
(2) t 
GR
GR
GS
[0.55814 0 0 0.55814 0 0.20929] CT
0 0.447 0.741 RC
2 LJ
N
98 136 M
98.583 95.912 L
99.166 73.278 L
99.749 76.511 L
100.332 100.797 L
100.915 131.006 L
101.498 150.086 L
102.081 148.372 L
102.664 128.757 L
103.247 104.936 L
103.83 93.678 L
104.413 105.361 L
104.996 137.928 L
105.579 177.582 L
106.162 205.89 L
106.745 209.472 L
107.328 187.063 L
107.911 150.134 L
108.494 116.737 L
109.077 101.914 L
109.66 109.844 L
110.243 131.951 L
110.826 151.978 L
111.409 155.211 L
111.992 136.837 L
112.575 104.85 L
113.158 75.912 L
113.741 66.387 L
114.324 83.403 L
114.907 120.797 L
115.49 162.156 L
116.073 189.338 L
116.656 191.882 L
117.239 172.268 L
117.822 144.187 L
118.405 124.828 L
118.988 125.361 L
119.571 144.819 L
120.154 170.691 L
120.737 185.891 L
121.32 178.322 L
121.903 147.812 L
122.486 106.624 L
123.069 73.227 L
123.652 62.663 L
124.235 78.694 L
124.818 111.952 L
125.401 145.087 L
125.984 162.103 L
126.567 156.836 L
S
GR
GS
[0.55814 0 0 0.55814 0 0.20929] CT
0 0.447 0.741 RC
2 LJ
N
126.567 156.836 M
127.15 136 L
127.733 115.164 L
128.316 109.897 L
128.899 126.913 L
129.482 160.048 L
130.065 193.306 L
130.648 209.337 L
131.231 198.773 L
131.814 165.376 L
132.397 124.188 L
132.98 93.678 L
133.563 86.109 L
134.146 101.309 L
134.729 127.181 L
135.312 146.639 L
135.895 147.172 L
136.478 127.813 L
137.061 99.732 L
137.644 80.118 L
138.227 82.662 L
138.81 109.844 L
139.393 151.203 L
139.976 188.597 L
140.559 205.613 L
141.142 196.088 L
141.725 167.15 L
142.308 135.163 L
142.891 116.789 L
143.474 120.022 L
144.057 140.049 L
144.64 162.156 L
145.223 170.086 L
145.806 155.263 L
146.389 121.866 L
146.972 84.937 L
147.555 62.528 L
148.138 66.11 L
148.721 94.418 L
149.304 134.072 L
149.887 166.639 L
150.47 178.322 L
151.053 167.064 L
151.636 143.243 L
152.219 123.628 L
152.802 121.914 L
153.385 140.994 L
153.968 171.203 L
154.551 195.489 L
155.134 198.722 L
S
GR
GS
[0.55814 0 0 0.55814 0 0.20929] CT
0 0.447 0.741 RC
2 LJ
N
155.134 198.722 M
155.717 176.088 L
156.3 136 L
156.883 95.912 L
157.466 73.278 L
158.049 76.511 L
158.632 100.797 L
159.215 131.006 L
159.798 150.086 L
160.381 148.372 L
160.964 128.757 L
161.547 104.936 L
162.13 93.678 L
162.713 105.361 L
163.296 137.928 L
163.879 177.582 L
164.462 205.89 L
165.045 209.472 L
165.628 187.063 L
166.211 150.134 L
166.794 116.737 L
167.377 101.914 L
167.96 109.844 L
168.543 131.951 L
169.126 151.978 L
169.709 155.211 L
170.292 136.837 L
170.875 104.85 L
171.458 75.912 L
172.041 66.387 L
172.624 83.403 L
173.207 120.797 L
173.79 162.156 L
174.373 189.338 L
174.956 191.882 L
175.539 172.268 L
176.122 144.187 L
176.705 124.828 L
177.288 125.361 L
177.871 144.819 L
178.454 170.691 L
179.037 185.891 L
179.62 178.322 L
180.203 147.812 L
180.786 106.624 L
181.369 73.227 L
181.952 62.663 L
182.535 78.694 L
183.118 111.952 L
183.701 145.087 L
S
GR
GS
[0.55814 0 0 0.55814 0 0.20929] CT
0 0.447 0.741 RC
2 LJ
N
183.701 145.087 M
184.284 162.103 L
184.867 156.836 L
185.45 136 L
186.033 115.164 L
186.616 109.897 L
187.199 126.913 L
187.782 160.048 L
188.365 193.306 L
188.948 209.337 L
189.531 198.773 L
190.114 165.376 L
190.697 124.188 L
191.28 93.678 L
191.863 86.109 L
192.446 101.309 L
193.029 127.181 L
193.612 146.639 L
194.195 147.172 L
194.778 127.813 L
195.361 99.732 L
195.944 80.118 L
196.527 82.662 L
197.11 109.844 L
197.693 151.203 L
198.276 188.597 L
198.859 205.613 L
199.442 196.088 L
200.025 167.15 L
200.608 135.163 L
201.191 116.789 L
201.774 120.022 L
202.357 140.049 L
202.94 162.156 L
203.523 170.086 L
204.106 155.263 L
204.689 121.866 L
205.272 84.937 L
205.855 62.528 L
206.438 66.11 L
207.021 94.418 L
207.604 134.072 L
208.187 166.639 L
208.77 178.322 L
209.353 167.064 L
209.936 143.243 L
210.519 123.628 L
211.102 121.914 L
211.685 140.994 L
212.268 171.203 L
S
GR
GS
[0.55814 0 0 0.55814 0 0.20929] CT
0 0.447 0.741 RC
2 LJ
N
212.268 171.203 M
212.851 195.489 L
213.434 198.722 L
214.017 176.088 L
214.6 136 L
215.183 95.912 L
215.766 73.278 L
216.349 76.511 L
216.932 100.797 L
217.515 131.006 L
218.098 150.086 L
218.681 148.372 L
219.264 128.757 L
219.847 104.936 L
220.43 93.678 L
221.013 105.361 L
221.596 137.928 L
222.179 177.582 L
222.762 205.89 L
223.345 209.472 L
223.928 187.063 L
224.511 150.134 L
225.094 116.737 L
225.677 101.914 L
226.26 109.844 L
226.843 131.951 L
227.426 151.978 L
228.009 155.211 L
228.592 136.837 L
229.175 104.85 L
229.758 75.912 L
230.341 66.387 L
230.924 83.403 L
231.507 120.797 L
232.09 162.156 L
232.673 189.338 L
233.256 191.882 L
233.839 172.268 L
234.422 144.187 L
235.005 124.828 L
235.588 125.361 L
236.171 144.819 L
236.754 170.691 L
237.337 185.891 L
237.92 178.322 L
238.503 147.812 L
239.086 106.624 L
239.669 73.227 L
240.252 62.663 L
240.835 78.694 L
S
GR
GS
[0.55814 0 0 0.55814 0 0.20929] CT
0 0.447 0.741 RC
2 LJ
N
240.835 78.694 M
241.418 111.952 L
242.001 145.087 L
242.584 162.103 L
243.167 156.836 L
243.75 136 L
244.333 115.164 L
244.916 109.897 L
245.499 126.913 L
246.082 160.048 L
246.665 193.306 L
247.248 209.337 L
247.831 198.773 L
248.414 165.376 L
248.997 124.188 L
249.58 93.678 L
250.163 86.109 L
250.746 101.309 L
251.329 127.181 L
251.912 146.639 L
252.495 147.172 L
253.078 127.813 L
253.661 99.732 L
254.244 80.118 L
254.827 82.662 L
255.41 109.844 L
255.993 151.203 L
256.576 188.597 L
257.159 205.613 L
257.742 196.088 L
258.325 167.15 L
258.908 135.163 L
259.491 116.789 L
260.074 120.022 L
260.657 140.049 L
261.24 162.156 L
261.823 170.086 L
262.406 155.263 L
262.989 121.866 L
263.572 84.937 L
264.155 62.528 L
264.738 66.11 L
265.321 94.418 L
265.904 134.072 L
266.487 166.639 L
267.07 178.322 L
267.653 167.064 L
268.236 143.243 L
268.819 123.628 L
269.402 121.914 L
S
GR
GS
[0.55814 0 0 0.55814 0 0.20929] CT
0 0.447 0.741 RC
2 LJ
N
269.402 121.914 M
269.985 140.994 L
270.568 171.203 L
271.151 195.489 L
271.734 198.722 L
272.317 176.088 L
272.9 136 L
273.483 95.912 L
274.066 73.278 L
274.649 76.511 L
275.232 100.797 L
275.815 131.006 L
276.398 150.086 L
276.981 148.372 L
277.564 128.757 L
278.147 104.936 L
278.73 93.678 L
279.313 105.361 L
279.896 137.928 L
280.479 177.582 L
281.062 205.89 L
281.645 209.472 L
282.228 187.063 L
282.811 150.134 L
283.394 116.737 L
283.977 101.914 L
284.56 109.844 L
285.143 131.951 L
285.726 151.978 L
286.309 155.211 L
286.892 136.837 L
287.475 104.85 L
288.058 75.912 L
288.641 66.387 L
289.224 83.403 L
289.807 120.797 L
290.39 162.156 L
290.973 189.338 L
291.556 191.882 L
292.139 172.268 L
292.722 144.187 L
293.305 124.828 L
293.888 125.361 L
294.471 144.819 L
295.054 170.691 L
295.637 185.891 L
296.22 178.322 L
296.803 147.812 L
297.386 106.624 L
297.969 73.227 L
S
GR
GS
[0.55814 0 0 0.55814 0 0.20929] CT
0 0.447 0.741 RC
2 LJ
N
297.969 73.227 M
298.552 62.663 L
299.135 78.694 L
299.718 111.952 L
300.301 145.087 L
300.884 162.103 L
301.467 156.836 L
302.05 136 L
302.633 115.164 L
303.216 109.897 L
303.799 126.913 L
304.382 160.048 L
304.965 193.306 L
305.548 209.337 L
306.131 198.773 L
306.714 165.376 L
307.297 124.188 L
307.88 93.678 L
308.463 86.109 L
309.046 101.309 L
309.629 127.181 L
310.212 146.639 L
310.795 147.172 L
311.378 127.813 L
311.961 99.732 L
312.544 80.118 L
313.127 82.662 L
313.71 109.844 L
314.293 151.203 L
314.876 188.597 L
315.459 205.613 L
316.042 196.088 L
316.625 167.15 L
317.208 135.163 L
317.791 116.789 L
318.374 120.022 L
318.957 140.049 L
319.54 162.156 L
320.123 170.086 L
320.706 155.263 L
321.289 121.866 L
321.872 84.937 L
322.455 62.528 L
323.038 66.11 L
323.621 94.418 L
324.204 134.072 L
324.787 166.639 L
325.37 178.322 L
325.953 167.064 L
326.536 143.243 L
S
GR
GS
[0.55814 0 0 0.55814 0 0.20929] CT
0 0.447 0.741 RC
2 LJ
N
326.536 143.243 M
327.119 123.628 L
327.702 121.914 L
328.285 140.994 L
328.868 171.203 L
329.451 195.489 L
330.034 198.722 L
330.617 176.088 L
331.2 136 L
331.783 95.912 L
332.366 73.278 L
332.949 76.511 L
333.532 100.797 L
334.115 131.006 L
334.698 150.086 L
335.281 148.372 L
335.864 128.757 L
336.447 104.936 L
337.03 93.678 L
337.613 105.361 L
338.196 137.928 L
338.779 177.582 L
339.362 205.89 L
339.945 209.472 L
340.528 187.063 L
341.111 150.134 L
341.694 116.737 L
342.277 101.914 L
342.86 109.844 L
343.443 131.951 L
344.026 151.978 L
344.609 155.211 L
345.192 136.837 L
345.775 104.85 L
346.358 75.912 L
346.941 66.387 L
347.524 83.403 L
348.107 120.797 L
348.69 162.156 L
349.273 189.338 L
349.856 191.882 L
350.439 172.268 L
351.022 144.187 L
351.605 124.828 L
352.188 125.361 L
352.771 144.819 L
353.354 170.691 L
353.937 185.891 L
354.52 178.322 L
355.103 147.812 L
S
GR
GS
[0.55814 0 0 0.55814 0 0.20929] CT
0 0.447 0.741 RC
2 LJ
N
355.103 147.812 M
355.686 106.624 L
356.269 73.227 L
356.852 62.663 L
357.435 78.694 L
358.018 111.952 L
358.601 145.087 L
359.184 162.103 L
359.767 156.836 L
360.35 136 L
360.933 115.164 L
361.516 109.897 L
362.099 126.913 L
362.682 160.048 L
363.265 193.306 L
363.848 209.337 L
364.431 198.773 L
365.014 165.376 L
365.597 124.188 L
366.18 93.678 L
366.763 86.109 L
367.346 101.309 L
367.929 127.181 L
368.512 146.639 L
369.095 147.172 L
369.678 127.813 L
370.261 99.732 L
370.844 80.118 L
371.427 82.662 L
372.01 109.844 L
372.593 151.203 L
373.176 188.597 L
373.759 205.613 L
374.342 196.088 L
374.925 167.15 L
375.508 135.163 L
376.091 116.789 L
376.674 120.022 L
377.257 140.049 L
377.84 162.156 L
378.423 170.086 L
379.006 155.263 L
379.589 121.866 L
380.172 84.937 L
380.755 62.528 L
381.338 66.11 L
381.921 94.418 L
382.504 134.072 L
383.087 166.639 L
383.67 178.322 L
S
GR
GS
[0.55814 0 0 0.55814 0 0.20929] CT
0 0.447 0.741 RC
2 LJ
N
383.67 178.322 M
384.253 167.064 L
384.836 143.243 L
385.419 123.628 L
386.002 121.914 L
386.585 140.994 L
387.168 171.203 L
387.751 195.489 L
388.334 198.722 L
388.917 176.088 L
389.5 136 L
390.083 95.912 L
390.666 73.278 L
391.249 76.511 L
391.832 100.797 L
392.415 131.006 L
392.998 150.086 L
393.581 148.372 L
394.164 128.757 L
394.747 104.936 L
395.33 93.678 L
395.913 105.361 L
396.496 137.928 L
397.079 177.582 L
397.662 205.89 L
398.245 209.472 L
398.828 187.063 L
399.411 150.134 L
399.994 116.737 L
400.577 101.914 L
401.16 109.844 L
401.743 131.951 L
402.326 151.978 L
402.909 155.211 L
403.492 136.837 L
404.075 104.85 L
404.658 75.912 L
405.241 66.387 L
405.824 83.403 L
406.407 120.797 L
406.99 162.156 L
407.573 189.338 L
408.156 191.882 L
408.739 172.268 L
409.322 144.187 L
409.905 124.828 L
410.488 125.361 L
411.071 144.819 L
411.654 170.691 L
412.237 185.891 L
S
GR
GS
[0.55814 0 0 0.55814 0 0.20929] CT
0 0.447 0.741 RC
2 LJ
N
412.237 185.891 M
412.82 178.322 L
413.403 147.812 L
413.986 106.624 L
414.569 73.227 L
415.152 62.663 L
415.735 78.694 L
416.318 111.952 L
416.901 145.087 L
417.484 162.103 L
418.067 156.836 L
418.65 136 L
419.233 115.164 L
419.816 109.897 L
420.399 126.913 L
420.982 160.048 L
421.565 193.306 L
422.148 209.337 L
422.731 198.773 L
423.314 165.376 L
423.897 124.188 L
424.48 93.678 L
425.063 86.109 L
425.646 101.309 L
426.229 127.181 L
426.812 146.639 L
427.395 147.172 L
427.978 127.813 L
428.561 99.732 L
429.144 80.118 L
429.727 82.662 L
430.31 109.844 L
430.893 151.203 L
431.476 188.597 L
432.059 205.613 L
432.642 196.088 L
433.225 167.15 L
433.808 135.163 L
434.391 116.789 L
434.974 120.022 L
435.557 140.049 L
436.14 162.156 L
436.723 170.086 L
437.306 155.263 L
437.889 121.866 L
438.472 84.937 L
439.055 62.528 L
439.638 66.11 L
440.221 94.418 L
440.804 134.072 L
S
GR
GS
[0.55814 0 0 0.55814 0 0.20929] CT
0 0.447 0.741 RC
2 LJ
N
440.804 134.072 M
441.387 166.639 L
441.97 178.322 L
442.553 167.064 L
443.136 143.243 L
443.719 123.628 L
444.302 121.914 L
444.885 140.994 L
445.468 171.203 L
446.051 195.489 L
446.634 198.722 L
447.217 176.088 L
447.8 136 L
448.383 95.912 L
448.966 73.278 L
449.549 76.511 L
450.132 100.797 L
450.715 131.006 L
451.298 150.086 L
451.881 148.372 L
452.464 128.757 L
453.047 104.936 L
453.63 93.678 L
454.213 105.361 L
454.796 137.928 L
455.379 177.582 L
455.962 205.89 L
456.545 209.472 L
457.128 187.063 L
457.711 150.134 L
458.294 116.737 L
458.877 101.914 L
459.46 109.844 L
460.043 131.951 L
460.626 151.978 L
461.209 155.211 L
461.792 136.837 L
462.375 104.85 L
462.958 75.912 L
463.541 66.387 L
464.124 83.403 L
464.707 120.797 L
465.29 162.156 L
465.873 189.338 L
466.456 191.882 L
467.039 172.268 L
467.622 144.187 L
468.205 124.828 L
468.788 125.361 L
469.371 144.819 L
S
GR
GS
[0.55814 0 0 0.55814 0 0.20929] CT
0 0.447 0.741 RC
2 LJ
N
469.371 144.819 M
469.954 170.691 L
470.537 185.891 L
471.12 178.322 L
471.703 147.812 L
472.286 106.624 L
472.869 73.227 L
473.452 62.663 L
474.035 78.694 L
474.618 111.952 L
475.201 145.087 L
475.784 162.103 L
476.367 156.836 L
476.95 136 L
477.533 115.164 L
478.116 109.897 L
478.699 126.913 L
479.282 160.048 L
479.865 193.306 L
480.448 209.337 L
481.031 198.773 L
481.614 165.376 L
482.197 124.188 L
482.78 93.678 L
483.363 86.109 L
483.946 101.309 L
484.529 127.181 L
485.112 146.639 L
485.695 147.172 L
486.278 127.813 L
486.861 99.732 L
487.444 80.118 L
488.027 82.662 L
488.61 109.844 L
489.193 151.203 L
489.776 188.597 L
490.359 205.613 L
490.942 196.088 L
491.525 167.15 L
492.108 135.163 L
492.691 116.789 L
493.274 120.022 L
493.857 140.049 L
494.44 162.156 L
495.023 170.086 L
495.606 155.263 L
496.189 121.866 L
496.772 84.937 L
497.355 62.528 L
497.938 66.11 L
S
GR
GS
[0.55814 0 0 0.55814 0 0.20929] CT
0 0.447 0.741 RC
2 LJ
N
497.938 66.11 M
498.521 94.418 L
499.104 134.072 L
499.687 166.639 L
500.27 178.322 L
500.853 167.064 L
501.436 143.243 L
502.019 123.628 L
502.602 121.914 L
503.185 140.994 L
503.768 171.203 L
504.351 195.489 L
504.934 198.722 L
505.517 176.088 L
506.1 136 L
506.683 95.912 L
507.266 73.278 L
507.849 76.511 L
508.432 100.797 L
509.015 131.006 L
509.598 150.086 L
510.181 148.372 L
510.764 128.757 L
511.347 104.936 L
511.93 93.678 L
512.513 105.361 L
513.096 137.928 L
513.679 177.582 L
514.262 205.89 L
514.845 209.472 L
515.428 187.063 L
516.011 150.134 L
516.594 116.737 L
517.177 101.914 L
517.76 109.844 L
518.343 131.951 L
518.926 151.978 L
519.509 155.211 L
520.092 136.837 L
520.675 104.85 L
521.258 75.912 L
521.841 66.387 L
522.424 83.403 L
523.007 120.797 L
523.59 162.156 L
524.173 189.338 L
524.756 191.882 L
525.339 172.268 L
525.922 144.187 L
526.505 124.828 L
S
GR
GS
[0.55814 0 0 0.55814 0 0.20929] CT
0 0.447 0.741 RC
2 LJ
N
526.505 124.828 M
527.088 125.361 L
527.671 144.819 L
528.254 170.691 L
528.837 185.891 L
529.42 178.322 L
530.003 147.812 L
530.586 106.624 L
531.169 73.227 L
531.752 62.663 L
532.335 78.694 L
532.918 111.952 L
533.501 145.087 L
534.084 162.103 L
534.667 156.836 L
535.25 136 L
535.833 115.164 L
536.416 109.897 L
536.999 126.913 L
537.582 160.048 L
538.165 193.306 L
538.748 209.337 L
539.331 198.773 L
539.914 165.376 L
540.497 124.188 L
541.08 93.678 L
541.663 86.109 L
542.246 101.309 L
542.829 127.181 L
543.412 146.639 L
543.995 147.172 L
544.578 127.813 L
545.161 99.732 L
545.744 80.118 L
546.327 82.662 L
546.91 109.844 L
547.493 151.203 L
548.076 188.597 L
548.659 205.613 L
549.242 196.088 L
549.825 167.15 L
550.408 135.163 L
550.991 116.789 L
551.574 120.022 L
552.157 140.049 L
552.74 162.156 L
553.323 170.086 L
553.906 155.263 L
554.489 121.866 L
555.072 84.937 L
S
GR
GS
[0.55814 0 0 0.55814 0 0.20929] CT
0 0.447 0.741 RC
2 LJ
N
555.072 84.937 M
555.655 62.528 L
556.238 66.11 L
556.821 94.418 L
557.404 134.072 L
557.987 166.639 L
558.57 178.322 L
559.153 167.064 L
559.736 143.243 L
560.319 123.628 L
560.902 121.914 L
561.485 140.994 L
562.068 171.203 L
562.651 195.489 L
563.234 198.722 L
563.817 176.088 L
564.4 136 L
564.983 95.912 L
565.566 73.278 L
566.149 76.511 L
566.732 100.797 L
567.315 131.006 L
567.898 150.086 L
568.481 148.372 L
569.064 128.757 L
569.647 104.936 L
570.23 93.678 L
570.813 105.361 L
571.396 137.928 L
571.979 177.582 L
572.562 205.89 L
573.145 209.472 L
573.728 187.063 L
574.311 150.134 L
574.894 116.737 L
575.477 101.914 L
576.06 109.844 L
576.643 131.951 L
577.226 151.978 L
577.809 155.211 L
578.392 136.837 L
578.975 104.85 L
579.558 75.912 L
580.141 66.387 L
580.724 83.403 L
581.307 120.797 L
581.89 162.156 L
582.473 189.338 L
583.056 191.882 L
583.639 172.268 L
S
GR
GS
[0.55814 0 0 0.55814 0 0.20929] CT
0 0.447 0.741 RC
2 LJ
N
583.639 172.268 M
584.222 144.187 L
584.805 124.828 L
585.388 125.361 L
585.971 144.819 L
586.554 170.691 L
587.137 185.891 L
587.72 178.322 L
588.303 147.812 L
588.886 106.624 L
589.469 73.227 L
590.052 62.663 L
590.635 78.694 L
591.218 111.952 L
591.801 145.087 L
592.384 162.103 L
592.967 156.836 L
593.55 136 L
594.133 115.164 L
594.716 109.897 L
595.299 126.913 L
595.882 160.048 L
596.465 193.306 L
597.048 209.337 L
597.631 198.773 L
598.214 165.376 L
598.797 124.188 L
599.38 93.678 L
599.963 86.109 L
600.546 101.309 L
601.129 127.181 L
601.712 146.639 L
602.295 147.172 L
602.878 127.813 L
603.461 99.732 L
604.044 80.118 L
604.627 82.662 L
605.21 109.844 L
605.793 151.203 L
606.376 188.597 L
606.959 205.613 L
607.542 196.088 L
608.125 167.15 L
608.708 135.163 L
609.291 116.789 L
609.874 120.022 L
610.457 140.049 L
611.04 162.156 L
611.623 170.086 L
612.206 155.263 L
S
GR
GS
[0.55814 0 0 0.55814 0 0.20929] CT
0 0.447 0.741 RC
2 LJ
N
612.206 155.263 M
612.789 121.866 L
613.372 84.937 L
613.955 62.528 L
614.538 66.11 L
615.121 94.418 L
615.704 134.072 L
616.287 166.639 L
616.87 178.322 L
617.453 167.064 L
618.036 143.243 L
618.619 123.628 L
619.202 121.914 L
619.785 140.994 L
620.368 171.203 L
620.951 195.489 L
621.534 198.722 L
622.117 176.088 L
622.7 136 L
623.283 95.912 L
623.866 73.278 L
624.449 76.511 L
625.032 100.797 L
625.615 131.006 L
626.198 150.086 L
626.781 148.372 L
627.364 128.757 L
627.947 104.936 L
628.53 93.678 L
629.113 105.361 L
629.696 137.928 L
630.279 177.582 L
630.862 205.89 L
631.445 209.472 L
632.028 187.063 L
632.611 150.134 L
633.194 116.737 L
633.777 101.914 L
634.36 109.844 L
634.943 131.951 L
635.526 151.978 L
636.109 155.211 L
636.692 136.837 L
637.275 104.85 L
637.858 75.912 L
638.441 66.387 L
639.024 83.403 L
639.607 120.797 L
640.19 162.156 L
640.773 189.338 L
S
GR
GS
[0.55814 0 0 0.55814 0 0.20929] CT
0 0.447 0.741 RC
2 LJ
N
640.773 189.338 M
641.356 191.882 L
641.939 172.268 L
642.522 144.187 L
643.105 124.828 L
643.688 125.361 L
644.271 144.819 L
644.854 170.691 L
645.437 185.891 L
646.02 178.322 L
646.603 147.812 L
647.186 106.624 L
647.769 73.227 L
648.352 62.663 L
648.935 78.694 L
649.518 111.952 L
650.101 145.087 L
650.684 162.103 L
651.267 156.836 L
651.85 136 L
652.433 115.164 L
653.016 109.897 L
653.599 126.913 L
654.182 160.048 L
654.765 193.306 L
655.348 209.337 L
655.931 198.773 L
656.514 165.376 L
657.097 124.188 L
657.68 93.678 L
658.263 86.109 L
658.846 101.309 L
659.429 127.181 L
660.012 146.639 L
660.595 147.172 L
661.178 127.813 L
661.761 99.732 L
662.344 80.118 L
662.927 82.662 L
663.51 109.844 L
664.093 151.203 L
664.676 188.597 L
665.259 205.613 L
665.842 196.088 L
666.425 167.15 L
667.008 135.163 L
667.591 116.789 L
668.174 120.022 L
668.757 140.049 L
669.34 162.156 L
S
GR
GS
[0.55814 0 0 0.55814 0 0.20929] CT
0 0.447 0.741 RC
2 LJ
N
669.34 162.156 M
669.923 170.086 L
670.506 155.263 L
671.089 121.866 L
671.672 84.937 L
672.255 62.528 L
672.838 66.11 L
673.421 94.418 L
674.004 134.072 L
674.587 166.639 L
675.17 178.322 L
675.753 167.064 L
676.336 143.243 L
676.919 123.628 L
677.502 121.914 L
678.085 140.994 L
678.668 171.203 L
679.251 195.489 L
679.834 198.722 L
680.417 176.088 L
S
GR
GS
[0.55814 0 0 0.55814 217.39556 24.90696] CT
/Helvetica-Bold 20 F
GS
[1 0 0 1 0 0] CT
-30.5 -5 moveto 
1 -1 scale
(Siglan) t 
GR
GR
GS
[0.55814 0 0 0.55814 0 0.20929] CT
1 GC
N
98 492 M
681 492 L
681 314 L
98 314 L
cp
f
GR
GS
[0.55814 0 0 0.55814 217.3955 292.65115] CT
0.149 GC
/Helvetica 20 F
GS
[1 0 0 1 0 0] CT
-13.5 21 moveto 
1 -1 scale
(t, s) t 
GR
GR
GS
[0.55814 0 0 0.55814 0 0.20929] CT
0.149 GC
2 LJ
N
98 492 M
681 492 L
S
GR
GS
[0.55814 0 0 0.55814 0 0.20929] CT
0.149 GC
2 LJ
N
98 314 M
681 314 L
S
GR
GS
[0.55814 0 0 0.55814 0 0.20929] CT
0.149 GC
2 LJ
N
98 492 M
98 486.17 L
S
GR
GS
[0.55814 0 0 0.55814 0 0.20929] CT
0.149 GC
2 LJ
N
214.6 492 M
214.6 486.17 L
S
GR
GS
[0.55814 0 0 0.55814 0 0.20929] CT
0.149 GC
2 LJ
N
331.2 492 M
331.2 486.17 L
S
GR
GS
[0.55814 0 0 0.55814 0 0.20929] CT
0.149 GC
2 LJ
N
447.8 492 M
447.8 486.17 L
S
GR
GS
[0.55814 0 0 0.55814 0 0.20929] CT
0.149 GC
2 LJ
N
564.4 492 M
564.4 486.17 L
S
GR
GS
[0.55814 0 0 0.55814 0 0.20929] CT
0.149 GC
2 LJ
N
681 492 M
681 486.17 L
S
GR
GS
[0.55814 0 0 0.55814 0 0.20929] CT
0.149 GC
2 LJ
N
98 314 M
98 319.83 L
S
GR
GS
[0.55814 0 0 0.55814 0 0.20929] CT
0.149 GC
2 LJ
N
214.6 314 M
214.6 319.83 L
S
GR
GS
[0.55814 0 0 0.55814 0 0.20929] CT
0.149 GC
2 LJ
N
331.2 314 M
331.2 319.83 L
S
GR
GS
[0.55814 0 0 0.55814 0 0.20929] CT
0.149 GC
2 LJ
N
447.8 314 M
447.8 319.83 L
S
GR
GS
[0.55814 0 0 0.55814 0 0.20929] CT
0.149 GC
2 LJ
N
564.4 314 M
564.4 319.83 L
S
GR
GS
[0.55814 0 0 0.55814 0 0.20929] CT
0.149 GC
2 LJ
N
681 314 M
681 319.83 L
S
GR
GS
[0.55814 0 0 0.55814 54.69767 278.81395] CT
0.149 GC
/Helvetica 18 F
GS
[1 0 0 1 0 0] CT
-5.5 19 moveto 
1 -1 scale
(0) t 
GR
GR
GS
[0.55814 0 0 0.55814 119.77674 278.81395] CT
0.149 GC
/Helvetica 18 F
GS
[1 0 0 1 0 0] CT
-13 19 moveto 
1 -1 scale
(0.2) t 
GR
GR
GS
[0.55814 0 0 0.55814 184.85581 278.81395] CT
0.149 GC
/Helvetica 18 F
GS
[1 0 0 1 0 0] CT
-13 19 moveto 
1 -1 scale
(0.4) t 
GR
GR
GS
[0.55814 0 0 0.55814 249.93489 278.81395] CT
0.149 GC
/Helvetica 18 F
GS
[1 0 0 1 0 0] CT
-13 19 moveto 
1 -1 scale
(0.6) t 
GR
GR
GS
[0.55814 0 0 0.55814 315.01396 278.81395] CT
0.149 GC
/Helvetica 18 F
GS
[1 0 0 1 0 0] CT
-13 19 moveto 
1 -1 scale
(0.8) t 
GR
GR
GS
[0.55814 0 0 0.55814 380.09301 278.81395] CT
0.149 GC
/Helvetica 18 F
GS
[1 0 0 1 0 0] CT
-5.5 19 moveto 
1 -1 scale
(1) t 
GR
GR
GS
[0.55814 0 0 0.55814 0 0.20929] CT
0.149 GC
2 setlinecap
10.0 ML
N
98 492 M
98 314 L
S
GR
GS
[0.55814 0 0 0.55814 0 0.20929] CT
0.149 GC
2 setlinecap
10.0 ML
N
681 492 M
681 314 L
S
GR
GS
[0.55814 0 0 0.55814 0 0.20929] CT
0.149 GC
2 setlinecap
10.0 ML
N
98 492 M
103.83 492 L
S
GR
GS
[0.55814 0 0 0.55814 0 0.20929] CT
0.149 GC
2 setlinecap
10.0 ML
N
98 432.667 M
103.83 432.667 L
S
GR
GS
[0.55814 0 0 0.55814 0 0.20929] CT
0.149 GC
2 setlinecap
10.0 ML
N
98 373.333 M
103.83 373.333 L
S
GR
GS
[0.55814 0 0 0.55814 0 0.20929] CT
0.149 GC
2 setlinecap
10.0 ML
N
98 314 M
103.83 314 L
S
GR
GS
[0.55814 0 0 0.55814 0 0.20929] CT
0.149 GC
2 setlinecap
10.0 ML
N
681 492 M
675.17 492 L
S
GR
GS
[0.55814 0 0 0.55814 0 0.20929] CT
0.149 GC
2 setlinecap
10.0 ML
N
681 432.667 M
675.17 432.667 L
S
GR
GS
[0.55814 0 0 0.55814 0 0.20929] CT
0.149 GC
2 setlinecap
10.0 ML
N
681 373.333 M
675.17 373.333 L
S
GR
GS
[0.55814 0 0 0.55814 0 0.20929] CT
0.149 GC
2 setlinecap
10.0 ML
N
681 314 M
675.17 314 L
S
GR
GS
[0.55814 0 0 0.55814 50.69767 274.81395] CT
0.149 GC
/Helvetica 18 F
GS
[1 0 0 1 0 0] CT
-17 7.5 moveto 
1 -1 scale
(-2) t 
GR
GR
GS
[0.55814 0 0 0.55814 50.69767 241.69767] CT
0.149 GC
/Helvetica 18 F
GS
[1 0 0 1 0 0] CT
-11 7.5 moveto 
1 -1 scale
(0) t 
GR
GR
GS
[0.55814 0 0 0.55814 50.69767 208.5814] CT
0.149 GC
/Helvetica 18 F
GS
[1 0 0 1 0 0] CT
-11 7.5 moveto 
1 -1 scale
(2) t 
GR
GR
GS
[0.55814 0 0 0.55814 50.69767 175.46511] CT
0.149 GC
/Helvetica 18 F
GS
[1 0 0 1 0 0] CT
-11 7.5 moveto 
1 -1 scale
(4) t 
GR
GR
GS
[0.55814 0 0 0.55814 0 0.20929] CT
0 0.447 0.741 RC
2 LJ
N
98 395.216 M
98.583 384.873 L
99.166 331.697 L
99.749 379.707 L
100.332 370.486 L
100.915 393.442 L
101.498 419.081 L
102.081 432.478 L
102.664 426.347 L
103.247 386.971 L
103.83 393.529 L
104.413 369.178 L
104.996 411.977 L
105.579 410.456 L
106.162 435.696 L
106.745 447.767 L
107.328 456.216 L
107.911 385.285 L
108.494 404.082 L
109.077 355.084 L
109.66 401.952 L
110.243 407.803 L
110.826 438.127 L
111.409 407.494 L
111.992 422.508 L
112.575 409.227 L
113.158 349.7 L
113.741 365.643 L
114.324 358.405 L
114.907 399.755 L
115.49 412.882 L
116.073 466.941 L
116.656 415.894 L
117.239 409.345 L
117.822 393.871 L
118.405 376.974 L
118.988 402.831 L
119.571 401.921 L
120.154 421.648 L
120.737 434.477 L
121.32 444.561 L
121.903 425.789 L
122.486 386.285 L
123.069 377.307 L
123.652 336.045 L
124.235 335.954 L
124.818 414.855 L
125.401 406.942 L
125.984 444.902 L
126.567 398.967 L
S
GR
GS
[0.55814 0 0 0.55814 0 0.20929] CT
0 0.447 0.741 RC
2 LJ
N
126.567 398.967 M
127.15 373.977 L
127.733 414.804 L
128.316 359.527 L
128.899 425.53 L
129.482 408.124 L
130.065 424.369 L
130.648 449.866 L
131.231 421.984 L
131.814 398.91 L
132.397 387.653 L
132.98 396.272 L
133.563 386.483 L
134.146 398.732 L
134.729 424.306 L
135.312 433.414 L
135.895 403.539 L
136.478 371.455 L
137.061 387.457 L
137.644 371.048 L
138.227 338.703 L
138.81 359.125 L
139.393 402.655 L
139.976 409.092 L
140.559 433.577 L
141.142 452.748 L
141.725 414.132 L
142.308 417.622 L
142.891 402.326 L
143.474 381.657 L
144.057 404.047 L
144.64 425.683 L
145.223 419.634 L
145.806 400.978 L
146.389 388.621 L
146.972 365.885 L
147.555 349.06 L
148.138 355.705 L
148.721 400.045 L
149.304 388.687 L
149.887 393.987 L
150.47 439.846 L
151.053 395.748 L
151.636 416.939 L
152.219 371.817 L
152.802 396.297 L
153.385 411.466 L
153.968 443.216 L
154.551 464.87 L
155.134 456.152 L
S
GR
GS
[0.55814 0 0 0.55814 0 0.20929] CT
0 0.447 0.741 RC
2 LJ
N
155.134 456.152 M
155.717 416.31 L
156.3 386.216 L
156.883 364.776 L
157.466 390.271 L
158.049 342.977 L
158.632 354.473 L
159.215 383.594 L
159.798 439.526 L
160.381 418.475 L
160.964 386.047 L
161.547 368.673 L
162.13 391.145 L
162.713 396.277 L
163.296 394.019 L
163.879 432.057 L
164.462 442.253 L
165.045 467.619 L
165.628 456.2 L
166.211 392.864 L
166.794 374.321 L
167.377 354.497 L
167.96 408.828 L
168.543 419.155 L
169.126 437.439 L
169.709 416.415 L
170.292 421.759 L
170.875 358.744 L
171.458 386.729 L
172.041 383.637 L
172.624 364.536 L
173.207 376.696 L
173.79 431.596 L
174.373 457.605 L
174.956 449.81 L
175.539 444.376 L
176.122 407.856 L
176.705 371.441 L
177.288 388.258 L
177.871 432.522 L
178.454 432.603 L
179.037 462.687 L
179.62 431.139 L
180.203 414.926 L
180.786 353.894 L
181.369 342.663 L
181.952 354.96 L
182.535 341.392 L
183.118 408.474 L
183.701 415.584 L
S
GR
GS
[0.55814 0 0 0.55814 0 0.20929] CT
0 0.447 0.741 RC
2 LJ
N
183.701 415.584 M
184.284 395.045 L
184.867 392.12 L
185.45 390.328 L
186.033 382.088 L
186.616 394.896 L
187.199 371.071 L
187.782 441.295 L
188.365 427.523 L
188.948 443.2 L
189.531 425.082 L
190.114 428.619 L
190.697 380.302 L
191.28 354.896 L
191.863 380.274 L
192.446 376.772 L
193.029 368.692 L
193.612 407.167 L
194.195 420.51 L
194.778 390.453 L
195.361 387.091 L
195.944 350.526 L
196.527 372.55 L
197.11 386.017 L
197.693 401.581 L
198.276 410.016 L
198.859 459.629 L
199.442 423.016 L
200.025 409.582 L
200.608 375.494 L
201.191 417.965 L
201.774 400.84 L
202.357 396.048 L
202.94 433.402 L
203.523 441.721 L
204.106 403.315 L
204.689 386.186 L
205.272 363.582 L
205.855 344.499 L
206.438 383.252 L
207.021 384.25 L
207.604 404.602 L
208.187 438.799 L
208.77 418.455 L
209.353 402.576 L
209.936 420.792 L
210.519 381.043 L
211.102 415.102 L
211.685 386.35 L
212.268 447.911 L
S
GR
GS
[0.55814 0 0 0.55814 0 0.20929] CT
0 0.447 0.741 RC
2 LJ
N
212.268 447.911 M
212.851 437.425 L
213.434 452.756 L
214.017 411.524 L
214.6 402.776 L
215.183 376.892 L
215.766 338.814 L
216.349 372.054 L
216.932 382.531 L
217.515 372.168 L
218.098 439.548 L
218.681 383.186 L
219.264 416.612 L
219.847 372.375 L
220.43 369.657 L
221.013 372.184 L
221.596 412.531 L
222.179 423.585 L
222.762 431.132 L
223.345 480.505 L
223.928 461.732 L
224.511 384.251 L
225.094 381.178 L
225.677 396.223 L
226.26 391.289 L
226.843 422.728 L
227.426 427.392 L
228.009 430.175 L
228.592 413.546 L
229.175 402.867 L
229.758 371.96 L
230.341 379.04 L
230.924 345.142 L
231.507 416.937 L
232.09 394.922 L
232.673 444.55 L
233.256 467.109 L
233.839 436.531 L
234.422 394.458 L
235.005 378.068 L
235.588 393.243 L
236.171 397.83 L
236.754 402.772 L
237.337 462.676 L
237.92 442.864 L
238.503 437.801 L
239.086 401.484 L
239.669 348.088 L
240.252 340.951 L
240.835 342.38 L
S
GR
GS
[0.55814 0 0 0.55814 0 0.20929] CT
0 0.447 0.741 RC
2 LJ
N
240.835 342.38 M
241.418 382.077 L
242.001 434.531 L
242.584 395.319 L
243.167 399.069 L
243.75 415.701 L
244.333 386.518 L
244.916 356.835 L
245.499 384.145 L
246.082 398.92 L
246.665 445.164 L
247.248 453.634 L
247.831 441.247 L
248.414 436.285 L
248.997 380.35 L
249.58 374.555 L
250.163 361.029 L
250.746 391.28 L
251.329 418.556 L
251.912 411.542 L
252.495 418.609 L
253.078 380.447 L
253.661 362.191 L
254.244 355.747 L
254.827 389.187 L
255.41 413.95 L
255.993 409.585 L
256.576 449.883 L
257.159 423.337 L
257.742 414.525 L
258.325 436.427 L
258.908 384.593 L
259.491 366.69 L
260.074 386.561 L
260.657 382.914 L
261.24 394.11 L
261.823 422.807 L
262.406 402.291 L
262.989 389.023 L
263.572 397.09 L
264.155 357.191 L
264.738 347.726 L
265.321 374.02 L
265.904 409.291 L
266.487 397.489 L
267.07 411.662 L
267.653 402.997 L
268.236 415.392 L
268.819 389.223 L
269.402 371.504 L
S
GR
GS
[0.55814 0 0 0.55814 0 0.20929] CT
0 0.447 0.741 RC
2 LJ
N
269.402 371.504 M
269.985 380.608 L
270.568 416.473 L
271.151 460.057 L
271.734 435.686 L
272.317 455.117 L
272.9 408.534 L
273.483 366.37 L
274.066 335.451 L
274.649 344.891 L
275.232 380.448 L
275.815 384.437 L
276.398 417.313 L
276.981 383.255 L
277.564 369.218 L
278.147 360.685 L
278.73 381.378 L
279.313 385.259 L
279.896 419.315 L
280.479 413.846 L
281.062 426.878 L
281.645 427.434 L
282.228 433.584 L
282.811 406.557 L
283.394 410.991 L
283.977 356.56 L
284.56 388.506 L
285.143 417.764 L
285.726 389.94 L
286.309 400.227 L
286.892 380.864 L
287.475 394.993 L
288.058 352.663 L
288.641 346.844 L
289.224 390.315 L
289.807 398.364 L
290.39 433.771 L
290.973 425.703 L
291.556 453.107 L
292.139 403.671 L
292.722 389.081 L
293.305 402.077 L
293.888 396.031 L
294.471 397.321 L
295.054 406.288 L
295.637 429.756 L
296.22 426.78 L
296.803 421.196 L
297.386 386.001 L
297.969 348.466 L
S
GR
GS
[0.55814 0 0 0.55814 0 0.20929] CT
0 0.447 0.741 RC
2 LJ
N
297.969 348.466 M
298.552 331.301 L
299.135 351.692 L
299.718 415.53 L
300.301 398.688 L
300.884 424.05 L
301.467 420.58 L
302.05 425.722 L
302.633 370.438 L
303.216 395.99 L
303.799 411.999 L
304.382 428.364 L
304.965 448.58 L
305.548 449.129 L
306.131 441.175 L
306.714 428.765 L
307.297 401.169 L
307.88 373.874 L
308.463 360.393 L
309.046 353.118 L
309.629 383.928 L
310.212 416.022 L
310.795 390.757 L
311.378 419.238 L
311.961 404.901 L
312.544 390.413 L
313.127 387.384 L
313.71 395.992 L
314.293 424.9 L
314.876 467.038 L
315.459 447.041 L
316.042 467.066 L
316.625 444.74 L
317.208 394.661 L
317.791 368.873 L
318.374 364.211 L
318.957 401.496 L
319.54 390.958 L
320.123 422.547 L
320.706 414.925 L
321.289 403.623 L
321.872 373.111 L
322.455 354.505 L
323.038 381.858 L
323.621 352.273 L
324.204 427.546 L
324.787 427.212 L
325.37 411.835 L
325.953 429.967 L
326.536 401.096 L
S
GR
GS
[0.55814 0 0 0.55814 0 0.20929] CT
0 0.447 0.741 RC
2 LJ
N
326.536 401.096 M
327.119 375.846 L
327.702 370.692 L
328.285 380.75 L
328.868 444.815 L
329.451 456.983 L
330.034 421.208 L
330.617 424.186 L
331.2 402.772 L
331.783 369.581 L
332.366 342.233 L
332.949 361.449 L
333.532 397.208 L
334.115 402.407 L
334.698 416.668 L
335.281 383.595 L
335.864 391.048 L
336.447 370.698 L
337.03 361.722 L
337.613 391.658 L
338.196 403.277 L
338.779 427.358 L
339.362 469.975 L
339.945 448.299 L
340.528 425.484 L
341.111 416.786 L
341.694 370.206 L
342.277 366.547 L
342.86 393.867 L
343.443 403.018 L
344.026 420.393 L
344.609 399.458 L
345.192 389.658 L
345.775 386.37 L
346.358 351.445 L
346.941 330.175 L
347.524 351.071 L
348.107 380.667 L
348.69 443.617 L
349.273 445.089 L
349.856 434.861 L
350.439 429.589 L
351.022 435.138 L
351.605 411.65 L
352.188 376.079 L
352.771 437.618 L
353.354 404.547 L
353.937 461.295 L
354.52 421.185 L
355.103 410.862 L
S
GR
GS
[0.55814 0 0 0.55814 0 0.20929] CT
0 0.447 0.741 RC
2 LJ
N
355.103 410.862 M
355.686 400.148 L
356.269 356.902 L
356.852 376.525 L
357.435 354.64 L
358.018 381.059 L
358.601 435.403 L
359.184 446.725 L
359.767 437.509 L
360.35 431.502 L
360.933 392.955 L
361.516 365.886 L
362.099 389.977 L
362.682 417.838 L
363.265 419.615 L
363.848 475.761 L
364.431 420.638 L
365.014 445.842 L
365.597 394.117 L
366.18 395.958 L
366.763 366.217 L
367.346 409.268 L
367.929 381.297 L
368.512 389.403 L
369.095 385.717 L
369.678 368.648 L
370.261 378.517 L
370.844 379.308 L
371.427 391.13 L
372.01 385.097 L
372.593 408.056 L
373.176 422.467 L
373.759 474.153 L
374.342 433.47 L
374.925 422.759 L
375.508 421.96 L
376.091 364.171 L
376.674 386.979 L
377.257 409.221 L
377.84 394.217 L
378.423 416.473 L
379.006 418.693 L
379.589 373.422 L
380.172 367.022 L
380.755 350.821 L
381.338 345.723 L
381.921 383.158 L
382.504 417.183 L
383.087 418.743 L
383.67 409.446 L
S
GR
GS
[0.55814 0 0 0.55814 0 0.20929] CT
0 0.447 0.741 RC
2 LJ
N
383.67 409.446 M
384.253 429.241 L
384.836 430.813 L
385.419 398.084 L
386.002 405.465 L
386.585 412.18 L
387.168 406.689 L
387.751 448.377 L
388.334 451.331 L
388.917 438.006 L
389.5 424.345 L
390.083 390.507 L
390.666 385.701 L
391.249 367.53 L
391.832 393.933 L
392.415 411.683 L
392.998 416.849 L
393.581 433.842 L
394.164 398.464 L
394.747 370.044 L
395.33 390 L
395.913 365.66 L
396.496 429.556 L
397.079 437.018 L
397.662 479.059 L
398.245 468.555 L
398.828 466.632 L
399.411 430.865 L
399.994 411.371 L
400.577 394.037 L
401.16 404.852 L
401.743 421.741 L
402.326 407.785 L
402.909 392.011 L
403.492 377.488 L
404.075 398.776 L
404.658 363.97 L
405.241 363.948 L
405.824 366.524 L
406.407 406.815 L
406.99 446.048 L
407.573 442.336 L
408.156 459.606 L
408.739 455.296 L
409.322 381.481 L
409.905 399.67 L
410.488 368.521 L
411.071 393.31 L
411.654 455.358 L
412.237 425.578 L
S
GR
GS
[0.55814 0 0 0.55814 0 0.20929] CT
0 0.447 0.741 RC
2 LJ
N
412.237 425.578 M
412.82 418.995 L
413.403 402.264 L
413.986 380.312 L
414.569 377.877 L
415.152 337.948 L
415.735 380.933 L
416.318 394.63 L
416.901 385.863 L
417.484 399.257 L
418.067 422.68 L
418.65 413.798 L
419.233 382.663 L
419.816 361.26 L
420.399 372.669 L
420.982 413.597 L
421.565 451.138 L
422.148 430.943 L
422.731 448.267 L
423.314 398.592 L
423.897 422.823 L
424.48 372.861 L
425.063 356.894 L
425.646 398.901 L
426.229 406.819 L
426.812 428.622 L
427.395 421.014 L
427.978 403.246 L
428.561 375.94 L
429.144 392.52 L
429.727 364.313 L
430.31 398.924 L
430.893 428.473 L
431.476 453.305 L
432.059 469.929 L
432.642 415.978 L
433.225 397.917 L
433.808 383.532 L
434.391 376.649 L
434.974 411.583 L
435.557 413.984 L
436.14 438.903 L
436.723 455.319 L
437.306 426.734 L
437.889 381.733 L
438.472 361.526 L
439.055 351.464 L
439.638 360.024 L
440.221 387.891 L
440.804 401.616 L
S
GR
GS
[0.55814 0 0 0.55814 0 0.20929] CT
0 0.447 0.741 RC
2 LJ
N
440.804 401.616 M
441.387 407.908 L
441.97 415.645 L
442.553 419.197 L
443.136 393.134 L
443.719 386.117 L
444.302 415.965 L
444.885 406.068 L
445.468 435.531 L
446.051 466.858 L
446.634 465.709 L
447.217 447.634 L
447.8 392.779 L
448.383 380.338 L
448.966 349.651 L
449.549 377.772 L
450.132 408.619 L
450.715 397.755 L
451.298 425.48 L
451.881 384.771 L
452.464 374.056 L
453.047 388.658 L
453.63 402.977 L
454.213 372.402 L
454.796 384.28 L
455.379 402.746 L
455.962 475.882 L
456.545 454.929 L
457.128 432.149 L
457.711 401.349 L
458.294 377.138 L
458.877 371.374 L
459.46 372.099 L
460.043 407.786 L
460.626 408.812 L
461.209 438.585 L
461.792 429.804 L
462.375 353.767 L
462.958 375.709 L
463.541 350.956 L
464.124 340.514 L
464.707 411.508 L
465.29 438.651 L
465.873 447.954 L
466.456 414.569 L
467.039 433.665 L
467.622 421.914 L
468.205 416.203 L
468.788 402.012 L
469.371 416.313 L
S
GR
GS
[0.55814 0 0 0.55814 0 0.20929] CT
0 0.447 0.741 RC
2 LJ
N
469.371 416.313 M
469.954 448.015 L
470.537 440.115 L
471.12 455.452 L
471.703 404.074 L
472.286 412.431 L
472.869 356.804 L
473.452 336.918 L
474.035 380.497 L
474.618 390.052 L
475.201 404.943 L
475.784 446.425 L
476.367 417.111 L
476.95 394.556 L
477.533 405.647 L
478.116 365.6 L
478.699 368.992 L
479.282 398.481 L
479.865 440.848 L
480.448 465.012 L
481.031 430.216 L
481.614 438.193 L
482.197 367.989 L
482.78 367.65 L
483.363 363.791 L
483.946 399.298 L
484.529 421.427 L
485.112 424.614 L
485.695 389.173 L
486.278 373.152 L
486.861 366.977 L
487.444 352.384 L
488.027 383.468 L
488.61 381.05 L
489.193 394.705 L
489.776 443.77 L
490.359 420.428 L
490.942 467.385 L
491.525 434.391 L
492.108 401.765 L
492.691 416.263 L
493.274 378.957 L
493.857 402.343 L
494.44 418.696 L
495.023 406.145 L
495.606 394.556 L
496.189 376.428 L
496.772 379.766 L
497.355 356.854 L
497.938 341.441 L
S
GR
GS
[0.55814 0 0 0.55814 0 0.20929] CT
0 0.447 0.741 RC
2 LJ
N
497.938 341.441 M
498.521 398.427 L
499.104 424.87 L
499.687 437.08 L
500.27 429.753 L
500.853 395.665 L
501.436 395.344 L
502.019 405.915 L
502.602 405.983 L
503.185 385.541 L
503.768 402.044 L
504.351 434.395 L
504.934 459.329 L
505.517 454.131 L
506.1 382.93 L
506.683 371.248 L
507.266 334.598 L
507.849 389.386 L
508.432 374.509 L
509.015 412.421 L
509.598 392.945 L
510.181 429.583 L
510.764 401.581 L
511.347 388.615 L
511.93 355.409 L
512.513 372.08 L
513.096 421.634 L
513.679 441.514 L
514.262 471.321 L
514.845 441.808 L
515.428 432.83 L
516.011 432.017 L
516.594 411.064 L
517.177 381.695 L
517.76 361.348 L
518.343 397.205 L
518.926 441.364 L
519.509 442.278 L
520.092 385.458 L
520.675 385.118 L
521.258 369.904 L
521.841 339.406 L
522.424 375.987 L
523.007 390.945 L
523.59 407.879 L
524.173 416.517 L
524.756 450.419 L
525.339 418.271 L
525.922 380.285 L
526.505 420.711 L
S
GR
GS
[0.55814 0 0 0.55814 0 0.20929] CT
0 0.447 0.741 RC
2 LJ
N
526.505 420.711 M
527.088 390.744 L
527.671 413.989 L
528.254 437.452 L
528.837 450.273 L
529.42 415.861 L
530.003 381.492 L
530.586 402.013 L
531.169 344.47 L
531.752 372.158 L
532.335 335.582 L
532.918 369.034 L
533.501 413.554 L
534.084 406.823 L
534.667 416.989 L
535.25 384.667 L
535.833 397.623 L
536.416 410.919 L
536.999 391.543 L
537.582 394.694 L
538.165 459.374 L
538.748 455.904 L
539.331 430.065 L
539.914 449.926 L
540.497 368.643 L
541.08 359.141 L
541.663 366.25 L
542.246 398.631 L
542.829 397.242 L
543.412 409.034 L
543.995 381.123 L
544.578 376.487 L
545.161 351.386 L
545.744 355.128 L
546.327 373.167 L
546.91 359.754 L
547.493 414.353 L
548.076 453.979 L
548.659 455.562 L
549.242 430.891 L
549.825 420.292 L
550.408 387.215 L
550.991 360.794 L
551.574 364.91 L
552.157 403.618 L
552.74 392.915 L
553.323 448.53 L
553.906 442.456 L
554.489 405.186 L
555.072 364.2 L
S
GR
GS
[0.55814 0 0 0.55814 0 0.20929] CT
0 0.447 0.741 RC
2 LJ
N
555.072 364.2 M
555.655 352.181 L
556.238 332.602 L
556.821 372.872 L
557.404 405.751 L
557.987 420.894 L
558.57 418.611 L
559.153 452.387 L
559.736 389.974 L
560.319 415.963 L
560.902 394.886 L
561.485 420.757 L
562.068 434.236 L
562.651 433.061 L
563.234 464.418 L
563.817 442.851 L
564.4 420.906 L
564.983 394.367 L
565.566 371.46 L
566.149 340.774 L
566.732 381.246 L
567.315 405.369 L
567.898 431.423 L
568.481 383.425 L
569.064 403.662 L
569.647 361.851 L
570.23 367.943 L
570.813 389.895 L
571.396 381.906 L
571.979 413.82 L
572.562 451.673 L
573.145 433.352 L
573.728 413.401 L
574.311 416.621 L
574.894 399.988 L
575.477 374.542 L
576.06 361.711 L
576.643 388.312 L
577.226 420.923 L
577.809 401.867 L
578.392 376.615 L
578.975 379.693 L
579.558 360.562 L
580.141 367.799 L
580.724 393.375 L
581.307 411.734 L
581.89 444.587 L
582.473 440.725 L
583.056 469.368 L
583.639 402.554 L
S
GR
GS
[0.55814 0 0 0.55814 0 0.20929] CT
0 0.447 0.741 RC
2 LJ
N
583.639 402.554 M
584.222 399.989 L
584.805 425.134 L
585.388 423.771 L
585.971 426.177 L
586.554 428.799 L
587.137 458.376 L
587.72 460.368 L
588.303 397.401 L
588.886 392.072 L
589.469 344.511 L
590.052 357.867 L
590.635 368.56 L
591.218 413.715 L
591.801 435.78 L
592.384 444.663 L
592.967 411.311 L
593.55 418.362 L
594.133 368.854 L
594.716 364.404 L
595.299 369.434 L
595.882 419.691 L
596.465 457.799 L
597.048 468.136 L
597.631 442.666 L
598.214 407.032 L
598.797 404.17 L
599.38 377.086 L
599.963 361.473 L
600.546 355.111 L
601.129 417.2 L
601.712 397.299 L
602.295 405.836 L
602.878 401.499 L
603.461 356.023 L
604.044 372.091 L
604.627 386.489 L
605.21 377.651 L
605.793 405.778 L
606.376 448.274 L
606.959 431.433 L
607.542 413.423 L
608.125 395.229 L
608.708 424.571 L
609.291 406.08 L
609.874 420.612 L
610.457 399.325 L
611.04 443.53 L
611.623 431.215 L
612.206 393.053 L
S
GR
GS
[0.55814 0 0 0.55814 0 0.20929] CT
0 0.447 0.741 RC
2 LJ
N
612.206 393.053 M
612.789 390.721 L
613.372 376.73 L
613.955 371.323 L
614.538 359.911 L
615.121 348.211 L
615.704 424.022 L
616.287 425.161 L
616.87 410.039 L
617.453 450.801 L
618.036 396.459 L
618.619 366.332 L
619.202 406.469 L
619.785 428.058 L
620.368 415.475 L
620.951 418.365 L
621.534 438.236 L
622.117 405.993 L
622.7 421.19 L
623.283 361.179 L
623.866 370.307 L
624.449 368.169 L
625.032 399.959 L
625.615 380.744 L
626.198 404.979 L
626.781 397.093 L
627.364 380.068 L
627.947 407.969 L
628.53 348.038 L
629.113 382.718 L
629.696 389.147 L
630.279 416.339 L
630.862 429.946 L
631.445 472.362 L
632.028 439.575 L
632.611 405.415 L
633.194 364.515 L
633.777 360.394 L
634.36 362.101 L
634.943 395.405 L
635.526 408.743 L
636.109 394.749 L
636.692 431.156 L
637.275 359.365 L
637.858 368.416 L
638.441 384.099 L
639.024 353.33 L
639.607 413.345 L
640.19 441.566 L
640.773 432.272 L
S
GR
GS
[0.55814 0 0 0.55814 0 0.20929] CT
0 0.447 0.741 RC
2 LJ
N
640.773 432.272 M
641.356 454.822 L
641.939 437.612 L
642.522 414.285 L
643.105 401.107 L
643.688 402.66 L
644.271 402.365 L
644.854 445.892 L
645.437 454.767 L
646.02 455.267 L
646.603 421.366 L
647.186 367.42 L
647.769 376.927 L
648.352 339.847 L
648.935 353.355 L
649.518 367.739 L
650.101 389.598 L
650.684 432.662 L
651.267 428.202 L
651.85 401.634 L
652.433 399.475 L
653.016 365.909 L
653.599 378.531 L
654.182 415.65 L
654.765 455.268 L
655.348 441.178 L
655.931 460.652 L
656.514 425.17 L
657.097 401.974 L
657.68 372.495 L
658.263 340.565 L
658.846 364.73 L
659.429 368.613 L
660.012 425.829 L
660.595 408.754 L
661.178 424.157 L
661.761 363.58 L
662.344 359.694 L
662.927 346.25 L
663.51 356.591 L
664.093 387.653 L
664.676 443.434 L
665.259 479.055 L
665.842 440.633 L
666.425 441.108 L
667.008 419.098 L
667.591 400.528 L
668.174 416.321 L
668.757 391.012 L
669.34 405.693 L
S
GR
GS
[0.55814 0 0 0.55814 0 0.20929] CT
0 0.447 0.741 RC
2 LJ
N
669.34 405.693 M
669.923 423.155 L
670.506 425.446 L
671.089 373.859 L
671.672 365.838 L
672.255 326.871 L
672.838 333.098 L
673.421 383.793 L
674.004 398.962 L
674.587 432.523 L
675.17 423.928 L
675.753 406.11 L
676.336 393.24 L
676.919 416.97 L
677.502 374.48 L
678.085 434.503 L
678.668 431.546 L
679.251 428.929 L
679.834 428.12 L
680.417 437.6 L
S
GR
GS
[0.55814 0 0 0.55814 217.39556 173.93023] CT
/Helvetica-Bold 20 F
GS
[1 0 0 1 0 0] CT
-63.5 -5 moveto 
1 -1 scale
(Signal+Noise) t 
GR
GR
%%Trailer
%%Pages: 1
%%EOF
