%!PS-Adobe-3.0 EPSF-3.0
%%Creator: (MATLAB, The Mathworks, Inc. Version 8.5.0.197613 \(R2015a\). Operating System: Windows 7)
%%Title: C:/Users/Shurshurik/Desktop/matlab_student/4/figure7.eps
%%CreationDate: 2018-11-26T15:53:21
%%Pages: (atend)
%%BoundingBox: 0 0 420 315
%%LanguageLevel: 2
%%EndComments
%%BeginProlog
%%BeginResource: procset (Apache XML Graphics Std ProcSet) 1.2 0
%%Version: 1.2 0
%%Copyright: (Copyright 2001-2003,2010 The Apache Software Foundation. License terms: http://www.apache.org/licenses/LICENSE-2.0)
/bd{bind def}bind def
/ld{load def}bd
/GR/grestore ld
/M/moveto ld
/LJ/setlinejoin ld
/C/curveto ld
/f/fill ld
/LW/setlinewidth ld
/GC/setgray ld
/t/show ld
/N/newpath ld
/CT/concat ld
/cp/closepath ld
/S/stroke ld
/L/lineto ld
/CC/setcmykcolor ld
/A/ashow ld
/GS/gsave ld
/RC/setrgbcolor ld
/RM/rmoveto ld
/ML/setmiterlimit ld
/re {4 2 roll M
1 index 0 rlineto
0 exch rlineto
neg 0 rlineto
cp } bd
/_ctm matrix def
/_tm matrix def
/BT { _ctm currentmatrix pop matrix _tm copy pop 0 0 moveto } bd
/ET { _ctm setmatrix } bd
/iTm { _ctm setmatrix _tm concat } bd
/Tm { _tm astore pop iTm 0 0 moveto } bd
/ux 0.0 def
/uy 0.0 def
/F {
  /Tp exch def
  /Tf exch def
  Tf findfont Tp scalefont setfont
  /cf Tf def  /cs Tp def
} bd
/ULS {currentpoint /uy exch def /ux exch def} bd
/ULE {
  /Tcx currentpoint pop def
  gsave
  newpath
  cf findfont cs scalefont dup
  /FontMatrix get 0 get /Ts exch def /FontInfo get dup
  /UnderlinePosition get Ts mul /To exch def
  /UnderlineThickness get Ts mul /Tt exch def
  ux uy To add moveto  Tcx uy To add lineto
  Tt setlinewidth stroke
  grestore
} bd
/OLE {
  /Tcx currentpoint pop def
  gsave
  newpath
  cf findfont cs scalefont dup
  /FontMatrix get 0 get /Ts exch def /FontInfo get dup
  /UnderlinePosition get Ts mul /To exch def
  /UnderlineThickness get Ts mul /Tt exch def
  ux uy To add cs add moveto Tcx uy To add cs add lineto
  Tt setlinewidth stroke
  grestore
} bd
/SOE {
  /Tcx currentpoint pop def
  gsave
  newpath
  cf findfont cs scalefont dup
  /FontMatrix get 0 get /Ts exch def /FontInfo get dup
  /UnderlinePosition get Ts mul /To exch def
  /UnderlineThickness get Ts mul /Tt exch def
  ux uy To add cs 10 mul 26 idiv add moveto Tcx uy To add cs 10 mul 26 idiv add lineto
  Tt setlinewidth stroke
  grestore
} bd
/QT {
/Y22 exch store
/X22 exch store
/Y21 exch store
/X21 exch store
currentpoint
/Y21 load 2 mul add 3 div exch
/X21 load 2 mul add 3 div exch
/X21 load 2 mul /X22 load add 3 div
/Y21 load 2 mul /Y22 load add 3 div
/X22 load /Y22 load curveto
} bd
/SSPD {
dup length /d exch dict def
{
/v exch def
/k exch def
currentpagedevice k known {
/cpdv currentpagedevice k get def
v cpdv ne {
/upd false def
/nullv v type /nulltype eq def
/nullcpdv cpdv type /nulltype eq def
nullv nullcpdv or
{
/upd true def
} {
/sametype v type cpdv type eq def
sametype {
v type /arraytype eq {
/vlen v length def
/cpdvlen cpdv length def
vlen cpdvlen eq {
0 1 vlen 1 sub {
/i exch def
/obj v i get def
/cpdobj cpdv i get def
obj cpdobj ne {
/upd true def
exit
} if
} for
} {
/upd true def
} ifelse
} {
v type /dicttype eq {
v {
/dv exch def
/dk exch def
/cpddv cpdv dk get def
dv cpddv ne {
/upd true def
exit
} if
} forall
} {
/upd true def
} ifelse
} ifelse
} if
} ifelse
upd true eq {
d k v put
} if
} if
} if
} forall
d length 0 gt {
d setpagedevice
} if
} bd
%%EndResource
%%BeginResource: procset (Apache XML Graphics EPS ProcSet) 1.0 0
%%Version: 1.0 0
%%Copyright: (Copyright 2002-2003 The Apache Software Foundation. License terms: http://www.apache.org/licenses/LICENSE-2.0)
/BeginEPSF { %def
/b4_Inc_state save def         % Save state for cleanup
/dict_count countdictstack def % Count objects on dict stack
/op_count count 1 sub def      % Count objects on operand stack
userdict begin                 % Push userdict on dict stack
/showpage { } def              % Redefine showpage, { } = null proc
0 setgray 0 setlinecap         % Prepare graphics state
1 setlinewidth 0 setlinejoin
10 setmiterlimit [ ] 0 setdash newpath
/languagelevel where           % If level not equal to 1 then
{pop languagelevel             % set strokeadjust and
1 ne                           % overprint to their defaults.
{false setstrokeadjust false setoverprint
} if
} if
} bd
/EndEPSF { %def
count op_count sub {pop} repeat            % Clean up stacks
countdictstack dict_count sub {end} repeat
b4_Inc_state restore
} bd
%%EndResource
%FOPBeginFontDict
%%IncludeResource: font Courier-Bold
%%IncludeResource: font Helvetica
%%IncludeResource: font Courier-BoldOblique
%%IncludeResource: font Courier-Oblique
%%IncludeResource: font Times-Roman
%%IncludeResource: font Helvetica-BoldOblique
%%IncludeResource: font Helvetica-Bold
%%IncludeResource: font Helvetica-Oblique
%%IncludeResource: font Times-BoldItalic
%%IncludeResource: font Courier
%%IncludeResource: font Times-Italic
%%IncludeResource: font Times-Bold
%%IncludeResource: font Symbol
%%IncludeResource: font ZapfDingbats
%FOPEndFontDict
%%BeginResource: encoding WinAnsiEncoding
/WinAnsiEncoding [
/.notdef /.notdef /.notdef /.notdef /.notdef
/.notdef /.notdef /.notdef /.notdef /.notdef
/.notdef /.notdef /.notdef /.notdef /.notdef
/.notdef /.notdef /.notdef /.notdef /.notdef
/.notdef /.notdef /.notdef /.notdef /.notdef
/.notdef /.notdef /.notdef /.notdef /.notdef
/.notdef /.notdef /space /exclam /quotedbl
/numbersign /dollar /percent /ampersand /quotesingle
/parenleft /parenright /asterisk /plus /comma
/hyphen /period /slash /zero /one
/two /three /four /five /six
/seven /eight /nine /colon /semicolon
/less /equal /greater /question /at
/A /B /C /D /E
/F /G /H /I /J
/K /L /M /N /O
/P /Q /R /S /T
/U /V /W /X /Y
/Z /bracketleft /backslash /bracketright /asciicircum
/underscore /quoteleft /a /b /c
/d /e /f /g /h
/i /j /k /l /m
/n /o /p /q /r
/s /t /u /v /w
/x /y /z /braceleft /bar
/braceright /asciitilde /bullet /Euro /bullet
/quotesinglbase /florin /quotedblbase /ellipsis /dagger
/daggerdbl /circumflex /perthousand /Scaron /guilsinglleft
/OE /bullet /Zcaron /bullet /bullet
/quoteleft /quoteright /quotedblleft /quotedblright /bullet
/endash /emdash /asciitilde /trademark /scaron
/guilsinglright /oe /bullet /zcaron /Ydieresis
/space /exclamdown /cent /sterling /currency
/yen /brokenbar /section /dieresis /copyright
/ordfeminine /guillemotleft /logicalnot /sfthyphen /registered
/macron /degree /plusminus /twosuperior /threesuperior
/acute /mu /paragraph /middot /cedilla
/onesuperior /ordmasculine /guillemotright /onequarter /onehalf
/threequarters /questiondown /Agrave /Aacute /Acircumflex
/Atilde /Adieresis /Aring /AE /Ccedilla
/Egrave /Eacute /Ecircumflex /Edieresis /Igrave
/Iacute /Icircumflex /Idieresis /Eth /Ntilde
/Ograve /Oacute /Ocircumflex /Otilde /Odieresis
/multiply /Oslash /Ugrave /Uacute /Ucircumflex
/Udieresis /Yacute /Thorn /germandbls /agrave
/aacute /acircumflex /atilde /adieresis /aring
/ae /ccedilla /egrave /eacute /ecircumflex
/edieresis /igrave /iacute /icircumflex /idieresis
/eth /ntilde /ograve /oacute /ocircumflex
/otilde /odieresis /divide /oslash /ugrave
/uacute /ucircumflex /udieresis /yacute /thorn
/ydieresis
] def
%%EndResource
%FOPBeginFontReencode
/Courier-Bold findfont
dup length dict begin
  {1 index /FID ne {def} {pop pop} ifelse} forall
  /Encoding WinAnsiEncoding def
  currentdict
end
/Courier-Bold exch definefont pop
/Helvetica findfont
dup length dict begin
  {1 index /FID ne {def} {pop pop} ifelse} forall
  /Encoding WinAnsiEncoding def
  currentdict
end
/Helvetica exch definefont pop
/Courier-BoldOblique findfont
dup length dict begin
  {1 index /FID ne {def} {pop pop} ifelse} forall
  /Encoding WinAnsiEncoding def
  currentdict
end
/Courier-BoldOblique exch definefont pop
/Courier-Oblique findfont
dup length dict begin
  {1 index /FID ne {def} {pop pop} ifelse} forall
  /Encoding WinAnsiEncoding def
  currentdict
end
/Courier-Oblique exch definefont pop
/Times-Roman findfont
dup length dict begin
  {1 index /FID ne {def} {pop pop} ifelse} forall
  /Encoding WinAnsiEncoding def
  currentdict
end
/Times-Roman exch definefont pop
/Helvetica-BoldOblique findfont
dup length dict begin
  {1 index /FID ne {def} {pop pop} ifelse} forall
  /Encoding WinAnsiEncoding def
  currentdict
end
/Helvetica-BoldOblique exch definefont pop
/Helvetica-Bold findfont
dup length dict begin
  {1 index /FID ne {def} {pop pop} ifelse} forall
  /Encoding WinAnsiEncoding def
  currentdict
end
/Helvetica-Bold exch definefont pop
/Helvetica-Oblique findfont
dup length dict begin
  {1 index /FID ne {def} {pop pop} ifelse} forall
  /Encoding WinAnsiEncoding def
  currentdict
end
/Helvetica-Oblique exch definefont pop
/Times-BoldItalic findfont
dup length dict begin
  {1 index /FID ne {def} {pop pop} ifelse} forall
  /Encoding WinAnsiEncoding def
  currentdict
end
/Times-BoldItalic exch definefont pop
/Courier findfont
dup length dict begin
  {1 index /FID ne {def} {pop pop} ifelse} forall
  /Encoding WinAnsiEncoding def
  currentdict
end
/Courier exch definefont pop
/Times-Italic findfont
dup length dict begin
  {1 index /FID ne {def} {pop pop} ifelse} forall
  /Encoding WinAnsiEncoding def
  currentdict
end
/Times-Italic exch definefont pop
/Times-Bold findfont
dup length dict begin
  {1 index /FID ne {def} {pop pop} ifelse} forall
  /Encoding WinAnsiEncoding def
  currentdict
end
/Times-Bold exch definefont pop
%FOPEndFontReencode
%%EndProlog
%%Page: 1 1
%%PageBoundingBox: 0 0 420 315
%%BeginPageSetup
[1 0 0 -1 0 315] CT
%%EndPageSetup
GS
[0.55814 0 0 0.55814 0 0.20929] CT
N
0 0 M
752 0 L
752 564 L
0 564 L
0 0 L
cp
clip
1 GC
N
0 0 752 564 re
f
GR
GS
[0.55814 0 0 0.55814 0 0.20929] CT
1 GC
N
0 0 752 564 re
f
GR
GS
[0.55814 0 0 0.55814 0 0.20929] CT
1 GC
N
98 502 M
681 502 L
681 42 L
98 42 L
cp
f
GR
GS
[0.55814 0 0 0.55814 0 0.20929] CT
0.873 GC
2 setlinecap
10.0 ML
N
98 502 M
98 42 L
S
GR
GS
[0.55814 0 0 0.55814 0 0.20929] CT
0.873 GC
2 setlinecap
10.0 ML
N
214.6 502 M
214.6 42 L
S
GR
GS
[0.55814 0 0 0.55814 0 0.20929] CT
0.873 GC
2 setlinecap
10.0 ML
N
331.2 502 M
331.2 42 L
S
GR
GS
[0.55814 0 0 0.55814 0 0.20929] CT
0.873 GC
2 setlinecap
10.0 ML
N
447.8 502 M
447.8 42 L
S
GR
GS
[0.55814 0 0 0.55814 0 0.20929] CT
0.873 GC
2 setlinecap
10.0 ML
N
564.4 502 M
564.4 42 L
S
GR
GS
[0.55814 0 0 0.55814 0 0.20929] CT
0.873 GC
2 setlinecap
10.0 ML
N
681 502 M
681 42 L
S
GR
GS
[0.55814 0 0 0.55814 0 0.20929] CT
0.873 GC
2 setlinecap
10.0 ML
N
681 502 M
98 502 L
S
GR
GS
[0.55814 0 0 0.55814 0 0.20929] CT
0.873 GC
2 setlinecap
10.0 ML
N
681 444.5 M
98 444.5 L
S
GR
GS
[0.55814 0 0 0.55814 0 0.20929] CT
0.873 GC
2 setlinecap
10.0 ML
N
681 387 M
98 387 L
S
GR
GS
[0.55814 0 0 0.55814 0 0.20929] CT
0.873 GC
2 setlinecap
10.0 ML
N
681 329.5 M
98 329.5 L
S
GR
GS
[0.55814 0 0 0.55814 0 0.20929] CT
0.873 GC
2 setlinecap
10.0 ML
N
681 272 M
98 272 L
S
GR
GS
[0.55814 0 0 0.55814 0 0.20929] CT
0.873 GC
2 setlinecap
10.0 ML
N
681 214.5 M
98 214.5 L
S
GR
GS
[0.55814 0 0 0.55814 0 0.20929] CT
0.873 GC
2 setlinecap
10.0 ML
N
681 157 M
98 157 L
S
GR
GS
[0.55814 0 0 0.55814 0 0.20929] CT
0.873 GC
2 setlinecap
10.0 ML
N
681 99.5 M
98 99.5 L
S
GR
GS
[0.55814 0 0 0.55814 0 0.20929] CT
0.873 GC
2 setlinecap
10.0 ML
N
681 42 M
98 42 L
S
GR
GS
[0.55814 0 0 0.55814 217.3955 298.23255] CT
0.149 GC
/Helvetica 20 F
GS
[1 0 0 1 0 0] CT
-3 21 moveto 
1 -1 scale
(t) t 
GR
GR
GS
[0.55814 0 0 0.55814 0 0.20929] CT
0.149 GC
2 setlinecap
10.0 ML
N
98 502 M
681 502 L
S
GR
GS
[0.55814 0 0 0.55814 0 0.20929] CT
0.149 GC
2 setlinecap
10.0 ML
N
98 42 M
681 42 L
S
GR
GS
[0.55814 0 0 0.55814 0 0.20929] CT
0.149 GC
2 setlinecap
10.0 ML
N
98 502 M
98 496.17 L
S
GR
GS
[0.55814 0 0 0.55814 0 0.20929] CT
0.149 GC
2 setlinecap
10.0 ML
N
214.6 502 M
214.6 496.17 L
S
GR
GS
[0.55814 0 0 0.55814 0 0.20929] CT
0.149 GC
2 setlinecap
10.0 ML
N
331.2 502 M
331.2 496.17 L
S
GR
GS
[0.55814 0 0 0.55814 0 0.20929] CT
0.149 GC
2 setlinecap
10.0 ML
N
447.8 502 M
447.8 496.17 L
S
GR
GS
[0.55814 0 0 0.55814 0 0.20929] CT
0.149 GC
2 setlinecap
10.0 ML
N
564.4 502 M
564.4 496.17 L
S
GR
GS
[0.55814 0 0 0.55814 0 0.20929] CT
0.149 GC
2 setlinecap
10.0 ML
N
681 502 M
681 496.17 L
S
GR
GS
[0.55814 0 0 0.55814 0 0.20929] CT
0.149 GC
2 setlinecap
10.0 ML
N
98 42 M
98 47.83 L
S
GR
GS
[0.55814 0 0 0.55814 0 0.20929] CT
0.149 GC
2 setlinecap
10.0 ML
N
214.6 42 M
214.6 47.83 L
S
GR
GS
[0.55814 0 0 0.55814 0 0.20929] CT
0.149 GC
2 setlinecap
10.0 ML
N
331.2 42 M
331.2 47.83 L
S
GR
GS
[0.55814 0 0 0.55814 0 0.20929] CT
0.149 GC
2 setlinecap
10.0 ML
N
447.8 42 M
447.8 47.83 L
S
GR
GS
[0.55814 0 0 0.55814 0 0.20929] CT
0.149 GC
2 setlinecap
10.0 ML
N
564.4 42 M
564.4 47.83 L
S
GR
GS
[0.55814 0 0 0.55814 0 0.20929] CT
0.149 GC
2 setlinecap
10.0 ML
N
681 42 M
681 47.83 L
S
GR
GS
[0.55814 0 0 0.55814 54.69767 284.39534] CT
0.149 GC
/Helvetica 18 F
GS
[1 0 0 1 0 0] CT
-5.5 19 moveto 
1 -1 scale
(0) t 
GR
GR
GS
[0.55814 0 0 0.55814 119.77674 284.39534] CT
0.149 GC
/Helvetica 18 F
GS
[1 0 0 1 0 0] CT
-10.5 19 moveto 
1 -1 scale
(20) t 
GR
GR
GS
[0.55814 0 0 0.55814 184.85581 284.39534] CT
0.149 GC
/Helvetica 18 F
GS
[1 0 0 1 0 0] CT
-10.5 19 moveto 
1 -1 scale
(40) t 
GR
GR
GS
[0.55814 0 0 0.55814 249.93487 284.39534] CT
0.149 GC
/Helvetica 18 F
GS
[1 0 0 1 0 0] CT
-10.5 19 moveto 
1 -1 scale
(60) t 
GR
GR
GS
[0.55814 0 0 0.55814 315.01396 284.39534] CT
0.149 GC
/Helvetica 18 F
GS
[1 0 0 1 0 0] CT
-10.5 19 moveto 
1 -1 scale
(80) t 
GR
GR
GS
[0.55814 0 0 0.55814 380.09301 284.39534] CT
0.149 GC
/Helvetica 18 F
GS
[1 0 0 1 0 0] CT
-15.5 19 moveto 
1 -1 scale
(100) t 
GR
GR
GS
[0 -0.55814 0.55814 0 30.39535 152.02313] CT
0.149 GC
/Helvetica 20 F
GS
[1 0 0 1 0 0] CT
-17 -5 moveto 
1 -1 scale
(N,P) t 
GR
GR
GS
[0.55814 0 0 0.55814 0 0.20929] CT
0.149 GC
2 setlinecap
10.0 ML
N
98 502 M
98 42 L
S
GR
GS
[0.55814 0 0 0.55814 0 0.20929] CT
0.149 GC
2 setlinecap
10.0 ML
N
681 502 M
681 42 L
S
GR
GS
[0.55814 0 0 0.55814 0 0.20929] CT
0.149 GC
2 setlinecap
10.0 ML
N
98 502 M
103.83 502 L
S
GR
GS
[0.55814 0 0 0.55814 0 0.20929] CT
0.149 GC
2 setlinecap
10.0 ML
N
98 444.5 M
103.83 444.5 L
S
GR
GS
[0.55814 0 0 0.55814 0 0.20929] CT
0.149 GC
2 setlinecap
10.0 ML
N
98 387 M
103.83 387 L
S
GR
GS
[0.55814 0 0 0.55814 0 0.20929] CT
0.149 GC
2 setlinecap
10.0 ML
N
98 329.5 M
103.83 329.5 L
S
GR
GS
[0.55814 0 0 0.55814 0 0.20929] CT
0.149 GC
2 setlinecap
10.0 ML
N
98 272 M
103.83 272 L
S
GR
GS
[0.55814 0 0 0.55814 0 0.20929] CT
0.149 GC
2 setlinecap
10.0 ML
N
98 214.5 M
103.83 214.5 L
S
GR
GS
[0.55814 0 0 0.55814 0 0.20929] CT
0.149 GC
2 setlinecap
10.0 ML
N
98 157 M
103.83 157 L
S
GR
GS
[0.55814 0 0 0.55814 0 0.20929] CT
0.149 GC
2 setlinecap
10.0 ML
N
98 99.5 M
103.83 99.5 L
S
GR
GS
[0.55814 0 0 0.55814 0 0.20929] CT
0.149 GC
2 setlinecap
10.0 ML
N
98 42 M
103.83 42 L
S
GR
GS
[0.55814 0 0 0.55814 0 0.20929] CT
0.149 GC
2 setlinecap
10.0 ML
N
681 502 M
675.17 502 L
S
GR
GS
[0.55814 0 0 0.55814 0 0.20929] CT
0.149 GC
2 setlinecap
10.0 ML
N
681 444.5 M
675.17 444.5 L
S
GR
GS
[0.55814 0 0 0.55814 0 0.20929] CT
0.149 GC
2 setlinecap
10.0 ML
N
681 387 M
675.17 387 L
S
GR
GS
[0.55814 0 0 0.55814 0 0.20929] CT
0.149 GC
2 setlinecap
10.0 ML
N
681 329.5 M
675.17 329.5 L
S
GR
GS
[0.55814 0 0 0.55814 0 0.20929] CT
0.149 GC
2 setlinecap
10.0 ML
N
681 272 M
675.17 272 L
S
GR
GS
[0.55814 0 0 0.55814 0 0.20929] CT
0.149 GC
2 setlinecap
10.0 ML
N
681 214.5 M
675.17 214.5 L
S
GR
GS
[0.55814 0 0 0.55814 0 0.20929] CT
0.149 GC
2 setlinecap
10.0 ML
N
681 157 M
675.17 157 L
S
GR
GS
[0.55814 0 0 0.55814 0 0.20929] CT
0.149 GC
2 setlinecap
10.0 ML
N
681 99.5 M
675.17 99.5 L
S
GR
GS
[0.55814 0 0 0.55814 0 0.20929] CT
0.149 GC
2 setlinecap
10.0 ML
N
681 42 M
675.17 42 L
S
GR
GS
[0.55814 0 0 0.55814 50.69767 280.39535] CT
0.149 GC
/Helvetica 18 F
GS
[1 0 0 1 0 0] CT
-31 7.5 moveto 
1 -1 scale
(250) t 
GR
GR
GS
[0.55814 0 0 0.55814 50.69767 248.30232] CT
0.149 GC
/Helvetica 18 F
GS
[1 0 0 1 0 0] CT
-31 7.5 moveto 
1 -1 scale
(300) t 
GR
GR
GS
[0.55814 0 0 0.55814 50.69767 216.2093] CT
0.149 GC
/Helvetica 18 F
GS
[1 0 0 1 0 0] CT
-31 7.5 moveto 
1 -1 scale
(350) t 
GR
GR
GS
[0.55814 0 0 0.55814 50.69767 184.11627] CT
0.149 GC
/Helvetica 18 F
GS
[1 0 0 1 0 0] CT
-31 7.5 moveto 
1 -1 scale
(400) t 
GR
GR
GS
[0.55814 0 0 0.55814 50.69767 152.02325] CT
0.149 GC
/Helvetica 18 F
GS
[1 0 0 1 0 0] CT
-31 7.5 moveto 
1 -1 scale
(450) t 
GR
GR
GS
[0.55814 0 0 0.55814 50.69767 119.93022] CT
0.149 GC
/Helvetica 18 F
GS
[1 0 0 1 0 0] CT
-31 7.5 moveto 
1 -1 scale
(500) t 
GR
GR
GS
[0.55814 0 0 0.55814 50.69767 87.8372] CT
0.149 GC
/Helvetica 18 F
GS
[1 0 0 1 0 0] CT
-31 7.5 moveto 
1 -1 scale
(550) t 
GR
GR
GS
[0.55814 0 0 0.55814 50.69767 55.74418] CT
0.149 GC
/Helvetica 18 F
GS
[1 0 0 1 0 0] CT
-31 7.5 moveto 
1 -1 scale
(600) t 
GR
GR
GS
[0.55814 0 0 0.55814 50.69767 23.65115] CT
0.149 GC
/Helvetica 18 F
GS
[1 0 0 1 0 0] CT
-31 7.5 moveto 
1 -1 scale
(650) t 
GR
GR
GS
[0.55814 0 0 0.55814 0 0.20929] CT
0 0.447 0.741 RC
2 LJ
N
98 214.5 M
98.584 228.686 L
99.167 242.382 L
99.751 255.474 L
100.334 267.865 L
100.918 279.48 L
101.502 290.261 L
102.085 300.178 L
102.669 309.205 L
103.252 317.31 L
103.836 324.471 L
104.419 330.676 L
105.003 335.924 L
105.587 340.224 L
106.17 343.592 L
106.754 346.059 L
107.337 347.662 L
107.921 348.449 L
108.505 348.436 L
109.088 347.615 L
109.672 345.999 L
110.255 343.604 L
110.839 340.446 L
111.422 336.544 L
112.006 331.916 L
112.59 326.582 L
113.173 320.565 L
113.757 313.886 L
114.34 306.57 L
114.924 298.643 L
115.508 290.131 L
116.091 281.062 L
116.675 271.46 L
117.258 261.354 L
117.842 250.779 L
118.425 239.78 L
119.009 228.406 L
119.593 216.714 L
120.176 204.766 L
120.76 192.632 L
121.343 180.389 L
121.927 168.12 L
122.511 155.914 L
123.094 143.857 L
123.678 132.021 L
124.261 120.557 L
124.845 109.616 L
125.428 99.341 L
126.012 89.869 L
126.596 81.33 L
S
GR
GS
[0.55814 0 0 0.55814 0 0.20929] CT
0 0.447 0.741 RC
2 LJ
N
126.596 81.33 M
127.179 73.845 L
127.763 67.531 L
128.346 62.495 L
128.93 58.837 L
129.514 56.652 L
130.097 56.026 L
130.681 57.047 L
131.264 59.783 L
131.848 64.174 L
132.431 70.142 L
133.015 77.592 L
133.599 86.421 L
134.182 96.513 L
134.766 107.737 L
135.349 119.956 L
135.933 133.015 L
136.517 146.751 L
137.1 160.987 L
137.684 175.535 L
138.267 190.194 L
138.851 204.769 L
139.434 219.099 L
140.018 233.045 L
140.602 246.482 L
141.185 259.304 L
141.769 271.416 L
142.352 282.742 L
142.936 293.22 L
143.52 302.807 L
144.103 311.471 L
144.687 319.2 L
145.27 325.996 L
145.854 331.871 L
146.437 336.83 L
147.021 340.874 L
147.605 344.014 L
148.188 346.26 L
148.772 347.629 L
149.355 348.141 L
149.939 347.818 L
150.523 346.689 L
151.106 344.786 L
151.69 342.138 L
152.273 338.754 L
152.857 334.643 L
153.44 329.818 L
154.024 324.293 L
154.608 318.088 L
155.191 311.223 L
S
GR
GS
[0.55814 0 0 0.55814 0 0.20929] CT
0 0.447 0.741 RC
2 LJ
N
155.191 311.223 M
155.775 303.721 L
156.358 295.609 L
156.942 286.914 L
157.526 277.667 L
158.109 267.903 L
158.693 257.658 L
159.276 246.97 L
159.86 235.881 L
160.443 224.439 L
161.027 212.701 L
161.611 200.732 L
162.194 188.602 L
162.778 176.39 L
163.361 164.184 L
163.945 152.075 L
164.529 140.165 L
165.112 128.563 L
165.696 117.385 L
166.279 106.753 L
166.863 96.797 L
167.446 87.603 L
168.03 79.3 L
168.614 72.069 L
169.197 66.064 L
169.781 61.416 L
170.364 58.231 L
170.948 56.59 L
171.532 56.549 L
172.115 58.14 L
172.699 61.371 L
173.282 66.224 L
173.866 72.657 L
174.449 80.602 L
175.033 89.965 L
175.617 100.605 L
176.2 112.361 L
176.784 125.066 L
177.367 138.55 L
177.951 152.641 L
178.535 167.157 L
179.118 181.918 L
179.702 196.735 L
180.285 211.416 L
180.869 225.767 L
181.452 239.585 L
182.036 252.774 L
182.62 265.322 L
183.203 277.128 L
183.787 288.111 L
S
GR
GS
[0.55814 0 0 0.55814 0 0.20929] CT
0 0.447 0.741 RC
2 LJ
N
183.787 288.111 M
184.37 298.204 L
184.954 307.36 L
185.538 315.549 L
186.121 322.758 L
186.705 328.992 L
187.288 334.273 L
187.872 338.64 L
188.455 342.153 L
189.039 344.847 L
189.623 346.68 L
190.206 347.661 L
190.79 347.807 L
191.373 347.133 L
191.957 345.659 L
192.541 343.402 L
193.124 340.383 L
193.708 336.622 L
194.291 332.143 L
194.875 326.967 L
195.458 321.121 L
196.042 314.62 L
196.626 307.478 L
197.209 299.714 L
197.793 291.349 L
198.376 282.409 L
198.96 272.927 L
199.544 262.938 L
200.127 252.481 L
200.711 241.602 L
201.294 230.349 L
201.878 218.777 L
202.461 206.942 L
203.045 194.905 L
203.629 182.723 L
204.212 170.492 L
204.796 158.314 L
205.379 146.293 L
205.963 134.54 L
206.547 123.166 L
207.13 112.286 L
207.714 102.021 L
208.297 92.493 L
208.881 83.829 L
209.464 76.157 L
210.048 69.612 L
210.632 64.324 L
211.215 60.388 L
211.799 57.904 L
212.382 56.956 L
S
GR
GS
[0.55814 0 0 0.55814 0 0.20929] CT
0 0.447 0.741 RC
2 LJ
N
212.382 56.956 M
212.966 57.601 L
213.55 59.867 L
214.133 63.757 L
214.717 69.246 L
215.3 76.282 L
215.884 84.787 L
216.467 94.656 L
217.051 105.755 L
217.635 117.925 L
218.218 130.98 L
218.802 144.693 L
219.385 158.871 L
219.969 173.352 L
220.553 187.979 L
221.136 202.6 L
221.72 217.066 L
222.303 231.232 L
222.887 244.959 L
223.47 258.108 L
224.054 270.549 L
224.638 282.153 L
225.221 292.796 L
225.805 302.517 L
226.388 311.355 L
226.972 319.27 L
227.556 326.234 L
228.139 332.23 L
228.723 337.254 L
229.306 341.31 L
229.89 344.415 L
230.473 346.598 L
231.057 347.897 L
231.641 348.363 L
232.224 348.058 L
232.808 347.011 L
233.391 345.183 L
233.975 342.586 L
234.559 339.235 L
235.142 335.147 L
235.726 330.34 L
236.309 324.833 L
236.893 318.648 L
237.476 311.807 L
238.06 304.333 L
238.644 296.252 L
239.227 287.591 L
239.811 278.378 L
240.394 268.647 L
240.978 258.427 L
S
GR
GS
[0.55814 0 0 0.55814 0 0.20929] CT
0 0.447 0.741 RC
2 LJ
N
240.978 258.427 M
241.562 247.754 L
242.145 236.671 L
242.729 225.228 L
243.312 213.482 L
243.896 201.497 L
244.479 189.345 L
245.063 177.106 L
245.647 164.864 L
246.23 152.714 L
246.814 140.756 L
247.397 129.088 L
247.981 117.78 L
248.565 106.992 L
249.148 96.89 L
249.732 87.624 L
250.315 79.335 L
250.899 72.15 L
251.482 66.185 L
252.066 61.544 L
252.65 58.319 L
253.233 56.588 L
253.817 56.419 L
254.4 57.867 L
254.984 60.981 L
255.568 65.785 L
256.151 72.191 L
256.735 80.086 L
257.318 89.351 L
257.902 99.854 L
258.485 111.454 L
259.069 124 L
259.653 137.332 L
260.236 151.278 L
260.82 165.658 L
261.403 180.281 L
261.987 194.946 L
262.571 209.453 L
263.154 223.668 L
263.738 237.458 L
264.321 250.7 L
264.905 263.289 L
265.488 275.136 L
266.072 286.168 L
266.656 296.331 L
267.239 305.585 L
267.823 313.911 L
268.406 321.303 L
268.99 327.772 L
269.574 333.335 L
S
GR
GS
[0.55814 0 0 0.55814 0 0.20929] CT
0 0.447 0.741 RC
2 LJ
N
269.574 333.335 M
270.157 337.987 L
270.741 341.735 L
271.324 344.589 L
271.908 346.56 L
272.491 347.664 L
273.075 347.919 L
273.659 347.347 L
274.242 345.973 L
274.826 343.822 L
275.409 340.926 L
275.993 337.305 L
276.577 332.967 L
277.16 327.924 L
277.744 322.191 L
278.327 315.785 L
278.911 308.727 L
279.494 301.04 L
280.078 292.75 L
280.662 283.886 L
281.245 274.482 L
281.829 264.57 L
282.412 254.191 L
282.996 243.383 L
283.58 232.19 L
284.163 220.661 L
284.747 208.855 L
285.33 196.841 L
285.914 184.693 L
286.497 172.492 L
287.081 160.328 L
287.665 148.296 L
288.248 136.498 L
288.832 125.046 L
289.415 114.055 L
289.999 103.649 L
290.583 93.96 L
291.166 85.108 L
291.75 77.176 L
292.333 70.335 L
292.917 64.744 L
293.501 60.535 L
294.084 57.813 L
294.668 56.655 L
295.251 57.115 L
295.835 59.217 L
296.418 62.96 L
297.002 68.316 L
297.586 75.233 L
298.169 83.628 L
S
GR
GS
[0.55814 0 0 0.55814 0 0.20929] CT
0 0.447 0.741 RC
2 LJ
N
298.169 83.628 M
298.753 93.394 L
299.336 104.385 L
299.92 116.436 L
300.504 129.378 L
301.087 143.041 L
301.671 157.251 L
302.254 171.831 L
302.838 186.603 L
303.421 201.383 L
304.005 215.986 L
304.589 230.226 L
305.172 243.912 L
305.756 256.891 L
306.339 269.194 L
306.923 280.744 L
307.507 291.46 L
308.09 301.277 L
308.674 310.148 L
309.257 318.043 L
309.841 324.95 L
310.424 330.871 L
311.008 335.829 L
311.592 339.861 L
312.175 343.024 L
312.759 345.387 L
313.342 346.929 L
313.926 347.629 L
314.51 347.502 L
315.093 346.564 L
315.677 344.833 L
316.26 342.327 L
316.844 339.066 L
317.427 335.069 L
318.011 330.358 L
318.595 324.955 L
319.178 318.883 L
319.762 312.167 L
320.345 304.823 L
320.929 296.868 L
321.513 288.322 L
322.096 279.212 L
322.68 269.57 L
323.263 259.432 L
323.847 248.84 L
324.43 237.84 L
325.014 226.483 L
325.598 214.827 L
326.181 202.931 L
326.765 190.863 L
S
GR
GS
[0.55814 0 0 0.55814 0 0.20929] CT
0 0.447 0.741 RC
2 LJ
N
326.765 190.863 M
327.348 178.681 L
327.932 166.465 L
328.516 154.326 L
329.099 142.378 L
329.683 130.737 L
330.266 119.52 L
330.85 108.847 L
331.433 98.837 L
332.017 89.612 L
332.601 81.296 L
333.184 74.014 L
333.768 67.893 L
334.351 63.061 L
334.935 59.64 L
335.519 57.713 L
336.102 57.342 L
336.686 58.563 L
337.269 61.389 L
337.853 65.81 L
338.436 71.788 L
339.02 79.266 L
339.604 88.16 L
340.187 98.362 L
340.771 109.74 L
341.354 122.14 L
341.938 135.38 L
342.522 149.256 L
343.105 163.532 L
343.689 178.032 L
344.272 192.603 L
344.856 207.097 L
345.439 221.375 L
346.023 235.304 L
346.607 248.759 L
347.19 261.618 L
347.774 273.772 L
348.357 285.112 L
348.941 295.543 L
349.525 304.979 L
350.108 313.49 L
350.692 321.086 L
351.275 327.749 L
351.859 333.465 L
352.442 338.232 L
353.026 342.055 L
353.61 344.947 L
354.193 346.931 L
354.777 348.037 L
355.36 348.303 L
S
GR
GS
[0.55814 0 0 0.55814 0 0.20929] CT
0 0.447 0.741 RC
2 LJ
N
355.36 348.303 M
355.944 347.778 L
356.528 346.502 L
357.111 344.458 L
357.695 341.653 L
358.278 338.099 L
358.862 333.814 L
359.445 328.814 L
360.029 323.118 L
360.613 316.747 L
361.196 309.725 L
361.78 302.076 L
362.363 293.826 L
362.947 285.003 L
363.531 275.637 L
364.114 265.762 L
364.698 255.413 L
365.281 244.626 L
365.865 233.445 L
366.448 221.92 L
367.032 210.11 L
367.616 198.08 L
368.199 185.904 L
368.783 173.663 L
369.366 161.445 L
369.95 149.346 L
370.534 137.469 L
371.117 125.926 L
371.701 114.816 L
372.284 104.22 L
372.868 94.313 L
373.451 85.265 L
374.035 77.228 L
374.619 70.339 L
375.202 64.717 L
375.786 60.465 L
376.369 57.671 L
376.953 56.403 L
377.537 56.716 L
378.12 58.645 L
378.704 62.212 L
379.287 67.423 L
379.871 74.248 L
380.454 82.564 L
381.038 92.238 L
381.622 103.127 L
382.205 115.079 L
382.789 127.935 L
383.372 141.528 L
383.956 155.681 L
S
GR
GS
[0.55814 0 0 0.55814 0 0.20929] CT
0 0.447 0.741 RC
2 LJ
N
383.956 155.681 M
384.54 170.211 L
385.123 184.924 L
385.707 199.621 L
386.29 214.093 L
386.874 228.197 L
387.457 241.841 L
388.041 254.903 L
388.625 267.28 L
389.208 278.885 L
389.792 289.649 L
390.375 299.52 L
390.959 308.464 L
391.543 316.465 L
392.126 323.523 L
392.71 329.656 L
393.293 334.899 L
393.877 339.25 L
394.46 342.704 L
395.044 345.272 L
395.628 346.968 L
396.211 347.805 L
396.795 347.803 L
397.378 346.981 L
397.962 345.359 L
398.546 342.964 L
399.129 339.819 L
399.713 335.954 L
400.296 331.383 L
400.88 326.118 L
401.463 320.17 L
402.047 313.558 L
402.631 306.301 L
403.214 298.422 L
403.798 289.947 L
404.381 280.908 L
404.965 271.336 L
405.549 261.268 L
406.132 250.745 L
406.716 239.808 L
407.299 228.504 L
407.883 216.88 L
408.466 204.996 L
409.05 192.925 L
409.634 180.745 L
410.217 168.544 L
410.801 156.411 L
411.384 144.446 L
411.968 132.754 L
412.552 121.445 L
S
GR
GS
[0.55814 0 0 0.55814 0 0.20929] CT
0 0.447 0.741 RC
2 LJ
N
412.552 121.445 M
413.135 110.638 L
413.719 100.456 L
414.302 91.031 L
414.886 82.498 L
415.469 74.954 L
416.053 68.52 L
416.637 63.354 L
417.22 59.589 L
417.804 57.329 L
418.387 56.651 L
418.971 57.603 L
419.555 60.205 L
420.138 64.449 L
420.722 70.299 L
421.305 77.691 L
421.889 86.534 L
422.472 96.707 L
423.056 108.057 L
423.64 120.406 L
424.223 133.584 L
424.807 147.419 L
425.39 161.74 L
425.974 176.374 L
426.558 191.149 L
427.141 205.888 L
427.725 220.418 L
428.308 234.562 L
428.892 248.142 L
429.475 260.98 L
430.059 273.037 L
430.643 284.339 L
431.226 294.804 L
431.81 304.368 L
432.393 312.983 L
432.977 320.616 L
433.561 327.253 L
434.144 332.892 L
434.728 337.552 L
435.311 341.266 L
435.895 344.084 L
436.478 346.07 L
437.062 347.297 L
437.646 347.716 L
438.229 347.316 L
438.813 346.114 L
439.396 344.127 L
439.98 341.371 L
440.564 337.866 L
441.147 333.631 L
S
GR
GS
[0.55814 0 0 0.55814 0 0.20929] CT
0 0.447 0.741 RC
2 LJ
N
441.147 333.631 M
441.731 328.686 L
442.314 323.054 L
442.898 316.754 L
443.481 309.812 L
444.065 302.253 L
444.649 294.097 L
445.232 285.364 L
445.816 276.078 L
446.399 266.27 L
446.983 255.978 L
447.567 245.243 L
448.15 234.113 L
448.734 222.642 L
449.317 210.889 L
449.901 198.92 L
450.484 186.805 L
451.068 174.621 L
451.652 162.429 L
452.235 150.322 L
452.819 138.427 L
453.402 126.875 L
453.986 115.791 L
454.57 105.302 L
455.153 95.531 L
455.737 86.601 L
456.32 78.632 L
456.904 71.745 L
457.487 66.057 L
458.071 61.684 L
458.655 58.741 L
459.238 57.351 L
459.822 57.577 L
460.405 59.421 L
460.989 62.863 L
461.573 67.866 L
462.156 74.375 L
462.74 82.317 L
463.323 91.599 L
463.907 102.11 L
464.49 113.723 L
465.074 126.29 L
465.658 139.646 L
466.241 153.608 L
466.825 167.972 L
467.408 182.516 L
467.992 197.058 L
468.576 211.446 L
469.159 225.543 L
469.743 239.22 L
S
GR
GS
[0.55814 0 0 0.55814 0 0.20929] CT
0 0.447 0.741 RC
2 LJ
N
469.743 239.22 M
470.326 252.364 L
470.91 264.871 L
471.493 276.651 L
472.077 287.626 L
472.661 297.727 L
473.244 306.901 L
473.828 315.111 L
474.411 322.396 L
474.995 328.761 L
475.579 334.199 L
476.162 338.71 L
476.746 342.299 L
477.329 344.979 L
477.913 346.766 L
478.496 347.685 L
479.08 347.764 L
479.664 347.04 L
480.247 345.553 L
480.831 343.313 L
481.414 340.323 L
481.998 336.594 L
482.582 332.139 L
483.165 326.975 L
483.749 321.12 L
484.332 314.595 L
484.916 307.422 L
485.5 299.628 L
486.083 291.239 L
486.667 282.286 L
487.25 272.801 L
487.834 262.818 L
488.417 252.375 L
489.001 241.511 L
489.585 230.269 L
490.168 218.703 L
490.752 206.873 L
491.335 194.844 L
491.919 182.693 L
492.503 170.5 L
493.086 158.358 L
493.67 146.361 L
494.253 134.616 L
494.837 123.235 L
495.42 112.337 L
496.004 102.039 L
496.588 92.413 L
497.171 83.633 L
497.755 75.873 L
498.338 69.283 L
S
GR
GS
[0.55814 0 0 0.55814 0 0.20929] CT
0 0.447 0.741 RC
2 LJ
N
498.338 69.283 M
498.922 63.993 L
499.505 60.109 L
500.089 57.718 L
500.673 56.885 L
501.256 57.652 L
501.84 60.04 L
502.423 64.05 L
503.007 69.659 L
503.591 76.824 L
504.174 85.468 L
504.758 95.452 L
505.341 106.623 L
505.925 118.82 L
506.508 131.881 L
507.092 145.633 L
507.676 159.899 L
508.259 174.497 L
508.843 189.237 L
509.426 203.924 L
510.01 218.357 L
510.594 232.333 L
511.177 245.783 L
511.761 258.635 L
512.344 270.786 L
512.928 282.147 L
513.512 292.65 L
514.095 302.243 L
514.679 310.892 L
515.262 318.58 L
515.846 325.307 L
516.429 331.094 L
517.013 335.975 L
517.597 340.003 L
518.18 343.17 L
518.764 345.462 L
519.347 346.894 L
519.931 347.48 L
520.515 347.236 L
521.098 346.182 L
521.682 344.335 L
522.265 341.718 L
522.849 338.352 L
523.432 334.261 L
524.016 329.471 L
524.6 324.001 L
525.183 317.864 L
525.767 311.073 L
526.35 303.647 L
526.934 295.609 L
S
GR
GS
[0.55814 0 0 0.55814 0 0.20929] CT
0 0.447 0.741 RC
2 LJ
N
526.934 295.609 M
527.518 286.983 L
528.101 277.801 L
528.685 268.095 L
529.268 257.905 L
529.852 247.272 L
530.435 236.242 L
531.019 224.864 L
531.603 213.192 L
532.186 201.278 L
532.77 189.19 L
533.353 177.016 L
533.937 164.849 L
534.521 152.786 L
535.104 140.93 L
535.688 129.387 L
536.271 118.27 L
536.855 107.697 L
537.438 97.789 L
538.022 88.673 L
538.606 80.482 L
539.189 73.353 L
539.773 67.393 L
540.356 62.707 L
540.94 59.422 L
541.523 57.64 L
542.107 57.433 L
542.691 58.847 L
543.274 61.896 L
543.858 66.57 L
544.441 72.828 L
545.025 80.601 L
545.609 89.794 L
546.192 100.281 L
546.776 111.91 L
547.359 124.494 L
547.943 137.827 L
548.526 151.737 L
549.11 166.061 L
549.694 180.634 L
550.277 195.295 L
550.861 209.883 L
551.444 224.242 L
552.028 238.215 L
552.612 251.649 L
553.195 264.39 L
553.779 276.29 L
554.362 287.29 L
554.946 297.476 L
555.53 306.788 L
S
GR
GS
[0.55814 0 0 0.55814 0 0.20929] CT
0 0.447 0.741 RC
2 LJ
N
555.53 306.788 M
556.113 315.173 L
556.697 322.595 L
557.28 329.028 L
557.864 334.465 L
558.447 338.909 L
559.031 342.381 L
559.615 344.914 L
560.198 346.556 L
560.782 347.37 L
561.365 347.433 L
561.949 346.774 L
562.533 345.327 L
563.116 343.105 L
563.7 340.124 L
564.283 336.401 L
564.867 331.954 L
565.45 326.802 L
566.034 320.966 L
566.618 314.468 L
567.201 307.331 L
567.785 299.578 L
568.368 291.235 L
568.952 282.334 L
569.536 272.901 L
570.119 262.963 L
570.703 252.554 L
571.286 241.716 L
571.87 230.496 L
572.453 218.951 L
573.037 207.14 L
573.621 195.133 L
574.204 183.004 L
574.788 170.836 L
575.371 158.716 L
575.955 146.74 L
576.539 134.976 L
577.122 123.536 L
577.706 112.578 L
578.289 102.252 L
578.873 92.698 L
579.456 84.049 L
580.04 76.429 L
580.624 69.953 L
581.207 64.728 L
581.791 60.853 L
582.374 58.417 L
582.958 57.503 L
583.542 58.184 L
584.125 60.544 L
S
GR
GS
[0.55814 0 0 0.55814 0 0.20929] CT
0 0.447 0.741 RC
2 LJ
N
584.125 60.544 M
584.709 64.573 L
585.292 70.192 L
585.876 77.306 L
586.459 85.812 L
587.043 95.593 L
587.627 106.523 L
588.21 118.463 L
588.794 131.264 L
589.377 144.763 L
589.961 158.79 L
590.545 173.161 L
591.128 187.679 L
591.712 202.146 L
592.295 216.403 L
592.879 230.306 L
593.462 243.73 L
594.046 256.564 L
594.63 268.712 L
595.213 280.095 L
595.797 290.649 L
596.38 300.327 L
596.964 309.097 L
597.548 316.942 L
598.131 323.862 L
598.715 329.868 L
599.298 334.966 L
599.882 339.157 L
600.465 342.449 L
601.049 344.853 L
601.633 346.382 L
602.216 347.055 L
602.8 346.894 L
603.383 345.922 L
603.967 344.171 L
604.551 341.671 L
605.134 338.44 L
605.718 334.487 L
606.301 329.822 L
606.885 324.459 L
607.469 318.417 L
608.052 311.715 L
608.636 304.375 L
609.219 296.423 L
609.803 287.886 L
610.386 278.797 L
610.97 269.187 L
611.554 259.093 L
612.137 248.555 L
612.721 237.612 L
S
GR
GS
[0.55814 0 0 0.55814 0 0.20929] CT
0 0.447 0.741 RC
2 LJ
N
612.721 237.612 M
613.304 226.312 L
613.888 214.709 L
614.471 202.867 L
615.055 190.855 L
615.639 178.752 L
616.222 166.641 L
616.806 154.615 L
617.389 142.772 L
617.973 131.218 L
618.557 120.066 L
619.14 109.436 L
619.724 99.456 L
620.307 90.242 L
620.891 81.876 L
621.474 74.531 L
622.058 68.368 L
622.642 63.525 L
623.225 60.111 L
623.809 58.214 L
624.392 57.894 L
624.976 59.189 L
625.56 62.107 L
626.143 66.637 L
626.727 72.737 L
627.31 80.345 L
627.894 89.37 L
628.477 99.686 L
629.061 111.133 L
629.645 123.549 L
630.228 136.768 L
630.812 150.617 L
631.395 164.922 L
631.979 179.506 L
632.563 194.186 L
633.146 208.777 L
633.73 223.088 L
634.313 236.927 L
634.897 250.124 L
635.48 262.687 L
636.064 274.541 L
636.648 285.6 L
637.231 295.793 L
637.815 305.067 L
638.398 313.387 L
638.982 320.734 L
639.566 327.106 L
640.149 332.521 L
640.733 337.009 L
641.316 340.622 L
S
GR
GS
[0.55814 0 0 0.55814 0 0.20929] CT
0 0.447 0.741 RC
2 LJ
N
641.316 340.622 M
641.9 343.423 L
642.483 345.396 L
643.067 346.521 L
643.651 346.813 L
644.234 346.288 L
644.818 344.963 L
645.401 342.857 L
645.985 339.989 L
646.569 336.379 L
647.152 332.048 L
647.736 327.018 L
648.319 321.314 L
648.903 314.959 L
649.487 307.968 L
650.07 300.357 L
650.654 292.146 L
651.237 283.36 L
651.821 274.029 L
652.404 264.189 L
652.988 253.877 L
653.572 243.139 L
654.155 232.022 L
654.739 220.58 L
655.322 208.872 L
655.906 196.959 L
656.49 184.898 L
657.073 172.765 L
657.657 160.666 L
658.24 148.707 L
658.824 136.999 L
659.407 125.654 L
659.991 114.788 L
660.575 104.518 L
661.158 94.965 L
661.742 86.25 L
662.325 78.501 L
662.909 71.843 L
663.492 66.408 L
664.076 62.314 L
664.66 59.648 L
665.243 58.489 L
665.827 58.893 L
666.41 60.89 L
666.994 64.485 L
667.578 69.655 L
668.161 76.355 L
668.745 84.513 L
669.328 94.033 L
669.912 104.792 L
S
GR
GS
[0.55814 0 0 0.55814 0 0.20929] CT
0 0.447 0.741 RC
2 LJ
N
669.912 104.792 M
670.495 116.642 L
671.079 129.411 L
671.663 142.898 L
672.246 156.871 L
672.83 171.158 L
673.413 185.605 L
673.997 200.066 L
674.581 214.396 L
675.164 228.456 L
675.748 242.114 L
676.331 255.241 L
676.915 267.713 L
677.498 279.411 L
678.082 290.223 L
678.666 300.048 L
679.249 308.936 L
679.833 316.905 L
680.416 323.947 L
681 330.06 L
S
GR
GS
[0.55814 0 0 0.55814 0 0.20929] CT
0.851 0.325 0.098 RC
2 LJ
N
98 185.75 M
98.584 186.499 L
99.167 188.709 L
99.751 192.304 L
100.334 197.193 L
100.918 203.27 L
101.502 210.416 L
102.085 218.502 L
102.669 227.399 L
103.252 236.98 L
103.836 247.122 L
104.419 257.706 L
105.003 268.617 L
105.587 279.745 L
106.17 290.983 L
106.754 302.228 L
107.337 313.382 L
107.921 324.35 L
108.505 335.082 L
109.088 345.543 L
109.672 355.676 L
110.255 365.432 L
110.839 374.766 L
111.422 383.638 L
112.006 392.016 L
112.59 399.872 L
113.173 407.184 L
113.757 413.936 L
114.34 420.119 L
114.924 425.728 L
115.508 430.758 L
116.091 435.191 L
116.675 439.005 L
117.258 442.181 L
117.842 444.702 L
118.425 446.552 L
119.009 447.715 L
119.593 448.178 L
120.176 447.927 L
120.76 446.953 L
121.343 445.245 L
121.927 442.794 L
122.511 439.593 L
123.094 435.643 L
123.678 430.946 L
124.261 425.462 L
124.845 419.161 L
125.428 412.027 L
126.012 404.061 L
126.596 395.275 L
S
GR
GS
[0.55814 0 0 0.55814 0 0.20929] CT
0.851 0.325 0.098 RC
2 LJ
N
126.596 395.275 M
127.179 385.699 L
127.763 375.377 L
128.346 364.368 L
128.93 352.744 L
129.514 340.595 L
130.097 328.022 L
130.681 315.112 L
131.264 301.885 L
131.848 288.571 L
132.431 275.408 L
133.015 262.609 L
133.599 250.37 L
134.182 238.863 L
134.766 228.243 L
135.349 218.642 L
135.933 210.173 L
136.517 202.925 L
137.1 196.971 L
137.684 192.361 L
138.267 189.123 L
138.851 187.35 L
139.434 187.085 L
140.018 188.281 L
140.602 190.878 L
141.185 194.807 L
141.769 199.983 L
142.352 206.312 L
142.936 213.686 L
143.52 221.985 L
144.103 231.077 L
144.687 240.82 L
145.27 251.061 L
145.854 261.691 L
146.437 272.601 L
147.021 283.684 L
147.605 294.842 L
148.188 305.982 L
148.772 317.023 L
149.355 327.888 L
149.939 338.509 L
150.523 348.828 L
151.106 358.793 L
151.69 368.363 L
152.273 377.517 L
152.857 386.218 L
153.44 394.433 L
154.024 402.13 L
154.608 409.282 L
155.191 415.866 L
S
GR
GS
[0.55814 0 0 0.55814 0 0.20929] CT
0.851 0.325 0.098 RC
2 LJ
N
155.191 415.866 M
155.775 421.863 L
156.358 427.256 L
156.942 432.033 L
157.526 436.185 L
158.109 439.708 L
158.693 442.6 L
159.276 444.864 L
159.86 446.493 L
160.443 447.457 L
161.027 447.731 L
161.611 447.291 L
162.194 446.117 L
162.778 444.191 L
163.361 441.5 L
163.945 438.032 L
164.529 433.779 L
165.112 428.737 L
165.696 422.904 L
166.279 416.281 L
166.863 408.872 L
167.446 400.694 L
168.03 391.754 L
168.614 382.063 L
169.197 371.651 L
169.781 360.564 L
170.364 348.868 L
170.948 336.645 L
171.532 323.998 L
172.115 311.047 L
172.699 297.928 L
173.282 284.797 L
173.866 271.83 L
174.449 259.217 L
175.033 247.13 L
175.617 235.72 L
176.2 225.174 L
176.784 215.659 L
177.367 207.315 L
177.951 200.262 L
178.535 194.595 L
179.118 190.385 L
179.702 187.682 L
180.285 186.51 L
180.869 186.872 L
181.452 188.748 L
182.036 192.048 L
182.62 196.639 L
183.203 202.423 L
183.787 209.297 L
S
GR
GS
[0.55814 0 0 0.55814 0 0.20929] CT
0.851 0.325 0.098 RC
2 LJ
N
183.787 209.297 M
184.37 217.15 L
184.954 225.869 L
185.538 235.332 L
186.121 245.414 L
186.705 255.982 L
187.288 266.899 L
187.872 278.02 L
188.455 289.197 L
189.039 300.32 L
189.623 311.384 L
190.206 322.317 L
190.79 333.046 L
191.373 343.507 L
191.957 353.643 L
192.541 363.406 L
193.124 372.751 L
193.708 381.646 L
194.291 390.062 L
194.875 397.98 L
195.458 405.385 L
196.042 412.256 L
196.626 418.57 L
197.209 424.306 L
197.793 429.443 L
198.376 433.964 L
198.96 437.853 L
199.544 441.097 L
200.127 443.684 L
200.711 445.604 L
201.294 446.849 L
201.878 447.414 L
202.461 447.294 L
203.045 446.488 L
203.629 444.989 L
204.212 442.758 L
204.796 439.763 L
205.379 435.978 L
205.963 431.386 L
206.547 425.978 L
207.13 419.752 L
207.714 412.713 L
208.297 404.875 L
208.881 396.259 L
209.464 386.894 L
210.048 376.816 L
210.632 366.06 L
211.215 354.627 L
211.799 342.624 L
212.382 330.177 L
S
GR
GS
[0.55814 0 0 0.55814 0 0.20929] CT
0.851 0.325 0.098 RC
2 LJ
N
212.382 330.177 M
212.966 317.421 L
213.55 304.491 L
214.133 291.527 L
214.717 278.673 L
215.3 266.075 L
215.884 253.886 L
216.467 242.259 L
217.051 231.353 L
217.635 221.331 L
218.218 212.358 L
218.802 204.623 L
219.385 198.24 L
219.969 193.261 L
220.553 189.72 L
221.136 187.637 L
221.72 187.018 L
222.303 187.848 L
222.887 190.101 L
223.47 193.732 L
224.054 198.682 L
224.638 204.873 L
225.221 212.215 L
225.805 220.509 L
226.388 229.578 L
226.972 239.301 L
227.556 249.562 L
228.139 260.247 L
228.723 271.244 L
229.306 282.445 L
229.89 293.745 L
230.473 305.041 L
231.057 316.233 L
231.641 327.223 L
232.224 337.919 L
232.808 348.267 L
233.391 358.277 L
233.975 367.904 L
234.559 377.105 L
235.142 385.841 L
235.726 394.079 L
236.309 401.792 L
236.893 408.957 L
237.476 415.555 L
238.06 421.573 L
238.644 427.002 L
239.227 431.839 L
239.811 436.083 L
240.394 439.716 L
240.978 442.715 L
S
GR
GS
[0.55814 0 0 0.55814 0 0.20929] CT
0.851 0.325 0.098 RC
2 LJ
N
240.978 442.715 M
241.562 445.062 L
242.145 446.736 L
242.729 447.723 L
243.312 448.005 L
243.896 447.569 L
244.479 446.402 L
245.063 444.494 L
245.647 441.834 L
246.23 438.414 L
246.814 434.228 L
247.397 429.274 L
247.981 423.564 L
248.565 417.065 L
249.148 409.752 L
249.732 401.616 L
250.315 392.668 L
250.899 382.933 L
251.482 372.454 L
252.066 361.292 L
252.65 349.522 L
253.233 337.24 L
253.817 324.555 L
254.4 311.595 L
254.984 298.482 L
255.568 285.271 L
256.151 272.187 L
256.735 259.463 L
257.318 247.31 L
257.902 235.917 L
258.485 225.448 L
259.069 216.047 L
259.653 207.832 L
260.236 200.9 L
260.82 195.324 L
261.403 191.157 L
261.987 188.427 L
262.571 187.15 L
263.154 187.37 L
263.738 189.039 L
264.321 192.09 L
264.905 196.444 L
265.488 202.013 L
266.072 208.697 L
266.656 216.385 L
267.239 224.956 L
267.823 234.277 L
268.406 244.206 L
268.99 254.589 L
269.574 265.297 L
S
GR
GS
[0.55814 0 0 0.55814 0 0.20929] CT
0.851 0.325 0.098 RC
2 LJ
N
269.574 265.297 M
270.157 276.25 L
270.741 287.343 L
271.324 298.482 L
271.908 309.575 L
272.491 320.545 L
273.075 331.317 L
273.659 341.827 L
274.242 352.02 L
274.826 361.846 L
275.409 371.266 L
275.993 380.255 L
276.577 388.785 L
277.16 396.823 L
277.744 404.34 L
278.327 411.309 L
278.911 417.707 L
279.494 423.514 L
280.078 428.715 L
280.662 433.297 L
281.245 437.248 L
281.829 440.564 L
282.412 443.24 L
282.996 445.277 L
283.58 446.676 L
284.163 447.416 L
284.747 447.466 L
285.33 446.802 L
285.914 445.4 L
286.497 443.241 L
287.081 440.311 L
287.665 436.598 L
288.248 432.096 L
288.832 426.799 L
289.415 420.708 L
289.999 413.828 L
290.583 406.164 L
291.166 397.73 L
291.75 388.541 L
292.333 378.617 L
292.917 367.996 L
293.501 356.732 L
294.084 344.894 L
294.668 332.571 L
295.251 319.866 L
295.835 306.902 L
296.418 293.816 L
297.002 280.763 L
297.586 267.914 L
298.169 255.459 L
S
GR
GS
[0.55814 0 0 0.55814 0 0.20929] CT
0.851 0.325 0.098 RC
2 LJ
N
298.169 255.459 M
298.753 243.597 L
299.336 232.481 L
299.92 222.279 L
300.504 213.144 L
301.087 205.209 L
301.671 198.585 L
302.254 193.359 L
302.838 189.598 L
303.421 187.342 L
304.005 186.614 L
304.589 187.411 L
305.172 189.708 L
305.756 193.438 L
306.339 198.434 L
306.923 204.582 L
307.507 211.779 L
308.09 219.912 L
308.674 228.869 L
309.257 238.53 L
309.841 248.771 L
310.424 259.465 L
311.008 270.479 L
311.592 281.676 L
312.175 292.915 L
312.759 304.051 L
313.342 315.061 L
313.926 325.917 L
314.51 336.551 L
315.093 346.899 L
315.677 356.908 L
316.26 366.53 L
316.844 375.723 L
317.427 384.453 L
318.011 392.694 L
318.595 400.425 L
319.178 407.633 L
319.762 414.304 L
320.345 420.416 L
320.929 425.949 L
321.513 430.883 L
322.096 435.198 L
322.68 438.881 L
323.263 441.915 L
323.847 444.288 L
324.43 445.988 L
325.014 447.007 L
325.598 447.337 L
326.181 446.971 L
326.765 445.906 L
S
GR
GS
[0.55814 0 0 0.55814 0 0.20929] CT
0.851 0.325 0.098 RC
2 LJ
N
326.765 445.906 M
327.348 444.143 L
327.932 441.661 L
328.516 438.422 L
329.099 434.395 L
329.683 429.558 L
330.266 423.901 L
330.85 417.419 L
331.433 410.119 L
332.017 402.019 L
332.601 393.141 L
333.184 383.522 L
333.768 373.203 L
334.351 362.239 L
334.935 350.647 L
335.519 338.464 L
336.102 325.852 L
336.686 312.969 L
337.269 299.975 L
337.853 287.023 L
338.436 274.267 L
339.02 261.857 L
339.604 249.94 L
340.187 238.662 L
340.771 228.166 L
341.354 218.592 L
341.938 210.078 L
342.522 202.764 L
343.105 196.828 L
343.689 192.335 L
344.272 189.303 L
344.856 187.734 L
345.439 187.617 L
346.023 188.924 L
346.607 191.617 L
347.19 195.639 L
347.774 200.921 L
348.357 207.381 L
348.941 214.92 L
349.525 223.42 L
350.108 232.682 L
350.692 242.556 L
351.275 252.922 L
351.859 263.665 L
352.442 274.676 L
353.026 285.849 L
353.61 297.086 L
354.193 308.292 L
354.777 319.377 L
355.36 330.258 L
S
GR
GS
[0.55814 0 0 0.55814 0 0.20929] CT
0.851 0.325 0.098 RC
2 LJ
N
355.36 330.258 M
355.944 340.855 L
356.528 351.107 L
357.111 361.008 L
357.695 370.517 L
358.278 379.592 L
358.862 388.196 L
359.445 396.295 L
360.029 403.863 L
360.613 410.875 L
361.196 417.312 L
361.78 423.16 L
362.363 428.41 L
362.947 433.056 L
363.531 437.098 L
364.114 440.535 L
364.698 443.346 L
365.281 445.507 L
365.865 446.998 L
366.448 447.799 L
367.032 447.892 L
367.616 447.263 L
368.199 445.896 L
368.783 443.781 L
369.366 440.906 L
369.95 437.264 L
370.534 432.847 L
371.117 427.65 L
371.701 421.678 L
372.284 414.942 L
372.868 407.414 L
373.451 399.081 L
374.035 389.949 L
374.619 380.042 L
375.202 369.401 L
375.786 358.087 L
376.369 346.177 L
376.953 333.769 L
377.537 320.978 L
378.12 307.937 L
378.704 294.796 L
379.287 281.702 L
379.871 268.746 L
380.454 256.154 L
381.038 244.146 L
381.622 232.918 L
382.205 222.643 L
382.789 213.468 L
383.372 205.52 L
383.956 198.898 L
S
GR
GS
[0.55814 0 0 0.55814 0 0.20929] CT
0.851 0.325 0.098 RC
2 LJ
N
383.956 198.898 M
384.54 193.68 L
385.123 189.918 L
385.707 187.642 L
386.29 186.858 L
386.874 187.557 L
387.457 189.693 L
388.041 193.191 L
388.625 197.965 L
389.208 203.92 L
389.792 210.954 L
390.375 218.954 L
390.959 227.797 L
391.543 237.353 L
392.126 247.48 L
392.71 258.03 L
393.293 268.845 L
393.877 279.848 L
394.46 290.96 L
395.044 302.089 L
395.628 313.146 L
396.211 324.056 L
396.795 334.747 L
397.378 345.157 L
397.962 355.233 L
398.546 364.929 L
399.129 374.206 L
399.713 383.037 L
400.296 391.401 L
400.88 399.267 L
401.463 406.609 L
402.047 413.4 L
402.631 419.617 L
403.214 425.241 L
403.798 430.256 L
404.381 434.647 L
404.965 438.403 L
405.549 441.516 L
406.132 443.98 L
406.716 445.794 L
407.299 446.956 L
407.883 447.464 L
408.466 447.288 L
409.05 446.399 L
409.634 444.769 L
410.217 442.378 L
410.801 439.209 L
411.384 435.25 L
411.968 430.493 L
412.552 424.936 L
S
GR
GS
[0.55814 0 0 0.55814 0 0.20929] CT
0.851 0.325 0.098 RC
2 LJ
N
412.552 424.936 M
413.135 418.581 L
413.719 411.433 L
414.302 403.505 L
414.886 394.811 L
415.469 385.365 L
416.053 375.191 L
416.637 364.34 L
417.22 352.876 L
417.804 340.879 L
418.387 328.443 L
418.971 315.677 L
419.555 302.702 L
420.138 289.657 L
420.722 276.695 L
421.305 263.981 L
421.889 251.697 L
422.472 240.038 L
423.056 229.202 L
423.64 219.337 L
424.223 210.586 L
424.807 203.066 L
425.39 196.877 L
425.974 192.097 L
426.558 188.782 L
427.141 186.966 L
427.725 186.666 L
428.308 187.873 L
428.892 190.559 L
429.475 194.677 L
430.059 200.081 L
430.643 206.596 L
431.226 214.115 L
431.81 222.527 L
432.393 231.717 L
432.977 241.571 L
433.561 251.968 L
434.144 262.786 L
434.728 273.899 L
435.311 285.179 L
435.895 296.495 L
436.478 307.713 L
437.062 318.707 L
437.646 329.494 L
438.229 340.04 L
438.813 350.286 L
439.396 360.178 L
439.98 369.671 L
440.564 378.724 L
441.147 387.302 L
S
GR
GS
[0.55814 0 0 0.55814 0 0.20929] CT
0.851 0.325 0.098 RC
2 LJ
N
441.147 387.302 M
441.731 395.379 L
442.314 402.934 L
442.898 409.95 L
443.481 416.42 L
444.065 422.332 L
444.649 427.665 L
445.232 432.398 L
445.816 436.514 L
446.399 439.995 L
446.983 442.826 L
447.567 444.991 L
448.15 446.479 L
448.734 447.278 L
449.317 447.377 L
449.901 446.769 L
450.484 445.447 L
451.068 443.404 L
451.652 440.647 L
452.235 437.153 L
452.819 432.883 L
453.402 427.807 L
453.986 421.907 L
454.57 415.177 L
455.153 407.622 L
455.737 399.259 L
456.32 390.114 L
456.904 380.228 L
457.487 369.652 L
458.071 358.447 L
458.655 346.687 L
459.238 334.387 L
459.822 321.605 L
460.405 308.549 L
460.989 295.421 L
461.573 282.406 L
462.156 269.681 L
462.74 257.409 L
463.323 245.744 L
463.907 234.825 L
464.49 224.783 L
465.074 215.733 L
465.658 207.783 L
466.241 201.025 L
466.825 195.543 L
467.408 191.486 L
467.992 188.926 L
468.576 187.851 L
469.159 188.232 L
469.743 190.028 L
S
GR
GS
[0.55814 0 0 0.55814 0 0.20929] CT
0.851 0.325 0.098 RC
2 LJ
N
469.743 190.028 M
470.326 193.185 L
470.91 197.632 L
471.493 203.287 L
472.077 210.054 L
472.661 217.822 L
473.244 226.468 L
473.828 235.85 L
474.411 245.815 L
474.995 256.235 L
475.579 266.994 L
476.162 277.984 L
476.746 289.102 L
477.329 300.253 L
477.913 311.349 L
478.496 322.308 L
479.08 333.055 L
479.664 343.522 L
480.247 353.65 L
480.831 363.415 L
481.414 372.784 L
481.998 381.716 L
482.582 390.173 L
483.165 398.123 L
483.749 405.537 L
484.332 412.392 L
484.916 418.666 L
485.5 424.344 L
486.083 429.414 L
486.667 433.87 L
487.25 437.707 L
487.834 440.927 L
488.417 443.533 L
489.001 445.504 L
489.585 446.812 L
490.168 447.434 L
490.752 447.35 L
491.335 446.54 L
491.919 444.989 L
492.503 442.683 L
493.086 439.611 L
493.67 435.764 L
494.253 431.137 L
494.837 425.726 L
495.42 419.529 L
496.004 412.552 L
496.588 404.811 L
497.171 396.296 L
497.755 387.011 L
498.338 376.977 L
S
GR
GS
[0.55814 0 0 0.55814 0 0.20929] CT
0.851 0.325 0.098 RC
2 LJ
N
498.338 376.977 M
498.922 366.233 L
499.505 354.839 L
500.089 342.871 L
500.673 330.427 L
501.256 317.619 L
501.84 304.582 L
502.423 291.466 L
503.007 278.444 L
503.591 265.694 L
504.174 253.339 L
504.758 241.573 L
505.341 230.594 L
505.925 220.578 L
506.508 211.675 L
507.092 204.013 L
507.676 197.697 L
508.259 192.805 L
508.843 189.394 L
509.426 187.496 L
510.01 187.121 L
510.594 188.252 L
511.177 190.813 L
511.761 194.707 L
512.344 199.844 L
512.928 206.125 L
513.512 213.444 L
514.095 221.69 L
514.679 230.743 L
515.262 240.474 L
515.846 250.751 L
516.429 261.432 L
517.013 272.368 L
517.597 283.407 L
518.18 294.491 L
518.764 305.567 L
519.347 316.551 L
519.931 327.368 L
520.515 337.949 L
521.098 348.234 L
521.682 358.172 L
522.265 367.716 L
522.849 376.831 L
523.432 385.486 L
524.016 393.66 L
524.6 401.336 L
525.183 408.487 L
525.767 415.089 L
526.35 421.119 L
526.934 426.557 L
S
GR
GS
[0.55814 0 0 0.55814 0 0.20929] CT
0.851 0.325 0.098 RC
2 LJ
N
526.934 426.557 M
527.518 431.385 L
528.101 435.589 L
528.685 439.154 L
529.268 442.071 L
529.852 444.329 L
530.435 445.924 L
531.019 446.851 L
531.603 447.109 L
532.186 446.696 L
532.77 445.586 L
533.353 443.744 L
533.937 441.143 L
534.521 437.76 L
535.104 433.581 L
535.688 428.595 L
536.271 422.801 L
536.855 416.202 L
537.438 408.807 L
538.022 400.633 L
538.606 391.702 L
539.189 382.042 L
539.773 371.665 L
540.356 360.606 L
540.94 348.958 L
541.523 336.82 L
542.107 324.302 L
542.691 311.523 L
543.274 298.61 L
543.858 285.699 L
544.441 272.937 L
545.025 260.478 L
545.609 248.486 L
546.192 237.134 L
546.776 226.603 L
547.359 217.086 L
547.943 208.744 L
548.526 201.675 L
549.11 195.955 L
549.694 191.645 L
550.277 188.783 L
550.861 187.393 L
551.444 187.478 L
552.028 189.025 L
552.612 192.001 L
553.195 196.355 L
553.779 202.019 L
554.362 208.854 L
554.946 216.643 L
555.53 225.269 L
S
GR
GS
[0.55814 0 0 0.55814 0 0.20929] CT
0.851 0.325 0.098 RC
2 LJ
N
555.53 225.269 M
556.113 234.622 L
556.697 244.589 L
557.28 255.056 L
557.864 265.912 L
558.447 277.043 L
559.031 288.334 L
559.615 299.672 L
560.198 310.94 L
560.782 322.025 L
561.365 332.811 L
561.949 343.243 L
562.533 353.361 L
563.116 363.119 L
563.7 372.471 L
564.283 381.377 L
564.867 389.803 L
565.45 397.72 L
566.034 405.103 L
566.618 411.933 L
567.201 418.197 L
567.785 423.887 L
568.368 428.998 L
568.952 433.522 L
569.536 437.436 L
570.119 440.721 L
570.703 443.359 L
571.286 445.333 L
571.87 446.625 L
572.453 447.223 L
573.037 447.113 L
573.621 446.284 L
574.204 444.725 L
574.788 442.427 L
575.371 439.382 L
575.955 435.586 L
576.539 431.047 L
577.122 425.748 L
577.706 419.651 L
578.289 412.736 L
578.873 404.996 L
579.456 396.442 L
580.04 387.096 L
580.624 376.999 L
581.207 366.207 L
581.791 354.789 L
582.374 342.832 L
582.958 330.435 L
583.542 317.715 L
584.125 304.71 L
S
GR
GS
[0.55814 0 0 0.55814 0 0.20929] CT
0.851 0.325 0.098 RC
2 LJ
N
584.125 304.71 M
584.709 291.544 L
585.292 278.46 L
585.876 265.683 L
586.459 253.413 L
587.043 241.833 L
587.627 231.102 L
588.21 221.36 L
588.794 212.725 L
589.377 205.294 L
589.961 199.144 L
590.545 194.33 L
591.128 190.885 L
591.712 188.853 L
592.295 188.313 L
592.879 189.229 L
593.462 191.546 L
594.046 195.193 L
594.63 200.092 L
595.213 206.149 L
595.797 213.262 L
596.38 221.315 L
596.964 230.181 L
597.548 239.722 L
598.131 249.788 L
598.715 260.252 L
599.298 271.017 L
599.882 281.975 L
600.465 293.028 L
601.049 304.082 L
601.633 315.055 L
602.216 325.87 L
602.8 336.458 L
603.383 346.758 L
603.967 356.718 L
604.551 366.293 L
605.134 375.457 L
605.718 384.182 L
606.301 392.431 L
606.885 400.174 L
607.469 407.382 L
608.052 414.031 L
608.636 420.1 L
609.219 425.572 L
609.803 430.433 L
610.386 434.673 L
610.97 438.285 L
611.554 441.267 L
612.137 443.619 L
612.721 445.341 L
S
GR
GS
[0.55814 0 0 0.55814 0 0.20929] CT
0.851 0.325 0.098 RC
2 LJ
N
612.721 445.341 M
613.304 446.413 L
613.888 446.805 L
614.471 446.493 L
615.055 445.455 L
615.639 443.672 L
616.222 441.128 L
616.806 437.814 L
617.389 433.719 L
617.973 428.839 L
618.557 423.173 L
619.14 416.722 L
619.724 409.492 L
620.307 401.492 L
620.891 392.738 L
621.474 383.242 L
622.058 373.031 L
622.642 362.149 L
623.225 350.658 L
623.809 338.637 L
624.392 326.183 L
624.976 313.409 L
625.56 300.447 L
626.143 287.445 L
626.727 274.57 L
627.31 262.004 L
627.894 249.943 L
628.477 238.529 L
629.061 227.937 L
629.645 218.333 L
630.228 209.861 L
630.812 202.641 L
631.395 196.771 L
631.979 192.329 L
632.563 189.365 L
633.146 187.911 L
633.73 187.973 L
634.313 189.538 L
634.897 192.555 L
635.48 196.879 L
636.064 202.399 L
636.648 209.015 L
637.231 216.621 L
637.815 225.105 L
638.398 234.349 L
638.982 244.232 L
639.566 254.627 L
640.149 265.4 L
640.733 276.415 L
641.316 287.529 L
S
GR
GS
[0.55814 0 0 0.55814 0 0.20929] CT
0.851 0.325 0.098 RC
2 LJ
N
641.316 287.529 M
641.9 298.595 L
642.483 309.583 L
643.067 320.456 L
643.651 331.142 L
644.234 341.577 L
644.818 351.7 L
645.401 361.463 L
645.985 370.82 L
646.569 379.735 L
647.152 388.179 L
647.736 396.128 L
648.319 403.567 L
648.903 410.482 L
649.487 416.85 L
650.07 422.648 L
650.654 427.857 L
651.237 432.457 L
651.821 436.433 L
652.404 439.769 L
652.988 442.453 L
653.572 444.473 L
654.155 445.821 L
654.739 446.488 L
655.322 446.471 L
655.906 445.764 L
656.49 444.371 L
657.073 442.268 L
657.657 439.417 L
658.24 435.79 L
658.824 431.364 L
659.407 426.127 L
659.991 420.074 L
660.575 413.211 L
661.158 405.548 L
661.742 397.106 L
662.325 387.916 L
662.909 378.013 L
663.492 367.445 L
664.076 356.227 L
664.66 344.396 L
665.243 332.093 L
665.827 319.461 L
666.41 306.644 L
666.994 293.786 L
667.578 281.033 L
668.161 268.53 L
668.745 256.424 L
669.328 244.864 L
669.912 233.997 L
S
GR
GS
[0.55814 0 0 0.55814 0 0.20929] CT
0.851 0.325 0.098 RC
2 LJ
N
669.912 233.997 M
670.495 223.973 L
671.079 214.941 L
671.663 207.057 L
672.246 200.5 L
672.83 195.339 L
673.413 191.603 L
673.997 189.308 L
674.581 188.455 L
675.164 189.031 L
675.748 191.007 L
676.331 194.34 L
676.915 198.973 L
677.498 204.833 L
678.082 211.834 L
678.666 219.867 L
679.249 228.73 L
679.833 238.264 L
680.416 248.342 L
681 258.845 L
S
GR
GS
[0.55814 0 0 0.55814 0 0.20929] CT
1 GC
N
576 110 M
576 60 L
663 60 L
663 110 L
cp
f
GR
GS
[0.55814 0 0 0.55814 360.37662 41.54831] CT
/Helvetica 16 F
GS
[1 0 0 1 0 0] CT
0 6.5 moveto 
1 -1 scale
(N) t 
GR
GR
GS
[0.55814 0 0 0.55814 0 0.20929] CT
0 0.447 0.741 RC
2 LJ
N
586.719 74.066 M
640.315 74.066 L
S
GR
GS
[0.55814 0 0 0.55814 360.37662 53.75399] CT
/Helvetica 16 F
GS
[1 0 0 1 0 0] CT
0 6.5 moveto 
1 -1 scale
(P) t 
GR
GR
GS
[0.55814 0 0 0.55814 0 0.20929] CT
0.851 0.325 0.098 RC
2 LJ
N
586.719 95.934 M
640.315 95.934 L
S
GR
GS
[0.55814 0 0 0.55814 0 0.20929] CT
0.149 GC
2 LJ
N
576 110 M
576 60 L
663 60 L
663 110 L
576 110 L
S
GR
%%Trailer
%%Pages: 1
%%EOF
