\relax 
\providecommand\hyper@newdestlabel[2]{}
\bibcite{automatyzacja-testow}{1}
\bibcite{automatyzacja-procesów}{2}
\bibcite{selenium-book}{3}
\bibcite{selenium-book}{4}
\bibcite{statistics}{5}
\bibcite{docker-documentation}{6}
\bibcite{attlassian-documentation}{7}
\bibcite{coreos-rkt-documentation}{8}
\bibcite{docker-stats}{9}
\bibcite{how-does-docker-work}{10}
\bibcite{selenium-documentation}{11}
\bibcite{protractor-page}{12}
\bibcite{jenkins}{13}
\bibcite{apache}{14}
\@writefile{toc}{\contentsline {chapter}{Bibliografia}{31}{section*.9}\protected@file@percent }
\bibcite{virtual-machine-definition}{15}
\bibcite{maven-docs}{16}
\bibcite{mit-license}{17}
\bibcite{git}{18}
\@setckpt{bibliografia}{
\setcounter{page}{33}
\setcounter{equation}{0}
\setcounter{enumi}{0}
\setcounter{enumii}{0}
\setcounter{enumiii}{0}
\setcounter{enumiv}{18}
\setcounter{footnote}{0}
\setcounter{mpfootnote}{0}
\setcounter{part}{0}
\setcounter{chapter}{5}
\setcounter{section}{3}
\setcounter{subsection}{0}
\setcounter{subsubsection}{0}
\setcounter{paragraph}{0}
\setcounter{subparagraph}{0}
\setcounter{figure}{0}
\setcounter{table}{0}
\setcounter{caption@flags}{0}
\setcounter{continuedfloat}{0}
\setcounter{lstnumber}{27}
\setcounter{FancyVerbLine}{0}
\setcounter{AM@survey}{0}
\setcounter{Item}{0}
\setcounter{Hfootnote}{0}
\setcounter{bookmark@seq@number}{28}
\setcounter{lstlisting}{0}
\setcounter{section@level}{0}
}
