\relax 
\providecommand\hyper@newdestlabel[2]{}
\@writefile{toc}{\contentsline {chapter}{Oświadczenie o udostępnianiu pracy dyplomowej}{36}{Item.27}\protected@file@percent }
\@setckpt{Oswiadczenie_udostepnienie}{
\setcounter{page}{37}
\setcounter{equation}{0}
\setcounter{enumi}{27}
\setcounter{enumii}{0}
\setcounter{enumiii}{0}
\setcounter{enumiv}{18}
\setcounter{footnote}{1}
\setcounter{mpfootnote}{0}
\setcounter{part}{0}
\setcounter{chapter}{5}
\setcounter{section}{3}
\setcounter{subsection}{0}
\setcounter{subsubsection}{0}
\setcounter{paragraph}{0}
\setcounter{subparagraph}{0}
\setcounter{figure}{0}
\setcounter{table}{0}
\setcounter{caption@flags}{0}
\setcounter{continuedfloat}{0}
\setcounter{lstnumber}{27}
\setcounter{FancyVerbLine}{0}
\setcounter{AM@survey}{0}
\setcounter{Item}{27}
\setcounter{Hfootnote}{1}
\setcounter{bookmark@seq@number}{32}
\setcounter{lstlisting}{0}
\setcounter{section@level}{0}
}
