\relax 
\providecommand\hyper@newdestlabel[2]{}
\@writefile{toc}{\contentsline {chapter}{\numberline {4}Część praktyczna}{12}{chapter.4}\protected@file@percent }
\@writefile{lof}{\addvspace {10\p@ }}
\@writefile{lot}{\addvspace {10\p@ }}
\@writefile{toc}{\contentsline {section}{\numberline {4.1}Wykorzystane narzędzia}{12}{section.4.1}\protected@file@percent }
\@writefile{toc}{\contentsline {section}{\numberline {4.2}Projekt}{13}{section.4.2}\protected@file@percent }
\@writefile{toc}{\contentsline {subsection}{\numberline {4.2.1}Continuous Integration}{13}{subsection.4.2.1}\protected@file@percent }
\newlabel{listing:.gitlab-ci.yml}{{4.1}{13}{Plik konfiguracyjny dla Gitlab CI}{lstlisting.4.1}{}}
\@writefile{lol}{\contentsline {lstlisting}{\numberline {4.1}Plik konfiguracyjny dla Gitlab CI}{13}{lstlisting.4.1}\protected@file@percent }
\@writefile{toc}{\contentsline {subsection}{\numberline {4.2.2}Docker}{16}{subsection.4.2.2}\protected@file@percent }
\newlabel{listing:Dockerfile}{{4.2}{16}{Plik konfiguracyjny obrazu dockerowego z testami Dockerfile}{lstlisting.4.2}{}}
\@writefile{lol}{\contentsline {lstlisting}{\numberline {4.2}Plik konfiguracyjny obrazu dockerowego z testami Dockerfile}{16}{lstlisting.4.2}\protected@file@percent }
\newlabel{listing:docker-compose.yml}{{4.3}{17}{Plik konfiguracyjny dla usługi docker-compose}{lstlisting.4.3}{}}
\@writefile{lol}{\contentsline {lstlisting}{\numberline {4.3}Plik konfiguracyjny dla usługi docker-compose}{17}{lstlisting.4.3}\protected@file@percent }
\@writefile{lof}{\contentsline {figure}{\numberline {4.1}{\ignorespaces Połączenia pomiędzy kontenerami w sieci [opracowanie własne]\relax }}{19}{figure.caption.2}\protected@file@percent }
\providecommand*\caption@xref[2]{\@setref\relax\@undefined{#1}}
\newlabel{fig:docker-compose-network}{{4.1}{19}{Połączenia pomiędzy kontenerami w sieci [opracowanie własne]\relax }{figure.caption.2}{}}
\@writefile{toc}{\contentsline {subsection}{\numberline {4.2.3}Testy automatyczne}{20}{subsection.4.2.3}\protected@file@percent }
\newlabel{webdriver-init}{{4.4}{21}{Inicjalizacja obiektów klas WebDriver i RemoteWebDriver}{lstlisting.4.4}{}}
\@writefile{lol}{\contentsline {lstlisting}{\numberline {4.4}Inicjalizacja obiektów klas WebDriver i RemoteWebDriver}{21}{lstlisting.4.4}\protected@file@percent }
\newlabel{HomePageClass}{{4.5}{23}{Klasa HomePage}{lstlisting.4.5}{}}
\@writefile{lol}{\contentsline {lstlisting}{\numberline {4.5}Klasa HomePage}{23}{lstlisting.4.5}\protected@file@percent }
\newlabel{HomePageTest}{{4.6}{24}{Klasa HomePageTest}{lstlisting.4.6}{}}
\@writefile{lol}{\contentsline {lstlisting}{\numberline {4.6}Klasa HomePageTest}{24}{lstlisting.4.6}\protected@file@percent }
\@writefile{toc}{\contentsline {subsection}{\numberline {4.2.4}Raporty}{25}{subsection.4.2.4}\protected@file@percent }
\@writefile{lof}{\contentsline {figure}{\numberline {4.2}{\ignorespaces Przejrzyste przedstawienie powodzenia poszczególnych etapów diagramu przepływu [opracowanie własne]\relax }}{25}{figure.caption.3}\protected@file@percent }
\newlabel{fig:gitlab-initial-graphic-report}{{4.2}{25}{Przejrzyste przedstawienie powodzenia poszczególnych etapów diagramu przepływu [opracowanie własne]\relax }{figure.caption.3}{}}
\@writefile{lof}{\contentsline {figure}{\numberline {4.3}{\ignorespaces Wylistowane wyniki poszczególnych testów [opracowanie własne]\relax }}{26}{figure.caption.4}\protected@file@percent }
\newlabel{fig:surefire-reports-all-tests}{{4.3}{26}{Wylistowane wyniki poszczególnych testów [opracowanie własne]\relax }{figure.caption.4}{}}
\@writefile{lof}{\contentsline {figure}{\numberline {4.4}{\ignorespaces Czas trwania poszczególnych testów [opracowanie własne]\relax }}{26}{figure.caption.5}\protected@file@percent }
\newlabel{fig:surefire-report-time}{{4.4}{26}{Czas trwania poszczególnych testów [opracowanie własne]\relax }{figure.caption.5}{}}
\@writefile{toc}{\contentsline {subsection}{\numberline {4.2.5}Wydajność rozwiązania}{27}{subsection.4.2.5}\protected@file@percent }
\@writefile{lof}{\contentsline {figure}{\numberline {4.5}{\ignorespaces Czas wykonywania się 50 testów [opracowanie własne]\relax }}{27}{figure.caption.6}\protected@file@percent }
\newlabel{fig:50-tests-run-time}{{4.5}{27}{Czas wykonywania się 50 testów [opracowanie własne]\relax }{figure.caption.6}{}}
\@writefile{lof}{\contentsline {figure}{\numberline {4.6}{\ignorespaces Czas wykonywania się 100 testów [opracowanie własne]\relax }}{27}{figure.caption.7}\protected@file@percent }
\newlabel{fig:50-tests-run-time}{{4.6}{27}{Czas wykonywania się 100 testów [opracowanie własne]\relax }{figure.caption.7}{}}
\@writefile{lof}{\contentsline {figure}{\numberline {4.7}{\ignorespaces Czas wykonywania się 150 testów [opracowanie własne]\relax }}{27}{figure.caption.8}\protected@file@percent }
\newlabel{fig:50-tests-run-time}{{4.7}{27}{Czas wykonywania się 150 testów [opracowanie własne]\relax }{figure.caption.8}{}}
\@setckpt{praktyczna}{
\setcounter{page}{29}
\setcounter{equation}{0}
\setcounter{enumi}{0}
\setcounter{enumii}{0}
\setcounter{enumiii}{0}
\setcounter{enumiv}{0}
\setcounter{footnote}{0}
\setcounter{mpfootnote}{0}
\setcounter{part}{0}
\setcounter{chapter}{4}
\setcounter{section}{2}
\setcounter{subsection}{5}
\setcounter{subsubsection}{0}
\setcounter{paragraph}{0}
\setcounter{subparagraph}{0}
\setcounter{figure}{7}
\setcounter{table}{0}
\setcounter{caption@flags}{0}
\setcounter{continuedfloat}{0}
\setcounter{lstnumber}{27}
\setcounter{FancyVerbLine}{0}
\setcounter{AM@survey}{0}
\setcounter{Item}{0}
\setcounter{Hfootnote}{0}
\setcounter{bookmark@seq@number}{23}
\setcounter{lstlisting}{6}
\setcounter{section@level}{0}
}
