[
    {
        "name": "tools set",
        "price": 250,
        "imagePath": "https://media.istockphoto.com/photos/adult-gifts-for-couples-close-up-photo-of-colorful-various-sex-toys-picture-id1133376597?k=6&m=1133376597&s=612x612&w=0&h=lJ0YfzOX705hnsJEHa-UY643-8n7SMWbe_cuNBWknwo=",
        "articul": "ts1",
        "color": "pink"
    },
    {
        "name": "glass solders",
        "price": 500,
        "imagePath": "https://media.istockphoto.com/photos/glass-dildoes-picture-id118302986?k=6&m=118302986&s=612x612&w=0&h=Zmdyq2P11NvOziC2R0JwBOnoQu6DmKR2KYpQmdGHHBc=",
        "articul": "gs1",
        "color": "pink"
    },
    {
        "name": "metal slave",
        "price": 300,
        "imagePath": "https://media.istockphoto.com/photos/golden-metal-sex-toy-vibrator-picture-id1031411454?k=6&m=1031411454&s=612x612&w=0&h=lPvpKPPlFMbwsk3oVTG61S6ByknvJWax9py7wimPsx8=",
        "articul": "ms1",
        "color": "gold"
    },
    {
        "name": "weekend pocket",
        "price": 600,
        "imagePath": "https://media.istockphoto.com/photos/adult-sex-toys-and-accessories-on-pink-background-picture-id1155655475?k=6&m=1155655475&s=612x612&w=0&h=LB8nnVZE8mopHCTepnnpL3PGTO3C9sq1I7C6wxBUVWQ=",
        "articul": "wp1",
        "color": "red"
    },
    {
        "name": "survival tools",
        "price": 1200,
        "imagePath": "https://media.istockphoto.com/photos/various-sex-toys-and-a-golden-christmas-ball-picture-id1049465126?k=6&m=1049465126&s=612x612&w=0&h=Kyv2h7JAXkf5EkShPn552aUut0EVZH_QwlLC4Iwb9M0=",
        "articul": "st1",
        "color": "brown"
    },
    {
        "name": "black master",
        "price": 800,
        "imagePath": "https://media.istockphoto.com/photos/black-silicone-vibe-with-blindfold-picture-id656662758?k=6&m=656662758&s=612x612&w=0&h=ldv4SdbaDmHRZ5BUrR9jDDVFNahmGvfLikzWBlMaut4=",
        "articul": "bm1",
        "color": "black"
    },
    {
        "name": "plesure claw",
        "price": 400,
        "imagePath": "https://media.istockphoto.com/photos/three-vibrators-on-a-white-background-picture-id905726540?k=20&m=905726540&s=612x612&w=0&h=3r-VMgoM6caKVls1MRFF5PrBv_1WS0iXMAhTHkAOEeM=",
        "articul": "pc1",
        "color": "pink"
    },
    {
        "name": "plesure set",
        "price": 900,
        "imagePath": "https://encrypted-tbn0.gstatic.com/images?q=tbn:ANd9GcR-hjty9LHSEHFKCZpsFL3CDCJFlB0_W15cyQ&usqp=CAU",
        "articul": "ps1",
        "color": "variable"
    },
    {
        "name": "singer",
        "price": 600,
        "imagePath": "https://encrypted-tbn0.gstatic.com/images?q=tbn:ANd9GcTS5J3OsruQVaMLKIHTsNS2OnyHsmW8wSX3dg&usqp=CAU",
        "articul": "s1",
        "color": "pink"
    },
    {
        "name": "singer set",
        "price": 1000,
        "imagePath": "https://encrypted-tbn0.gstatic.com/images?q=tbn:ANd9GcREZTUEvCyeSpGDt8uYT1iMJTcW5rsITSv3qw&usqp=CAU",
        "articul": "ss1",
        "color": "pink"
    }
]

