@startuml MIS Architecture design

!include <C4/C4>
!include <C4/C4_Context>
!include <C4/C4_Container>

LAYOUT_WITH_LEGEND()
LAYOUT_LANDSCAPE()

' !define actors https://gitlab.com/microarch-ru/microservices/system-design/-/raw/main/containers/actors

!include https://gitlab.com/soprun/arch/-/raw/main/containers/actors/employeeManager.puml
!include https://gitlab.com/soprun/arch/-/raw/main/containers/actors/headOfSalesDepartment.puml

!include https://gitlab.com/soprun/arch/-/raw/main/services/amoCRM.puml
!include https://gitlab.com/soprun/arch/-/raw/main/services/Datareon.puml
!include https://gitlab.com/soprun/arch/-/raw/main/services/Sentry.puml
!include https://gitlab.com/soprun/arch/-/raw/main/services/CB.puml

!include https://gitlab.com/soprun/arch/-/raw/main/services/MIS/MIS.puml

System_Boundary(MIS, "") {
    Boundary(MIS.WebApplicationComponent, "Web Application Context", $tags="CLI") {
        Container(MIS.WebApplication, "Web Application", "JavaScript, Vue.js", "Все пользователи используют единый web интерфейс")
    }
    
    ContainerDb(MIS.Database, "Database", "PostgreSQL", $tags="")
    ContainerDb(MIS.ClickHouse, "ClickHouse", "ClickHouse", $tags="")
    ContainerQueue(MIS.EventBus, "Event Bus", "Apache Kafka", $tags="")

    Boundary(MIS.BackendApplication, "Backend Application Context", $tags="CLI") {
        Container(MIS.APIbackend, "API backend", "Python, FastAPI", $tags="")

        Boundary(MIS.CLI, "CLI", $tags="CLI") {
            Container(MIS.CLI_import_amoCRM, "CLI import amoCRM", "python, cron", $tags="")
            Container(MIS.CLI_import_CB, "CLI import получить ставки ЦБ", "python, cron", $tags="")
            Container(MIS.CLI_prepare, "CLI prepare", "python, cron, producer", $tags="")
            Container(MIS.CLI_scoring, "CLI scoring", "python, cron, comsumer", $tags="")
            Container(MIS.CLI_processing, "CLI processing", "python, cron", $tags="")

            Rel(CB, MIS.CLI_import_CB, "Получаем ставки ЦБ, рефинансирования, RUONA", "Json, HTTP")

            Rel(MIS.CLI_import_amoCRM, Sentry, "Send error trace", "HTTPs")
            Rel(MIS.CLI_prepare, Sentry, "Send error trace", "HTTPs")
            Rel(MIS.CLI_scoring, Sentry, "Send error trace", "HTTPs")
            Rel(MIS.CLI_processing, Sentry, "Send error trace", "HTTPs")
        }
    }

    Rel(employeeManager, MIS.WebApplication, "", "HTTPs")
    Rel(headOfSalesDepartment, MIS.WebApplication, "", "HTTPs")
    
    Rel(MIS.WebApplication, MIS.APIbackend, "", "HTTPs, JSON, REST")
    Rel(MIS.WebApplication, Sentry, "Send error trace", "HTTPs")
    Rel(Datareon, MIS.Database, "Поток данных из 1С", "")

    BiRel(MIS.APIbackend, MIS.Database, "Чтение и запись", "TCP, port 5432")
    Rel(MIS.ClickHouse, MIS.APIbackend, "Только чтение", "HTTPs, port 8123")

    Rel(amoCRM, MIS.CLI_import_amoCRM, "Чтение данных из API ЦБ", "HTTPs, JSON, REST")
    Rel(MIS.CLI_import_amoCRM, MIS.Database, "Только запись", "TCP, port 5432")
    Rel(MIS.Database, MIS.CLI_prepare, "Только чтение", "TCP, port 5432")

    Rel(MIS.CLI_prepare, MIS.EventBus, "Наполнение очереди на расчет", "TCP, port 9092")

    Rel(MIS.Database, MIS.CLI_scoring, "Только чтение", "TCP, port 5432")
    Rel(MIS.EventBus, MIS.CLI_scoring, "Чтение очереди на расчет", "TCP, port 9092")
    Rel(MIS.CLI_scoring, MIS.ClickHouse, "Запись расчета ", "HTTPs, port 8123")

    BiRel(MIS.Database, MIS.CLI_processing, "Только чтение", "HTTP, port 8123")
}

@endum
