@startuml Profitbase

!include <C4/C4>
!include <C4/C4_Context>

Boundary(CRM, "Система управления взаимоотношениями с клиентами") {
    System_Ext(Profitbase, "Profitbase", "Profitbase включает в себя приложения для отдела маркетинга и продаж, а также личный кабинет клиента для покупки квартиры онлайн.")
}

Rel(amoCRM, Profitbase, "", "")

@endum