@startuml ER-диаграмма MIS

!include <C4/C4>
!include <C4/C4_Context>
!include <C4/C4_Container>


entity "freedomApp_division" as e02 {
  *id: int NOT NULL
  *c_name : text NULL
  *c_code : text NOT NULL
  *c_show_division : varchar(5) NOT NULL
  *level : int NOT NULL
  *parent_id : int NULL
  *c_type_id : int NULL
}


@enduml