<svg width="34" height="34" viewBox="0 0 34 34" fill="none" xmlns="http://www.w3.org/2000/svg">
<path d="M12.9391 0C16.3708 0 19.6619 1.36243 22.0884 3.78756C24.515 6.21269 25.8782 9.50188 25.8782 12.9315C25.8782 16.1545 24.7037 19.0989 22.7529 21.347L34 32.5875L32.5867 34L21.3396 22.7595C19.0012 24.7652 16.0206 25.8664 12.9391 25.8631C9.50744 25.8631 6.21633 24.5007 3.78978 22.0755C1.36322 19.6504 0 16.3612 0 12.9315C0 9.50188 1.36322 6.21269 3.78978 3.78756C6.21633 1.36243 9.50744 0 12.9391 0ZM12.9391 1.98947C10.0354 1.98947 7.25061 3.14229 5.19737 5.19433C3.14413 7.24636 1.99063 10.0295 1.99063 12.9315C1.99063 15.8336 3.14413 18.6167 5.19737 20.6688C7.25061 22.7208 10.0354 23.8736 12.9391 23.8736C14.3769 23.8736 15.8006 23.5906 17.1289 23.0407C18.4572 22.4908 19.6642 21.6848 20.6809 20.6688C21.6975 19.6527 22.504 18.4464 23.0542 17.1189C23.6044 15.7913 23.8876 14.3685 23.8876 12.9315C23.8876 11.4946 23.6044 10.0717 23.0542 8.74419C22.504 7.41664 21.6975 6.21039 20.6809 5.19433C19.6642 4.17826 18.4572 3.37227 17.1289 2.82238C15.8006 2.27249 14.3769 1.98947 12.9391 1.98947Z" fill="#242424"/>
</svg>
