<svg width="25" height="25" viewBox="0 0 25 25" fill="none" xmlns="http://www.w3.org/2000/svg">
<path d="M18.0889 0.244808C18.0115 0.167208 17.9196 0.10564 17.8183 0.0636316C17.7171 0.0216234 17.6086 0 17.499 0C17.3894 0 17.2808 0.0216234 17.1796 0.0636316C17.0784 0.10564 16.9864 0.167208 16.909 0.244808L0 17.1555V24.1667C0 24.3877 0.0877922 24.5997 0.244063 24.7559C0.400334 24.9122 0.612283 25 0.833284 25H7.84453L24.7552 8.09101C24.8328 8.0136 24.8944 7.92165 24.9364 7.82041C24.9784 7.71918 25 7.61065 25 7.50104C25 7.39144 24.9784 7.28291 24.9364 7.18167C24.8944 7.08044 24.8328 6.98848 24.7552 6.91108L18.0889 0.244808Z" fill="#F7F7F7"/>
</svg>
