click==7.1.2
dlib==19.22.0
face-recognition==1.3.0
face-recognition-models==0.3.0
hnswlib==0.5.1
numpy==1.20.2
opencv-python==4.5.1.48
Pillow==8.1.2
torch==1.8.1
torchvision==0.9.1
typing-extensions==3.7.4.3
